FailedConsole Output

Skipping 1,798 KB.. Full Log
tests.unit.diagram.vsm.VSMVariableTypesValidationTest)  Time elapsed: 0 s
13:07:12 matchesExpectationsRegardingValidation[org.eclipse.sirius.tests.unit.diagram.vsm.VSMVariableTypesValidationTest.169: (browseExpression : var:self in vsmtypes:VSMTypes:SelfTypeInference:Default:ShouldBeValid:Domain ParticipantNode to Interaction Node:InitEdgeCreationOperation:ChangeContext:ChangeContext)](org.eclipse.sirius.tests.unit.diagram.vsm.VSMVariableTypesValidationTest)  Time elapsed: 0.001 s
13:07:12 matchesExpectationsRegardingValidation[org.eclipse.sirius.tests.unit.diagram.vsm.VSMVariableTypesValidationTest.170: (browseExpression : feature:sendingEnd in vsmtypes:VSMTypes:SelfTypeInference:Default:ShouldBeValid:Domain ParticipantNode to Interaction Node:InitEdgeCreationOperation:ChangeContext:ChangeContext:ChangeContext)](org.eclipse.sirius.tests.unit.diagram.vsm.VSMVariableTypesValidationTest)  Time elapsed: 0 s
13:07:12 matchesExpectationsRegardingValidation[org.eclipse.sirius.tests.unit.diagram.vsm.VSMVariableTypesValidationTest.171: (browseExpression : var:targetView in vsmtypes:VSMTypes:SelfTypeInference:Default:ShouldBeValid:Domain ParticipantNode to Interaction Node:InitEdgeCreationOperation:ChangeContext:ChangeContext)](org.eclipse.sirius.tests.unit.diagram.vsm.VSMVariableTypesValidationTest)  Time elapsed: 0 s
13:07:12 matchesExpectationsRegardingValidation[org.eclipse.sirius.tests.unit.diagram.vsm.VSMVariableTypesValidationTest.172: (browseExpression : feature:resizeKind in vsmtypes:VSMTypes:SelfTypeInference:Default:ShouldBeValid:Domain ParticipantNode to Interaction Node:InitEdgeCreationOperation:ChangeContext:ChangeContext:ChangeContext)](org.eclipse.sirius.tests.unit.diagram.vsm.VSMVariableTypesValidationTest)  Time elapsed: 0.001 s
13:07:12 matchesExpectationsRegardingValidation[org.eclipse.sirius.tests.unit.diagram.vsm.VSMVariableTypesValidationTest.173: (browseExpression : var:sourceView in vsmtypes:VSMTypes:SelfTypeInference:Default:ShouldBeValid:Domain ParticipantNode to Interaction Node:InitEdgeCreationOperation:ChangeContext:ChangeContext)](org.eclipse.sirius.tests.unit.diagram.vsm.VSMVariableTypesValidationTest)  Time elapsed: 0 s
13:07:12 matchesExpectationsRegardingValidation[org.eclipse.sirius.tests.unit.diagram.vsm.VSMVariableTypesValidationTest.174: (browseExpression : feature:resizeKind in vsmtypes:VSMTypes:SelfTypeInference:Default:ShouldBeValid:Domain ParticipantNode to Interaction Node:InitEdgeCreationOperation:ChangeContext:ChangeContext:ChangeContext)](org.eclipse.sirius.tests.unit.diagram.vsm.VSMVariableTypesValidationTest)  Time elapsed: 0 s
13:07:12 matchesExpectationsRegardingValidation[org.eclipse.sirius.tests.unit.diagram.vsm.VSMVariableTypesValidationTest.175: (browseExpression : var:self in vsmtypes:VSMTypes:SelfTypeInference:Default:ShouldBeValid:Domain ParticipantNode to Interaction Node two Edge Mappings:InitEdgeCreationOperation:ChangeContext)](org.eclipse.sirius.tests.unit.diagram.vsm.VSMVariableTypesValidationTest)  Time elapsed: 0 s
13:07:12 matchesExpectationsRegardingValidation[org.eclipse.sirius.tests.unit.diagram.vsm.VSMVariableTypesValidationTest.176: (browseExpression : var:source in vsmtypes:VSMTypes:SelfTypeInference:Default:ShouldBeValid:Domain ParticipantNode to Interaction Node two Edge Mappings:InitEdgeCreationOperation:ChangeContext:ChangeContext)](org.eclipse.sirius.tests.unit.diagram.vsm.VSMVariableTypesValidationTest)  Time elapsed: 0 s
13:07:12 matchesExpectationsRegardingValidation[org.eclipse.sirius.tests.unit.diagram.vsm.VSMVariableTypesValidationTest.177: (browseExpression : feature:type in vsmtypes:VSMTypes:SelfTypeInference:Default:ShouldBeValid:Domain ParticipantNode to Interaction Node two Edge Mappings:InitEdgeCreationOperation:ChangeContext:ChangeContext:ChangeContext)](org.eclipse.sirius.tests.unit.diagram.vsm.VSMVariableTypesValidationTest)  Time elapsed: 0 s
13:07:12 matchesExpectationsRegardingValidation[org.eclipse.sirius.tests.unit.diagram.vsm.VSMVariableTypesValidationTest.178: (browseExpression : var:target in vsmtypes:VSMTypes:SelfTypeInference:Default:ShouldBeValid:Domain ParticipantNode to Interaction Node two Edge Mappings:InitEdgeCreationOperation:ChangeContext:ChangeContext)](org.eclipse.sirius.tests.unit.diagram.vsm.VSMVariableTypesValidationTest)  Time elapsed: 0 s
13:07:12 matchesExpectationsRegardingValidation[org.eclipse.sirius.tests.unit.diagram.vsm.VSMVariableTypesValidationTest.179: (browseExpression : feature:participants in vsmtypes:VSMTypes:SelfTypeInference:Default:ShouldBeValid:Domain ParticipantNode to Interaction Node two Edge Mappings:InitEdgeCreationOperation:ChangeContext:ChangeContext:ChangeContext)](org.eclipse.sirius.tests.unit.diagram.vsm.VSMVariableTypesValidationTest)  Time elapsed: 0.001 s
13:07:12 matchesExpectationsRegardingValidation[org.eclipse.sirius.tests.unit.diagram.vsm.VSMVariableTypesValidationTest.180: (browseExpression : var:self in vsmtypes:VSMTypes:SelfTypeInference:Default:ShouldBeValid:Domain ParticipantNode to Interaction Node two Edge Mappings:InitEdgeCreationOperation:ChangeContext:ChangeContext)](org.eclipse.sirius.tests.unit.diagram.vsm.VSMVariableTypesValidationTest)  Time elapsed: 0 s
13:07:12 matchesExpectationsRegardingValidation[org.eclipse.sirius.tests.unit.diagram.vsm.VSMVariableTypesValidationTest.181: (browseExpression : feature:sendingEnd in vsmtypes:VSMTypes:SelfTypeInference:Default:ShouldBeValid:Domain ParticipantNode to Interaction Node two Edge Mappings:InitEdgeCreationOperation:ChangeContext:ChangeContext:ChangeContext)](org.eclipse.sirius.tests.unit.diagram.vsm.VSMVariableTypesValidationTest)  Time elapsed: 0.001 s
13:07:12 matchesExpectationsRegardingValidation[org.eclipse.sirius.tests.unit.diagram.vsm.VSMVariableTypesValidationTest.182: (browseExpression : var:targetView in vsmtypes:VSMTypes:SelfTypeInference:Default:ShouldBeValid:Domain ParticipantNode to Interaction Node two Edge Mappings:InitEdgeCreationOperation:ChangeContext:ChangeContext)](org.eclipse.sirius.tests.unit.diagram.vsm.VSMVariableTypesValidationTest)  Time elapsed: 0 s
13:07:12 matchesExpectationsRegardingValidation[org.eclipse.sirius.tests.unit.diagram.vsm.VSMVariableTypesValidationTest.183: (browseExpression : feature:resizeKind in vsmtypes:VSMTypes:SelfTypeInference:Default:ShouldBeValid:Domain ParticipantNode to Interaction Node two Edge Mappings:InitEdgeCreationOperation:ChangeContext:ChangeContext:ChangeContext)](org.eclipse.sirius.tests.unit.diagram.vsm.VSMVariableTypesValidationTest)  Time elapsed: 0 s
13:07:12 matchesExpectationsRegardingValidation[org.eclipse.sirius.tests.unit.diagram.vsm.VSMVariableTypesValidationTest.184: (browseExpression : var:sourceView in vsmtypes:VSMTypes:SelfTypeInference:Default:ShouldBeValid:Domain ParticipantNode to Interaction Node two Edge Mappings:InitEdgeCreationOperation:ChangeContext:ChangeContext)](org.eclipse.sirius.tests.unit.diagram.vsm.VSMVariableTypesValidationTest)  Time elapsed: 0.001 s
13:07:12 matchesExpectationsRegardingValidation[org.eclipse.sirius.tests.unit.diagram.vsm.VSMVariableTypesValidationTest.185: (browseExpression : feature:resizeKind in vsmtypes:VSMTypes:SelfTypeInference:Default:ShouldBeValid:Domain ParticipantNode to Interaction Node two Edge Mappings:InitEdgeCreationOperation:ChangeContext:ChangeContext:ChangeContext)](org.eclipse.sirius.tests.unit.diagram.vsm.VSMVariableTypesValidationTest)  Time elapsed: 0 s
13:07:12 matchesExpectationsRegardingValidation[org.eclipse.sirius.tests.unit.diagram.vsm.VSMVariableTypesValidationTest.186: (browseExpression : var:element in vsmtypes:VSMTypes:SelfTypeInference:Default:ShouldBeValid:Delete ParticipantNode:InitialOperation:ChangeContext)](org.eclipse.sirius.tests.unit.diagram.vsm.VSMVariableTypesValidationTest)  Time elapsed: 0 s
13:07:12 matchesExpectationsRegardingValidation[org.eclipse.sirius.tests.unit.diagram.vsm.VSMVariableTypesValidationTest.187: (browseExpression : var:element in vsmtypes:VSMTypes:SelfTypeInference:Default:ShouldBeValid:Delete ParticipantNode:InitialOperation:ChangeContext:ChangeContext)](org.eclipse.sirius.tests.unit.diagram.vsm.VSMVariableTypesValidationTest)  Time elapsed: 0.001 s
13:07:12 matchesExpectationsRegardingValidation[org.eclipse.sirius.tests.unit.diagram.vsm.VSMVariableTypesValidationTest.188: (browseExpression : feature:type in vsmtypes:VSMTypes:SelfTypeInference:Default:ShouldBeValid:Delete ParticipantNode:InitialOperation:ChangeContext:ChangeContext:ChangeContext)](org.eclipse.sirius.tests.unit.diagram.vsm.VSMVariableTypesValidationTest)  Time elapsed: 0 s
13:07:12 matchesExpectationsRegardingValidation[org.eclipse.sirius.tests.unit.diagram.vsm.VSMVariableTypesValidationTest.189: (browseExpression : var:elementView in vsmtypes:VSMTypes:SelfTypeInference:Default:ShouldBeValid:Delete ParticipantNode:InitialOperation:ChangeContext:ChangeContext)](org.eclipse.sirius.tests.unit.diagram.vsm.VSMVariableTypesValidationTest)  Time elapsed: 0.001 s
13:07:12 matchesExpectationsRegardingValidation[org.eclipse.sirius.tests.unit.diagram.vsm.VSMVariableTypesValidationTest.190: (browseExpression : feature:width in vsmtypes:VSMTypes:SelfTypeInference:Default:ShouldBeValid:Delete ParticipantNode:InitialOperation:ChangeContext:ChangeContext:ChangeContext)](org.eclipse.sirius.tests.unit.diagram.vsm.VSMVariableTypesValidationTest)  Time elapsed: 0 s
13:07:12 matchesExpectationsRegardingValidation[org.eclipse.sirius.tests.unit.diagram.vsm.VSMVariableTypesValidationTest.191: (browseExpression : var:containerView in vsmtypes:VSMTypes:SelfTypeInference:Default:ShouldBeValid:Delete ParticipantNode:InitialOperation:ChangeContext:ChangeContext)](org.eclipse.sirius.tests.unit.diagram.vsm.VSMVariableTypesValidationTest)  Time elapsed: 0.001 s
13:07:12 matchesExpectationsRegardingValidation[org.eclipse.sirius.tests.unit.diagram.vsm.VSMVariableTypesValidationTest.192: (browseExpression : feature:edges in vsmtypes:VSMTypes:SelfTypeInference:Default:ShouldBeValid:Delete ParticipantNode:InitialOperation:ChangeContext:ChangeContext:ChangeContext)](org.eclipse.sirius.tests.unit.diagram.vsm.VSMVariableTypesValidationTest)  Time elapsed: 0 s
13:07:12 matchesExpectationsRegardingValidation[org.eclipse.sirius.tests.unit.diagram.vsm.VSMVariableTypesValidationTest.193: (browseExpression : var:element in vsmtypes:VSMTypes:SelfTypeInference:Default:ShouldBeValid:Delete ParticipantContainer:InitialOperation:ChangeContext)](org.eclipse.sirius.tests.unit.diagram.vsm.VSMVariableTypesValidationTest)  Time elapsed: 0.001 s
13:07:12 matchesExpectationsRegardingValidation[org.eclipse.sirius.tests.unit.diagram.vsm.VSMVariableTypesValidationTest.194: (browseExpression : var:element in vsmtypes:VSMTypes:SelfTypeInference:Default:ShouldBeValid:Delete ParticipantContainer:InitialOperation:ChangeContext:ChangeContext)](org.eclipse.sirius.tests.unit.diagram.vsm.VSMVariableTypesValidationTest)  Time elapsed: 0 s
13:07:12 matchesExpectationsRegardingValidation[org.eclipse.sirius.tests.unit.diagram.vsm.VSMVariableTypesValidationTest.195: (browseExpression : feature:type in vsmtypes:VSMTypes:SelfTypeInference:Default:ShouldBeValid:Delete ParticipantContainer:InitialOperation:ChangeContext:ChangeContext:ChangeContext)](org.eclipse.sirius.tests.unit.diagram.vsm.VSMVariableTypesValidationTest)  Time elapsed: 0.001 s
13:07:12 matchesExpectationsRegardingValidation[org.eclipse.sirius.tests.unit.diagram.vsm.VSMVariableTypesValidationTest.196: (browseExpression : var:elementView in vsmtypes:VSMTypes:SelfTypeInference:Default:ShouldBeValid:Delete ParticipantContainer:InitialOperation:ChangeContext:ChangeContext)](org.eclipse.sirius.tests.unit.diagram.vsm.VSMVariableTypesValidationTest)  Time elapsed: 0 s
13:07:12 matchesExpectationsRegardingValidation[org.eclipse.sirius.tests.unit.diagram.vsm.VSMVariableTypesValidationTest.197: (browseExpression : feature:childrenPresentation in vsmtypes:VSMTypes:SelfTypeInference:Default:ShouldBeValid:Delete ParticipantContainer:InitialOperation:ChangeContext:ChangeContext:ChangeContext)](org.eclipse.sirius.tests.unit.diagram.vsm.VSMVariableTypesValidationTest)  Time elapsed: 0.001 s
13:07:12 matchesExpectationsRegardingValidation[org.eclipse.sirius.tests.unit.diagram.vsm.VSMVariableTypesValidationTest.198: (browseExpression : var:containerView in vsmtypes:VSMTypes:SelfTypeInference:Default:ShouldBeValid:Delete ParticipantContainer:InitialOperation:ChangeContext:ChangeContext)](org.eclipse.sirius.tests.unit.diagram.vsm.VSMVariableTypesValidationTest)  Time elapsed: 0 s
13:07:12 matchesExpectationsRegardingValidation[org.eclipse.sirius.tests.unit.diagram.vsm.VSMVariableTypesValidationTest.199: (browseExpression : feature:edges in vsmtypes:VSMTypes:SelfTypeInference:Default:ShouldBeValid:Delete ParticipantContainer:InitialOperation:ChangeContext:ChangeContext:ChangeContext)](org.eclipse.sirius.tests.unit.diagram.vsm.VSMVariableTypesValidationTest)  Time elapsed: 0.001 s
13:07:12 matchesExpectationsRegardingValidation[org.eclipse.sirius.tests.unit.diagram.vsm.VSMVariableTypesValidationTest.200: (browseExpression : var:element in vsmtypes:VSMTypes:SelfTypeInference:Default:ShouldBeValid:Delete Message Edge:InitialOperation:ChangeContext)](org.eclipse.sirius.tests.unit.diagram.vsm.VSMVariableTypesValidationTest)  Time elapsed: 0 s
13:07:12 matchesExpectationsRegardingValidation[org.eclipse.sirius.tests.unit.diagram.vsm.VSMVariableTypesValidationTest.201: (browseExpression : var:element in vsmtypes:VSMTypes:SelfTypeInference:Default:ShouldBeValid:Delete Message Edge:InitialOperation:ChangeContext:ChangeContext)](org.eclipse.sirius.tests.unit.diagram.vsm.VSMVariableTypesValidationTest)  Time elapsed: 0 s
13:07:12 matchesExpectationsRegardingValidation[org.eclipse.sirius.tests.unit.diagram.vsm.VSMVariableTypesValidationTest.202: (browseExpression : feature:sendingEnd in vsmtypes:VSMTypes:SelfTypeInference:Default:ShouldBeValid:Delete Message Edge:InitialOperation:ChangeContext:ChangeContext:ChangeContext)](org.eclipse.sirius.tests.unit.diagram.vsm.VSMVariableTypesValidationTest)  Time elapsed: 0.001 s
13:07:12 matchesExpectationsRegardingValidation[org.eclipse.sirius.tests.unit.diagram.vsm.VSMVariableTypesValidationTest.203: (browseExpression : var:elementView in vsmtypes:VSMTypes:SelfTypeInference:Default:ShouldBeValid:Delete Message Edge:InitialOperation:ChangeContext:ChangeContext)](org.eclipse.sirius.tests.unit.diagram.vsm.VSMVariableTypesValidationTest)  Time elapsed: 0 s
13:07:12 matchesExpectationsRegardingValidation[org.eclipse.sirius.tests.unit.diagram.vsm.VSMVariableTypesValidationTest.204: (browseExpression : feature:sourceNode in vsmtypes:VSMTypes:SelfTypeInference:Default:ShouldBeValid:Delete Message Edge:InitialOperation:ChangeContext:ChangeContext:ChangeContext)](org.eclipse.sirius.tests.unit.diagram.vsm.VSMVariableTypesValidationTest)  Time elapsed: 0.013 s
13:07:12 matchesExpectationsRegardingValidation[org.eclipse.sirius.tests.unit.diagram.vsm.VSMVariableTypesValidationTest.205: (browseExpression : var:containerView in vsmtypes:VSMTypes:SelfTypeInference:Default:ShouldBeValid:Delete Message Edge:InitialOperation:ChangeContext:ChangeContext)](org.eclipse.sirius.tests.unit.diagram.vsm.VSMVariableTypesValidationTest)  Time elapsed: 0 s
13:07:12 matchesExpectationsRegardingValidation[org.eclipse.sirius.tests.unit.diagram.vsm.VSMVariableTypesValidationTest.206: (browseExpression : feature:edges in vsmtypes:VSMTypes:SelfTypeInference:Default:ShouldBeValid:Delete Message Edge:InitialOperation:ChangeContext:ChangeContext:ChangeContext)](org.eclipse.sirius.tests.unit.diagram.vsm.VSMVariableTypesValidationTest)  Time elapsed: 0.001 s
13:07:12 matchesExpectationsRegardingValidation[org.eclipse.sirius.tests.unit.diagram.vsm.VSMVariableTypesValidationTest.207: (browseExpression : var:self in vsmtypes:VSMTypes:SelfTypeInference:Default:ShouldBeValid:Check AQL type inference:InitialNodeCreationOperation:ChangeContext)](org.eclipse.sirius.tests.unit.diagram.vsm.VSMVariableTypesValidationTest)  Time elapsed: 0 s
13:07:12 matchesExpectationsRegardingValidation[org.eclipse.sirius.tests.unit.diagram.vsm.VSMVariableTypesValidationTest.208: (conditionExpression : aql:self.name <> null in vsmtypes:VSMTypes:SelfTypeInference:Default:ShouldBeValid:Check AQL type inference:InitialNodeCreationOperation:ChangeContext:If)](org.eclipse.sirius.tests.unit.diagram.vsm.VSMVariableTypesValidationTest)  Time elapsed: 0 s
13:07:12 matchesExpectationsRegardingValidation[org.eclipse.sirius.tests.unit.diagram.vsm.VSMVariableTypesValidationTest.209: (browseExpression : feature:eAllContents in vsmtypes:VSMTypes:SelfTypeInference:Default:ShouldBeValid:Check AQL type inference:InitialNodeCreationOperation:ChangeContext:If:ChangeContext)](org.eclipse.sirius.tests.unit.diagram.vsm.VSMVariableTypesValidationTest)  Time elapsed: 0.001 s
13:07:12 matchesExpectationsRegardingValidation[org.eclipse.sirius.tests.unit.diagram.vsm.VSMVariableTypesValidationTest.210: (conditionExpression : aql:self.oclIsKindOf(interactions::Interaction) in vsmtypes:VSMTypes:SelfTypeInference:Default:ShouldBeValid:Check AQL type inference:InitialNodeCreationOperation:ChangeContext:If:ChangeContext:If)](org.eclipse.sirius.tests.unit.diagram.vsm.VSMVariableTypesValidationTest)  Time elapsed: 0.002 s
13:07:12 matchesExpectationsRegardingValidation[org.eclipse.sirius.tests.unit.diagram.vsm.VSMVariableTypesValidationTest.211: (browseExpression : feature:ownedInteractions in vsmtypes:VSMTypes:SelfTypeInference:Default:ShouldBeValid:Check AQL type inference:InitialNodeCreationOperation:ChangeContext:ChangeContext)](org.eclipse.sirius.tests.unit.diagram.vsm.VSMVariableTypesValidationTest)  Time elapsed: 0 s
13:07:12 matchesExpectationsRegardingValidation[org.eclipse.sirius.tests.unit.diagram.vsm.VSMVariableTypesValidationTest.212: (browseExpression : feature:name in vsmtypes:VSMTypes:SelfTypeInference:Default:ShouldBeValid:Check AQL type inference:InitialNodeCreationOperation:ChangeContext:ChangeContext)](org.eclipse.sirius.tests.unit.diagram.vsm.VSMVariableTypesValidationTest)  Time elapsed: 0 s
13:07:12 matchesExpectationsRegardingValidation[org.eclipse.sirius.tests.unit.diagram.vsm.VSMVariableTypesValidationTest.213: (valueExpression : test in vsmtypes:VSMTypes:SelfTypeInference:Default:ShouldBeValid:Check AQL type inference:InitialNodeCreationOperation:ChangeContext:CreateInstance:SetValue)](org.eclipse.sirius.tests.unit.diagram.vsm.VSMVariableTypesValidationTest)  Time elapsed: 0 s
13:07:12 matchesExpectationsRegardingValidation[org.eclipse.sirius.tests.unit.diagram.vsm.VSMVariableTypesValidationTest.214: (expression : aql:self.eAllContents() in vsmtypes:VSMTypes:SelfTypeInference:Default:ShouldBeValid:Check AQL type inference:InitialNodeCreationOperation:ChangeContext:For)](org.eclipse.sirius.tests.unit.diagram.vsm.VSMVariableTypesValidationTest)  Time elapsed: 0.001 s
13:07:12 matchesExpectationsRegardingValidation[org.eclipse.sirius.tests.unit.diagram.vsm.VSMVariableTypesValidationTest.215: (conditionExpression : aql:i.oclIsKindOf(interactions::Interaction) in vsmtypes:VSMTypes:SelfTypeInference:Default:ShouldBeValid:Check AQL type inference:InitialNodeCreationOperation:ChangeContext:For:Switch:Case)](org.eclipse.sirius.tests.unit.diagram.vsm.VSMVariableTypesValidationTest)  Time elapsed: 0.001 s
13:07:12 matchesExpectationsRegardingValidation[org.eclipse.sirius.tests.unit.diagram.vsm.VSMVariableTypesValidationTest.216: (browseExpression : aql:containerView in vsmtypes:VSMTypes:SelfTypeInference:Default:ShouldBeValid:Check AQL type inference:InitialNodeCreationOperation:ChangeContext:For:Switch:Case:ChangeContext)](org.eclipse.sirius.tests.unit.diagram.vsm.VSMVariableTypesValidationTest)  Time elapsed: 0.002 s
13:07:12 matchesExpectationsRegardingValidation[org.eclipse.sirius.tests.unit.diagram.vsm.VSMVariableTypesValidationTest.217: (conditionExpression : aql:i.oclIsKindOf(ecore::EObject) in vsmtypes:VSMTypes:SelfTypeInference:Default:ShouldBeValid:Check AQL type inference:InitialNodeCreationOperation:ChangeContext:For:Switch:Case)](org.eclipse.sirius.tests.unit.diagram.vsm.VSMVariableTypesValidationTest)  Time elapsed: 0.002 s
13:07:12 matchesExpectationsRegardingValidation[org.eclipse.sirius.tests.unit.diagram.vsm.VSMVariableTypesValidationTest.218: (browseExpression : feature:eClass in vsmtypes:VSMTypes:SelfTypeInference:Default:ShouldBeValid:Check AQL type inference:InitialNodeCreationOperation:ChangeContext:For:Switch:Case:ChangeContext)](org.eclipse.sirius.tests.unit.diagram.vsm.VSMVariableTypesValidationTest)  Time elapsed: 0.003 s
13:07:12 matchesExpectationsRegardingValidation[org.eclipse.sirius.tests.unit.diagram.vsm.VSMVariableTypesValidationTest.219: (precondition : aql:element.oclIsKindOf(interactions::Model) and elementView.oclIsKindOf(diagram::DNode) in vsmtypes:VSMTypes:SelfTypeInference:Default:ShouldBeValid:GenericTool)](org.eclipse.sirius.tests.unit.diagram.vsm.VSMVariableTypesValidationTest)  Time elapsed: 0 s
13:07:12 matchesExpectationsRegardingValidation[org.eclipse.sirius.tests.unit.diagram.vsm.VSMVariableTypesValidationTest.220: (browseExpression : var:element in vsmtypes:VSMTypes:SelfTypeInference:Default:ShouldBeValid:GenericTool:InitialOperation:ChangeContext)](org.eclipse.sirius.tests.unit.diagram.vsm.VSMVariableTypesValidationTest)  Time elapsed: 0.001 s
13:07:12 matchesExpectationsRegardingValidation[org.eclipse.sirius.tests.unit.diagram.vsm.VSMVariableTypesValidationTest.221: (browseExpression : feature:ownedInteractions in vsmtypes:VSMTypes:SelfTypeInference:Default:ShouldBeValid:GenericTool:InitialOperation:ChangeContext:ChangeContext)](org.eclipse.sirius.tests.unit.diagram.vsm.VSMVariableTypesValidationTest)  Time elapsed: 0.001 s
13:07:12 matchesExpectationsRegardingValidation[org.eclipse.sirius.tests.unit.diagram.vsm.VSMVariableTypesValidationTest.222: (browseExpression : var:elementView in vsmtypes:VSMTypes:SelfTypeInference:Default:ShouldBeValid:GenericTool:InitialOperation:ChangeContext:ChangeContext)](org.eclipse.sirius.tests.unit.diagram.vsm.VSMVariableTypesValidationTest)  Time elapsed: 0.001 s
13:07:12 matchesExpectationsRegardingValidation[org.eclipse.sirius.tests.unit.diagram.vsm.VSMVariableTypesValidationTest.223: (browseExpression : feature:width in vsmtypes:VSMTypes:SelfTypeInference:Default:ShouldBeValid:GenericTool:InitialOperation:ChangeContext:ChangeContext:ChangeContext)](org.eclipse.sirius.tests.unit.diagram.vsm.VSMVariableTypesValidationTest)  Time elapsed: 0.002 s
13:07:12 matchesExpectationsRegardingValidation[org.eclipse.sirius.tests.unit.diagram.vsm.VSMVariableTypesValidationTest.224: (browseExpression : aql:diagram in vsmtypes:VSMTypes:SelfTypeInference:Default:ShouldBeValid:GenericTool:InitialOperation:ChangeContext:ChangeContext)](org.eclipse.sirius.tests.unit.diagram.vsm.VSMVariableTypesValidationTest)  Time elapsed: 0.001 s
13:07:12 matchesExpectationsRegardingValidation[org.eclipse.sirius.tests.unit.diagram.vsm.VSMVariableTypesValidationTest.225: (browseExpression : var:self in vsmtypes:VSMTypes:SelfTypeInference:Default:ShouldBeValid:Check container view when its a container:InitialNodeCreationOperation:ChangeContext)](org.eclipse.sirius.tests.unit.diagram.vsm.VSMVariableTypesValidationTest)  Time elapsed: 0 s
13:07:12 matchesExpectationsRegardingValidation[org.eclipse.sirius.tests.unit.diagram.vsm.VSMVariableTypesValidationTest.226: (browseExpression : var:containerView in vsmtypes:VSMTypes:SelfTypeInference:Default:ShouldBeValid:Check container view when its a container:InitialNodeCreationOperation:ChangeContext:ChangeContext)](org.eclipse.sirius.tests.unit.diagram.vsm.VSMVariableTypesValidationTest)  Time elapsed: 0.001 s
13:07:12 matchesExpectationsRegardingValidation[org.eclipse.sirius.tests.unit.diagram.vsm.VSMVariableTypesValidationTest.227: (browseExpression : aql:self.childrenPresentation = diagram::ContainerLayout::List in vsmtypes:VSMTypes:SelfTypeInference:Default:ShouldBeValid:Check container view when its a container:InitialNodeCreationOperation:ChangeContext:ChangeContext:ChangeContext)](org.eclipse.sirius.tests.unit.diagram.vsm.VSMVariableTypesValidationTest)  Time elapsed: 0 s
13:07:12 matchesExpectationsRegardingValidation[org.eclipse.sirius.tests.unit.diagram.vsm.VSMVariableTypesValidationTest.228: (precondition : aql:views.target->size() > 0 in vsmtypes:VSMTypes:SelfTypeInference:Default:ShouldBeValid:A Menu:Some Operation)](org.eclipse.sirius.tests.unit.diagram.vsm.VSMVariableTypesValidationTest)  Time elapsed: 0 s
13:07:12 matchesExpectationsRegardingValidation[org.eclipse.sirius.tests.unit.diagram.vsm.VSMVariableTypesValidationTest.229: (elementsToSelect : aql:views.target->first() in vsmtypes:VSMTypes:SelfTypeInference:Default:ShouldBeValid:A Menu:Some Operation)](org.eclipse.sirius.tests.unit.diagram.vsm.VSMVariableTypesValidationTest)  Time elapsed: 0 s
13:07:12 matchesExpectationsRegardingValidation[org.eclipse.sirius.tests.unit.diagram.vsm.VSMVariableTypesValidationTest.230: (browseExpression : var:views in vsmtypes:VSMTypes:SelfTypeInference:Default:ShouldBeValid:A Menu:Some Operation:InitialOperation:ChangeContext)](org.eclipse.sirius.tests.unit.diagram.vsm.VSMVariableTypesValidationTest)  Time elapsed: 0 s
13:07:12 matchesExpectationsRegardingValidation[org.eclipse.sirius.tests.unit.diagram.vsm.VSMVariableTypesValidationTest.231: (browseExpression : feature:target in vsmtypes:VSMTypes:SelfTypeInference:Default:ShouldBeValid:A Menu:Some Operation:InitialOperation:ChangeContext:ChangeContext)](org.eclipse.sirius.tests.unit.diagram.vsm.VSMVariableTypesValidationTest)  Time elapsed: 0 s
13:07:12 matchesExpectationsRegardingValidation[org.eclipse.sirius.tests.unit.diagram.vsm.VSMVariableTypesValidationTest.232: (precondition : aql:container.ownedInteractions->size() > 0 and containerView.edges->size() > 0 in vsmtypes:VSMTypes:SelfTypeInference:Default:ShouldBeValid:toDiagram)](org.eclipse.sirius.tests.unit.diagram.vsm.VSMVariableTypesValidationTest)  Time elapsed: 0 s
13:07:12 matchesExpectationsRegardingValidation[org.eclipse.sirius.tests.unit.diagram.vsm.VSMVariableTypesValidationTest.233: (navigationNameExpression : aql:diagramName + ' ' + containerView.documentation + container.ownedInteractions->size() in vsmtypes:VSMTypes:SelfTypeInference:Default:ShouldBeValid:toDiagram)](org.eclipse.sirius.tests.unit.diagram.vsm.VSMVariableTypesValidationTest)  Time elapsed: 0 s
13:07:12 matchesExpectationsRegardingValidation[org.eclipse.sirius.tests.unit.diagram.vsm.VSMVariableTypesValidationTest.234: (navigationNameExpression : var:tableName in vsmtypes:VSMTypes:SelfTypeInference:Default:ShouldBeValid:ToTable)](org.eclipse.sirius.tests.unit.diagram.vsm.VSMVariableTypesValidationTest)  Time elapsed: 0 s
13:07:12 matchesExpectationsRegardingValidation[org.eclipse.sirius.tests.unit.diagram.vsm.VSMVariableTypesValidationTest.235: (browseExpression : var:element in vsmtypes:VSMTypes:SelfTypeInference:Default:ShouldBeValid:DoubleClick on Interaction:InitialOperation:ChangeContext)](org.eclipse.sirius.tests.unit.diagram.vsm.VSMVariableTypesValidationTest)  Time elapsed: 0 s
13:07:12 matchesExpectationsRegardingValidation[org.eclipse.sirius.tests.unit.diagram.vsm.VSMVariableTypesValidationTest.236: (browseExpression : aql:self.executions in vsmtypes:VSMTypes:SelfTypeInference:Default:ShouldBeValid:DoubleClick on Interaction:InitialOperation:ChangeContext:ChangeContext)](org.eclipse.sirius.tests.unit.diagram.vsm.VSMVariableTypesValidationTest)  Time elapsed: 0 s
13:07:12 matchesExpectationsRegardingValidation[org.eclipse.sirius.tests.unit.diagram.vsm.VSMVariableTypesValidationTest.237: (browseExpression : var:elementView in vsmtypes:VSMTypes:SelfTypeInference:Default:ShouldBeValid:DoubleClick on Interaction:InitialOperation:ChangeContext:ChangeContext)](org.eclipse.sirius.tests.unit.diagram.vsm.VSMVariableTypesValidationTest)  Time elapsed: 0 s
13:07:12 matchesExpectationsRegardingValidation[org.eclipse.sirius.tests.unit.diagram.vsm.VSMVariableTypesValidationTest.238: (browseExpression : aql:self.resizeKind in vsmtypes:VSMTypes:SelfTypeInference:Default:ShouldBeValid:DoubleClick on Interaction:InitialOperation:ChangeContext:ChangeContext:ChangeContext)](org.eclipse.sirius.tests.unit.diagram.vsm.VSMVariableTypesValidationTest)  Time elapsed: 0 s
13:07:12 matchesExpectationsRegardingValidation[org.eclipse.sirius.tests.unit.diagram.vsm.VSMVariableTypesValidationTest.239: (precondition : aql:container.ownedInteractions->size() > 0 and source.type <> null and target.messages->size() > 0 and diagram<>null and sourceView <>null and targetView<>null  in vsmtypes:VSMTypes:SelfTypeInference:Default:ShouldBeValid:Reconnect participantnode to interaction node)](org.eclipse.sirius.tests.unit.diagram.vsm.VSMVariableTypesValidationTest)  Time elapsed: 0.001 s
13:07:12 matchesExpectationsRegardingValidation[org.eclipse.sirius.tests.unit.diagram.vsm.VSMVariableTypesValidationTest.240: (browseExpression : var:element in vsmtypes:VSMTypes:SelfTypeInference:Default:ShouldBeValid:Reconnect participantnode to interaction node:InitialOperation:ChangeContext)](org.eclipse.sirius.tests.unit.diagram.vsm.VSMVariableTypesValidationTest)  Time elapsed: 0 s
13:07:12 matchesExpectationsRegardingValidation[org.eclipse.sirius.tests.unit.diagram.vsm.VSMVariableTypesValidationTest.241: (browseExpression : aql:self.receivingEnd in vsmtypes:VSMTypes:SelfTypeInference:Default:ShouldBeValid:Reconnect participantnode to interaction node:InitialOperation:ChangeContext:ChangeContext)](org.eclipse.sirius.tests.unit.diagram.vsm.VSMVariableTypesValidationTest)  Time elapsed: 0 s
13:07:12 matchesExpectationsRegardingValidation[org.eclipse.sirius.tests.unit.diagram.vsm.VSMVariableTypesValidationTest.242: (browseExpression : aql:sourceView.resizeKind in vsmtypes:VSMTypes:SelfTypeInference:Default:ShouldBeValid:Reconnect participantnode to interaction node:InitialOperation:ChangeContext:ChangeContext)](org.eclipse.sirius.tests.unit.diagram.vsm.VSMVariableTypesValidationTest)  Time elapsed: 0.001 s
13:07:12 matchesExpectationsRegardingValidation[org.eclipse.sirius.tests.unit.diagram.vsm.VSMVariableTypesValidationTest.243: (browseExpression : aql:targetView.resizeKind in vsmtypes:VSMTypes:SelfTypeInference:Default:ShouldBeValid:Reconnect participantnode to interaction node:InitialOperation:ChangeContext:ChangeContext)](org.eclipse.sirius.tests.unit.diagram.vsm.VSMVariableTypesValidationTest)  Time elapsed: 0 s
13:07:12 matchesExpectationsRegardingValidation[org.eclipse.sirius.tests.unit.diagram.vsm.VSMVariableTypesValidationTest.244: (browseExpression : aql:source.type in vsmtypes:VSMTypes:SelfTypeInference:Default:ShouldBeValid:Reconnect participantnode to interaction node:InitialOperation:ChangeContext:ChangeContext)](org.eclipse.sirius.tests.unit.diagram.vsm.VSMVariableTypesValidationTest)  Time elapsed: 0.001 s
13:07:12 matchesExpectationsRegardingValidation[org.eclipse.sirius.tests.unit.diagram.vsm.VSMVariableTypesValidationTest.245: (browseExpression : aql:target.states in vsmtypes:VSMTypes:SelfTypeInference:Default:ShouldBeValid:Reconnect participantnode to interaction node:InitialOperation:ChangeContext:ChangeContext)](org.eclipse.sirius.tests.unit.diagram.vsm.VSMVariableTypesValidationTest)  Time elapsed: 0 s
13:07:12 matchesExpectationsRegardingValidation[org.eclipse.sirius.tests.unit.diagram.vsm.VSMVariableTypesValidationTest.246: (precondition : aql:self.oclIsKindOf(interactions::Interaction) in vsmtypes:VSMTypes:SelfTypeInference:Default:ShouldBeValid:Selection Wizard)](org.eclipse.sirius.tests.unit.diagram.vsm.VSMVariableTypesValidationTest)  Time elapsed: 0 s
13:07:12 matchesExpectationsRegardingValidation[org.eclipse.sirius.tests.unit.diagram.vsm.VSMVariableTypesValidationTest.247: (candidatesExpression : aql:self.participants in vsmtypes:VSMTypes:SelfTypeInference:Default:ShouldBeValid:Selection Wizard)](org.eclipse.sirius.tests.unit.diagram.vsm.VSMVariableTypesValidationTest)  Time elapsed: 0 s
13:07:12 matchesExpectationsRegardingValidation[org.eclipse.sirius.tests.unit.diagram.vsm.VSMVariableTypesValidationTest.248: (rootExpression : aql:self in vsmtypes:VSMTypes:SelfTypeInference:Default:ShouldBeValid:Selection Wizard)](org.eclipse.sirius.tests.unit.diagram.vsm.VSMVariableTypesValidationTest)  Time elapsed: 0 s
13:07:12 matchesExpectationsRegardingValidation[org.eclipse.sirius.tests.unit.diagram.vsm.VSMVariableTypesValidationTest.249: (childrenExpression : aql:self.eContents() in vsmtypes:VSMTypes:SelfTypeInference:Default:ShouldBeValid:Selection Wizard)](org.eclipse.sirius.tests.unit.diagram.vsm.VSMVariableTypesValidationTest)  Time elapsed: 0 s
13:07:12 matchesExpectationsRegardingValidation[org.eclipse.sirius.tests.unit.diagram.vsm.VSMVariableTypesValidationTest.250: (expression : aql:element in vsmtypes:VSMTypes:SelfTypeInference:Default:ShouldBeValid:Selection Wizard:InitialOperation:For)](org.eclipse.sirius.tests.unit.diagram.vsm.VSMVariableTypesValidationTest)  Time elapsed: 0 s
13:07:12 matchesExpectationsRegardingValidation[org.eclipse.sirius.tests.unit.diagram.vsm.VSMVariableTypesValidationTest.251: (browseExpression : aql:i.states in vsmtypes:VSMTypes:SelfTypeInference:Default:ShouldBeValid:Selection Wizard:InitialOperation:For:ChangeContext)](org.eclipse.sirius.tests.unit.diagram.vsm.VSMVariableTypesValidationTest)  Time elapsed: 0.001 s
13:07:12 matchesExpectationsRegardingValidation[org.eclipse.sirius.tests.unit.diagram.vsm.VSMVariableTypesValidationTest.252: (precondition : aql:self.participants->size() > 0 and  container.ownedInteractions->size() > 0 in vsmtypes:VSMTypes:SelfTypeInference:Default:ShouldBeValid:Create diag from interaction)](org.eclipse.sirius.tests.unit.diagram.vsm.VSMVariableTypesValidationTest)  Time elapsed: 0 s
13:07:12 matchesExpectationsRegardingValidation[org.eclipse.sirius.tests.unit.diagram.vsm.VSMVariableTypesValidationTest.253: (titleExpression : aql:self.participants->size() in vsmtypes:VSMTypes:SelfTypeInference:Default:ShouldBeValid:Create diag from interaction)](org.eclipse.sirius.tests.unit.diagram.vsm.VSMVariableTypesValidationTest)  Time elapsed: 0.001 s
13:07:12 matchesExpectationsRegardingValidation[org.eclipse.sirius.tests.unit.diagram.vsm.VSMVariableTypesValidationTest.254: (browseExpression : aql:self.participants->first() in vsmtypes:VSMTypes:SelfTypeInference:Default:ShouldBeValid:Create diag from interaction)](org.eclipse.sirius.tests.unit.diagram.vsm.VSMVariableTypesValidationTest)  Time elapsed: 0 s
13:07:12 matchesExpectationsRegardingValidation[org.eclipse.sirius.tests.unit.diagram.vsm.VSMVariableTypesValidationTest.255: (browseExpression : var:self in vsmtypes:VSMTypes:SelfTypeInference:Default:ShouldBeValid:Create diag from interaction:InitialOperation:ChangeContext)](org.eclipse.sirius.tests.unit.diagram.vsm.VSMVariableTypesValidationTest)  Time elapsed: 0 s
13:07:12 matchesExpectationsRegardingValidation[org.eclipse.sirius.tests.unit.diagram.vsm.VSMVariableTypesValidationTest.256: (conditionExpression : aql:self.name = diagramName in vsmtypes:VSMTypes:SelfTypeInference:Default:ShouldBeValid:Create diag from interaction:InitialOperation:ChangeContext:If)](org.eclipse.sirius.tests.unit.diagram.vsm.VSMVariableTypesValidationTest)  Time elapsed: 0 s
13:07:12 matchesExpectationsRegardingValidation[org.eclipse.sirius.tests.unit.diagram.vsm.VSMVariableTypesValidationTest.257: (browseExpression : aql:containerView.edges in vsmtypes:VSMTypes:SelfTypeInference:Default:ShouldBeValid:Create diag from interaction:InitialOperation:ChangeContext:If:ChangeContext)](org.eclipse.sirius.tests.unit.diagram.vsm.VSMVariableTypesValidationTest)  Time elapsed: 0.001 s
13:07:12 matchesExpectationsRegardingValidation[org.eclipse.sirius.tests.unit.diagram.vsm.VSMVariableTypesValidationTest.258: (precondition : aql:self.oclIsKindOf(interactions::Interaction) in vsmtypes:VSMTypes:SelfTypeInference:Default:ShouldBeValid:Pane based selection wizard)](org.eclipse.sirius.tests.unit.diagram.vsm.VSMVariableTypesValidationTest)  Time elapsed: 0 s
13:07:12 matchesExpectationsRegardingValidation[org.eclipse.sirius.tests.unit.diagram.vsm.VSMVariableTypesValidationTest.259: (candidatesExpression : aql:self.participants in vsmtypes:VSMTypes:SelfTypeInference:Default:ShouldBeValid:Pane based selection wizard)](org.eclipse.sirius.tests.unit.diagram.vsm.VSMVariableTypesValidationTest)  Time elapsed: 0 s
13:07:12 matchesExpectationsRegardingValidation[org.eclipse.sirius.tests.unit.diagram.vsm.VSMVariableTypesValidationTest.260: (rootExpression : aql:self in vsmtypes:VSMTypes:SelfTypeInference:Default:ShouldBeValid:Pane based selection wizard)](org.eclipse.sirius.tests.unit.diagram.vsm.VSMVariableTypesValidationTest)  Time elapsed: 0 s
13:07:12 matchesExpectationsRegardingValidation[org.eclipse.sirius.tests.unit.diagram.vsm.VSMVariableTypesValidationTest.261: (childrenExpression : aql:self.eContents() in vsmtypes:VSMTypes:SelfTypeInference:Default:ShouldBeValid:Pane based selection wizard)](org.eclipse.sirius.tests.unit.diagram.vsm.VSMVariableTypesValidationTest)  Time elapsed: 0 s
13:07:12 matchesExpectationsRegardingValidation[org.eclipse.sirius.tests.unit.diagram.vsm.VSMVariableTypesValidationTest.262: (expression : aql:element in vsmtypes:VSMTypes:SelfTypeInference:Default:ShouldBeValid:Pane based selection wizard:InitialOperation:For)](org.eclipse.sirius.tests.unit.diagram.vsm.VSMVariableTypesValidationTest)  Time elapsed: 0.001 s
13:07:12 matchesExpectationsRegardingValidation[org.eclipse.sirius.tests.unit.diagram.vsm.VSMVariableTypesValidationTest.263: (browseExpression : aql:i.states in vsmtypes:VSMTypes:SelfTypeInference:Default:ShouldBeValid:Pane based selection wizard:InitialOperation:For:ChangeContext)](org.eclipse.sirius.tests.unit.diagram.vsm.VSMVariableTypesValidationTest)  Time elapsed: 0 s
13:07:12 matchesExpectationsRegardingValidation[org.eclipse.sirius.tests.unit.diagram.vsm.VSMVariableTypesValidationTest.264: (browseExpression : var:self in vsmtypes:VSMTypes:SelfTypeInference:Default:ShouldBeValid:Ignored:ElementType:InitialOperation:ChangeContext)](org.eclipse.sirius.tests.unit.diagram.vsm.VSMVariableTypesValidationTest)  Time elapsed: 0 s
13:07:12 matchesExpectationsRegardingValidation[org.eclipse.sirius.tests.unit.diagram.vsm.VSMVariableTypesValidationTest.265: (browseExpression : var:arg0 in vsmtypes:VSMTypes:SelfTypeInference:Default:ShouldBeValid:Ignored:ElementType:InitialOperation:ChangeContext:ChangeContext)](org.eclipse.sirius.tests.unit.diagram.vsm.VSMVariableTypesValidationTest)  Time elapsed: 0.001 s
13:07:12 matchesExpectationsRegardingValidation[org.eclipse.sirius.tests.unit.diagram.vsm.VSMVariableTypesValidationTest.266: (browseExpression : feature:name in vsmtypes:VSMTypes:SelfTypeInference:Default:ShouldBeValid:Ignored:ElementType:InitialOperation:ChangeContext:ChangeContext)](org.eclipse.sirius.tests.unit.diagram.vsm.VSMVariableTypesValidationTest)  Time elapsed: 0 s
13:07:12 matchesExpectationsRegardingValidation[org.eclipse.sirius.tests.unit.diagram.vsm.VSMVariableTypesValidationTest.267: (browseExpression : var:self in vsmtypes:VSMTypes:SelfTypeInference:Default:ShouldBeInvalid:Goto self.nonExistent:InitialNodeCreationOperation:ChangeContext)](org.eclipse.sirius.tests.unit.diagram.vsm.VSMVariableTypesValidationTest)  Time elapsed: 0 s
13:07:12 matchesExpectationsRegardingValidation[org.eclipse.sirius.tests.unit.diagram.vsm.VSMVariableTypesValidationTest.268: (browseExpression : feature:nonExistent in vsmtypes:VSMTypes:SelfTypeInference:Default:ShouldBeInvalid:Goto self.nonExistent:InitialNodeCreationOperation:ChangeContext:ChangeContext)](org.eclipse.sirius.tests.unit.diagram.vsm.VSMVariableTypesValidationTest)  Time elapsed: 0 s
13:07:12 matchesExpectationsRegardingValidation[org.eclipse.sirius.tests.unit.diagram.vsm.VSMVariableTypesValidationTest.269: (browseExpression : var:self in vsmtypes:VSMTypes:SelfTypeInference:Default:ShouldBeInvalid:Container Goto self.nonExistent:InitialNodeCreationOperation:ChangeContext)](org.eclipse.sirius.tests.unit.diagram.vsm.VSMVariableTypesValidationTest)  Time elapsed: 0 s
13:07:12 matchesExpectationsRegardingValidation[org.eclipse.sirius.tests.unit.diagram.vsm.VSMVariableTypesValidationTest.270: (browseExpression : feature:nonExistent in vsmtypes:VSMTypes:SelfTypeInference:Default:ShouldBeInvalid:Container Goto self.nonExistent:InitialNodeCreationOperation:ChangeContext:ChangeContext)](org.eclipse.sirius.tests.unit.diagram.vsm.VSMVariableTypesValidationTest)  Time elapsed: 0.001 s
13:07:12 matchesExpectationsRegardingValidation[org.eclipse.sirius.tests.unit.diagram.vsm.VSMVariableTypesValidationTest.271: (browseExpression : var:self in vsmtypes:VSMTypes:SelfTypeInference:Default:ShouldBeInvalid:Domain Participant/InteractionContainer to Interaction/Participant Container:InitEdgeCreationOperation:ChangeContext)](org.eclipse.sirius.tests.unit.diagram.vsm.VSMVariableTypesValidationTest)  Time elapsed: 0 s
13:07:12 matchesExpectationsRegardingValidation[org.eclipse.sirius.tests.unit.diagram.vsm.VSMVariableTypesValidationTest.272: (browseExpression : var:source in vsmtypes:VSMTypes:SelfTypeInference:Default:ShouldBeInvalid:Domain Participant/InteractionContainer to Interaction/Participant Container:InitEdgeCreationOperation:ChangeContext:ChangeContext)](org.eclipse.sirius.tests.unit.diagram.vsm.VSMVariableTypesValidationTest)  Time elapsed: 0 s
13:07:12 matchesExpectationsRegardingValidation[org.eclipse.sirius.tests.unit.diagram.vsm.VSMVariableTypesValidationTest.273: (browseExpression : feature:type in vsmtypes:VSMTypes:SelfTypeInference:Default:ShouldBeInvalid:Domain Participant/InteractionContainer to Interaction/Participant Container:InitEdgeCreationOperation:ChangeContext:ChangeContext:ChangeContext)](org.eclipse.sirius.tests.unit.diagram.vsm.VSMVariableTypesValidationTest)  Time elapsed: 0 s
13:07:12 matchesExpectationsRegardingValidation[org.eclipse.sirius.tests.unit.diagram.vsm.VSMVariableTypesValidationTest.274: (browseExpression : var:target in vsmtypes:VSMTypes:SelfTypeInference:Default:ShouldBeInvalid:Domain Participant/InteractionContainer to Interaction/Participant Container:InitEdgeCreationOperation:ChangeContext:ChangeContext)](org.eclipse.sirius.tests.unit.diagram.vsm.VSMVariableTypesValidationTest)  Time elapsed: 0.001 s
13:07:12 matchesExpectationsRegardingValidation[org.eclipse.sirius.tests.unit.diagram.vsm.VSMVariableTypesValidationTest.275: (browseExpression : feature:participants in vsmtypes:VSMTypes:SelfTypeInference:Default:ShouldBeInvalid:Domain Participant/InteractionContainer to Interaction/Participant Container:InitEdgeCreationOperation:ChangeContext:ChangeContext:ChangeContext)](org.eclipse.sirius.tests.unit.diagram.vsm.VSMVariableTypesValidationTest)  Time elapsed: 0 s
13:07:12 matchesExpectationsRegardingValidation[org.eclipse.sirius.tests.unit.diagram.vsm.VSMVariableTypesValidationTest.276: (browseExpression : var:self in vsmtypes:VSMTypes:SelfTypeInference:Default:ShouldBeInvalid:Domain Participant/InteractionContainer to Interaction/Participant Container With Extra Mapping:InitEdgeCreationOperation:ChangeContext)](org.eclipse.sirius.tests.unit.diagram.vsm.VSMVariableTypesValidationTest)  Time elapsed: 0 s
13:07:12 matchesExpectationsRegardingValidation[org.eclipse.sirius.tests.unit.diagram.vsm.VSMVariableTypesValidationTest.277: (browseExpression : var:self in vsmtypes:VSMTypes:SelfTypeInference:Default:ShouldBeInvalid:Domain Participant/InteractionContainer to Interaction/Participant Container With Extra Mapping:InitEdgeCreationOperation:ChangeContext:ChangeContext)](org.eclipse.sirius.tests.unit.diagram.vsm.VSMVariableTypesValidationTest)  Time elapsed: 0.001 s
13:07:12 matchesExpectationsRegardingValidation[org.eclipse.sirius.tests.unit.diagram.vsm.VSMVariableTypesValidationTest.278: (browseExpression : feature:sendingEnd in vsmtypes:VSMTypes:SelfTypeInference:Default:ShouldBeInvalid:Domain Participant/InteractionContainer to Interaction/Participant Container With Extra Mapping:InitEdgeCreationOperation:ChangeContext:ChangeContext:ChangeContext)](org.eclipse.sirius.tests.unit.diagram.vsm.VSMVariableTypesValidationTest)  Time elapsed: 0 s
13:07:12 matchesExpectationsRegardingValidation[org.eclipse.sirius.tests.unit.diagram.vsm.VSMVariableTypesValidationTest.279: (browseExpression : var:container in vsmtypes:VSMTypes:SelfTypeInference:Default:ShouldBeInvalid:Goto container.nonExistent:InitialNodeCreationOperation:ChangeContext)](org.eclipse.sirius.tests.unit.diagram.vsm.VSMVariableTypesValidationTest)  Time elapsed: 0 s
13:07:12 matchesExpectationsRegardingValidation[org.eclipse.sirius.tests.unit.diagram.vsm.VSMVariableTypesValidationTest.280: (browseExpression : feature:nonExistent in vsmtypes:VSMTypes:SelfTypeInference:Default:ShouldBeInvalid:Goto container.nonExistent:InitialNodeCreationOperation:ChangeContext:ChangeContext)](org.eclipse.sirius.tests.unit.diagram.vsm.VSMVariableTypesValidationTest)  Time elapsed: 0 s
13:07:12 matchesExpectationsRegardingValidation[org.eclipse.sirius.tests.unit.diagram.vsm.VSMVariableTypesValidationTest.281: (browseExpression : var:container in vsmtypes:VSMTypes:SelfTypeInference:Default:ShouldBeInvalid:Container Goto container.nonExistent:InitialNodeCreationOperation:ChangeContext)](org.eclipse.sirius.tests.unit.diagram.vsm.VSMVariableTypesValidationTest)  Time elapsed: 0 s
13:07:12 matchesExpectationsRegardingValidation[org.eclipse.sirius.tests.unit.diagram.vsm.VSMVariableTypesValidationTest.282: (browseExpression : feature:nonExistent in vsmtypes:VSMTypes:SelfTypeInference:Default:ShouldBeInvalid:Container Goto container.nonExistent:InitialNodeCreationOperation:ChangeContext:ChangeContext)](org.eclipse.sirius.tests.unit.diagram.vsm.VSMVariableTypesValidationTest)  Time elapsed: 0 s
13:07:12 matchesExpectationsRegardingValidation[org.eclipse.sirius.tests.unit.diagram.vsm.VSMVariableTypesValidationTest.283: (browseExpression : var:container in vsmtypes:VSMTypes:SelfTypeInference:Default:ShouldBeInvalid:For self.nonExistent:InitialNodeCreationOperation:ChangeContext)](org.eclipse.sirius.tests.unit.diagram.vsm.VSMVariableTypesValidationTest)  Time elapsed: 0 s
13:07:12 matchesExpectationsRegardingValidation[org.eclipse.sirius.tests.unit.diagram.vsm.VSMVariableTypesValidationTest.284: (expression : aql:self.ownedInteractions in vsmtypes:VSMTypes:SelfTypeInference:Default:ShouldBeInvalid:For self.nonExistent:InitialNodeCreationOperation:ChangeContext:For)](org.eclipse.sirius.tests.unit.diagram.vsm.VSMVariableTypesValidationTest)  Time elapsed: 0 s
13:07:12 matchesExpectationsRegardingValidation[org.eclipse.sirius.tests.unit.diagram.vsm.VSMVariableTypesValidationTest.285: (browseExpression : aql:i.nonExistent in vsmtypes:VSMTypes:SelfTypeInference:Default:ShouldBeInvalid:For self.nonExistent:InitialNodeCreationOperation:ChangeContext:For:ChangeContext)](org.eclipse.sirius.tests.unit.diagram.vsm.VSMVariableTypesValidationTest)  Time elapsed: 0.001 s
13:07:12 matchesExpectationsRegardingValidation[org.eclipse.sirius.tests.unit.diagram.vsm.VSMVariableTypesValidationTest.286: (headerLabelExpression : feature:sendingEnd in vsmtypes:VSMTypes:XTable:Message Line)](org.eclipse.sirius.tests.unit.diagram.vsm.VSMVariableTypesValidationTest)  Time elapsed: 0 s
13:07:12 matchesExpectationsRegardingValidation[org.eclipse.sirius.tests.unit.diagram.vsm.VSMVariableTypesValidationTest.287: (predicateExpression : feature:sendingEnd in vsmtypes:VSMTypes:XTable:Message Line:ForegroundConditionalStyle)](org.eclipse.sirius.tests.unit.diagram.vsm.VSMVariableTypesValidationTest)  Time elapsed: 0 s
13:07:12 matchesExpectationsRegardingValidation[org.eclipse.sirius.tests.unit.diagram.vsm.VSMVariableTypesValidationTest.288: (predicateExpression : feature:nonExistent in vsmtypes:VSMTypes:XTable:Message Line:ForegroundConditionalStyle)](org.eclipse.sirius.tests.unit.diagram.vsm.VSMVariableTypesValidationTest)  Time elapsed: 0 s
13:07:12 matchesExpectationsRegardingValidation[org.eclipse.sirius.tests.unit.diagram.vsm.VSMVariableTypesValidationTest.289: (predicateExpression : feature:sendingEnd in vsmtypes:VSMTypes:XTable:Message Line:BackgroundConditionalStyle)](org.eclipse.sirius.tests.unit.diagram.vsm.VSMVariableTypesValidationTest)  Time elapsed: 0.001 s
13:07:12 matchesExpectationsRegardingValidation[org.eclipse.sirius.tests.unit.diagram.vsm.VSMVariableTypesValidationTest.290: (predicateExpression : feature:nonExistent in vsmtypes:VSMTypes:XTable:Message Line:BackgroundConditionalStyle)](org.eclipse.sirius.tests.unit.diagram.vsm.VSMVariableTypesValidationTest)  Time elapsed: 0 s
13:07:12 matchesExpectationsRegardingValidation[org.eclipse.sirius.tests.unit.diagram.vsm.VSMVariableTypesValidationTest.291: (semanticCandidatesExpression : feature:sendingEnd in vsmtypes:VSMTypes:XTable:Message Line:MessageEnd subline)](org.eclipse.sirius.tests.unit.diagram.vsm.VSMVariableTypesValidationTest)  Time elapsed: 0 s
13:07:12 matchesExpectationsRegardingValidation[org.eclipse.sirius.tests.unit.diagram.vsm.VSMVariableTypesValidationTest.292: (headerLabelExpression : feature:context in vsmtypes:VSMTypes:XTable:Message Line:MessageEnd subline)](org.eclipse.sirius.tests.unit.diagram.vsm.VSMVariableTypesValidationTest)  Time elapsed: 0 s
13:07:12 matchesExpectationsRegardingValidation[org.eclipse.sirius.tests.unit.diagram.vsm.VSMVariableTypesValidationTest.293: (elementsToSelect : service:stdEmptyCollection in vsmtypes:VSMTypes:XTable:Message Line:Create MessageEnd)](org.eclipse.sirius.tests.unit.diagram.vsm.VSMVariableTypesValidationTest)  Time elapsed: 0 s
13:07:12 matchesExpectationsRegardingValidation[org.eclipse.sirius.tests.unit.diagram.vsm.VSMVariableTypesValidationTest.294: (browseExpression : var:root in vsmtypes:VSMTypes:XTable:Message Line:Create MessageEnd:ChangeContext)](org.eclipse.sirius.tests.unit.diagram.vsm.VSMVariableTypesValidationTest)  Time elapsed: 0 s
13:07:12 matchesExpectationsRegardingValidation[org.eclipse.sirius.tests.unit.diagram.vsm.VSMVariableTypesValidationTest.295: (browseExpression : var:root in vsmtypes:VSMTypes:XTable:Message Line:Create MessageEnd:ChangeContext:ChangeContext)](org.eclipse.sirius.tests.unit.diagram.vsm.VSMVariableTypesValidationTest)  Time elapsed: 0 s
13:07:12 matchesExpectationsRegardingValidation[org.eclipse.sirius.tests.unit.diagram.vsm.VSMVariableTypesValidationTest.296: (browseExpression : feature:ownedInteractions in vsmtypes:VSMTypes:XTable:Message Line:Create MessageEnd:ChangeContext:ChangeContext:ChangeContext)](org.eclipse.sirius.tests.unit.diagram.vsm.VSMVariableTypesValidationTest)  Time elapsed: 0.001 s
13:07:12 matchesExpectationsRegardingValidation[org.eclipse.sirius.tests.unit.diagram.vsm.VSMVariableTypesValidationTest.297: (browseExpression : var:element in vsmtypes:VSMTypes:XTable:Message Line:Create MessageEnd:ChangeContext:ChangeContext)](org.eclipse.sirius.tests.unit.diagram.vsm.VSMVariableTypesValidationTest)  Time elapsed: 0 s
13:07:12 matchesExpectationsRegardingValidation[org.eclipse.sirius.tests.unit.diagram.vsm.VSMVariableTypesValidationTest.298: (browseExpression : feature:sendingEnd in vsmtypes:VSMTypes:XTable:Message Line:Create MessageEnd:ChangeContext:ChangeContext:ChangeContext)](org.eclipse.sirius.tests.unit.diagram.vsm.VSMVariableTypesValidationTest)  Time elapsed: 0 s
13:07:12 matchesExpectationsRegardingValidation[org.eclipse.sirius.tests.unit.diagram.vsm.VSMVariableTypesValidationTest.299: (browseExpression : var:container in vsmtypes:VSMTypes:XTable:Message Line:Create MessageEnd:ChangeContext:ChangeContext)](org.eclipse.sirius.tests.unit.diagram.vsm.VSMVariableTypesValidationTest)  Time elapsed: 0 s
13:07:12 matchesExpectationsRegardingValidation[org.eclipse.sirius.tests.unit.diagram.vsm.VSMVariableTypesValidationTest.300: (browseExpression : feature:sendingEnd in vsmtypes:VSMTypes:XTable:Message Line:Create MessageEnd:ChangeContext:ChangeContext:ChangeContext)](org.eclipse.sirius.tests.unit.diagram.vsm.VSMVariableTypesValidationTest)  Time elapsed: 0.001 s
13:07:12 matchesExpectationsRegardingValidation[org.eclipse.sirius.tests.unit.diagram.vsm.VSMVariableTypesValidationTest.301: (browseExpression : var:root in vsmtypes:VSMTypes:XTable:Message Line:Delete Message:ChangeContext)](org.eclipse.sirius.tests.unit.diagram.vsm.VSMVariableTypesValidationTest)  Time elapsed: 0 s
13:07:12 matchesExpectationsRegardingValidation[org.eclipse.sirius.tests.unit.diagram.vsm.VSMVariableTypesValidationTest.302: (browseExpression : var:root in vsmtypes:VSMTypes:XTable:Message Line:Delete Message:ChangeContext:ChangeContext)](org.eclipse.sirius.tests.unit.diagram.vsm.VSMVariableTypesValidationTest)  Time elapsed: 0 s
13:07:12 matchesExpectationsRegardingValidation[org.eclipse.sirius.tests.unit.diagram.vsm.VSMVariableTypesValidationTest.303: (browseExpression : feature:ownedInteractions in vsmtypes:VSMTypes:XTable:Message Line:Delete Message:ChangeContext:ChangeContext:ChangeContext)](org.eclipse.sirius.tests.unit.diagram.vsm.VSMVariableTypesValidationTest)  Time elapsed: 0.001 s
13:07:12 matchesExpectationsRegardingValidation[org.eclipse.sirius.tests.unit.diagram.vsm.VSMVariableTypesValidationTest.304: (browseExpression : var:element in vsmtypes:VSMTypes:XTable:Message Line:Delete Message:ChangeContext:ChangeContext)](org.eclipse.sirius.tests.unit.diagram.vsm.VSMVariableTypesValidationTest)  Time elapsed: 0 s
13:07:12 matchesExpectationsRegardingValidation[org.eclipse.sirius.tests.unit.diagram.vsm.VSMVariableTypesValidationTest.305: (browseExpression : feature:sendingEnd in vsmtypes:VSMTypes:XTable:Message Line:Delete Message:ChangeContext:ChangeContext:ChangeContext)](org.eclipse.sirius.tests.unit.diagram.vsm.VSMVariableTypesValidationTest)  Time elapsed: 0 s
13:07:12 matchesExpectationsRegardingValidation[org.eclipse.sirius.tests.unit.diagram.vsm.VSMVariableTypesValidationTest.306: (headerLabelExpression : feature:type in vsmtypes:VSMTypes:XTable:Participant Column)](org.eclipse.sirius.tests.unit.diagram.vsm.VSMVariableTypesValidationTest)  Time elapsed: 0 s
13:07:12 matchesExpectationsRegardingValidation[org.eclipse.sirius.tests.unit.diagram.vsm.VSMVariableTypesValidationTest.307: (elementsToSelect : service:stdEmptyCollection in vsmtypes:VSMTypes:XTable:Participant Column:Create Participant)](org.eclipse.sirius.tests.unit.diagram.vsm.VSMVariableTypesValidationTest)  Time elapsed: 0 s
13:07:12 matchesExpectationsRegardingValidation[org.eclipse.sirius.tests.unit.diagram.vsm.VSMVariableTypesValidationTest.308: (browseExpression : var:root in vsmtypes:VSMTypes:XTable:Participant Column:Create Participant:ChangeContext)](org.eclipse.sirius.tests.unit.diagram.vsm.VSMVariableTypesValidationTest)  Time elapsed: 0 s
13:07:12 matchesExpectationsRegardingValidation[org.eclipse.sirius.tests.unit.diagram.vsm.VSMVariableTypesValidationTest.309: (browseExpression : var:root in vsmtypes:VSMTypes:XTable:Participant Column:Create Participant:ChangeContext:ChangeContext)](org.eclipse.sirius.tests.unit.diagram.vsm.VSMVariableTypesValidationTest)  Time elapsed: 0 s
13:07:12 matchesExpectationsRegardingValidation[org.eclipse.sirius.tests.unit.diagram.vsm.VSMVariableTypesValidationTest.310: (browseExpression : feature:ownedInteractions in vsmtypes:VSMTypes:XTable:Participant Column:Create Participant:ChangeContext:ChangeContext:ChangeContext)](org.eclipse.sirius.tests.unit.diagram.vsm.VSMVariableTypesValidationTest)  Time elapsed: 0 s
13:07:12 matchesExpectationsRegardingValidation[org.eclipse.sirius.tests.unit.diagram.vsm.VSMVariableTypesValidationTest.311: (browseExpression : var:element in vsmtypes:VSMTypes:XTable:Participant Column:Create Participant:ChangeContext:ChangeContext)](org.eclipse.sirius.tests.unit.diagram.vsm.VSMVariableTypesValidationTest)  Time elapsed: 0 s
13:07:12 matchesExpectationsRegardingValidation[org.eclipse.sirius.tests.unit.diagram.vsm.VSMVariableTypesValidationTest.312: (browseExpression : feature:type in vsmtypes:VSMTypes:XTable:Participant Column:Create Participant:ChangeContext:ChangeContext:ChangeContext)](org.eclipse.sirius.tests.unit.diagram.vsm.VSMVariableTypesValidationTest)  Time elapsed: 0.001 s
13:07:12 matchesExpectationsRegardingValidation[org.eclipse.sirius.tests.unit.diagram.vsm.VSMVariableTypesValidationTest.313: (browseExpression : var:container in vsmtypes:VSMTypes:XTable:Participant Column:Create Participant:ChangeContext:ChangeContext)](org.eclipse.sirius.tests.unit.diagram.vsm.VSMVariableTypesValidationTest)  Time elapsed: 0 s
13:07:12 matchesExpectationsRegardingValidation[org.eclipse.sirius.tests.unit.diagram.vsm.VSMVariableTypesValidationTest.314: (browseExpression : feature:type in vsmtypes:VSMTypes:XTable:Participant Column:Create Participant:ChangeContext:ChangeContext:ChangeContext)](org.eclipse.sirius.tests.unit.diagram.vsm.VSMVariableTypesValidationTest)  Time elapsed: 0 s
13:07:12 matchesExpectationsRegardingValidation[org.eclipse.sirius.tests.unit.diagram.vsm.VSMVariableTypesValidationTest.315: (browseExpression : var:root in vsmtypes:VSMTypes:XTable:Participant Column:Delete Participant:ChangeContext)](org.eclipse.sirius.tests.unit.diagram.vsm.VSMVariableTypesValidationTest)  Time elapsed: 0 s
13:07:12 matchesExpectationsRegardingValidation[org.eclipse.sirius.tests.unit.diagram.vsm.VSMVariableTypesValidationTest.316: (browseExpression : var:root in vsmtypes:VSMTypes:XTable:Participant Column:Delete Participant:ChangeContext:ChangeContext)](org.eclipse.sirius.tests.unit.diagram.vsm.VSMVariableTypesValidationTest)  Time elapsed: 0.001 s
13:07:12 matchesExpectationsRegardingValidation[org.eclipse.sirius.tests.unit.diagram.vsm.VSMVariableTypesValidationTest.317: (browseExpression : feature:ownedInteractions in vsmtypes:VSMTypes:XTable:Participant Column:Delete Participant:ChangeContext:ChangeContext:ChangeContext)](org.eclipse.sirius.tests.unit.diagram.vsm.VSMVariableTypesValidationTest)  Time elapsed: 0 s
13:07:12 matchesExpectationsRegardingValidation[org.eclipse.sirius.tests.unit.diagram.vsm.VSMVariableTypesValidationTest.318: (browseExpression : var:element in vsmtypes:VSMTypes:XTable:Participant Column:Delete Participant:ChangeContext:ChangeContext)](org.eclipse.sirius.tests.unit.diagram.vsm.VSMVariableTypesValidationTest)  Time elapsed: 0 s
13:07:12 matchesExpectationsRegardingValidation[org.eclipse.sirius.tests.unit.diagram.vsm.VSMVariableTypesValidationTest.319: (browseExpression : feature:type in vsmtypes:VSMTypes:XTable:Participant Column:Delete Participant:ChangeContext:ChangeContext:ChangeContext)](org.eclipse.sirius.tests.unit.diagram.vsm.VSMVariableTypesValidationTest)  Time elapsed: 0.001 s
13:07:12 matchesExpectationsRegardingValidation[org.eclipse.sirius.tests.unit.diagram.vsm.VSMVariableTypesValidationTest.320: (labelExpression : X in vsmtypes:VSMTypes:XTable:Intersection Message Participant)](org.eclipse.sirius.tests.unit.diagram.vsm.VSMVariableTypesValidationTest)  Time elapsed: 0 s
13:07:12 matchesExpectationsRegardingValidation[org.eclipse.sirius.tests.unit.diagram.vsm.VSMVariableTypesValidationTest.321: (columnFinderExpression : aql:self.sendingEnd.context in vsmtypes:VSMTypes:XTable:Intersection Message Participant)](org.eclipse.sirius.tests.unit.diagram.vsm.VSMVariableTypesValidationTest)  Time elapsed: 0.027 s
13:07:12 matchesExpectationsRegardingValidation[org.eclipse.sirius.tests.unit.diagram.vsm.VSMVariableTypesValidationTest.322: (browseExpression : var:root in vsmtypes:VSMTypes:XTable:Intersection Message Participant:LabelEditTool:ChangeContext)](org.eclipse.sirius.tests.unit.diagram.vsm.VSMVariableTypesValidationTest)  Time elapsed: 0 s
13:07:12 matchesExpectationsRegardingValidation[org.eclipse.sirius.tests.unit.diagram.vsm.VSMVariableTypesValidationTest.323: (browseExpression : var:lineSemantic in vsmtypes:VSMTypes:XTable:Intersection Message Participant:LabelEditTool:ChangeContext:ChangeContext)](org.eclipse.sirius.tests.unit.diagram.vsm.VSMVariableTypesValidationTest)  Time elapsed: 0.001 s
13:07:12 matchesExpectationsRegardingValidation[org.eclipse.sirius.tests.unit.diagram.vsm.VSMVariableTypesValidationTest.324: (browseExpression : feature:sendingEnd in vsmtypes:VSMTypes:XTable:Intersection Message Participant:LabelEditTool:ChangeContext:ChangeContext:ChangeContext)](org.eclipse.sirius.tests.unit.diagram.vsm.VSMVariableTypesValidationTest)  Time elapsed: 0 s
13:07:12 matchesExpectationsRegardingValidation[org.eclipse.sirius.tests.unit.diagram.vsm.VSMVariableTypesValidationTest.325: (browseExpression : var:columnSemantic in vsmtypes:VSMTypes:XTable:Intersection Message Participant:LabelEditTool:ChangeContext:ChangeContext)](org.eclipse.sirius.tests.unit.diagram.vsm.VSMVariableTypesValidationTest)  Time elapsed: 0 s
13:07:12 matchesExpectationsRegardingValidation[org.eclipse.sirius.tests.unit.diagram.vsm.VSMVariableTypesValidationTest.326: (browseExpression : feature:type in vsmtypes:VSMTypes:XTable:Intersection Message Participant:LabelEditTool:ChangeContext:ChangeContext:ChangeContext)](org.eclipse.sirius.tests.unit.diagram.vsm.VSMVariableTypesValidationTest)  Time elapsed: 0.001 s
13:07:12 matchesExpectationsRegardingValidation[org.eclipse.sirius.tests.unit.diagram.vsm.VSMVariableTypesValidationTest.327: (browseExpression : var:root in vsmtypes:VSMTypes:XTable:Intersection Message Participant:Create Cell:ChangeContext)](org.eclipse.sirius.tests.unit.diagram.vsm.VSMVariableTypesValidationTest)  Time elapsed: 0 s
13:07:12 matchesExpectationsRegardingValidation[org.eclipse.sirius.tests.unit.diagram.vsm.VSMVariableTypesValidationTest.328: (browseExpression : var:lineSemantic in vsmtypes:VSMTypes:XTable:Intersection Message Participant:Create Cell:ChangeContext:ChangeContext)](org.eclipse.sirius.tests.unit.diagram.vsm.VSMVariableTypesValidationTest)  Time elapsed: 0 s
13:07:12 matchesExpectationsRegardingValidation[org.eclipse.sirius.tests.unit.diagram.vsm.VSMVariableTypesValidationTest.329: (browseExpression : feature:sendingEnd in vsmtypes:VSMTypes:XTable:Intersection Message Participant:Create Cell:ChangeContext:ChangeContext:ChangeContext)](org.eclipse.sirius.tests.unit.diagram.vsm.VSMVariableTypesValidationTest)  Time elapsed: 0.001 s
13:07:12 matchesExpectationsRegardingValidation[org.eclipse.sirius.tests.unit.diagram.vsm.VSMVariableTypesValidationTest.330: (browseExpression : var:columnSemantic in vsmtypes:VSMTypes:XTable:Intersection Message Participant:Create Cell:ChangeContext:ChangeContext)](org.eclipse.sirius.tests.unit.diagram.vsm.VSMVariableTypesValidationTest)  Time elapsed: 0 s
13:07:12 matchesExpectationsRegardingValidation[org.eclipse.sirius.tests.unit.diagram.vsm.VSMVariableTypesValidationTest.331: (browseExpression : feature:type in vsmtypes:VSMTypes:XTable:Intersection Message Participant:Create Cell:ChangeContext:ChangeContext:ChangeContext)](org.eclipse.sirius.tests.unit.diagram.vsm.VSMVariableTypesValidationTest)  Time elapsed: 0 s
13:07:12 matchesExpectationsRegardingValidation[org.eclipse.sirius.tests.unit.diagram.vsm.VSMVariableTypesValidationTest.332: (elementsToSelect : service:stdEmptyCollection in vsmtypes:VSMTypes:EditionTable:Participants:create message)](org.eclipse.sirius.tests.unit.diagram.vsm.VSMVariableTypesValidationTest)  Time elapsed: 0 s
13:07:12 matchesExpectationsRegardingValidation[org.eclipse.sirius.tests.unit.diagram.vsm.VSMVariableTypesValidationTest.333: (browseExpression : var:root in vsmtypes:VSMTypes:EditionTable:Participants:create message:ChangeContext)](org.eclipse.sirius.tests.unit.diagram.vsm.VSMVariableTypesValidationTest)  Time elapsed: 0 s
13:07:12 matchesExpectationsRegardingValidation[org.eclipse.sirius.tests.unit.diagram.vsm.VSMVariableTypesValidationTest.334: (browseExpression : var:root in vsmtypes:VSMTypes:EditionTable:Participants:create message:ChangeContext:ChangeContext)](org.eclipse.sirius.tests.unit.diagram.vsm.VSMVariableTypesValidationTest)  Time elapsed: 0.001 s
13:07:12 matchesExpectationsRegardingValidation[org.eclipse.sirius.tests.unit.diagram.vsm.VSMVariableTypesValidationTest.335: (browseExpression : feature:ownedInteractions in vsmtypes:VSMTypes:EditionTable:Participants:create message:ChangeContext:ChangeContext:ChangeContext)](org.eclipse.sirius.tests.unit.diagram.vsm.VSMVariableTypesValidationTest)  Time elapsed: 0 s
13:07:12 matchesExpectationsRegardingValidation[org.eclipse.sirius.tests.unit.diagram.vsm.VSMVariableTypesValidationTest.336: (browseExpression : var:element in vsmtypes:VSMTypes:EditionTable:Participants:create message:ChangeContext:ChangeContext)](org.eclipse.sirius.tests.unit.diagram.vsm.VSMVariableTypesValidationTest)  Time elapsed: 0 s
13:07:12 matchesExpectationsRegardingValidation[org.eclipse.sirius.tests.unit.diagram.vsm.VSMVariableTypesValidationTest.337: (browseExpression : feature:type in vsmtypes:VSMTypes:EditionTable:Participants:create message:ChangeContext:ChangeContext:ChangeContext)](org.eclipse.sirius.tests.unit.diagram.vsm.VSMVariableTypesValidationTest)  Time elapsed: 0.001 s
13:07:12 matchesExpectationsRegardingValidation[org.eclipse.sirius.tests.unit.diagram.vsm.VSMVariableTypesValidationTest.338: (browseExpression : var:container in vsmtypes:VSMTypes:EditionTable:Participants:create message:ChangeContext:ChangeContext)](org.eclipse.sirius.tests.unit.diagram.vsm.VSMVariableTypesValidationTest)  Time elapsed: 0 s
13:07:12 matchesExpectationsRegardingValidation[org.eclipse.sirius.tests.unit.diagram.vsm.VSMVariableTypesValidationTest.339: (browseExpression : feature:type in vsmtypes:VSMTypes:EditionTable:Participants:create message:ChangeContext:ChangeContext:ChangeContext)](org.eclipse.sirius.tests.unit.diagram.vsm.VSMVariableTypesValidationTest)  Time elapsed: 0 s
13:07:12 matchesExpectationsRegardingValidation[org.eclipse.sirius.tests.unit.diagram.vsm.VSMVariableTypesValidationTest.340: (elementsToSelect : service:stdEmptyCollection in vsmtypes:VSMTypes:EditionTable:Create new Participant)](org.eclipse.sirius.tests.unit.diagram.vsm.VSMVariableTypesValidationTest)  Time elapsed: 0 s
13:07:12 matchesExpectationsRegardingValidation[org.eclipse.sirius.tests.unit.diagram.vsm.VSMVariableTypesValidationTest.341: (browseExpression : var:root in vsmtypes:VSMTypes:EditionTable:Create new Participant:ChangeContext)](org.eclipse.sirius.tests.unit.diagram.vsm.VSMVariableTypesValidationTest)  Time elapsed: 0 s
13:07:12 matchesExpectationsRegardingValidation[org.eclipse.sirius.tests.unit.diagram.vsm.VSMVariableTypesValidationTest.342: (browseExpression : var:root in vsmtypes:VSMTypes:EditionTable:Create new Participant:ChangeContext:ChangeContext)](org.eclipse.sirius.tests.unit.diagram.vsm.VSMVariableTypesValidationTest)  Time elapsed: 0.001 s
13:07:12 matchesExpectationsRegardingValidation[org.eclipse.sirius.tests.unit.diagram.vsm.VSMVariableTypesValidationTest.343: (browseExpression : feature:ownedInteractions in vsmtypes:VSMTypes:EditionTable:Create new Participant:ChangeContext:ChangeContext:ChangeContext)](org.eclipse.sirius.tests.unit.diagram.vsm.VSMVariableTypesValidationTest)  Time elapsed: 0 s
13:07:12 matchesExpectationsRegardingValidation[org.eclipse.sirius.tests.unit.diagram.vsm.VSMVariableTypesValidationTest.344: (browseExpression : var:element in vsmtypes:VSMTypes:EditionTable:Create new Participant:ChangeContext:ChangeContext)](org.eclipse.sirius.tests.unit.diagram.vsm.VSMVariableTypesValidationTest)  Time elapsed: 0 s
13:07:12 matchesExpectationsRegardingValidation[org.eclipse.sirius.tests.unit.diagram.vsm.VSMVariableTypesValidationTest.345: (browseExpression : feature:ownedInteractions in vsmtypes:VSMTypes:EditionTable:Create new Participant:ChangeContext:ChangeContext:ChangeContext)](org.eclipse.sirius.tests.unit.diagram.vsm.VSMVariableTypesValidationTest)  Time elapsed: 0.001 s
13:07:12 matchesExpectationsRegardingValidation[org.eclipse.sirius.tests.unit.diagram.vsm.VSMVariableTypesValidationTest.346: (browseExpression : var:container in vsmtypes:VSMTypes:EditionTable:Create new Participant:ChangeContext:ChangeContext)](org.eclipse.sirius.tests.unit.diagram.vsm.VSMVariableTypesValidationTest)  Time elapsed: 0 s
13:07:12 matchesExpectationsRegardingValidation[org.eclipse.sirius.tests.unit.diagram.vsm.VSMVariableTypesValidationTest.347: (browseExpression : feature:ownedInteractions in vsmtypes:VSMTypes:EditionTable:Create new Participant:ChangeContext:ChangeContext:ChangeContext)](org.eclipse.sirius.tests.unit.diagram.vsm.VSMVariableTypesValidationTest)  Time elapsed: 0 s
13:07:12 matchesExpectationsRegardingValidation[org.eclipse.sirius.tests.unit.diagram.vsm.VSMVariableTypesValidationTest.348: (labelExpression : feature:name in vsmtypes:VSMTypes:EditionTable:name)](org.eclipse.sirius.tests.unit.diagram.vsm.VSMVariableTypesValidationTest)  Time elapsed: 0 s
13:07:12 testEnablingSiriusWithExtension(org.eclipse.sirius.tests.unit.api.componentization.DiagramCustomizationTest)  Time elapsed: 0.057 s
13:07:12 testEnablingSiriusWithExtensionTwice(org.eclipse.sirius.tests.unit.api.componentization.DiagramCustomizationTest)  Time elapsed: 0.046 s
13:07:12 testGetMappingsOverride(org.eclipse.sirius.tests.unit.api.mm.MMTest)  Time elapsed: 0.049 s
13:07:12 testIdentifiedElementInheritence(org.eclipse.sirius.tests.unit.api.mm.MMTest)  Time elapsed: 0.055 s
13:07:12 testParticipantCreationToolCreatesInstanceRoleAndLifeline(org.eclipse.sirius.tests.unit.diagram.sequence.SiriusSequenceDiagramTests)  Time elapsed: 0.432 s
13:07:12 testParticipantCreationToolCreatesOneSemanticElement(org.eclipse.sirius.tests.unit.diagram.sequence.SiriusSequenceDiagramTests)  Time elapsed: 0.213 s
13:07:12 testExposedAdapterFactories(org.eclipse.sirius.tests.unit.diagram.sequence.vsm.edit.SequenceAdapterFactoryRegistryTest)  Time elapsed: 0.001 s
13:07:12 testExecutionToExecutionMappingRules(org.eclipse.sirius.tests.unit.diagram.sequence.template.TemplateToDiagramDescriptionTest)  Time elapsed: 0.016 s
13:07:12 testTemplateToDiagramRule(org.eclipse.sirius.tests.unit.diagram.sequence.template.TemplateToDiagramDescriptionTest)  Time elapsed: 0.001 s
13:07:12 testDiagramKeepingCustomData(org.eclipse.sirius.tests.unit.diagram.sequence.template.TemplateToDiagramDescriptionTest)  Time elapsed: 0 s
13:07:12 testLifelineToNodeMappingRules(org.eclipse.sirius.tests.unit.diagram.sequence.template.TemplateToDiagramDescriptionTest)  Time elapsed: 0.002 s
13:07:12 testExecutionToExecutionMappingRulesRecursivity(org.eclipse.sirius.tests.unit.diagram.sequence.template.TemplateToDiagramDescriptionTest)  Time elapsed: 0.001 s
13:07:12 testChildElementIsDeletedWhenSourceIsDeleted(org.eclipse.sirius.tests.unit.diagram.sequence.template.TemplateToDiagramDescriptionTest)  Time elapsed: 0.001 s
13:07:12 testDiagramIsRecreatedWhenRemoved(org.eclipse.sirius.tests.unit.diagram.sequence.template.TemplateToDiagramDescriptionTest)  Time elapsed: 0 s
13:07:12 testBasicMessageToEdgeMappingRules(org.eclipse.sirius.tests.unit.diagram.sequence.template.TemplateToDiagramDescriptionTest)  Time elapsed: 0.002 s
13:07:12 testExecutionToExecutionAndSubExecutionsRules(org.eclipse.sirius.tests.unit.diagram.sequence.template.TemplateToDiagramDescriptionTest)  Time elapsed: 0.001 s
13:07:12 testDiagramKeepingCustomChilds(org.eclipse.sirius.tests.unit.diagram.sequence.template.TemplateToDiagramDescriptionTest)  Time elapsed: 0 s
13:07:12 testSequenceSpecificMappingsAvailable(org.eclipse.sirius.tests.unit.diagram.sequence.NewChildMenusExtensionTests)  Time elapsed: 0.024 s
13:07:12 testSequenceSpecificToolsAvailable(org.eclipse.sirius.tests.unit.diagram.sequence.NewChildMenusExtensionTests)  Time elapsed: 0.066 s
13:07:12 test_execution_identification(org.eclipse.sirius.tests.unit.diagram.sequence.structure.SequenceDiagramElementsIdentificationTests)  Time elapsed: 0.387 s
13:07:12 test_diagram_identification(org.eclipse.sirius.tests.unit.diagram.sequence.structure.SequenceDiagramElementsIdentificationTests)  Time elapsed: 0.428 s
13:07:12 test_instancerole_identification(org.eclipse.sirius.tests.unit.diagram.sequence.structure.SequenceDiagramElementsIdentificationTests)  Time elapsed: 0.372 s
13:07:12 test_operand_fragment_identification(org.eclipse.sirius.tests.unit.diagram.sequence.structure.SequenceDiagramElementsIdentificationTests)  Time elapsed: 0.348 s
13:07:12 test_observation_point_identification(org.eclipse.sirius.tests.unit.diagram.sequence.structure.SequenceDiagramElementsIdentificationTests)  Time elapsed: 0.474 s
13:07:12 test_message_identification(org.eclipse.sirius.tests.unit.diagram.sequence.structure.SequenceDiagramElementsIdentificationTests)  Time elapsed: 0.339 s
13:07:12 test_state_identification(org.eclipse.sirius.tests.unit.diagram.sequence.structure.SequenceDiagramElementsIdentificationTests)  Time elapsed: 0.332 s
13:07:12 test_lost_message_end_identification(org.eclipse.sirius.tests.unit.diagram.sequence.structure.SequenceDiagramElementsIdentificationTests)  Time elapsed: 0.408 s
13:07:12 test_lifeline_identification(org.eclipse.sirius.tests.unit.diagram.sequence.structure.SequenceDiagramElementsIdentificationTests)  Time elapsed: 0.327 s
13:07:12 test_combined_fragment_identification(org.eclipse.sirius.tests.unit.diagram.sequence.structure.SequenceDiagramElementsIdentificationTests)  Time elapsed: 0.291 s
13:07:12 test_end_of_life_identification(org.eclipse.sirius.tests.unit.diagram.sequence.structure.SequenceDiagramElementsIdentificationTests)  Time elapsed: 0.347 s
13:07:12 test_interaction_use_identification(org.eclipse.sirius.tests.unit.diagram.sequence.structure.SequenceDiagramElementsIdentificationTests)  Time elapsed: 0.315 s
13:07:12 test_navigation_diagram_to_lifelines(org.eclipse.sirius.tests.unit.diagram.sequence.structure.SequenceDiagramElementsNavigationTests)  Time elapsed: 0.342 s
13:07:12 test_find_all_observation_point_on_diagram(org.eclipse.sirius.tests.unit.diagram.sequence.structure.SequenceDiagramElementsNavigationTests)  Time elapsed: 0.414 s
13:07:12 test_non_reflective_synchronous_message(org.eclipse.sirius.tests.unit.diagram.sequence.structure.SequenceDiagramElementsNavigationTests)  Time elapsed: 0.391 s
13:07:12 test_find_all_states_on_diagram(org.eclipse.sirius.tests.unit.diagram.sequence.structure.SequenceDiagramElementsNavigationTests)  Time elapsed: 0.322 s
13:07:12 test_find_all_messages_on_diagram(org.eclipse.sirius.tests.unit.diagram.sequence.structure.SequenceDiagramElementsNavigationTests)  Time elapsed: 0.329 s
13:07:12 test_find_all_executions_on_diagram(org.eclipse.sirius.tests.unit.diagram.sequence.structure.SequenceDiagramElementsNavigationTests)  Time elapsed: 0.355 s
13:07:12 test_find_all_lost_messages_end_on_diagram(org.eclipse.sirius.tests.unit.diagram.sequence.structure.SequenceDiagramElementsNavigationTests)  Time elapsed: 0.361 s
13:07:12 test_find_all_interaction_uses_on_diagram(org.eclipse.sirius.tests.unit.diagram.sequence.structure.SequenceDiagramElementsNavigationWithCFTests)  Time elapsed: 0.304 s
13:07:12 test_find_all_combined_fragments_on_diagram(org.eclipse.sirius.tests.unit.diagram.sequence.structure.SequenceDiagramElementsNavigationWithCFTests)  Time elapsed: 0.297 s
13:07:12 test_find_all_operands_on_diagram(org.eclipse.sirius.tests.unit.diagram.sequence.structure.SequenceDiagramElementsNavigationWithCFTests)  Time elapsed: 0.299 s
13:07:12 test_sub_events_message(org.eclipse.sirius.tests.unit.diagram.sequence.structure.SequenceDiagramElementsSubEventsTests)  Time elapsed: 0.352 s
13:07:12 test_sub_events_lifeline(org.eclipse.sirius.tests.unit.diagram.sequence.structure.SequenceDiagramElementsSubEventsTests)  Time elapsed: 0.368 s
13:07:12 test_sub_events_combined_fragment(org.eclipse.sirius.tests.unit.diagram.sequence.structure.SequenceDiagramElementsSubEventsTests)  Time elapsed: 0.332 s
13:07:12 test_sub_events_state(org.eclipse.sirius.tests.unit.diagram.sequence.structure.SequenceDiagramElementsSubEventsTests)  Time elapsed: 0.347 s
13:07:12 test_sub_events_operand(org.eclipse.sirius.tests.unit.diagram.sequence.structure.SequenceDiagramElementsSubEventsTests)  Time elapsed: 0.347 s
13:07:12 test_sub_events_execution(org.eclipse.sirius.tests.unit.diagram.sequence.structure.SequenceDiagramElementsSubEventsTests)  Time elapsed: 0.351 s
13:07:12 test_sub_events_interaction_use(org.eclipse.sirius.tests.unit.diagram.sequence.structure.SequenceDiagramElementsSubEventsTests)  Time elapsed: 0.358 s
13:07:12 test_sub_events_message(org.eclipse.sirius.tests.unit.diagram.sequence.structure.SequenceDiagramElementsParentEventsTests)  Time elapsed: 0.342 s
13:07:12 test_sub_events_lifeline(org.eclipse.sirius.tests.unit.diagram.sequence.structure.SequenceDiagramElementsParentEventsTests)  Time elapsed: 0.356 s
13:07:12 test_sub_events_combined_fragment(org.eclipse.sirius.tests.unit.diagram.sequence.structure.SequenceDiagramElementsParentEventsTests)  Time elapsed: 0.383 s
13:07:12 test_sub_events_operand(org.eclipse.sirius.tests.unit.diagram.sequence.structure.SequenceDiagramElementsParentEventsTests)  Time elapsed: 0.357 s
13:07:12 test_sub_events_execution(org.eclipse.sirius.tests.unit.diagram.sequence.structure.SequenceDiagramElementsParentEventsTests)  Time elapsed: 0.337 s
13:07:12 test_sub_events_interaction_use(org.eclipse.sirius.tests.unit.diagram.sequence.structure.SequenceDiagramElementsParentEventsTests)  Time elapsed: 0.322 s
13:07:12 testArrangeAllAfterSequenceDiagramCreationGeneratesValidBounds(org.eclipse.sirius.tests.unit.diagram.sequence.LifelinesSouthCenteredBorderItemLocatorTest)  Time elapsed: 0.624 s
13:07:12 testGMFTextCreationInALifelineNotPossible(org.eclipse.sirius.tests.unit.diagram.sequence.LifelineTests)  Time elapsed: 0.194 s
13:07:12 testGMFNoteUnset(org.eclipse.sirius.tests.unit.diagram.sequence.LifelineTests)  Time elapsed: 0.321 s
13:07:12 testGMFNoteCreationInALifelineNotPossible(org.eclipse.sirius.tests.unit.diagram.sequence.LifelineTests)  Time elapsed: 0.198 s
13:07:12 testGMFTextDropInALifelineNotPossible(org.eclipse.sirius.tests.unit.diagram.sequence.LifelineTests)  Time elapsed: 0.2 s
13:07:12 testGMFNoteDropInALifelineNotPossible(org.eclipse.sirius.tests.unit.diagram.sequence.LifelineTests)  Time elapsed: 0.2 s
13:07:12 testExecutionDeletion1Bis(org.eclipse.sirius.tests.unit.diagram.sequence.ExecutionTests)  Time elapsed: 0.735 s
13:07:12 testDiagramConsistency(org.eclipse.sirius.tests.unit.diagram.sequence.ExecutionTests)  Time elapsed: 0.254 s
13:07:12 testExecutionDeletion1(org.eclipse.sirius.tests.unit.diagram.sequence.ExecutionTests)  Time elapsed: 0.746 s
13:07:12 testHeaderHeightSize(org.eclipse.sirius.tests.unit.diagram.sequence.HeaderHeightTests)  Time elapsed: 0.209 s
13:07:12 testSequenceSpecificsVariablesAccess(org.eclipse.sirius.tests.unit.diagram.sequence.vsm.interpreted.expression.variables.AbstractToolDescription_Precondition_AbstractVariable_Access_Tests)  Time elapsed: 0.665 s
13:07:12 testMigrationIsNeededOnData(org.eclipse.sirius.tests.unit.diagram.sequence.CollapseFilterSequenceMigrationTest)  Time elapsed: 0.072 s
13:07:12 testSequenceCollapseFilterMigrationDoneOnce(org.eclipse.sirius.tests.unit.diagram.sequence.CollapseFilterSequenceMigrationTest)  Time elapsed: 0.121 s
13:07:12 testSequenceCollapseFilterMigrationDone(org.eclipse.sirius.tests.unit.diagram.sequence.CollapseFilterSequenceMigrationTest)  Time elapsed: 0.215 s
13:07:12 testMigrationIsNeededOnData(org.eclipse.sirius.tests.unit.diagram.sequence.SequenceMessageFlagResetMigrationTest)  Time elapsed: 0.067 s
13:07:12 testSequenceMessageFlagMigrationDoneOnce(org.eclipse.sirius.tests.unit.diagram.sequence.SequenceMessageFlagResetMigrationTest)  Time elapsed: 0.128 s
13:07:12 testSequenceMessageFlagMigrationDone(org.eclipse.sirius.tests.unit.diagram.sequence.SequenceMessageFlagResetMigrationTest)  Time elapsed: 0.222 s
13:07:12 testNoteAttachmentIsVisible(org.eclipse.sirius.tests.unit.diagram.sequence.OperandFigureAndEdgesTest)  Time elapsed: 0.203 s
13:07:12 testCheckConsistantStoreFormat(org.eclipse.sirius.tests.unit.diagram.format.data.SiriusFormatDataManagerForSemanticElementsTest)  Time elapsed: 1.994 s
13:07:12 testCheckNumberOfStoredFormats(org.eclipse.sirius.tests.unit.diagram.format.data.SiriusFormatDataManagerForSemanticElementsTest)  Time elapsed: 1.637 s
13:07:12 testBasicStoreFormat(org.eclipse.sirius.tests.unit.diagram.format.data.SiriusFormatDataManagerForSemanticElementsTest)  Time elapsed: 1.694 s
13:07:12 testStoreEdgeFormatData(org.eclipse.sirius.tests.unit.diagram.format.data.SiriusFormatDataManagerForSemanticElementsTest)  Time elapsed: 0.221 s
13:07:12 testStoreNodeFormatData(org.eclipse.sirius.tests.unit.diagram.format.data.SiriusFormatDataManagerForSemanticElementsTest)  Time elapsed: 0.22 s
13:07:12 testStoreFormatAgainstPredefinedData[0](org.eclipse.sirius.tests.unit.diagram.format.data.SiriusFormatDataManagerForSemanticElementsStoreWithPredefinedDataTest)  Time elapsed: 0.308 s
13:07:12 testStoreFormatAgainstPredefinedData[1](org.eclipse.sirius.tests.unit.diagram.format.data.SiriusFormatDataManagerForSemanticElementsStoreWithPredefinedDataTest)  Time elapsed: 0.373 s
13:07:12 testStoreFormatAgainstPredefinedData[2](org.eclipse.sirius.tests.unit.diagram.format.data.SiriusFormatDataManagerForSemanticElementsStoreWithPredefinedDataTest)  Time elapsed: 0.301 s
13:07:12 testStoreFormatAgainstPredefinedData[3](org.eclipse.sirius.tests.unit.diagram.format.data.SiriusFormatDataManagerForSemanticElementsStoreWithPredefinedDataTest)  Time elapsed: 0.221 s
13:07:12 testStoreFormatAgainstPredefinedData[4](org.eclipse.sirius.tests.unit.diagram.format.data.SiriusFormatDataManagerForSemanticElementsStoreWithPredefinedDataTest)  Time elapsed: 0.23 s
13:07:12 testStoreFormatAgainstPredefinedData[5](org.eclipse.sirius.tests.unit.diagram.format.data.SiriusFormatDataManagerForSemanticElementsStoreWithPredefinedDataTest)  Time elapsed: 0.219 s
13:07:12 testStoreFormatAgainstPredefinedData[6](org.eclipse.sirius.tests.unit.diagram.format.data.SiriusFormatDataManagerForSemanticElementsStoreWithPredefinedDataTest)  Time elapsed: 0.201 s
13:07:12 testStoreFormatAgainstPredefinedData[7](org.eclipse.sirius.tests.unit.diagram.format.data.SiriusFormatDataManagerForSemanticElementsStoreWithPredefinedDataTest)  Time elapsed: 0.206 s
13:07:12 testStoreFormatAgainstPredefinedData[8](org.eclipse.sirius.tests.unit.diagram.format.data.SiriusFormatDataManagerForSemanticElementsStoreWithPredefinedDataTest)  Time elapsed: 0.203 s
13:07:12 testStoreFormatAgainstPredefinedData[9](org.eclipse.sirius.tests.unit.diagram.format.data.SiriusFormatDataManagerForSemanticElementsStoreWithPredefinedDataTest)  Time elapsed: 0.245 s
13:07:12 testStoreFormatAgainstPredefinedData[10](org.eclipse.sirius.tests.unit.diagram.format.data.SiriusFormatDataManagerForSemanticElementsStoreWithPredefinedDataTest)  Time elapsed: 0.202 s
13:07:12 testStoreFormatAgainstPredefinedData[11](org.eclipse.sirius.tests.unit.diagram.format.data.SiriusFormatDataManagerForSemanticElementsStoreWithPredefinedDataTest)  Time elapsed: 0.245 s
13:07:12 testStoreFormatAgainstPredefinedData[12](org.eclipse.sirius.tests.unit.diagram.format.data.SiriusFormatDataManagerForSemanticElementsStoreWithPredefinedDataTest)  Time elapsed: 0.202 s
13:07:12 testStoreFormatAgainstPredefinedData[13](org.eclipse.sirius.tests.unit.diagram.format.data.SiriusFormatDataManagerForSemanticElementsStoreWithPredefinedDataTest)  Time elapsed: 0.206 s
13:07:12 testStoreFormatAgainstPredefinedData[14](org.eclipse.sirius.tests.unit.diagram.format.data.SiriusFormatDataManagerForSemanticElementsStoreWithPredefinedDataTest)  Time elapsed: 0.205 s
13:07:12 testStoreFormatAgainstPredefinedData[15](org.eclipse.sirius.tests.unit.diagram.format.data.SiriusFormatDataManagerForSemanticElementsStoreWithPredefinedDataTest)  Time elapsed: 0.212 s
13:07:12 testStoreFormatAgainstPredefinedData[16](org.eclipse.sirius.tests.unit.diagram.format.data.SiriusFormatDataManagerForSemanticElementsStoreWithPredefinedDataTest)  Time elapsed: 0.227 s
13:07:12 testStoreFormatAgainstPredefinedData[17](org.eclipse.sirius.tests.unit.diagram.format.data.SiriusFormatDataManagerForSemanticElementsStoreWithPredefinedDataTest)  Time elapsed: 0.205 s
13:07:12 testStoreFormatAgainstPredefinedData[18](org.eclipse.sirius.tests.unit.diagram.format.data.SiriusFormatDataManagerForSemanticElementsStoreWithPredefinedDataTest)  Time elapsed: 0.303 s
13:07:12 testStoreFormatAgainstPredefinedData[19](org.eclipse.sirius.tests.unit.diagram.format.data.SiriusFormatDataManagerForSemanticElementsStoreWithPredefinedDataTest)  Time elapsed: 0.323 s
13:07:12 testStoreFormatAgainstPredefinedData[20](org.eclipse.sirius.tests.unit.diagram.format.data.SiriusFormatDataManagerForSemanticElementsStoreWithPredefinedDataTest)  Time elapsed: 0.325 s
13:07:12 testStoreFormatAgainstPredefinedData[21](org.eclipse.sirius.tests.unit.diagram.format.data.SiriusFormatDataManagerForSemanticElementsStoreWithPredefinedDataTest)  Time elapsed: 0.419 s
13:07:12 testStoreFormatAgainstPredefinedData[22](org.eclipse.sirius.tests.unit.diagram.format.data.SiriusFormatDataManagerForSemanticElementsStoreWithPredefinedDataTest)  Time elapsed: 0.484 s
13:07:12 testStoreFormatAgainstPredefinedData[23](org.eclipse.sirius.tests.unit.diagram.format.data.SiriusFormatDataManagerForSemanticElementsStoreWithPredefinedDataTest)  Time elapsed: 0.398 s
13:07:12 testStoreFormatAgainstPredefinedData[24](org.eclipse.sirius.tests.unit.diagram.format.data.SiriusFormatDataManagerForSemanticElementsStoreWithPredefinedDataTest)  Time elapsed: 0.33 s
13:07:12 testStoreFormatAgainstPredefinedData[25](org.eclipse.sirius.tests.unit.diagram.format.data.SiriusFormatDataManagerForSemanticElementsStoreWithPredefinedDataTest)  Time elapsed: 0.307 s
13:07:12 testStoreFormatAgainstPredefinedData[26](org.eclipse.sirius.tests.unit.diagram.format.data.SiriusFormatDataManagerForSemanticElementsStoreWithPredefinedDataTest)  Time elapsed: 0.288 s
13:07:12 testStoreFormatAgainstPredefinedData[27](org.eclipse.sirius.tests.unit.diagram.format.data.SiriusFormatDataManagerForSemanticElementsStoreWithPredefinedDataTest)  Time elapsed: 0.29 s
13:07:12 testStoreFormatAgainstPredefinedData[28](org.eclipse.sirius.tests.unit.diagram.format.data.SiriusFormatDataManagerForSemanticElementsStoreWithPredefinedDataTest)  Time elapsed: 0.294 s
13:07:12 testStoreFormatAgainstPredefinedData[29](org.eclipse.sirius.tests.unit.diagram.format.data.SiriusFormatDataManagerForSemanticElementsStoreWithPredefinedDataTest)  Time elapsed: 0.282 s
13:07:12 testPackageImportWithPrefix(org.eclipse.sirius.tests.unit.common.interpreter.acceleo.mtl.AcceleoMTInterpreterOnPackageImportTests)  Time elapsed: 0.907 s
13:07:12 testPackageImportWithoutPrefix(org.eclipse.sirius.tests.unit.common.interpreter.acceleo.mtl.AcceleoMTInterpreterOnPackageImportTests)  Time elapsed: 0.135 s
13:07:12 testSessionCreationTime(org.eclipse.sirius.tests.unit.perf.common.Session1MillionTests)  Time elapsed: 0.075 s
13:07:12 testTwoRepresentationsMovesSuccessively(org.eclipse.sirius.tests.unit.api.session.SessionManagerListener2Tests)  Time elapsed: 0.994 s
13:07:12 testOpenMultipleSessions(org.eclipse.sirius.tests.unit.api.session.SessionManagerListener2Tests)  Time elapsed: 0.932 s
13:07:12 testNoMultipleSyncNotifications(org.eclipse.sirius.tests.unit.api.session.SessionManagerListener2Tests)  Time elapsed: 0.422 s
13:07:12 testDeleteAndUndo(org.eclipse.sirius.tests.unit.api.session.SessionManagerListener2Tests)  Time elapsed: 0.624 s
13:07:12 testCloseEventsNonDirty(org.eclipse.sirius.tests.unit.api.session.SessionManagerListener2Tests)  Time elapsed: 0.892 s
13:07:12 testNoNotification(org.eclipse.sirius.tests.unit.api.session.SessionManagerListener2Tests)  Time elapsed: 0.395 s
13:07:12 testCreateRepresentationEvents(org.eclipse.sirius.tests.unit.api.session.SessionManagerListener2Tests)  Time elapsed: 0.803 s
13:07:12 testSaveSession(org.eclipse.sirius.tests.unit.api.session.SessionManagerListener2Tests)  Time elapsed: 0.4 s
13:07:12 testBorderedBoundsAreCorrectAfterRunningRepair(org.eclipse.sirius.tests.unit.diagram.migration.RepairWithActivatedFiltersTest)  Time elapsed: 0.192 s
13:07:12 testFiltersAreCorrectlyRestoredAfterRunningRepair(org.eclipse.sirius.tests.unit.diagram.migration.RepairWithActivatedFiltersTest)  Time elapsed: 0.308 s
13:07:12 testRepairOnStyleCustomizations(org.eclipse.sirius.tests.unit.diagram.migration.RepairOnStyleCustomizationsTest)  Time elapsed: 0.587 s
13:07:12 testRepairOnStyleCustomizationsUnsynchronized(org.eclipse.sirius.tests.unit.diagram.migration.RepairOnStyleCustomizationsTest)  Time elapsed: 0.606 s
13:07:12 testDiagramEditorOpeningInsideMultiPageEditor(org.eclipse.sirius.tests.unit.multipageeditor.SiriusMultiPageEditorTest)  Time elapsed: 0.166 s
13:07:12 testOpenEntitiesRepresentationInEditor(org.eclipse.sirius.tests.unit.api.session.TablesAndEntitiesDirtyTest)  Time elapsed: 1.428 s
13:07:12 testOpenCrossTableRepresentationInEditor(org.eclipse.sirius.tests.unit.api.session.TablesAndEntitiesDirtyTest)  Time elapsed: 0.863 s
13:07:12 testOpenTableRepresentationInEditor(org.eclipse.sirius.tests.unit.api.session.TablesAndEntitiesDirtyTest)  Time elapsed: 0.324 s
13:07:12 testCreateAndOpenTableRepresentationInEditor(org.eclipse.sirius.tests.unit.api.session.TablesAndEntitiesDirtyTest)  Time elapsed: 0.317 s
13:07:12 
13:07:12 Results:
13:07:12 
13:07:12 Tests run: 2905, Failures: 0, Errors: 0, Skipped: 0
13:07:12 
13:07:14 [INFO] All tests passed!
13:07:14 [INFO] 
13:07:14 [INFO] ----------< org.eclipse.sirius:org.eclipse.sirius.tests.tree >----------
13:07:14 [INFO] Building org.eclipse.sirius.tests.tree 6.4.0-SNAPSHOT          [143/160]
13:07:14 [INFO] ------------------------[ eclipse-test-plugin ]-------------------------
13:07:14 [INFO] 
13:07:14 [INFO] --- maven-clean-plugin:2.5:clean (default-clean) @ org.eclipse.sirius.tests.tree ---
13:07:14 [INFO] 
13:07:14 [INFO] --- tycho-packaging-plugin:1.7.0:build-qualifier (default-build-qualifier) @ org.eclipse.sirius.tests.tree ---
13:07:14 [INFO] The project's OSGi version is 6.4.0.202008131654
13:07:14 [INFO] 
13:07:14 [INFO] --- tycho-packaging-plugin:1.7.0:validate-id (default-validate-id) @ org.eclipse.sirius.tests.tree ---
13:07:14 [INFO] 
13:07:14 [INFO] --- tycho-packaging-plugin:1.7.0:validate-version (default-validate-version) @ org.eclipse.sirius.tests.tree ---
13:07:14 [INFO] 
13:07:14 [INFO] --- jacoco-maven-plugin:0.8.5:prepare-agent (agent-for-ut) @ org.eclipse.sirius.tests.tree ---
13:07:14 [INFO] jacoco.agent.ut.arg set to -javaagent:/home/jenkins/agent/workspace/sirius.sonar-master/.repository/org/jacoco/org.jacoco.agent/0.8.5/org.jacoco.agent-0.8.5-runtime.jar=destfile=/home/jenkins/agent/workspace/sirius.sonar-master/plugins/org.eclipse.sirius.tests.tree/../../packaging/org.eclipse.sirius.parent/target/jacoco.exec,append=true
13:07:14 [INFO] 
13:07:14 [INFO] --- maven-resources-plugin:2.4.1:resources (default-resources) @ org.eclipse.sirius.tests.tree ---
13:07:14 [INFO] Using 'ISO-8859-1' encoding to copy filtered resources.
13:07:14 [INFO] skip non existing resourceDirectory /home/jenkins/agent/workspace/sirius.sonar-master/plugins/org.eclipse.sirius.tests.tree/src/main/resources
13:07:14 [INFO] 
13:07:14 [INFO] --- tycho-compiler-plugin:1.7.0:compile (default-compile) @ org.eclipse.sirius.tests.tree ---
13:07:14 [INFO] Compiling 40 source files to /home/jenkins/agent/workspace/sirius.sonar-master/plugins/org.eclipse.sirius.tests.tree/target/classes
13:07:17 [INFO] 
13:07:17 [INFO] --- org.eclipse.acceleo.maven:3.5.2:acceleo-compile (acceleo-compile) @ org.eclipse.sirius.tests.tree ---
13:07:17 [INFO] Acceleo maven stand alone build...
13:07:17 [INFO] Starting packages registration...
13:07:17 [INFO] Registering package 'org.eclipse.emf.ecore.EcorePackage'.
13:07:17 [INFO] Starting the build sequence for the project '/home/jenkins/agent/workspace/sirius.sonar-master/plugins/org.eclipse.sirius.tests.tree'...
13:07:17 [INFO] Mapping the pom.xml to AcceleoProject...
13:07:17 [INFO] Adding jar dependencies...
13:07:17 [INFO] Starting parsing...
13:07:17 [INFO] Build completed.
13:07:17 [INFO] 
13:07:17 [INFO] --- org.eclipse.acceleo.maven:3.5.2:acceleo-compile (default) @ org.eclipse.sirius.tests.tree ---
13:07:17 [INFO] Acceleo maven stand alone build...
13:07:17 [INFO] Starting packages registration...
13:07:17 [INFO] Registering package 'org.eclipse.emf.ecore.EcorePackage'.
13:07:17 [INFO] Starting the build sequence for the project '/home/jenkins/agent/workspace/sirius.sonar-master/plugins/org.eclipse.sirius.tests.tree'...
13:07:17 [INFO] Mapping the pom.xml to AcceleoProject...
13:07:17 [INFO] Adding jar dependencies...
13:07:17 [INFO] Starting parsing...
13:07:17 [INFO] Build completed.
13:07:17 [INFO] 
13:07:17 [INFO] --- maven-resources-plugin:2.4.1:testResources (default-testResources) @ org.eclipse.sirius.tests.tree ---
13:07:17 [INFO] Using 'ISO-8859-1' encoding to copy filtered resources.
13:07:17 [INFO] skip non existing resourceDirectory /home/jenkins/agent/workspace/sirius.sonar-master/plugins/org.eclipse.sirius.tests.tree/src/test/resources
13:07:17 [INFO] 
13:07:17 [INFO] --- tycho-source-plugin:1.7.0:plugin-source (plugin-source) @ org.eclipse.sirius.tests.tree ---
13:07:17 [INFO] Building jar: /home/jenkins/agent/workspace/sirius.sonar-master/plugins/org.eclipse.sirius.tests.tree/target/org.eclipse.sirius.tests.tree-6.4.0-SNAPSHOT-sources.jar
13:07:17 [INFO] 
13:07:17 [INFO] --- target-platform-configuration:1.7.0:target-platform (default-target-platform) @ org.eclipse.sirius.tests.tree ---
13:07:17 [INFO] 
13:07:17 [INFO] --- tycho-packaging-plugin:1.7.0:package-plugin (default-package-plugin) @ org.eclipse.sirius.tests.tree ---
13:07:17 [INFO] Building jar: /home/jenkins/agent/workspace/sirius.sonar-master/plugins/org.eclipse.sirius.tests.tree/target/org.eclipse.sirius.tests.tree-6.4.0-SNAPSHOT.jar
13:07:17 [INFO] 
13:07:17 [INFO] --- tycho-p2-plugin:1.7.0:p2-metadata-default (default-p2-metadata-default) @ org.eclipse.sirius.tests.tree ---
13:07:17 [INFO] 
13:07:17 [INFO] --- tycho-source-feature-plugin:1.7.0:source-feature (source-feature) @ org.eclipse.sirius.tests.tree ---
13:07:17 [INFO] 
13:07:17 [INFO] --- tycho-p2-plugin:1.7.0:p2-metadata (p2-metadata) @ org.eclipse.sirius.tests.tree ---
13:07:17 [INFO] 
13:07:17 [INFO] --- jacoco-maven-plugin:0.8.5:prepare-agent-integration (agent-for-it) @ org.eclipse.sirius.tests.tree ---
13:07:17 [INFO] jacoco.agent.it.arg set to -javaagent:/home/jenkins/agent/workspace/sirius.sonar-master/.repository/org/jacoco/org.jacoco.agent/0.8.5/org.jacoco.agent-0.8.5-runtime.jar=destfile=/home/jenkins/agent/workspace/sirius.sonar-master/plugins/org.eclipse.sirius.tests.tree/../../packaging/org.eclipse.sirius.parent/target/jacoco-it.exec,append=true
13:07:17 [INFO] 
13:07:17 [INFO] --- tycho-surefire-plugin:1.7.0:test (default-test) @ org.eclipse.sirius.tests.tree ---
13:07:18 [INFO] Executing Test Runtime with timeout 0, logs (if any) will be placed at: /home/jenkins/agent/workspace/sirius.sonar-master/plugins/org.eclipse.sirius.tests.tree/target/work/data/.metadata/.log
13:07:18 [INFO] Command line:
13:07:18 	[/opt/tools/java/openjdk/jdk-11/11.0.2+9/bin/java, -Dosgi.noShutdown=false, -Dosgi.os=linux, -Dosgi.ws=gtk, -Dosgi.arch=x86_64, -javaagent:/home/jenkins/agent/workspace/sirius.sonar-master/.repository/org/jacoco/org.jacoco.agent/0.8.5/org.jacoco.agent-0.8.5-runtime.jar=destfile=/home/jenkins/agent/workspace/sirius.sonar-master/plugins/org.eclipse.sirius.tests.tree/../../packaging/org.eclipse.sirius.parent/target/jacoco.exec,append=true, -Xmx2048m, -XX:+HeapDumpOnOutOfMemoryError, -Dosgi.clean=true, -Dorg.eclipse.sirius.tests.skipLongTests=true, -Dorg.eclipse.sirius.tests.skipUnreliableTests=true, -jar, /home/jenkins/agent/workspace/sirius.sonar-master/.repository/p2/osgi/bundle/org.eclipse.equinox.launcher/1.5.700.v20200207-2156/org.eclipse.equinox.launcher-1.5.700.v20200207-2156.jar, -data, /home/jenkins/agent/workspace/sirius.sonar-master/plugins/org.eclipse.sirius.tests.tree/target/work/data, -install, /home/jenkins/agent/workspace/sirius.sonar-master/plugins/org.eclipse.sirius.tests.tree/target/work, -configuration, /home/jenkins/agent/workspace/sirius.sonar-master/plugins/org.eclipse.sirius.tests.tree/target/work/configuration, -application, org.eclipse.tycho.surefire.osgibooter.uitest, -testproperties, /home/jenkins/agent/workspace/sirius.sonar-master/plugins/org.eclipse.sirius.tests.tree/target/surefire.properties]
13:07:27 Running org.eclipse.sirius.tests.suite.tree.AllSiriusTestSuite
13:07:29 Setup of org.eclipse.sirius.tests.api.tools.TreeItemDeletionToolsTest.testCreateDeletionTools()
13:07:30 Setup of org.eclipse.sirius.tests.api.tools.TreeItemDeletionToolsTest.testDeleteUndo()
13:07:32 Setup of org.eclipse.sirius.tests.api.tools.TreeItemCreationToolsTest.testCreateInRepresentation()
13:07:33 Setup of org.eclipse.sirius.tests.api.tools.TreeItemEditionToolTest.testDirectEditWithoutEditionTool()
13:07:33 Setup of org.eclipse.sirius.tests.api.tools.TreeItemEditionToolTest.testDirectEditWithNoBehavior()
13:07:33 Setup of org.eclipse.sirius.tests.api.tools.TreeItemEditionToolTest.testDirectEditWithEditMask()
13:07:34 Setup of org.eclipse.sirius.tests.api.tools.TreeItemEditionToolTest.testDirectEditDefinitionWithImports()
13:07:34 Setup of org.eclipse.sirius.tests.api.tools.TreeItemEditionToolTest.testDirectEditWithPrecondition()
13:07:34 Setup of org.eclipse.sirius.tests.unit.tree.TreeVariablesTest.testAvailableVariablesForTreeItem()
13:07:35 Setup of org.eclipse.sirius.tests.api.tools.TreeItemDragAndDropToolTest.testDnDWithDropAfter()
13:07:35 Setup of org.eclipse.sirius.tests.api.tools.TreeItemDragAndDropToolTest.testDnDWithTwoElementsSelection()
13:07:36 Setup of org.eclipse.sirius.tests.api.tools.TreeItemDragAndDropToolTest.testDnDDirectlyOnTree()
13:07:36 Setup of org.eclipse.sirius.tests.api.tools.TreeItemDragAndDropToolTest.testDnDWithSingleSelection()
13:07:36 Setup of org.eclipse.sirius.tests.api.tools.TreeItemDragAndDropToolTest.testPrecedingSiblingsValues()
13:07:36 Setup of org.eclipse.sirius.tests.api.tools.TreeItemDragAndDropToolTest.testDnDWithDropBefore()
13:07:37 Setup of org.eclipse.sirius.tests.api.tools.TreeItemDragAndDropToolTest.testDnDWithPermissionAuthority()
13:07:37 Setup of org.eclipse.sirius.tests.api.tools.TreeItemDragAndDropToolTest.testDnDWithFalseToolPrecondition()
13:07:37 Setup of org.eclipse.sirius.tests.api.tools.TreeItemDragAndDropToolTest.testDnDFromModelContentViewToTreeEditorWithSingleSelection()
13:07:37 Setup of org.eclipse.sirius.tests.api.tools.TreeItemDragAndDropToolTest.testDnDFromModelContentViewToTreeEditorWithMultipleSelection()
13:07:37 Setup of org.eclipse.sirius.tests.api.tools.TreeItemDragAndDropToolTest.testDnDWithMultipleSelection()
13:07:38 Setup of org.eclipse.sirius.tests.api.tools.TreeItemDragAndDropToolUsingRecordingCommandCompositionTest.testDnDWithTwoElementsSelection()
13:07:38 Setup of org.eclipse.sirius.tests.api.tools.TreeItemDragAndDropToolUsingRecordingCommandCompositionTest.testDnDFromModelContentViewToTreeEditorWithMultipleSelection()
13:07:38 Setup of org.eclipse.sirius.tests.api.tools.RefreshWhenSeveralEditorsOpenTest.testAddClassOnDiagram()
13:07:40 
13:07:40 (SWT:6578): Gtk-CRITICAL **: 17:07:40.620: gtk_box_gadget_distribute: assertion 'size >= 0' failed in GtkScrollbar
13:07:40 
13:07:40 (SWT:6578): Gtk-CRITICAL **: 17:07:40.758: gtk_box_gadget_distribute: assertion 'size >= 0' failed in GtkScrollbar
13:07:42 Setup of org.eclipse.sirius.tests.api.tools.RefreshWhenSeveralEditorsOpenTest.testRenamePackageOnDiagram()
13:07:43 
13:07:43 (SWT:6578): Gtk-CRITICAL **: 17:07:43.502: gtk_box_gadget_distribute: assertion 'size >= 0' failed in GtkScrollbar
13:07:43 
13:07:43 (SWT:6578): Gtk-CRITICAL **: 17:07:43.568: gtk_box_gadget_distribute: assertion 'size >= 0' failed in GtkScrollbar
13:07:44 Setup of org.eclipse.sirius.tests.api.tools.RefreshWhenSeveralEditorsOpenTest.testRenameClassOnDiagram()
13:07:45 
13:07:45 (SWT:6578): Gtk-CRITICAL **: 17:07:45.341: gtk_box_gadget_distribute: assertion 'size >= 0' failed in GtkScrollbar
13:07:45 
13:07:45 (SWT:6578): Gtk-CRITICAL **: 17:07:45.424: gtk_box_gadget_distribute: assertion 'size >= 0' failed in GtkScrollbar
13:07:46 Setup of org.eclipse.sirius.tests.api.tools.RefreshWhenSeveralEditorsOpenTest.testEditorRename()
13:07:47 
13:07:47 (SWT:6578): Gtk-CRITICAL **: 17:07:47.013: gtk_box_gadget_distribute: assertion 'size >= 0' failed in GtkScrollbar
13:07:47 
13:07:47 (SWT:6578): Gtk-CRITICAL **: 17:07:47.073: gtk_box_gadget_distribute: assertion 'size >= 0' failed in GtkScrollbar
13:07:47 Setup of org.eclipse.sirius.tests.api.tools.RefreshWhenSeveralEditorsOpenTest.testInitialisation()
13:07:48 
13:07:48 (SWT:6578): Gtk-CRITICAL **: 17:07:48.277: gtk_box_gadget_distribute: assertion 'size >= 0' failed in GtkScrollbar
13:07:48 
13:07:48 (SWT:6578): Gtk-CRITICAL **: 17:07:48.350: gtk_box_gadget_distribute: assertion 'size >= 0' failed in GtkScrollbar
13:07:49 Setup of org.eclipse.sirius.tests.unit.tree.TreeItemOrderTests.testItemOrdersOnTreeCreation()
13:07:49 Setup of org.eclipse.sirius.tests.unit.tree.TreeItemOrderTests.testItemOrders()
13:07:49 Setup of org.eclipse.sirius.tests.api.tools.TreeItemRefreshWithToolsTest.testEditTool()
13:07:49 Setup of org.eclipse.sirius.tests.api.tools.TreeItemRefreshWithToolsTest.testDeleteFromTool()
13:07:49 Setup of org.eclipse.sirius.tests.api.tools.TreeItemRefreshWithToolsTest.testToolCreateSiblingClass()
13:07:49 Setup of org.eclipse.sirius.tests.unit.tree.tools.SelectionInTreeAfterToolExecutionTest.testSelectionAfterTreeItemCreationTool()
13:07:49 Setup of org.eclipse.sirius.tests.unit.tree.tools.SelectionInTreeAfterToolExecutionTest.testRunTimeVariableAfterCreateLineTool()
13:07:50 Setup of org.eclipse.sirius.tests.unit.migration.InitializeElementsToSelectExpressionForTreeMigrationTest.testMigrationIsNeededOnData()
13:07:50 Setup of org.eclipse.sirius.tests.unit.migration.InitializeElementsToSelectExpressionForTreeMigrationTest.testElementsToSelectExpressionMigration()
13:07:50 Setup of org.eclipse.sirius.tests.unit.dialect.TreeUIDialectServicesTests.testDiagramDialectUIManagerRefresh()
13:07:50 Tests run: 58, Failures: 0, Errors: 0, Skipped: 0, Time elapsed: 23.056 s - in org.eclipse.sirius.tests.suite.tree.AllSiriusTestSuite
13:07:50 testInterpreterContextForAbstractToolElementsToSelectVariables(org.eclipse.sirius.tests.unit.api.vsm.interpreted.expression.variables.TreeVariablesTest)  Time elapsed: 0.559 s
13:07:50 testInterpreterContextForContainerDropTool(org.eclipse.sirius.tests.unit.api.vsm.interpreted.expression.variables.TreeVariablesTest)  Time elapsed: 0.011 s
13:07:50 testVariableTypesInterpretedExpressionEAnnotation(org.eclipse.sirius.tests.unit.api.vsm.interpreted.expression.variables.TreeVariablesTest)  Time elapsed: 0.003 s
13:07:50 testReturnTypeInterpretedExpressionEAnnotation(org.eclipse.sirius.tests.unit.api.vsm.interpreted.expression.variables.TreeVariablesTest)  Time elapsed: 0.001 s
13:07:50 testVariablesInInterpretedExpressionEAnnotation(org.eclipse.sirius.tests.unit.api.vsm.interpreted.expression.variables.TreeVariablesTest)  Time elapsed: 0 s
13:07:50 testColorReferencesInitialization(org.eclipse.sirius.tests.unit.tree.vsm.color.TreeColorTest)  Time elapsed: 0.001 s
13:07:50 testColorReferencesCardinality(org.eclipse.sirius.tests.unit.tree.vsm.color.TreeColorTest)  Time elapsed: 0.001 s
13:07:50 testCreateDeletionTools(org.eclipse.sirius.tests.api.tools.TreeItemDeletionToolsTest)  Time elapsed: 0.967 s
13:07:50 testDeleteUndo(org.eclipse.sirius.tests.api.tools.TreeItemDeletionToolsTest)  Time elapsed: 1.946 s
13:07:50 testCreateInRepresentation(org.eclipse.sirius.tests.api.tools.TreeItemCreationToolsTest)  Time elapsed: 0.383 s
13:07:50 testAisSuperOfB(org.eclipse.sirius.tests.unit.tree.MappingHierarchyTableTest)  Time elapsed: 0.001 s
13:07:50 testMappingHierarchy(org.eclipse.sirius.tests.unit.tree.MappingHierarchyTableTest)  Time elapsed: 0.001 s
13:07:50 testASingleMappingHasAHierarchy(org.eclipse.sirius.tests.unit.tree.MappingHierarchyTableTest)  Time elapsed: 0 s
13:07:50 test2UnrelatedElementsHaveDifferentHierarchies(org.eclipse.sirius.tests.unit.tree.MappingHierarchyTableTest)  Time elapsed: 0 s
13:07:50 testDirectEditWithoutEditionTool(org.eclipse.sirius.tests.api.tools.TreeItemEditionToolTest)  Time elapsed: 0.257 s
13:07:50 testDirectEditWithNoBehavior(org.eclipse.sirius.tests.api.tools.TreeItemEditionToolTest)  Time elapsed: 0.261 s
13:07:50 testDirectEditWithEditMask(org.eclipse.sirius.tests.api.tools.TreeItemEditionToolTest)  Time elapsed: 0.281 s
13:07:50 testDirectEditDefinitionWithImports(org.eclipse.sirius.tests.api.tools.TreeItemEditionToolTest)  Time elapsed: 0.346 s
13:07:50 testDirectEditWithPrecondition(org.eclipse.sirius.tests.api.tools.TreeItemEditionToolTest)  Time elapsed: 0.29 s
13:07:50 testCreateElement(org.eclipse.sirius.tests.unit.tree.TreeRefreshTests)  Time elapsed: 0.026 s
13:07:50 testSynchronizationSemanticElementsMappgings(org.eclipse.sirius.tests.unit.tree.TreeRefreshTests)  Time elapsed: 0.04 s
13:07:50 testRefreshBoundedToExpansionState(org.eclipse.sirius.tests.unit.tree.TreeRefreshTests)  Time elapsed: 0.036 s
13:07:50 testSwitchMappingInHierarchy(org.eclipse.sirius.tests.unit.tree.TreeRefreshTests)  Time elapsed: 0.015 s
13:07:50 testDeleteElement(org.eclipse.sirius.tests.unit.tree.TreeRefreshTests)  Time elapsed: 0.048 s
13:07:50 testOrderKeptOnSubsequentRefreshes(org.eclipse.sirius.tests.unit.tree.TreeRefreshTests)  Time elapsed: 0.019 s
13:07:50 testOrderIsDeterministicAmongRepresentationInstances(org.eclipse.sirius.tests.unit.tree.TreeRefreshTests)  Time elapsed: 0.094 s
13:07:50 testWarningLoggingWithIncorrectSemanticCandidateExpression(org.eclipse.sirius.tests.unit.tree.TreeRefreshTests)  Time elapsed: 0.01 s
13:07:50 testRenameElement(org.eclipse.sirius.tests.unit.tree.TreeRefreshTests)  Time elapsed: 0.015 s
13:07:50 testOrderMatchesTheModelOrder(org.eclipse.sirius.tests.unit.tree.TreeRefreshTests)  Time elapsed: 0.012 s
13:07:50 testAvailableVariablesForTreeItem(org.eclipse.sirius.tests.unit.tree.TreeVariablesTest)  Time elapsed: 0.57 s
13:07:50 testDnDWithDropAfter(org.eclipse.sirius.tests.api.tools.TreeItemDragAndDropToolTest)  Time elapsed: 0.341 s
13:07:50 testDnDWithTwoElementsSelection(org.eclipse.sirius.tests.api.tools.TreeItemDragAndDropToolTest)  Time elapsed: 0.281 s
13:07:50 testDnDDirectlyOnTree(org.eclipse.sirius.tests.api.tools.TreeItemDragAndDropToolTest)  Time elapsed: 0.22 s
13:07:50 testDnDWithSingleSelection(org.eclipse.sirius.tests.api.tools.TreeItemDragAndDropToolTest)  Time elapsed: 0.239 s
13:07:50 testPrecedingSiblingsValues(org.eclipse.sirius.tests.api.tools.TreeItemDragAndDropToolTest)  Time elapsed: 0.206 s
13:07:50 testDnDWithDropBefore(org.eclipse.sirius.tests.api.tools.TreeItemDragAndDropToolTest)  Time elapsed: 0.211 s
13:07:50 testDnDWithPermissionAuthority(org.eclipse.sirius.tests.api.tools.TreeItemDragAndDropToolTest)  Time elapsed: 0.189 s
13:07:50 testDnDWithFalseToolPrecondition(org.eclipse.sirius.tests.api.tools.TreeItemDragAndDropToolTest)  Time elapsed: 0.195 s
13:07:50 testDnDFromModelContentViewToTreeEditorWithSingleSelection(org.eclipse.sirius.tests.api.tools.TreeItemDragAndDropToolTest)  Time elapsed: 0.199 s
13:07:50 testDnDFromModelContentViewToTreeEditorWithMultipleSelection(org.eclipse.sirius.tests.api.tools.TreeItemDragAndDropToolTest)  Time elapsed: 0.203 s
13:07:50 testDnDWithMultipleSelection(org.eclipse.sirius.tests.api.tools.TreeItemDragAndDropToolTest)  Time elapsed: 0.196 s
13:07:50 testDnDWithTwoElementsSelection(org.eclipse.sirius.tests.api.tools.TreeItemDragAndDropToolUsingRecordingCommandCompositionTest)  Time elapsed: 0.196 s
13:07:50 testDnDFromModelContentViewToTreeEditorWithMultipleSelection(org.eclipse.sirius.tests.api.tools.TreeItemDragAndDropToolUsingRecordingCommandCompositionTest)  Time elapsed: 0.168 s
13:07:50 testAddClassOnDiagram(org.eclipse.sirius.tests.api.tools.RefreshWhenSeveralEditorsOpenTest)  Time elapsed: 4.533 s
13:07:50 testRenamePackageOnDiagram(org.eclipse.sirius.tests.api.tools.RefreshWhenSeveralEditorsOpenTest)  Time elapsed: 1.849 s
13:07:50 testRenameClassOnDiagram(org.eclipse.sirius.tests.api.tools.RefreshWhenSeveralEditorsOpenTest)  Time elapsed: 1.753 s
13:07:50 testEditorRename(org.eclipse.sirius.tests.api.tools.RefreshWhenSeveralEditorsOpenTest)  Time elapsed: 1.316 s
13:07:50 testInitialisation(org.eclipse.sirius.tests.api.tools.RefreshWhenSeveralEditorsOpenTest)  Time elapsed: 1.206 s
13:07:50 testItemOrdersOnTreeCreation(org.eclipse.sirius.tests.unit.tree.TreeItemOrderTests)  Time elapsed: 0.111 s
13:07:50 testItemOrders(org.eclipse.sirius.tests.unit.tree.TreeItemOrderTests)  Time elapsed: 0.102 s
13:07:50 testEditTool(org.eclipse.sirius.tests.api.tools.TreeItemRefreshWithToolsTest)  Time elapsed: 0.21 s
13:07:50 testDeleteFromTool(org.eclipse.sirius.tests.api.tools.TreeItemRefreshWithToolsTest)  Time elapsed: 0.148 s
13:07:50 testToolCreateSiblingClass(org.eclipse.sirius.tests.api.tools.TreeItemRefreshWithToolsTest)  Time elapsed: 0.142 s
13:07:50 testSelectionAfterTreeItemCreationTool(org.eclipse.sirius.tests.unit.tree.tools.SelectionInTreeAfterToolExecutionTest)  Time elapsed: 0.236 s
13:07:50 testRunTimeVariableAfterCreateLineTool(org.eclipse.sirius.tests.unit.tree.tools.SelectionInTreeAfterToolExecutionTest)  Time elapsed: 0.271 s
13:07:50 testMigrationIsNeededOnData(org.eclipse.sirius.tests.unit.migration.InitializeElementsToSelectExpressionForTreeMigrationTest)  Time elapsed: 0.015 s
13:07:50 testElementsToSelectExpressionMigration(org.eclipse.sirius.tests.unit.migration.InitializeElementsToSelectExpressionForTreeMigrationTest)  Time elapsed: 0.054 s
13:07:50 testDiagramDialectUIManagerRefresh(org.eclipse.sirius.tests.unit.dialect.TreeUIDialectServicesTests)  Time elapsed: 0.29 s
13:07:50 
13:07:50 Results:
13:07:50 
13:07:50 Tests run: 58, Failures: 0, Errors: 0, Skipped: 0
13:07:50 
13:07:51 [INFO] All tests passed!
13:07:51 [INFO] 
13:07:51 [INFO] ---------< org.eclipse.sirius:org.eclipse.sirius.tests.swtbot >---------
13:07:51 [INFO] Building org.eclipse.sirius.tests.swtbot 6.4.0-SNAPSHOT        [144/160]
13:07:51 [INFO] ------------------------[ eclipse-test-plugin ]-------------------------
13:07:51 [INFO] 
13:07:51 [INFO] --- maven-clean-plugin:2.5:clean (default-clean) @ org.eclipse.sirius.tests.swtbot ---
13:07:51 [INFO] 
13:07:51 [INFO] --- tycho-packaging-plugin:1.7.0:build-qualifier (default-build-qualifier) @ org.eclipse.sirius.tests.swtbot ---
13:07:51 [INFO] The project's OSGi version is 6.4.0.202008131654
13:07:51 [INFO] 
13:07:51 [INFO] --- tycho-packaging-plugin:1.7.0:validate-id (default-validate-id) @ org.eclipse.sirius.tests.swtbot ---
13:07:51 [INFO] 
13:07:51 [INFO] --- tycho-packaging-plugin:1.7.0:validate-version (default-validate-version) @ org.eclipse.sirius.tests.swtbot ---
13:07:51 [INFO] 
13:07:51 [INFO] --- jacoco-maven-plugin:0.8.5:prepare-agent (agent-for-ut) @ org.eclipse.sirius.tests.swtbot ---
13:07:51 [INFO] jacoco.agent.ut.arg set to -javaagent:/home/jenkins/agent/workspace/sirius.sonar-master/.repository/org/jacoco/org.jacoco.agent/0.8.5/org.jacoco.agent-0.8.5-runtime.jar=destfile=/home/jenkins/agent/workspace/sirius.sonar-master/plugins/org.eclipse.sirius.tests.swtbot/../../packaging/org.eclipse.sirius.parent/target/jacoco.exec,append=true
13:07:51 [INFO] 
13:07:51 [INFO] --- maven-resources-plugin:2.4.1:resources (default-resources) @ org.eclipse.sirius.tests.swtbot ---
13:07:51 [INFO] Using 'ISO-8859-1' encoding to copy filtered resources.
13:07:51 [INFO] skip non existing resourceDirectory /home/jenkins/agent/workspace/sirius.sonar-master/plugins/org.eclipse.sirius.tests.swtbot/src/main/resources
13:07:51 [INFO] 
13:07:51 [INFO] --- tycho-compiler-plugin:1.7.0:compile (default-compile) @ org.eclipse.sirius.tests.swtbot ---
13:07:51 [INFO] Compiling 454 source files to /home/jenkins/agent/workspace/sirius.sonar-master/plugins/org.eclipse.sirius.tests.swtbot/target/classes
13:07:54 [INFO] 
13:07:54 [INFO] --- org.eclipse.acceleo.maven:3.5.2:acceleo-compile (acceleo-compile) @ org.eclipse.sirius.tests.swtbot ---
13:07:54 [INFO] Acceleo maven stand alone build...
13:07:54 [INFO] Starting packages registration...
13:07:54 [INFO] Registering package 'org.eclipse.emf.ecore.EcorePackage'.
13:07:54 [INFO] Starting the build sequence for the project '/home/jenkins/agent/workspace/sirius.sonar-master/plugins/org.eclipse.sirius.tests.swtbot'...
13:07:54 [INFO] Mapping the pom.xml to AcceleoProject...
13:07:54 [INFO] Adding jar dependencies...
13:07:54 [INFO] Starting parsing...
13:07:54 [INFO] Build completed.
13:07:54 [INFO] 
13:07:54 [INFO] --- org.eclipse.acceleo.maven:3.5.2:acceleo-compile (default) @ org.eclipse.sirius.tests.swtbot ---
13:07:54 [INFO] Acceleo maven stand alone build...
13:07:54 [INFO] Starting packages registration...
13:07:54 [INFO] Registering package 'org.eclipse.emf.ecore.EcorePackage'.
13:07:54 [INFO] Starting the build sequence for the project '/home/jenkins/agent/workspace/sirius.sonar-master/plugins/org.eclipse.sirius.tests.swtbot'...
13:07:54 [INFO] Mapping the pom.xml to AcceleoProject...
13:07:54 [INFO] Adding jar dependencies...
13:07:54 [INFO] Starting parsing...
13:07:54 [INFO] Build completed.
13:07:54 [INFO] 
13:07:54 [INFO] --- maven-resources-plugin:2.4.1:testResources (default-testResources) @ org.eclipse.sirius.tests.swtbot ---
13:07:54 [INFO] Using 'ISO-8859-1' encoding to copy filtered resources.
13:07:54 [INFO] skip non existing resourceDirectory /home/jenkins/agent/workspace/sirius.sonar-master/plugins/org.eclipse.sirius.tests.swtbot/src/test/resources
13:07:54 [INFO] 
13:07:54 [INFO] --- tycho-source-plugin:1.7.0:plugin-source (plugin-source) @ org.eclipse.sirius.tests.swtbot ---
13:07:55 [INFO] Building jar: /home/jenkins/agent/workspace/sirius.sonar-master/plugins/org.eclipse.sirius.tests.swtbot/target/org.eclipse.sirius.tests.swtbot-6.4.0-SNAPSHOT-sources.jar
13:07:55 [INFO] 
13:07:55 [INFO] --- target-platform-configuration:1.7.0:target-platform (default-target-platform) @ org.eclipse.sirius.tests.swtbot ---
13:07:55 [INFO] 
13:07:55 [INFO] --- tycho-packaging-plugin:1.7.0:package-plugin (default-package-plugin) @ org.eclipse.sirius.tests.swtbot ---
13:07:55 [INFO] Building jar: /home/jenkins/agent/workspace/sirius.sonar-master/plugins/org.eclipse.sirius.tests.swtbot/target/org.eclipse.sirius.tests.swtbot-6.4.0-SNAPSHOT.jar
13:07:56 [INFO] 
13:07:56 [INFO] --- tycho-p2-plugin:1.7.0:p2-metadata-default (default-p2-metadata-default) @ org.eclipse.sirius.tests.swtbot ---
13:07:56 [INFO] 
13:07:56 [INFO] --- tycho-source-feature-plugin:1.7.0:source-feature (source-feature) @ org.eclipse.sirius.tests.swtbot ---
13:07:56 [INFO] 
13:07:56 [INFO] --- tycho-p2-plugin:1.7.0:p2-metadata (p2-metadata) @ org.eclipse.sirius.tests.swtbot ---
13:07:56 [INFO] 
13:07:56 [INFO] --- jacoco-maven-plugin:0.8.5:prepare-agent-integration (agent-for-it) @ org.eclipse.sirius.tests.swtbot ---
13:07:56 [INFO] jacoco.agent.it.arg set to -javaagent:/home/jenkins/agent/workspace/sirius.sonar-master/.repository/org/jacoco/org.jacoco.agent/0.8.5/org.jacoco.agent-0.8.5-runtime.jar=destfile=/home/jenkins/agent/workspace/sirius.sonar-master/plugins/org.eclipse.sirius.tests.swtbot/../../packaging/org.eclipse.sirius.parent/target/jacoco-it.exec,append=true
13:07:56 [INFO] 
13:07:56 [INFO] --- tycho-surefire-plugin:1.7.0:test (default-test) @ org.eclipse.sirius.tests.swtbot ---
13:07:56 [INFO] Executing Test Runtime with timeout 0, logs (if any) will be placed at: /home/jenkins/agent/workspace/sirius.sonar-master/plugins/org.eclipse.sirius.tests.swtbot/target/work/data/.metadata/.log
13:07:56 [INFO] Command line:
13:07:56 	[/opt/tools/java/openjdk/jdk-11/11.0.2+9/bin/java, -Dosgi.noShutdown=false, -Dosgi.os=linux, -Dosgi.ws=gtk, -Dosgi.arch=x86_64, -javaagent:/home/jenkins/agent/workspace/sirius.sonar-master/.repository/org/jacoco/org.jacoco.agent/0.8.5/org.jacoco.agent-0.8.5-runtime.jar=destfile=/home/jenkins/agent/workspace/sirius.sonar-master/plugins/org.eclipse.sirius.tests.swtbot/../../packaging/org.eclipse.sirius.parent/target/jacoco.exec,append=true, -Xmx2048m, -XX:+HeapDumpOnOutOfMemoryError, -Dosgi.clean=true, -DcreateLocalRepresentationInSeparateResource=null, -Dorg.eclipse.sirius.tests.skipLongTests=true, -Dorg.eclipse.sirius.tests.skipUnreliableTests=true, -Dorg.eclipse.swtbot.screenshots.dir=/home/jenkins/agent/workspace/sirius.sonar-master/plugins/org.eclipse.sirius.tests.swtbot/target/screenshots, -jar, /home/jenkins/agent/workspace/sirius.sonar-master/.repository/p2/osgi/bundle/org.eclipse.equinox.launcher/1.5.700.v20200207-2156/org.eclipse.equinox.launcher-1.5.700.v20200207-2156.jar, -data, /home/jenkins/agent/workspace/sirius.sonar-master/plugins/org.eclipse.sirius.tests.swtbot/target/work/data, -install, /home/jenkins/agent/workspace/sirius.sonar-master/plugins/org.eclipse.sirius.tests.swtbot/target/work, -configuration, /home/jenkins/agent/workspace/sirius.sonar-master/plugins/org.eclipse.sirius.tests.swtbot/target/work/configuration, -application, org.eclipse.tycho.surefire.osgibooter.uitest, -testproperties, /home/jenkins/agent/workspace/sirius.sonar-master/plugins/org.eclipse.sirius.tests.swtbot/target/surefire.properties, -testApplication, org.eclipse.ui.ide.workbench, -product, org.eclipse.sdk.ide, -nouithread]
13:08:00 Launching application org.eclipse.ui.ide.workbench...
13:08:07 Running org.eclipse.sirius.tests.swtbot.suite.SequenceSwtBotTestSuite
13:08:07 Setup of org.eclipse.sirius.tests.swtbot.sequence.InstanceRoleResizableEditPolicyTests.testInstanceRoleResizeMultiple()
13:08:10 
13:08:10 (Eclipse:6652): Gtk-WARNING **: 17:08:10.157: Negative content height -5 (allocation 1, extents 3x3) while allocating gadget (node button, owner GtkToggleButton)
13:08:10 
13:08:10 (Eclipse:6652): Gtk-WARNING **: 17:08:10.238: Negative content width -12 (allocation 1, extents 6x7) while allocating gadget (node separator, owner GtkSeparatorToolItem)
13:08:10 
13:08:10 (Eclipse:6652): Gtk-WARNING **: 17:08:10.242: Negative content width -12 (allocation 1, extents 6x7) while allocating gadget (node separator, owner GtkSeparatorToolItem)
13:08:10 
13:08:10 (Eclipse:6652): Gtk-WARNING **: 17:08:10.265: Negative content width -12 (allocation 1, extents 6x7) while allocating gadget (node separator, owner GtkSeparatorToolItem)
13:08:13 log4j:WARN No appenders could be found for logger (org.eclipse.swtbot.swt.finder.widgets.SWTBotMenu).
13:08:13 log4j:WARN Please initialize the log4j system properly.
13:08:14 Setup of org.eclipse.sirius.tests.swtbot.sequence.InstanceRoleResizableEditPolicyTests.testInstanceRoleMoveWithCreateMessage()
13:08:15 
13:08:15 (Eclipse:6652): Gtk-WARNING **: 17:08:15.459: Negative content height -5 (allocation 1, extents 3x3) while allocating gadget (node button, owner GtkToggleButton)
13:08:15 
13:08:15 (Eclipse:6652): Gtk-WARNING **: 17:08:15.479: Negative content width -12 (allocation 1, extents 6x7) while allocating gadget (node separator, owner GtkSeparatorToolItem)
13:08:15 
13:08:15 (Eclipse:6652): Gtk-WARNING **: 17:08:15.485: Negative content width -12 (allocation 1, extents 6x7) while allocating gadget (node separator, owner GtkSeparatorToolItem)
13:08:15 
13:08:15 (Eclipse:6652): Gtk-WARNING **: 17:08:15.515: Negative content width -12 (allocation 1, extents 6x7) while allocating gadget (node separator, owner GtkSeparatorToolItem)
13:08:18 Setup of org.eclipse.sirius.tests.swtbot.sequence.InstanceRoleResizableEditPolicyTests.testInstanceRoleResizeOnLeftMargin()
13:08:18 
13:08:18 (Eclipse:6652): Gtk-WARNING **: 17:08:18.941: Negative content height -5 (allocation 1, extents 3x3) while allocating gadget (node button, owner GtkToggleButton)
13:08:18 
13:08:18 (Eclipse:6652): Gtk-WARNING **: 17:08:18.954: Negative content width -12 (allocation 1, extents 6x7) while allocating gadget (node separator, owner GtkSeparatorToolItem)
13:08:18 
13:08:18 (Eclipse:6652): Gtk-WARNING **: 17:08:18.958: Negative content width -12 (allocation 1, extents 6x7) while allocating gadget (node separator, owner GtkSeparatorToolItem)
13:08:18 
13:08:18 (Eclipse:6652): Gtk-WARNING **: 17:08:18.994: Negative content width -12 (allocation 1, extents 6x7) while allocating gadget (node separator, owner GtkSeparatorToolItem)
13:08:19 Setup of org.eclipse.sirius.tests.swtbot.sequence.InstanceRoleResizableEditPolicyTests.testInstanceRoleMoveSimpleOnLeftMargin()
13:08:20 
13:08:20 (Eclipse:6652): Gtk-WARNING **: 17:08:20.640: Negative content height -5 (allocation 1, extents 3x3) while allocating gadget (node button, owner GtkToggleButton)
13:08:20 
13:08:20 (Eclipse:6652): Gtk-WARNING **: 17:08:20.655: Negative content width -12 (allocation 1, extents 6x7) while allocating gadget (node separator, owner GtkSeparatorToolItem)
13:08:20 
13:08:20 (Eclipse:6652): Gtk-WARNING **: 17:08:20.660: Negative content width -12 (allocation 1, extents 6x7) while allocating gadget (node separator, owner GtkSeparatorToolItem)
13:08:20 
13:08:20 (Eclipse:6652): Gtk-WARNING **: 17:08:20.676: Negative content width -12 (allocation 1, extents 6x7) while allocating gadget (node separator, owner GtkSeparatorToolItem)
13:08:21 Setup of org.eclipse.sirius.tests.swtbot.sequence.InstanceRoleResizableEditPolicyTests.testInstanceRoleResizeOfAOnRight()
13:08:22 
13:08:22 (Eclipse:6652): Gtk-WARNING **: 17:08:22.248: Negative content height -5 (allocation 1, extents 3x3) while allocating gadget (node button, owner GtkToggleButton)
13:08:22 
13:08:22 (Eclipse:6652): Gtk-WARNING **: 17:08:22.268: Negative content width -12 (allocation 1, extents 6x7) while allocating gadget (node separator, owner GtkSeparatorToolItem)
13:08:22 
13:08:22 (Eclipse:6652): Gtk-WARNING **: 17:08:22.274: Negative content width -12 (allocation 1, extents 6x7) while allocating gadget (node separator, owner GtkSeparatorToolItem)
13:08:22 
13:08:22 (Eclipse:6652): Gtk-WARNING **: 17:08:22.297: Negative content width -12 (allocation 1, extents 6x7) while allocating gadget (node separator, owner GtkSeparatorToolItem)
13:08:23 Setup of org.eclipse.sirius.tests.swtbot.sequence.InstanceRoleResizableEditPolicyTests.testInstanceRoleMoveMultiple2()
13:08:23 
13:08:23 (Eclipse:6652): Gtk-WARNING **: 17:08:23.933: Negative content height -5 (allocation 1, extents 3x3) while allocating gadget (node button, owner GtkToggleButton)
13:08:23 
13:08:23 (Eclipse:6652): Gtk-WARNING **: 17:08:23.946: Negative content width -12 (allocation 1, extents 6x7) while allocating gadget (node separator, owner GtkSeparatorToolItem)
13:08:23 
13:08:23 (Eclipse:6652): Gtk-WARNING **: 17:08:23.950: Negative content width -12 (allocation 1, extents 6x7) while allocating gadget (node separator, owner GtkSeparatorToolItem)
13:08:23 
13:08:23 (Eclipse:6652): Gtk-WARNING **: 17:08:23.964: Negative content width -12 (allocation 1, extents 6x7) while allocating gadget (node separator, owner GtkSeparatorToolItem)
13:08:25 Setup of org.eclipse.sirius.tests.swtbot.sequence.InstanceRoleResizableEditPolicyTests.testInstanceRoleCreateEBetweenBAndC2()
13:08:26 
13:08:26 (Eclipse:6652): Gtk-WARNING **: 17:08:26.635: Negative content height -5 (allocation 1, extents 3x3) while allocating gadget (node button, owner GtkToggleButton)
13:08:26 
13:08:26 (Eclipse:6652): Gtk-WARNING **: 17:08:26.648: Negative content width -12 (allocation 1, extents 6x7) while allocating gadget (node separator, owner GtkSeparatorToolItem)
13:08:26 
13:08:26 (Eclipse:6652): Gtk-WARNING **: 17:08:26.651: Negative content width -12 (allocation 1, extents 6x7) while allocating gadget (node separator, owner GtkSeparatorToolItem)
13:08:26 
13:08:26 (Eclipse:6652): Gtk-WARNING **: 17:08:26.666: Negative content width -12 (allocation 1, extents 6x7) while allocating gadget (node separator, owner GtkSeparatorToolItem)
13:08:28 Setup of org.eclipse.sirius.tests.swtbot.sequence.InstanceRoleResizableEditPolicyTests.testInstanceRoleResizeOfAOverB()
13:08:29 
13:08:29 (Eclipse:6652): Gtk-WARNING **: 17:08:29.300: Negative content height -5 (allocation 1, extents 3x3) while allocating gadget (node button, owner GtkToggleButton)
13:08:29 
13:08:29 (Eclipse:6652): Gtk-WARNING **: 17:08:29.319: Negative content width -12 (allocation 1, extents 6x7) while allocating gadget (node separator, owner GtkSeparatorToolItem)
13:08:29 
13:08:29 (Eclipse:6652): Gtk-WARNING **: 17:08:29.325: Negative content width -12 (allocation 1, extents 6x7) while allocating gadget (node separator, owner GtkSeparatorToolItem)
13:08:29 
13:08:29 (Eclipse:6652): Gtk-WARNING **: 17:08:29.344: Negative content width -12 (allocation 1, extents 6x7) while allocating gadget (node separator, owner GtkSeparatorToolItem)
13:08:30 Setup of org.eclipse.sirius.tests.swtbot.sequence.InstanceRoleResizableEditPolicyTests.testInstanceRoleResizeOnTopMargin()
13:08:30 
13:08:30 (Eclipse:6652): Gtk-WARNING **: 17:08:30.887: Negative content height -5 (allocation 1, extents 3x3) while allocating gadget (node button, owner GtkToggleButton)
13:08:30 
13:08:30 (Eclipse:6652): Gtk-WARNING **: 17:08:30.900: Negative content width -12 (allocation 1, extents 6x7) while allocating gadget (node separator, owner GtkSeparatorToolItem)
13:08:30 
13:08:30 (Eclipse:6652): Gtk-WARNING **: 17:08:30.904: Negative content width -12 (allocation 1, extents 6x7) while allocating gadget (node separator, owner GtkSeparatorToolItem)
13:08:30 
13:08:30 (Eclipse:6652): Gtk-WARNING **: 17:08:30.919: Negative content width -12 (allocation 1, extents 6x7) while allocating gadget (node separator, owner GtkSeparatorToolItem)
13:08:31 Setup of org.eclipse.sirius.tests.swtbot.sequence.InstanceRoleResizableEditPolicyTests.testInstanceRoleResizeOfCOnLeftLimit()
13:08:32 
13:08:32 (Eclipse:6652): Gtk-WARNING **: 17:08:32.359: Negative content height -5 (allocation 1, extents 3x3) while allocating gadget (node button, owner GtkToggleButton)
13:08:32 
13:08:32 (Eclipse:6652): Gtk-WARNING **: 17:08:32.372: Negative content width -12 (allocation 1, extents 6x7) while allocating gadget (node separator, owner GtkSeparatorToolItem)
13:08:32 
13:08:32 (Eclipse:6652): Gtk-WARNING **: 17:08:32.375: Negative content width -12 (allocation 1, extents 6x7) while allocating gadget (node separator, owner GtkSeparatorToolItem)
13:08:32 
13:08:32 (Eclipse:6652): Gtk-WARNING **: 17:08:32.391: Negative content width -12 (allocation 1, extents 6x7) while allocating gadget (node separator, owner GtkSeparatorToolItem)
13:08:33 Setup of org.eclipse.sirius.tests.swtbot.sequence.InstanceRoleResizableEditPolicyTests.testInstanceRoleMoveSimpleToRight()
13:08:34 
13:08:34 (Eclipse:6652): Gtk-WARNING **: 17:08:34.830: Negative content height -5 (allocation 1, extents 3x3) while allocating gadget (node button, owner GtkToggleButton)
13:08:34 
13:08:34 (Eclipse:6652): Gtk-WARNING **: 17:08:34.843: Negative content width -12 (allocation 1, extents 6x7) while allocating gadget (node separator, owner GtkSeparatorToolItem)
13:08:34 
13:08:34 (Eclipse:6652): Gtk-WARNING **: 17:08:34.846: Negative content width -12 (allocation 1, extents 6x7) while allocating gadget (node separator, owner GtkSeparatorToolItem)
13:08:34 
13:08:34 (Eclipse:6652): Gtk-WARNING **: 17:08:34.860: Negative content width -12 (allocation 1, extents 6x7) while allocating gadget (node separator, owner GtkSeparatorToolItem)
13:08:35 Setup of org.eclipse.sirius.tests.swtbot.sequence.InstanceRoleResizableEditPolicyTests.testInstanceRoleResizeOnCreateMessage()
13:08:36 
13:08:36 (Eclipse:6652): Gtk-WARNING **: 17:08:36.241: Negative content height -5 (allocation 1, extents 3x3) while allocating gadget (node button, owner GtkToggleButton)
13:08:36 
13:08:36 (Eclipse:6652): Gtk-WARNING **: 17:08:36.254: Negative content width -12 (allocation 1, extents 6x7) while allocating gadget (node separator, owner GtkSeparatorToolItem)
13:08:36 
13:08:36 (Eclipse:6652): Gtk-WARNING **: 17:08:36.257: Negative content width -12 (allocation 1, extents 6x7) while allocating gadget (node separator, owner GtkSeparatorToolItem)
13:08:36 
13:08:36 (Eclipse:6652): Gtk-WARNING **: 17:08:36.272: Negative content width -12 (allocation 1, extents 6x7) while allocating gadget (node separator, owner GtkSeparatorToolItem)
13:08:36 Setup of org.eclipse.sirius.tests.swtbot.sequence.InstanceRoleResizableEditPolicyTests.testInstanceRoleMoveAToShiftBAndC()
13:08:37 
13:08:37 (Eclipse:6652): Gtk-WARNING **: 17:08:37.758: Negative content height -5 (allocation 1, extents 3x3) while allocating gadget (node button, owner GtkToggleButton)
13:08:37 
13:08:37 (Eclipse:6652): Gtk-WARNING **: 17:08:37.771: Negative content width -12 (allocation 1, extents 6x7) while allocating gadget (node separator, owner GtkSeparatorToolItem)
13:08:37 
13:08:37 (Eclipse:6652): Gtk-WARNING **: 17:08:37.774: Negative content width -12 (allocation 1, extents 6x7) while allocating gadget (node separator, owner GtkSeparatorToolItem)
13:08:37 
13:08:37 (Eclipse:6652): Gtk-WARNING **: 17:08:37.789: Negative content width -12 (allocation 1, extents 6x7) while allocating gadget (node separator, owner GtkSeparatorToolItem)
13:08:38 Setup of org.eclipse.sirius.tests.swtbot.sequence.InstanceRoleResizableEditPolicyTests.testInstanceRoleCreateEBetweenBAndC()
13:08:39 
13:08:39 (Eclipse:6652): Gtk-WARNING **: 17:08:39.167: Negative content height -5 (allocation 1, extents 3x3) while allocating gadget (node button, owner GtkToggleButton)
13:08:39 
13:08:39 (Eclipse:6652): Gtk-WARNING **: 17:08:39.180: Negative content width -12 (allocation 1, extents 6x7) while allocating gadget (node separator, owner GtkSeparatorToolItem)
13:08:39 
13:08:39 (Eclipse:6652): Gtk-WARNING **: 17:08:39.184: Negative content width -12 (allocation 1, extents 6x7) while allocating gadget (node separator, owner GtkSeparatorToolItem)
13:08:39 
13:08:39 (Eclipse:6652): Gtk-WARNING **: 17:08:39.198: Negative content width -12 (allocation 1, extents 6x7) while allocating gadget (node separator, owner GtkSeparatorToolItem)
13:08:40 Setup of org.eclipse.sirius.tests.swtbot.sequence.SequenceReorderTest.test_Reorder_Execution()
13:08:41 
13:08:41 (Eclipse:6652): Gtk-WARNING **: 17:08:41.682: Negative content height -5 (allocation 1, extents 3x3) while allocating gadget (node button, owner GtkToggleButton)
13:08:41 
13:08:41 (Eclipse:6652): Gtk-WARNING **: 17:08:41.695: Negative content width -12 (allocation 1, extents 6x7) while allocating gadget (node separator, owner GtkSeparatorToolItem)
13:08:41 
13:08:41 (Eclipse:6652): Gtk-WARNING **: 17:08:41.699: Negative content width -12 (allocation 1, extents 6x7) while allocating gadget (node separator, owner GtkSeparatorToolItem)
13:08:41 
13:08:41 (Eclipse:6652): Gtk-WARNING **: 17:08:41.714: Negative content width -12 (allocation 1, extents 6x7) while allocating gadget (node separator, owner GtkSeparatorToolItem)
13:08:42 Setup of org.eclipse.sirius.tests.swtbot.sequence.SequenceDiagramDirtyTests.test_reopen_saved_sequence_diagram_in_same_session()
13:08:43 
13:08:43 (Eclipse:6652): Gtk-WARNING **: 17:08:43.822: Negative content height -5 (allocation 1, extents 3x3) while allocating gadget (node button, owner GtkToggleButton)
13:08:43 
13:08:43 (Eclipse:6652): Gtk-WARNING **: 17:08:43.835: Negative content width -12 (allocation 1, extents 6x7) while allocating gadget (node separator, owner GtkSeparatorToolItem)
13:08:43 
13:08:43 (Eclipse:6652): Gtk-WARNING **: 17:08:43.839: Negative content width -12 (allocation 1, extents 6x7) while allocating gadget (node separator, owner GtkSeparatorToolItem)
13:08:43 
13:08:43 (Eclipse:6652): Gtk-WARNING **: 17:08:43.853: Negative content width -12 (allocation 1, extents 6x7) while allocating gadget (node separator, owner GtkSeparatorToolItem)
13:08:45 
13:08:45 (Eclipse:6652): Gtk-WARNING **: 17:08:45.096: Negative content height -5 (allocation 1, extents 3x3) while allocating gadget (node button, owner GtkToggleButton)
13:08:45 
13:08:45 (Eclipse:6652): Gtk-WARNING **: 17:08:45.109: Negative content width -12 (allocation 1, extents 6x7) while allocating gadget (node separator, owner GtkSeparatorToolItem)
13:08:45 
13:08:45 (Eclipse:6652): Gtk-WARNING **: 17:08:45.112: Negative content width -12 (allocation 1, extents 6x7) while allocating gadget (node separator, owner GtkSeparatorToolItem)
13:08:45 
13:08:45 (Eclipse:6652): Gtk-WARNING **: 17:08:45.127: Negative content width -12 (allocation 1, extents 6x7) while allocating gadget (node separator, owner GtkSeparatorToolItem)
13:08:45 Setup of org.eclipse.sirius.tests.swtbot.sequence.SequenceDiagramDirtyTests.test_session_clean_after_diagram_opened()
13:08:46 
13:08:46 (Eclipse:6652): Gtk-WARNING **: 17:08:46.423: Negative content height -5 (allocation 1, extents 3x3) while allocating gadget (node button, owner GtkToggleButton)
13:08:46 
13:08:46 (Eclipse:6652): Gtk-WARNING **: 17:08:46.437: Negative content width -12 (allocation 1, extents 6x7) while allocating gadget (node separator, owner GtkSeparatorToolItem)
13:08:46 
13:08:46 (Eclipse:6652): Gtk-WARNING **: 17:08:46.441: Negative content width -12 (allocation 1, extents 6x7) while allocating gadget (node separator, owner GtkSeparatorToolItem)
13:08:46 
13:08:46 (Eclipse:6652): Gtk-WARNING **: 17:08:46.455: Negative content width -12 (allocation 1, extents 6x7) while allocating gadget (node separator, owner GtkSeparatorToolItem)
13:08:46 Setup of org.eclipse.sirius.tests.swtbot.sequence.SequenceOpeningFilteredEventEndsTests.testDiagramOpeningAndSessionNonDirty()
13:08:47 
13:08:47 (Eclipse:6652): Gtk-WARNING **: 17:08:47.744: Negative content height -5 (allocation 1, extents 3x3) while allocating gadget (node button, owner GtkToggleButton)
13:08:47 
13:08:47 (Eclipse:6652): Gtk-WARNING **: 17:08:47.758: Negative content width -12 (allocation 1, extents 6x7) while allocating gadget (node separator, owner GtkSeparatorToolItem)
13:08:47 
13:08:47 (Eclipse:6652): Gtk-WARNING **: 17:08:47.761: Negative content width -12 (allocation 1, extents 6x7) while allocating gadget (node separator, owner GtkSeparatorToolItem)
13:08:47 
13:08:47 (Eclipse:6652): Gtk-WARNING **: 17:08:47.776: Negative content width -12 (allocation 1, extents 6x7) while allocating gadget (node separator, owner GtkSeparatorToolItem)
13:08:48 Setup of org.eclipse.sirius.tests.swtbot.sequence.SequenceDiagramNoSnapTest.testSnapOptionsStillDisabledOnSequenceDiagramWhenChangedInStandardDiagram()
13:08:48 
13:08:48 (Eclipse:6652): Gtk-WARNING **: 17:08:48.984: Negative content height -5 (allocation 1, extents 3x3) while allocating gadget (node button, owner GtkToggleButton)
13:08:48 
13:08:48 (Eclipse:6652): Gtk-WARNING **: 17:08:48.997: Negative content width -12 (allocation 1, extents 6x7) while allocating gadget (node separator, owner GtkSeparatorToolItem)
13:08:49 
13:08:49 (Eclipse:6652): Gtk-WARNING **: 17:08:49.000: Negative content width -12 (allocation 1, extents 6x7) while allocating gadget (node separator, owner GtkSeparatorToolItem)
13:08:49 
13:08:49 (Eclipse:6652): Gtk-WARNING **: 17:08:49.014: Negative content width -12 (allocation 1, extents 6x7) while allocating gadget (node separator, owner GtkSeparatorToolItem)
13:08:53 #
13:08:53 # A fatal error has been detected by the Java Runtime Environment:
13:08:53 #
13:08:53 #  SIGSEGV (0xb) at pc=0x00007fb89a4a3b8d, pid=6652, tid=6698
13:08:53 #
13:08:53 # JRE version: OpenJDK Runtime Environment (11.0.2+9) (build 11.0.2+9)
13:08:53 # Java VM: OpenJDK 64-Bit Server VM (11.0.2+9, mixed mode, tiered, compressed oops, g1 gc, linux-amd64)
13:08:53 # Problematic frame:
13:08:53 # C  [libpango-1.0.so.0+0x22b8d]
13:08:53 #
13:08:53 # Core dump will be written. Default location: /home/jenkins/agent/workspace/sirius.sonar-master/plugins/org.eclipse.sirius.tests.swtbot/core.6652
13:08:53 #
13:08:53 # An error report file with more information is saved as:
13:08:53 # /home/jenkins/agent/workspace/sirius.sonar-master/plugins/org.eclipse.sirius.tests.swtbot/hs_err_pid6652.log
13:08:53 #
13:08:53 # If you would like to submit a bug report, please visit:
13:08:53 #   http://bugreport.java.com/bugreport/crash.jsp
13:08:53 # The crash happened outside the Java Virtual Machine in native code.
13:08:53 # See problematic frame for where to report the bug.
13:08:53 #
13:08:54 [INFO] ------------------------------------------------------------------------
13:08:54 [INFO] Reactor Summary:
13:08:54 [INFO] 
13:08:54 [INFO] Sirius Parent 6.4.0-SNAPSHOT ....................... SUCCESS [  9.372 s]
13:08:54 [INFO] org.eclipse.sirius.ext.base 6.4.0-SNAPSHOT ......... SUCCESS [  7.405 s]
13:08:54 [INFO] org.eclipse.sirius.ext.e3 6.4.0-SNAPSHOT ........... SUCCESS [  0.102 s]
13:08:54 [INFO] org.eclipse.sirius.ext.emf 6.4.0-SNAPSHOT .......... SUCCESS [  0.231 s]
13:08:54 [INFO] org.eclipse.sirius.ext.emf.edit 6.4.0-SNAPSHOT ..... SUCCESS [  0.301 s]
13:08:54 [INFO] org.eclipse.sirius.ext.emf.tx 6.4.0-SNAPSHOT ....... SUCCESS [  0.188 s]
13:08:54 [INFO] org.eclipse.sirius.ext.gmf.notation 6.4.0-SNAPSHOT . SUCCESS [  0.090 s]
13:08:54 [INFO] org.eclipse.sirius.ext.ide 6.4.0-SNAPSHOT .......... SUCCESS [  0.210 s]
13:08:54 [INFO] org.eclipse.sirius.ecore.extender 6.4.0-SNAPSHOT ... SUCCESS [  0.613 s]
13:08:54 [INFO] org.eclipse.sirius.common 6.4.0-SNAPSHOT ........... SUCCESS [  0.986 s]
13:08:54 [INFO] org.eclipse.sirius 6.4.0-SNAPSHOT .................. SUCCESS [  3.287 s]
13:08:54 [INFO] org.eclipse.sirius.common.acceleo.aql 6.4.0-SNAPSHOT SUCCESS [  0.198 s]
13:08:54 [INFO] org.eclipse.sirius.common.acceleo.mtl 6.4.0-SNAPSHOT SUCCESS [  0.398 s]
13:08:54 [INFO] org.eclipse.sirius.common.interpreter 6.4.0-SNAPSHOT SUCCESS [  0.230 s]
13:08:54 [INFO] org.eclipse.sirius.common.ocl 6.4.0-SNAPSHOT ....... SUCCESS [  0.210 s]
13:08:54 [INFO] org.eclipse.sirius.diagram 6.4.0-SNAPSHOT .......... SUCCESS [  2.397 s]
13:08:54 [INFO] org.eclipse.sirius.diagram.formatdata 6.4.0-SNAPSHOT SUCCESS [  0.300 s]
13:08:54 [INFO] org.eclipse.sirius.synchronizer 6.4.0-SNAPSHOT ..... SUCCESS [  0.262 s]
13:08:54 [INFO] org.eclipse.sirius.table 6.4.0-SNAPSHOT ............ SUCCESS [  0.545 s]
13:08:54 [INFO] org.eclipse.sirius.tree 6.4.0-SNAPSHOT ............. SUCCESS [  0.407 s]
13:08:54 [INFO] org.eclipse.sirius.workflow.model 6.4.0-SNAPSHOT ... SUCCESS [  0.162 s]
13:08:54 [INFO] org.eclipse.sirius.runtime 6.4.0-SNAPSHOT .......... SUCCESS [  0.394 s]
13:08:54 [INFO] org.eclipse.sirius.runtime.acceleo 6.4.0-SNAPSHOT .. SUCCESS [  0.131 s]
13:08:54 [INFO] org.eclipse.sirius.runtime.aql 6.4.0-SNAPSHOT ...... SUCCESS [  0.073 s]
13:08:54 [INFO] org.eclipse.sirius.runtime.ocl 6.4.0-SNAPSHOT ...... SUCCESS [  0.095 s]
13:08:54 [INFO] org.eclipse.sirius.headless.update 6.4.0-SNAPSHOT .. SUCCESS [  2.149 s]
13:08:54 [INFO] org.eclipse.sirius.services.common 6.4.0-SNAPSHOT .. SUCCESS [  0.113 s]
13:08:54 [INFO] org.eclipse.sirius.services.diagram 6.4.0-SNAPSHOT . SUCCESS [  0.229 s]
13:08:54 [INFO] org.eclipse.sirius.services.graphql.common 6.4.0-SNAPSHOT SUCCESS [  0.131 s]
13:08:54 [INFO] org.eclipse.sirius.services.graphql.core 6.4.0-SNAPSHOT SUCCESS [  0.167 s]
13:08:54 [INFO] org.eclipse.sirius.services.graphql.emf 6.4.0-SNAPSHOT SUCCESS [  0.129 s]
13:08:54 [INFO] org.eclipse.sirius.services.graphql.workspace 6.4.0-SNAPSHOT SUCCESS [  0.131 s]
13:08:54 [INFO] org.eclipse.sirius.services.graphql 6.4.0-SNAPSHOT . SUCCESS [  0.377 s]
13:08:54 [INFO] org.eclipse.sirius.server 6.4.0-SNAPSHOT ........... SUCCESS [  0.288 s]
13:08:54 [INFO] org.eclipse.sirius.server.application 6.4.0-SNAPSHOT SUCCESS [  0.174 s]
13:08:54 [INFO] org.eclipse.sirius.server.backend 6.4.0-SNAPSHOT ... SUCCESS [  0.321 s]
13:08:54 [INFO] org.eclipse.sirius.server.images 6.4.0-SNAPSHOT .... SUCCESS [  0.206 s]
13:08:54 [INFO] org.eclipse.sirius.server.diagram 6.4.0-SNAPSHOT ... SUCCESS [  0.282 s]
13:08:54 [INFO] org.eclipse.sirius.server.frontend 6.4.0-SNAPSHOT .. SUCCESS [  0.222 s]
13:08:54 [INFO] org.eclipse.sirius.server.frontend.workflow 6.4.0-SNAPSHOT SUCCESS [  0.220 s]
13:08:54 [INFO] org.eclipse.sirius.server.graphql 6.4.0-SNAPSHOT ... SUCCESS [  0.198 s]
13:08:54 [INFO] org.eclipse.sirius.tests.server 6.4.0-SNAPSHOT ..... SUCCESS [  3.683 s]
13:08:54 [INFO] org.eclipse.sirius.tests.services.graphql 6.4.0-SNAPSHOT SUCCESS [  7.802 s]
13:08:54 [INFO] org.eclipse.sirius.server.feature 6.4.0-SNAPSHOT ... SUCCESS [  0.171 s]
13:08:54 [INFO] org.eclipse.sirius.server.product.feature 6.4.0-SNAPSHOT SUCCESS [  0.108 s]
13:08:54 [INFO] org.eclipse.sirius.server.product 6.4.0-SNAPSHOT ... SUCCESS [ 13.090 s]
13:08:54 [INFO] org.eclipse.sirius.ext.draw2d 6.4.0-SNAPSHOT ....... SUCCESS [  0.122 s]
13:08:54 [INFO] org.eclipse.sirius.ext.e3.ui 6.4.0-SNAPSHOT ........ SUCCESS [  0.306 s]
13:08:54 [INFO] org.eclipse.sirius.ext.emf.ui 6.4.0-SNAPSHOT ....... SUCCESS [  0.174 s]
13:08:54 [INFO] org.eclipse.sirius.ext.gef 6.4.0-SNAPSHOT .......... SUCCESS [  0.194 s]
13:08:54 [INFO] org.eclipse.sirius.ext.gmf.runtime 6.4.0-SNAPSHOT .. SUCCESS [  0.316 s]
13:08:54 [INFO] org.eclipse.sirius.ext.jface 6.4.0-SNAPSHOT ........ SUCCESS [  0.109 s]
13:08:54 [INFO] org.eclipse.sirius.ext.swt 6.4.0-SNAPSHOT .......... SUCCESS [  0.115 s]
13:08:54 [INFO] org.eclipse.sirius.common.acceleo.aql.ide 6.4.0-SNAPSHOT SUCCESS [  0.196 s]
13:08:54 [INFO] org.eclipse.sirius.common.acceleo.mtl.ide 6.4.0-SNAPSHOT SUCCESS [  0.313 s]
13:08:54 [INFO] org.eclipse.sirius.common.ui 6.4.0-SNAPSHOT ........ SUCCESS [  0.658 s]
13:08:54 [INFO] org.eclipse.sirius.common.ui.ext 6.4.0-SNAPSHOT .... SUCCESS [  0.192 s]
13:08:54 [INFO] org.eclipse.sirius.common.xtext 6.4.0-SNAPSHOT ..... SUCCESS [  0.206 s]
13:08:54 [INFO] org.eclipse.sirius.ui 6.4.0-SNAPSHOT ............... SUCCESS [  1.719 s]
13:08:54 [INFO] org.eclipse.sirius.diagram.ui 6.4.0-SNAPSHOT ....... SUCCESS [  4.196 s]
13:08:54 [INFO] org.eclipse.sirius.diagram.elk 6.4.0-SNAPSHOT ...... SUCCESS [  0.311 s]
13:08:54 [INFO] org.eclipse.sirius.diagram.elk.debug 6.4.0-SNAPSHOT  SUCCESS [  0.230 s]
13:08:54 [INFO] org.eclipse.sirius.diagram.ui.ext 6.4.0-SNAPSHOT ... SUCCESS [  0.191 s]
13:08:54 [INFO] org.eclipse.sirius.diagram.sequence 6.4.0-SNAPSHOT . SUCCESS [  0.888 s]
13:08:54 [INFO] org.eclipse.sirius.diagram.sequence.edit 6.4.0-SNAPSHOT SUCCESS [  0.577 s]
13:08:54 [INFO] org.eclipse.sirius.diagram.sequence.ui 6.4.0-SNAPSHOT SUCCESS [  0.631 s]
13:08:54 [INFO] org.eclipse.sirius.doc 6.4.0-SNAPSHOT .............. SUCCESS [  0.829 s]
13:08:54 [INFO] org.eclipse.sirius.editor 6.4.0-SNAPSHOT ........... SUCCESS [  0.969 s]
13:08:54 [INFO] org.eclipse.sirius.editor.diagram 6.4.0-SNAPSHOT ... SUCCESS [  1.250 s]
13:08:54 [INFO] org.eclipse.sirius.editor.sequence 6.4.0-SNAPSHOT .. SUCCESS [  0.637 s]
13:08:54 [INFO] org.eclipse.sirius.table.ui 6.4.0-SNAPSHOT ......... SUCCESS [  0.784 s]
13:08:54 [INFO] org.eclipse.sirius.editor.table 6.4.0-SNAPSHOT ..... SUCCESS [  0.502 s]
13:08:54 [INFO] org.eclipse.sirius.tree.ui 6.4.0-SNAPSHOT .......... SUCCESS [  0.418 s]
13:08:54 [INFO] org.eclipse.sirius.editor.tree 6.4.0-SNAPSHOT ...... SUCCESS [  0.462 s]
13:08:54 [INFO] org.eclipse.sirius.editor.workflow 6.4.0-SNAPSHOT .. SUCCESS [  0.350 s]
13:08:54 [INFO] org.eclipse.sirius.eef.adapters 6.4.0-SNAPSHOT ..... SUCCESS [  0.374 s]
13:08:54 [INFO] org.eclipse.sirius.interpreter 6.4.0-SNAPSHOT ...... SUCCESS [  0.231 s]
13:08:54 [INFO] org.eclipse.sirius.table.ui.ext 6.4.0-SNAPSHOT ..... SUCCESS [  0.186 s]
13:08:54 [INFO] org.eclipse.sirius.tree.ui.ext 6.4.0-SNAPSHOT ...... SUCCESS [  0.188 s]
13:08:54 [INFO] org.eclipse.sirius.ui.ext 6.4.0-SNAPSHOT ........... SUCCESS [  0.185 s]
13:08:54 [INFO] org.eclipse.sirius.ui.editor 6.4.0-SNAPSHOT ........ SUCCESS [  0.332 s]
13:08:54 [INFO] org.eclipse.sirius.tests.junit.support 6.4.0-SNAPSHOT SUCCESS [  0.498 s]
13:08:54 [INFO] org.eclipse.sirius.tests.swtbot.support 6.4.0-SNAPSHOT SUCCESS [  0.864 s]
13:08:54 [INFO] org.eclipse.sirius.workflow.edit 6.4.0-SNAPSHOT .... SUCCESS [  0.223 s]
13:08:54 [INFO] org.eclipse.sirius.sample.basicfamily 1.0.0-SNAPSHOT SUCCESS [  0.194 s]
13:08:54 [INFO] org.eclipse.sirius.sample.basicfamily.edit 1.0.0-SNAPSHOT SUCCESS [  0.130 s]
13:08:54 [INFO] org.eclipse.sirius.sample.basicfamily.editor 1.0.0-SNAPSHOT SUCCESS [  0.267 s]
13:08:54 [INFO] org.eclipse.sirius.sample.basicfamily.design 1.0.0-SNAPSHOT SUCCESS [  0.131 s]
13:08:54 [INFO] org.eclipse.sirius.samples.family 6.4.0-SNAPSHOT ... SUCCESS [  0.157 s]
13:08:54 [INFO] org.eclipse.sirius.common.interpreter.aql 6.4.0-SNAPSHOT SUCCESS [  0.148 s]
13:08:54 [INFO] org.eclipse.sirius.properties 6.4.0-SNAPSHOT ....... SUCCESS [  0.653 s]
13:08:54 [INFO] org.eclipse.sirius.properties.edit 6.4.0-SNAPSHOT .. SUCCESS [  0.604 s]
13:08:54 [INFO] org.eclipse.sirius.properties.ext.widgets.reference 6.4.0-SNAPSHOT SUCCESS [  0.187 s]
13:08:54 [INFO] org.eclipse.sirius.properties.ext.widgets.reference.edit 6.4.0-SNAPSHOT SUCCESS [  0.234 s]
13:08:54 [INFO] org.eclipse.sirius.properties.defaultrules 6.4.0-SNAPSHOT SUCCESS [  0.202 s]
13:08:54 [INFO] org.eclipse.sirius.properties.core 6.4.0-SNAPSHOT .. SUCCESS [  0.406 s]
13:08:54 [INFO] org.eclipse.sirius.editor.properties 6.4.0-SNAPSHOT  SUCCESS [  1.280 s]
13:08:54 [INFO] org.eclipse.sirius.editor.properties.ext.widgets.reference 6.4.0-SNAPSHOT SUCCESS [  0.376 s]
13:08:54 [INFO] org.eclipse.sirius.ui.properties 6.4.0-SNAPSHOT .... SUCCESS [  0.331 s]
13:08:54 [INFO] org.eclipse.sirius.ui.properties.ext.widgets.reference 6.4.0-SNAPSHOT SUCCESS [  0.217 s]
13:08:54 [INFO] org.eclipse.sirius.sample.properties 6.4.0-SNAPSHOT  SUCCESS [  0.179 s]
13:08:54 [INFO] org.eclipse.sirius.sample.properties.checkbox 6.4.0-SNAPSHOT SUCCESS [  0.192 s]
13:08:54 [INFO] org.eclipse.sirius.sample.properties.radio 6.4.0-SNAPSHOT SUCCESS [  0.186 s]
13:08:54 [INFO] org.eclipse.sirius.sample.properties.textarea 6.4.0-SNAPSHOT SUCCESS [  0.206 s]
13:08:54 [INFO] org.eclipse.sirius.tests.ui.properties 6.4.0-SNAPSHOT SUCCESS [ 10.713 s]
13:08:54 [INFO] org.eclipse.sirius.workflow.ui.page 6.4.0-SNAPSHOT . SUCCESS [  0.205 s]
13:08:54 [INFO] org.eclipse.sirius.server.ui.autostart 6.4.0-SNAPSHOT SUCCESS [  0.186 s]
13:08:54 [INFO] org.eclipse.sirius.aql 6.4.0-SNAPSHOT .............. SUCCESS [  0.093 s]
13:08:54 [INFO] org.eclipse.sirius.doc.feature 6.4.0-SNAPSHOT ...... SUCCESS [  0.101 s]
13:08:54 [INFO] org.eclipse.sirius.runtime.ide.eef 6.4.0-SNAPSHOT .. SUCCESS [  0.115 s]
13:08:54 [INFO] org.eclipse.sirius.runtime.ide.ui.acceleo 6.4.0-SNAPSHOT SUCCESS [  0.081 s]
13:08:54 [INFO] org.eclipse.sirius.runtime.ide.ui 6.4.0-SNAPSHOT ... SUCCESS [  0.302 s]
13:08:54 [INFO] org.eclipse.sirius.runtime.ide.xtext 6.4.0-SNAPSHOT  SUCCESS [  0.098 s]
13:08:54 [INFO] org.eclipse.sirius.samples 6.4.0-SNAPSHOT .......... SUCCESS [  0.110 s]
13:08:54 [INFO] org.eclipse.sirius.specifier 6.4.0-SNAPSHOT ........ SUCCESS [  0.577 s]
13:08:54 [INFO] org.eclipse.sirius.specifier.ide.ui.acceleo 6.4.0-SNAPSHOT SUCCESS [  0.046 s]
13:08:54 [INFO] org.eclipse.sirius.specifier.ide.ui.aql 6.4.0-SNAPSHOT SUCCESS [  0.087 s]
13:08:54 [INFO] org.eclipse.sirius.specifier.ide.ui 6.4.0-SNAPSHOT . SUCCESS [  0.126 s]
13:08:54 [INFO] org.eclipse.sirius.tests.support 6.4.0-SNAPSHOT .... SUCCESS [  0.147 s]
13:08:54 [INFO] org.eclipse.sirius.interpreter.feature 6.4.0-SNAPSHOT SUCCESS [  0.106 s]
13:08:54 [INFO] org.eclipse.sirius.properties.feature 6.4.0-SNAPSHOT SUCCESS [  0.117 s]
13:08:54 [INFO] org.eclipse.sirius.specifier.properties.feature 6.4.0-SNAPSHOT SUCCESS [  0.098 s]
13:08:54 [INFO] org.eclipse.sirius.samples.properties.feature 6.4.0-SNAPSHOT SUCCESS [  0.133 s]
13:08:54 [INFO] org.eclipse.sirius.workflow.feature 6.4.0-SNAPSHOT . SUCCESS [  0.174 s]
13:08:54 [INFO] org.eclipse.sirius.diagram.elk.feature 6.4.0-SNAPSHOT SUCCESS [  0.102 s]
13:08:54 [INFO] org.eclipse.sirius.server.ui.autostart.feature 6.4.0-SNAPSHOT SUCCESS [  0.092 s]
13:08:54 [INFO] org.eclipse.sirius.sample.basicfamily.feature 6.4.0-SNAPSHOT SUCCESS [  0.098 s]
13:08:54 [INFO] org.eclipse.sirius.sample.ecore.design 6.4.0-SNAPSHOT SUCCESS [  0.317 s]
13:08:54 [INFO] org.eclipse.sirius.sample.interactions 6.4.0-SNAPSHOT SUCCESS [  0.228 s]
13:08:54 [INFO] org.eclipse.sirius.sample.interactions.design 6.4.0-SNAPSHOT SUCCESS [  0.285 s]
13:08:54 [INFO] org.eclipse.sirius.sample.interactions.edit 6.4.0-SNAPSHOT SUCCESS [  0.256 s]
13:08:54 [INFO] org.eclipse.sirius.sample.interactions.editor 6.4.0-SNAPSHOT SUCCESS [  0.228 s]
13:08:54 [INFO] org.eclipse.sirius.tests.sample.benchmark 6.4.0-SNAPSHOT SUCCESS [  0.191 s]
13:08:54 [INFO] org.eclipse.sirius.tests.sample.docbook 6.4.0-SNAPSHOT SUCCESS [  0.210 s]
13:08:54 [INFO] org.eclipse.sirius.tests.sample.docbook.design 6.4.0-SNAPSHOT SUCCESS [  0.170 s]
13:08:54 [INFO] org.eclipse.sirius.tests.sample.migration 6.4.0-SNAPSHOT SUCCESS [  0.345 s]
13:08:54 [INFO] org.eclipse.sirius.tests.sample.migration.design 6.4.0-SNAPSHOT SUCCESS [  0.354 s]
13:08:54 [INFO] org.eclipse.sirius.tests.sample.component 6.4.0-SNAPSHOT SUCCESS [  0.138 s]
13:08:54 [INFO] org.eclipse.sirius.tests.sample.scxml 6.4.0-SNAPSHOT SUCCESS [  0.474 s]
13:08:54 [INFO] org.eclipse.sirius.tests.sample.scxml.design 6.4.0-SNAPSHOT SUCCESS [  0.192 s]
13:08:54 [INFO] org.eclipse.sirius.tests.sample.component.design 6.4.0-SNAPSHOT SUCCESS [  0.317 s]
13:08:54 [INFO] org.eclipse.sirius.tests.junit 6.4.0-SNAPSHOT ...... SUCCESS [09:03 min]
13:08:54 [INFO] org.eclipse.sirius.tests.tree 6.4.0-SNAPSHOT ....... SUCCESS [ 37.125 s]
13:08:54 [INFO] org.eclipse.sirius.tests.swtbot 6.4.0-SNAPSHOT ..... FAILURE [01:02 min]
13:08:54 [INFO] org.eclipse.sirius.tests 6.4.0-SNAPSHOT ............ SKIPPED
13:08:54 [INFO] org.eclipse.sirius.tests.rcptt.properties 6.4.0-SNAPSHOT SKIPPED
13:08:54 [INFO] org.eclipse.sirius.tests.rcptt.properties.edit 6.4.0-SNAPSHOT SKIPPED
13:08:54 [INFO] org.eclipse.sirius.tests.rcptt.properties.editor 6.4.0-SNAPSHOT SKIPPED
13:08:54 [INFO] org.eclipse.sirius.tests.rcptt.properties.samples 6.4.0-SNAPSHOT SKIPPED
13:08:54 [INFO] org.eclipse.sirius.tests.rcptt.feature 6.4.0-SNAPSHOT SKIPPED
13:08:54 [INFO] org.eclipse.sirius.update 6.4.0-SNAPSHOT ........... SKIPPED
13:08:54 [INFO] org.eclipse.sirius.sample.basicfamily.update 6.4.0-SNAPSHOT SKIPPED
13:08:54 [INFO] org.eclipse.sirius.tests.sample.docbook.edit 6.4.0-SNAPSHOT SKIPPED
13:08:54 [INFO] org.eclipse.sirius.tests.sample.docbook.editor 6.4.0-SNAPSHOT SKIPPED
13:08:54 [INFO] org.eclipse.sirius.tests.sample.xtext.statemachine 6.4.0-SNAPSHOT SKIPPED
13:08:54 [INFO] org.eclipse.sirius.tests.sample.xtext.statemachine.ide 6.4.0-SNAPSHOT SKIPPED
13:08:54 [INFO] org.eclipse.sirius.tests.sample.xtext.statemachine.ui 6.4.0-SNAPSHOT SKIPPED
13:08:54 [INFO] org.eclipse.sirius.tests.sample.xtext.statemachine.design 6.4.0-SNAPSHOT SKIPPED
13:08:54 [INFO] org.eclipse.sirius.tests.junit.xtext 6.4.0-SNAPSHOT  SKIPPED
13:08:54 [INFO] org.eclipse.sirius.tests.update 6.4.0-SNAPSHOT ..... SKIPPED
13:08:54 [INFO] ------------------------------------------------------------------------
13:08:54 [INFO] BUILD FAILURE
13:08:54 [INFO] ------------------------------------------------------------------------
13:08:54 [INFO] Total time:  14:32 min
13:08:54 [INFO] Finished at: 2020-08-13T17:08:54Z
13:08:54 [INFO] ------------------------------------------------------------------------
13:08:54 [ERROR] Failed to execute goal org.eclipse.tycho:tycho-surefire-plugin:1.7.0:test (default-test) on project org.eclipse.sirius.tests.swtbot: An unexpected error occurred while launching the test runtime (process returned error code 134(SIGABRT received?)). The process logfile /home/jenkins/agent/workspace/sirius.sonar-master/plugins/org.eclipse.sirius.tests.swtbot/target/work/data/.metadata/.log might contain further details. Command-line used to launch the sub-process was null -Dosgi.noShutdown=false -Dosgi.os=linux -Dosgi.ws=gtk -Dosgi.arch=x86_64 -javaagent:/home/jenkins/agent/workspace/sirius.sonar-master/.repository/org/jacoco/org.jacoco.agent/0.8.5/org.jacoco.agent-0.8.5-runtime.jar=destfile=/home/jenkins/agent/workspace/sirius.sonar-master/plugins/org.eclipse.sirius.tests.swtbot/../../packaging/org.eclipse.sirius.parent/target/jacoco.exec,append=true -Xmx2048m -XX:+HeapDumpOnOutOfMemoryError -Dosgi.clean=true -DcreateLocalRepresentationInSeparateResource=null -Dorg.eclipse.sirius.tests.skipLongTests=true -Dorg.eclipse.sirius.tests.skipUnreliableTests=true -Dorg.eclipse.swtbot.screenshots.dir=/home/jenkins/agent/workspace/sirius.sonar-master/plugins/org.eclipse.sirius.tests.swtbot/target/screenshots -jar /home/jenkins/agent/workspace/sirius.sonar-master/.repository/p2/osgi/bundle/org.eclipse.equinox.launcher/1.5.700.v20200207-2156/org.eclipse.equinox.launcher-1.5.700.v20200207-2156.jar -data /home/jenkins/agent/workspace/sirius.sonar-master/plugins/org.eclipse.sirius.tests.swtbot/target/work/data -install /home/jenkins/agent/workspace/sirius.sonar-master/plugins/org.eclipse.sirius.tests.swtbot/target/work -configuration /home/jenkins/agent/workspace/sirius.sonar-master/plugins/org.eclipse.sirius.tests.swtbot/target/work/configuration -application org.eclipse.tycho.surefire.osgibooter.uitest -testproperties /home/jenkins/agent/workspace/sirius.sonar-master/plugins/org.eclipse.sirius.tests.swtbot/target/surefire.properties -testApplication org.eclipse.ui.ide.workbench -product org.eclipse.sdk.ide -nouithread in working directory /home/jenkins/agent/workspace/sirius.sonar-master/plugins/org.eclipse.sirius.tests.swtbot -> [Help 1]
13:08:54 [ERROR] 
13:08:54 [ERROR] To see the full stack trace of the errors, re-run Maven with the -e switch.
13:08:54 [ERROR] Re-run Maven using the -X switch to enable full debug logging.
13:08:54 [ERROR] 
13:08:54 [ERROR] For more information about the errors and possible solutions, please read the following articles:
13:08:54 [ERROR] [Help 1] http://cwiki.apache.org/confluence/display/MAVEN/MojoFailureException
13:08:54 [ERROR] 
13:08:54 [ERROR] After correcting the problems, you can resume the build with the command
13:08:54 [ERROR]   mvn <args> -rf :org.eclipse.sirius.tests.swtbot
13:08:55 Build step 'Invoke top-level Maven targets' marked build as failure
13:08:55 Terminating xvnc.
13:09:18 Skipping sonar analysis due to bad build status FAILURE
13:09:18 Recording test results
13:09:18 Archiving artifacts
13:09:20 Finished: FAILURE