FailedConsole Output

Skipping 242 KB.. Full Log
/repositories/maven_central/org/apache/maven/maven-parent/22/maven-parent-22.pom (0 B at 0.0 KB/sec)
Downloading: https://repo.eclipse.org/content/repositories/maven_central/org/apache/apache/11/apache-11.pom
Downloaded: https://repo.eclipse.org/content/repositories/maven_central/org/apache/apache/11/apache-11.pom (0 B at 0.0 KB/sec)
Downloading: https://repo.eclipse.org/content/repositories/maven_central/org/apache/maven/plugins/maven-install-plugin/2.4/maven-install-plugin-2.4.jar
Downloaded: https://repo.eclipse.org/content/repositories/maven_central/org/apache/maven/plugins/maven-install-plugin/2.4/maven-install-plugin-2.4.jar (0 B at 0.0 KB/sec)
Downloading: https://repo.eclipse.org/content/repositories/maven_central/org/apache/maven/plugins/maven-deploy-plugin/2.7/maven-deploy-plugin-2.7.pom
Downloaded: https://repo.eclipse.org/content/repositories/maven_central/org/apache/maven/plugins/maven-deploy-plugin/2.7/maven-deploy-plugin-2.7.pom (6 KB at 210.8 KB/sec)
Downloading: https://repo.eclipse.org/content/repositories/maven_central/org/apache/maven/plugins/maven-deploy-plugin/2.7/maven-deploy-plugin-2.7.jar
Downloaded: https://repo.eclipse.org/content/repositories/maven_central/org/apache/maven/plugins/maven-deploy-plugin/2.7/maven-deploy-plugin-2.7.jar (27 KB at 970.4 KB/sec)
Downloading: https://repo.eclipse.org/content/repositories/maven_central/org/apache/maven/plugins/maven-antrun-plugin/1.3/maven-antrun-plugin-1.3.pom
Downloaded: https://repo.eclipse.org/content/repositories/maven_central/org/apache/maven/plugins/maven-antrun-plugin/1.3/maven-antrun-plugin-1.3.pom (5 KB at 154.0 KB/sec)
Downloading: https://repo.eclipse.org/content/repositories/maven_central/org/apache/maven/plugins/maven-plugins/12/maven-plugins-12.pom
Downloaded: https://repo.eclipse.org/content/repositories/maven_central/org/apache/maven/plugins/maven-plugins/12/maven-plugins-12.pom (12 KB at 498.8 KB/sec)
Downloading: https://repo.eclipse.org/content/repositories/maven_central/org/apache/maven/maven-parent/9/maven-parent-9.pom
Downloaded: https://repo.eclipse.org/content/repositories/maven_central/org/apache/maven/maven-parent/9/maven-parent-9.pom (33 KB at 1282.7 KB/sec)
Downloading: https://repo.eclipse.org/content/repositories/maven_central/org/apache/maven/plugins/maven-antrun-plugin/1.3/maven-antrun-plugin-1.3.jar
Downloaded: https://repo.eclipse.org/content/repositories/maven_central/org/apache/maven/plugins/maven-antrun-plugin/1.3/maven-antrun-plugin-1.3.jar (24 KB at 920.8 KB/sec)
Downloading: https://repo.eclipse.org/content/repositories/maven_central/org/apache/maven/plugins/maven-assembly-plugin/2.2-beta-5/maven-assembly-plugin-2.2-beta-5.pom
Downloaded: https://repo.eclipse.org/content/repositories/maven_central/org/apache/maven/plugins/maven-assembly-plugin/2.2-beta-5/maven-assembly-plugin-2.2-beta-5.pom (15 KB at 548.3 KB/sec)
Downloading: https://repo.eclipse.org/content/repositories/maven_central/org/apache/maven/plugins/maven-assembly-plugin/2.2-beta-5/maven-assembly-plugin-2.2-beta-5.jar
Downloaded: https://repo.eclipse.org/content/repositories/maven_central/org/apache/maven/plugins/maven-assembly-plugin/2.2-beta-5/maven-assembly-plugin-2.2-beta-5.jar (204 KB at 793.7 KB/sec)
Downloading: https://repo.eclipse.org/content/repositories/maven_central/org/apache/maven/plugins/maven-dependency-plugin/2.8/maven-dependency-plugin-2.8.pom
Downloaded: https://repo.eclipse.org/content/repositories/maven_central/org/apache/maven/plugins/maven-dependency-plugin/2.8/maven-dependency-plugin-2.8.pom (12 KB at 414.3 KB/sec)
Downloading: https://repo.eclipse.org/content/repositories/maven_central/org/apache/maven/plugins/maven-dependency-plugin/2.8/maven-dependency-plugin-2.8.jar
Downloaded: https://repo.eclipse.org/content/repositories/maven_central/org/apache/maven/plugins/maven-dependency-plugin/2.8/maven-dependency-plugin-2.8.jar (150 KB at 4533.2 KB/sec)
Downloading: https://repo.eclipse.org/content/repositories/maven_central/org/apache/maven/plugins/maven-release-plugin/2.3.2/maven-release-plugin-2.3.2.pom
Downloaded: https://repo.eclipse.org/content/repositories/maven_central/org/apache/maven/plugins/maven-release-plugin/2.3.2/maven-release-plugin-2.3.2.pom (10 KB at 363.6 KB/sec)
Downloading: https://repo.eclipse.org/content/repositories/maven_central/org/apache/maven/release/maven-release/2.3.2/maven-release-2.3.2.pom
Downloaded: https://repo.eclipse.org/content/repositories/maven_central/org/apache/maven/release/maven-release/2.3.2/maven-release-2.3.2.pom (9 KB at 233.9 KB/sec)
Downloading: https://repo.eclipse.org/content/repositories/maven_central/org/apache/maven/plugins/maven-release-plugin/2.3.2/maven-release-plugin-2.3.2.jar
Downloaded: https://repo.eclipse.org/content/repositories/maven_central/org/apache/maven/plugins/maven-release-plugin/2.3.2/maven-release-plugin-2.3.2.jar (44 KB at 1666.4 KB/sec)
Downloading: https://repo.eclipse.org/content/repositories/maven_central/org/apache/maven/plugins/maven-metadata.xml
Downloading: https://repo.eclipse.org/content/repositories/maven_central/org/codehaus/mojo/maven-metadata.xml
Downloaded: https://repo.eclipse.org/content/repositories/maven_central/org/codehaus/mojo/maven-metadata.xml (20 KB at 833.0 KB/sec)
Downloaded: https://repo.eclipse.org/content/repositories/maven_central/org/apache/maven/plugins/maven-metadata.xml (13 KB at 458.1 KB/sec)
Downloading: https://repo.eclipse.org/content/repositories/maven_central/org/apache/maven/plugins/maven-surefire-report-plugin/maven-metadata.xml
Downloaded: https://repo.eclipse.org/content/repositories/maven_central/org/apache/maven/plugins/maven-surefire-report-plugin/maven-metadata.xml (2 KB at 57.8 KB/sec)
Downloading: https://repo.eclipse.org/content/repositories/maven_central/org/apache/maven/plugins/maven-surefire-report-plugin/2.19.1/maven-surefire-report-plugin-2.19.1.pom
Downloaded: https://repo.eclipse.org/content/repositories/maven_central/org/apache/maven/plugins/maven-surefire-report-plugin/2.19.1/maven-surefire-report-plugin-2.19.1.pom (7 KB at 271.7 KB/sec)
Downloading: https://repo.eclipse.org/content/repositories/maven_central/org/apache/maven/surefire/surefire/2.19.1/surefire-2.19.1.pom
Downloaded: https://repo.eclipse.org/content/repositories/maven_central/org/apache/maven/surefire/surefire/2.19.1/surefire-2.19.1.pom (19 KB at 383.4 KB/sec)
Downloading: https://repo.eclipse.org/content/repositories/maven_central/org/apache/maven/maven-parent/26/maven-parent-26.pom
Downloaded: https://repo.eclipse.org/content/repositories/maven_central/org/apache/maven/maven-parent/26/maven-parent-26.pom (39 KB at 1554.1 KB/sec)
Downloading: https://repo.eclipse.org/content/repositories/maven_central/org/apache/apache/16/apache-16.pom
Downloaded: https://repo.eclipse.org/content/repositories/maven_central/org/apache/apache/16/apache-16.pom (16 KB at 537.0 KB/sec)
Downloading: https://repo.eclipse.org/content/repositories/maven_central/org/apache/maven/plugins/maven-surefire-report-plugin/2.19.1/maven-surefire-report-plugin-2.19.1.jar
Downloaded: https://repo.eclipse.org/content/repositories/maven_central/org/apache/maven/plugins/maven-surefire-report-plugin/2.19.1/maven-surefire-report-plugin-2.19.1.jar (39 KB at 980.4 KB/sec)
[INFO]                                                                         
[INFO] ------------------------------------------------------------------------
[INFO] Building Capra 0.7.0-SNAPSHOT
[INFO] ------------------------------------------------------------------------
[INFO] 
[INFO] --- maven-clean-plugin:2.5:clean (default-clean) @ parent ---
Downloading: https://repo.eclipse.org/content/repositories/maven_central/org/apache/maven/maven-plugin-api/2.0.6/maven-plugin-api-2.0.6.jar
Downloading: https://repo.eclipse.org/content/repositories/maven_central/org/codehaus/plexus/plexus-utils/3.0/plexus-utils-3.0.jar
Downloaded: https://repo.eclipse.org/content/repositories/maven_central/org/apache/maven/maven-plugin-api/2.0.6/maven-plugin-api-2.0.6.jar (0 B at 0.0 KB/sec)
Downloaded: https://repo.eclipse.org/content/repositories/maven_central/org/codehaus/plexus/plexus-utils/3.0/plexus-utils-3.0.jar (0 B at 0.0 KB/sec)
[INFO] 
[INFO] >>> maven-surefire-report-plugin:2.19.1:report (default-cli) > [surefire]test @ parent >>>
[INFO] 
[INFO] <<< maven-surefire-report-plugin:2.19.1:report (default-cli) < [surefire]test @ parent <<<
[INFO] 
[INFO] --- maven-surefire-report-plugin:2.19.1:report (default-cli) @ parent ---
Downloading: https://repo.eclipse.org/content/repositories/maven_central/junit/junit/4.12/junit-4.12.pom
Downloaded: https://repo.eclipse.org/content/repositories/maven_central/junit/junit/4.12/junit-4.12.pom (24 KB at 963.5 KB/sec)
Downloading: https://repo.eclipse.org/content/repositories/maven_central/org/apache/maven/surefire/surefire-report-parser/2.19.1/surefire-report-parser-2.19.1.pom
Downloaded: https://repo.eclipse.org/content/repositories/maven_central/org/apache/maven/surefire/surefire-report-parser/2.19.1/surefire-report-parser-2.19.1.pom (4 KB at 126.1 KB/sec)
Downloading: https://repo.eclipse.org/content/repositories/maven_central/org/apache/maven/reporting/maven-reporting-api/3.0/maven-reporting-api-3.0.pom
Downloaded: https://repo.eclipse.org/content/repositories/maven_central/org/apache/maven/reporting/maven-reporting-api/3.0/maven-reporting-api-3.0.pom (3 KB at 105.3 KB/sec)
Downloading: https://repo.eclipse.org/content/repositories/maven_central/org/apache/maven/shared/maven-shared-components/15/maven-shared-components-15.pom
Downloaded: https://repo.eclipse.org/content/repositories/maven_central/org/apache/maven/shared/maven-shared-components/15/maven-shared-components-15.pom (0 B at 0.0 KB/sec)
Downloading: https://repo.eclipse.org/content/repositories/maven_central/org/apache/maven/doxia/doxia-sink-api/1.0/doxia-sink-api-1.0.pom
Downloaded: https://repo.eclipse.org/content/repositories/maven_central/org/apache/maven/doxia/doxia-sink-api/1.0/doxia-sink-api-1.0.pom (2 KB at 50.2 KB/sec)
Downloading: https://repo.eclipse.org/content/repositories/maven_central/org/apache/maven/doxia/doxia/1.0/doxia-1.0.pom
Downloaded: https://repo.eclipse.org/content/repositories/maven_central/org/apache/maven/doxia/doxia/1.0/doxia-1.0.pom (10 KB at 428.1 KB/sec)
Downloading: https://repo.eclipse.org/content/repositories/maven_central/org/apache/maven/maven-parent/10/maven-parent-10.pom
Downloaded: https://repo.eclipse.org/content/repositories/maven_central/org/apache/maven/maven-parent/10/maven-parent-10.pom (31 KB at 1103.3 KB/sec)
Downloading: https://repo.eclipse.org/content/repositories/maven_central/org/apache/maven/reporting/maven-reporting-impl/2.4/maven-reporting-impl-2.4.pom
Downloaded: https://repo.eclipse.org/content/repositories/maven_central/org/apache/maven/reporting/maven-reporting-impl/2.4/maven-reporting-impl-2.4.pom (6 KB at 159.8 KB/sec)
Downloading: https://repo.eclipse.org/content/repositories/maven_central/org/apache/maven/shared/maven-shared-components/21/maven-shared-components-21.pom
Downloaded: https://repo.eclipse.org/content/repositories/maven_central/org/apache/maven/shared/maven-shared-components/21/maven-shared-components-21.pom (5 KB at 237.5 KB/sec)
Downloading: https://repo.eclipse.org/content/repositories/maven_central/org/apache/maven/maven-parent/25/maven-parent-25.pom
Downloaded: https://repo.eclipse.org/content/repositories/maven_central/org/apache/maven/maven-parent/25/maven-parent-25.pom (37 KB at 1406.2 KB/sec)
Downloading: https://repo.eclipse.org/content/repositories/maven_central/org/apache/apache/15/apache-15.pom
Downloaded: https://repo.eclipse.org/content/repositories/maven_central/org/apache/apache/15/apache-15.pom (15 KB at 646.9 KB/sec)
Downloading: https://repo.eclipse.org/content/repositories/maven_central/org/apache/maven/shared/maven-shared-utils/0.9/maven-shared-utils-0.9.pom
Downloaded: https://repo.eclipse.org/content/repositories/maven_central/org/apache/maven/shared/maven-shared-utils/0.9/maven-shared-utils-0.9.pom (7 KB at 202.6 KB/sec)
Downloading: https://repo.eclipse.org/content/repositories/maven_central/com/google/code/findbugs/jsr305/2.0.1/jsr305-2.0.1.pom
Downloaded: https://repo.eclipse.org/content/repositories/maven_central/com/google/code/findbugs/jsr305/2.0.1/jsr305-2.0.1.pom (965 B at 21.4 KB/sec)
Downloading: https://repo.eclipse.org/content/repositories/maven_central/org/apache/maven/doxia/doxia-sink-api/1.6/doxia-sink-api-1.6.pom
Downloaded: https://repo.eclipse.org/content/repositories/maven_central/org/apache/maven/doxia/doxia-sink-api/1.6/doxia-sink-api-1.6.pom (2 KB at 62.3 KB/sec)
Downloading: https://repo.eclipse.org/content/repositories/maven_central/org/apache/maven/doxia/doxia/1.6/doxia-1.6.pom
Downloaded: https://repo.eclipse.org/content/repositories/maven_central/org/apache/maven/doxia/doxia/1.6/doxia-1.6.pom (19 KB at 806.0 KB/sec)
Downloading: https://repo.eclipse.org/content/repositories/maven_central/org/apache/maven/doxia/doxia-logging-api/1.6/doxia-logging-api-1.6.pom
Downloaded: https://repo.eclipse.org/content/repositories/maven_central/org/apache/maven/doxia/doxia-logging-api/1.6/doxia-logging-api-1.6.pom (2 KB at 62.5 KB/sec)
Downloading: https://repo.eclipse.org/content/repositories/maven_central/org/apache/maven/doxia/doxia-core/1.6/doxia-core-1.6.pom
Downloaded: https://repo.eclipse.org/content/repositories/maven_central/org/apache/maven/doxia/doxia-core/1.6/doxia-core-1.6.pom (5 KB at 171.0 KB/sec)
Downloading: https://repo.eclipse.org/content/repositories/maven_central/org/codehaus/plexus/plexus-utils/3.0.15/plexus-utils-3.0.15.pom
Downloaded: https://repo.eclipse.org/content/repositories/maven_central/org/codehaus/plexus/plexus-utils/3.0.15/plexus-utils-3.0.15.pom (4 KB at 128.0 KB/sec)
Downloading: https://repo.eclipse.org/content/repositories/maven_central/org/codehaus/plexus/plexus/3.3.1/plexus-3.3.1.pom
Downloaded: https://repo.eclipse.org/content/repositories/maven_central/org/codehaus/plexus/plexus/3.3.1/plexus-3.3.1.pom (0 B at 0.0 KB/sec)
Downloading: https://repo.eclipse.org/content/repositories/maven_central/xerces/xercesImpl/2.9.1/xercesImpl-2.9.1.pom
Downloaded: https://repo.eclipse.org/content/repositories/maven_central/xerces/xercesImpl/2.9.1/xercesImpl-2.9.1.pom (2 KB at 49.3 KB/sec)
Downloading: https://repo.eclipse.org/content/repositories/maven_central/xml-apis/xml-apis/1.3.04/xml-apis-1.3.04.pom
Downloaded: https://repo.eclipse.org/content/repositories/maven_central/xml-apis/xml-apis/1.3.04/xml-apis-1.3.04.pom (2 KB at 53.9 KB/sec)
Downloading: https://repo.eclipse.org/content/repositories/maven_central/commons-lang/commons-lang/2.4/commons-lang-2.4.pom
Downloaded: https://repo.eclipse.org/content/repositories/maven_central/commons-lang/commons-lang/2.4/commons-lang-2.4.pom (14 KB at 505.5 KB/sec)
Downloading: https://repo.eclipse.org/content/repositories/maven_central/org/apache/commons/commons-parent/9/commons-parent-9.pom
Downloaded: https://repo.eclipse.org/content/repositories/maven_central/org/apache/commons/commons-parent/9/commons-parent-9.pom (22 KB at 764.9 KB/sec)
Downloading: https://repo.eclipse.org/content/repositories/maven_central/org/apache/httpcomponents/httpclient/4.0.2/httpclient-4.0.2.pom
Downloaded: https://repo.eclipse.org/content/repositories/maven_central/org/apache/httpcomponents/httpclient/4.0.2/httpclient-4.0.2.pom (8 KB at 292.8 KB/sec)
Downloading: https://repo.eclipse.org/content/repositories/maven_central/org/apache/httpcomponents/httpcomponents-client/4.0.2/httpcomponents-client-4.0.2.pom
Downloaded: https://repo.eclipse.org/content/repositories/maven_central/org/apache/httpcomponents/httpcomponents-client/4.0.2/httpcomponents-client-4.0.2.pom (9 KB at 380.7 KB/sec)
Downloading: https://repo.eclipse.org/content/repositories/maven_central/org/apache/httpcomponents/project/4.1/project-4.1.pom
Downloaded: https://repo.eclipse.org/content/repositories/maven_central/org/apache/httpcomponents/project/4.1/project-4.1.pom (16 KB at 320.0 KB/sec)
Downloading: https://repo.eclipse.org/content/repositories/maven_central/org/apache/httpcomponents/httpcore/4.0.1/httpcore-4.0.1.pom
Downloaded: https://repo.eclipse.org/content/repositories/maven_central/org/apache/httpcomponents/httpcore/4.0.1/httpcore-4.0.1.pom (5 KB at 191.0 KB/sec)
Downloading: https://repo.eclipse.org/content/repositories/maven_central/org/apache/httpcomponents/httpcomponents-core/4.0.1/httpcomponents-core-4.0.1.pom
Downloaded: https://repo.eclipse.org/content/repositories/maven_central/org/apache/httpcomponents/httpcomponents-core/4.0.1/httpcomponents-core-4.0.1.pom (10 KB at 198.5 KB/sec)
Downloading: https://repo.eclipse.org/content/repositories/maven_central/xmlunit/xmlunit/1.5/xmlunit-1.5.pom
Downloaded: https://repo.eclipse.org/content/repositories/maven_central/xmlunit/xmlunit/1.5/xmlunit-1.5.pom (3 KB at 106.4 KB/sec)
Downloading: https://repo.eclipse.org/content/repositories/maven_central/org/apache/maven/doxia/doxia-site-renderer/1.6/doxia-site-renderer-1.6.pom
Downloaded: https://repo.eclipse.org/content/repositories/maven_central/org/apache/maven/doxia/doxia-site-renderer/1.6/doxia-site-renderer-1.6.pom (6 KB at 284.2 KB/sec)
Downloading: https://repo.eclipse.org/content/repositories/maven_central/org/apache/maven/doxia/doxia-sitetools/1.6/doxia-sitetools-1.6.pom
Downloaded: https://repo.eclipse.org/content/repositories/maven_central/org/apache/maven/doxia/doxia-sitetools/1.6/doxia-sitetools-1.6.pom (18 KB at 698.7 KB/sec)
Downloading: https://repo.eclipse.org/content/repositories/maven_central/org/apache/maven/doxia/doxia-decoration-model/1.6/doxia-decoration-model-1.6.pom
Downloaded: https://repo.eclipse.org/content/repositories/maven_central/org/apache/maven/doxia/doxia-decoration-model/1.6/doxia-decoration-model-1.6.pom (3 KB at 112.5 KB/sec)
Downloading: https://repo.eclipse.org/content/repositories/maven_central/org/apache/maven/doxia/doxia-module-xhtml/1.6/doxia-module-xhtml-1.6.pom
Downloaded: https://repo.eclipse.org/content/repositories/maven_central/org/apache/maven/doxia/doxia-module-xhtml/1.6/doxia-module-xhtml-1.6.pom (2 KB at 45.5 KB/sec)
Downloading: https://repo.eclipse.org/content/repositories/maven_central/org/apache/maven/doxia/doxia-modules/1.6/doxia-modules-1.6.pom
Downloaded: https://repo.eclipse.org/content/repositories/maven_central/org/apache/maven/doxia/doxia-modules/1.6/doxia-modules-1.6.pom (3 KB at 106.7 KB/sec)
Downloading: https://repo.eclipse.org/content/repositories/maven_central/org/apache/maven/doxia/doxia-module-fml/1.6/doxia-module-fml-1.6.pom
Downloaded: https://repo.eclipse.org/content/repositories/maven_central/org/apache/maven/doxia/doxia-module-fml/1.6/doxia-module-fml-1.6.pom (5 KB at 180.4 KB/sec)
Downloading: https://repo.eclipse.org/content/repositories/maven_central/org/codehaus/plexus/plexus-i18n/1.0-beta-7/plexus-i18n-1.0-beta-7.pom
Downloaded: https://repo.eclipse.org/content/repositories/maven_central/org/codehaus/plexus/plexus-i18n/1.0-beta-7/plexus-i18n-1.0-beta-7.pom (2 KB at 47.0 KB/sec)
Downloading: https://repo.eclipse.org/content/repositories/maven_central/org/codehaus/plexus/plexus-components/1.1.12/plexus-components-1.1.12.pom
Downloaded: https://repo.eclipse.org/content/repositories/maven_central/org/codehaus/plexus/plexus-components/1.1.12/plexus-components-1.1.12.pom (3 KB at 81.5 KB/sec)
Downloading: https://repo.eclipse.org/content/repositories/maven_central/org/codehaus/plexus/plexus-velocity/1.1.7/plexus-velocity-1.1.7.pom
Downloaded: https://repo.eclipse.org/content/repositories/maven_central/org/codehaus/plexus/plexus-velocity/1.1.7/plexus-velocity-1.1.7.pom (2 KB at 79.6 KB/sec)
Downloading: https://repo.eclipse.org/content/repositories/maven_central/org/codehaus/plexus/plexus-container-default/1.0-alpha-20/plexus-container-default-1.0-alpha-20.pom
Downloaded: https://repo.eclipse.org/content/repositories/maven_central/org/codehaus/plexus/plexus-container-default/1.0-alpha-20/plexus-container-default-1.0-alpha-20.pom (3 KB at 127.0 KB/sec)
Downloading: https://repo.eclipse.org/content/repositories/maven_central/org/codehaus/plexus/plexus-containers/1.0-alpha-20/plexus-containers-1.0-alpha-20.pom
Downloaded: https://repo.eclipse.org/content/repositories/maven_central/org/codehaus/plexus/plexus-containers/1.0-alpha-20/plexus-containers-1.0-alpha-20.pom (2 KB at 80.1 KB/sec)
Downloading: https://repo.eclipse.org/content/repositories/maven_central/org/codehaus/plexus/plexus-utils/1.3/plexus-utils-1.3.pom
Downloaded: https://repo.eclipse.org/content/repositories/maven_central/org/codehaus/plexus/plexus-utils/1.3/plexus-utils-1.3.pom (2 KB at 45.9 KB/sec)
Downloading: https://repo.eclipse.org/content/repositories/maven_central/org/codehaus/plexus/plexus/1.0.8/plexus-1.0.8.pom
Downloaded: https://repo.eclipse.org/content/repositories/maven_central/org/codehaus/plexus/plexus/1.0.8/plexus-1.0.8.pom (0 B at 0.0 KB/sec)
Downloading: https://repo.eclipse.org/content/repositories/maven_central/org/codehaus/plexus/plexus-classworlds/1.2-alpha-7/plexus-classworlds-1.2-alpha-7.pom
Downloaded: https://repo.eclipse.org/content/repositories/maven_central/org/codehaus/plexus/plexus-classworlds/1.2-alpha-7/plexus-classworlds-1.2-alpha-7.pom (3 KB at 100.7 KB/sec)
Downloading: https://repo.eclipse.org/content/repositories/maven_central/org/codehaus/plexus/plexus/1.0.9/plexus-1.0.9.pom
Downloaded: https://repo.eclipse.org/content/repositories/maven_central/org/codehaus/plexus/plexus/1.0.9/plexus-1.0.9.pom (8 KB at 340.9 KB/sec)
Downloading: https://repo.eclipse.org/content/repositories/maven_central/org/apache/velocity/velocity/1.5/velocity-1.5.pom
Downloaded: https://repo.eclipse.org/content/repositories/maven_central/org/apache/velocity/velocity/1.5/velocity-1.5.pom (8 KB at 291.7 KB/sec)
Downloading: https://repo.eclipse.org/content/repositories/maven_central/commons-collections/commons-collections/3.1/commons-collections-3.1.pom
Downloaded: https://repo.eclipse.org/content/repositories/maven_central/commons-collections/commons-collections/3.1/commons-collections-3.1.pom (6 KB at 220.1 KB/sec)
Downloading: https://repo.eclipse.org/content/repositories/maven_central/commons-lang/commons-lang/2.1/commons-lang-2.1.pom
Downloaded: https://repo.eclipse.org/content/repositories/maven_central/commons-lang/commons-lang/2.1/commons-lang-2.1.pom (10 KB at 220.3 KB/sec)
Downloading: https://repo.eclipse.org/content/repositories/maven_central/oro/oro/2.0.8/oro-2.0.8.pom
Downloaded: https://repo.eclipse.org/content/repositories/maven_central/oro/oro/2.0.8/oro-2.0.8.pom (140 B at 5.7 KB/sec)
Downloading: https://repo.eclipse.org/content/repositories/maven_central/org/apache/velocity/velocity-tools/2.0/velocity-tools-2.0.pom
Downloaded: https://repo.eclipse.org/content/repositories/maven_central/org/apache/velocity/velocity-tools/2.0/velocity-tools-2.0.pom (18 KB at 403.9 KB/sec)
Downloading: https://repo.eclipse.org/content/repositories/maven_central/commons-beanutils/commons-beanutils/1.7.0/commons-beanutils-1.7.0.pom
Downloaded: https://repo.eclipse.org/content/repositories/maven_central/commons-beanutils/commons-beanutils/1.7.0/commons-beanutils-1.7.0.pom (357 B at 11.6 KB/sec)
Downloading: https://repo.eclipse.org/content/repositories/maven_central/commons-logging/commons-logging/1.0.3/commons-logging-1.0.3.pom
Downloaded: https://repo.eclipse.org/content/repositories/maven_central/commons-logging/commons-logging/1.0.3/commons-logging-1.0.3.pom (866 B at 38.4 KB/sec)
Downloading: https://repo.eclipse.org/content/repositories/maven_central/commons-digester/commons-digester/1.8/commons-digester-1.8.pom
Downloaded: https://repo.eclipse.org/content/repositories/maven_central/commons-digester/commons-digester/1.8/commons-digester-1.8.pom (7 KB at 244.3 KB/sec)
Downloading: https://repo.eclipse.org/content/repositories/maven_central/commons-logging/commons-logging/1.1/commons-logging-1.1.pom
Downloaded: https://repo.eclipse.org/content/repositories/maven_central/commons-logging/commons-logging/1.1/commons-logging-1.1.pom (7 KB at 287.5 KB/sec)
Downloading: https://repo.eclipse.org/content/repositories/maven_central/logkit/logkit/1.0.1/logkit-1.0.1.pom
Downloaded: https://repo.eclipse.org/content/repositories/maven_central/logkit/logkit/1.0.1/logkit-1.0.1.pom (147 B at 5.1 KB/sec)
Downloading: https://repo.eclipse.org/content/repositories/maven_central/avalon-framework/avalon-framework/4.1.3/avalon-framework-4.1.3.pom
Downloaded: https://repo.eclipse.org/content/repositories/maven_central/avalon-framework/avalon-framework/4.1.3/avalon-framework-4.1.3.pom (167 B at 6.3 KB/sec)
Downloading: https://repo.eclipse.org/content/repositories/maven_central/javax/servlet/servlet-api/2.3/servlet-api-2.3.pom
Downloaded: https://repo.eclipse.org/content/repositories/maven_central/javax/servlet/servlet-api/2.3/servlet-api-2.3.pom (156 B at 5.1 KB/sec)
Downloading: https://repo.eclipse.org/content/repositories/maven_central/commons-chain/commons-chain/1.1/commons-chain-1.1.pom
Downloaded: https://repo.eclipse.org/content/repositories/maven_central/commons-chain/commons-chain/1.1/commons-chain-1.1.pom (6 KB at 225.8 KB/sec)
Downloading: https://repo.eclipse.org/content/repositories/maven_central/commons-digester/commons-digester/1.6/commons-digester-1.6.pom
Downloaded: https://repo.eclipse.org/content/repositories/maven_central/commons-digester/commons-digester/1.6/commons-digester-1.6.pom (974 B at 43.2 KB/sec)
Downloading: https://repo.eclipse.org/content/repositories/maven_central/commons-beanutils/commons-beanutils/1.6/commons-beanutils-1.6.pom
Downloaded: https://repo.eclipse.org/content/repositories/maven_central/commons-beanutils/commons-beanutils/1.6/commons-beanutils-1.6.pom (3 KB at 83.6 KB/sec)
Downloading: https://repo.eclipse.org/content/repositories/maven_central/commons-logging/commons-logging/1.0/commons-logging-1.0.pom
Downloaded: https://repo.eclipse.org/content/repositories/maven_central/commons-logging/commons-logging/1.0/commons-logging-1.0.pom (163 B at 7.2 KB/sec)
Downloading: https://repo.eclipse.org/content/repositories/maven_central/commons-collections/commons-collections/2.0/commons-collections-2.0.pom
Downloaded: https://repo.eclipse.org/content/repositories/maven_central/commons-collections/commons-collections/2.0/commons-collections-2.0.pom (171 B at 8.0 KB/sec)
Downloading: https://repo.eclipse.org/content/repositories/maven_central/commons-collections/commons-collections/2.1/commons-collections-2.1.pom
Downloaded: https://repo.eclipse.org/content/repositories/maven_central/commons-collections/commons-collections/2.1/commons-collections-2.1.pom (4 KB at 125.3 KB/sec)
Downloading: https://repo.eclipse.org/content/repositories/maven_central/xml-apis/xml-apis/1.0.b2/xml-apis-1.0.b2.pom
Downloaded: https://repo.eclipse.org/content/repositories/maven_central/xml-apis/xml-apis/1.0.b2/xml-apis-1.0.b2.pom (3 KB at 104.6 KB/sec)
Downloading: https://repo.eclipse.org/content/repositories/maven_central/commons-collections/commons-collections/3.2/commons-collections-3.2.pom
Downloaded: https://repo.eclipse.org/content/repositories/maven_central/commons-collections/commons-collections/3.2/commons-collections-3.2.pom (11 KB at 513.1 KB/sec)
Downloading: https://repo.eclipse.org/content/repositories/maven_central/commons-validator/commons-validator/1.3.1/commons-validator-1.3.1.pom
Downloaded: https://repo.eclipse.org/content/repositories/maven_central/commons-validator/commons-validator/1.3.1/commons-validator-1.3.1.pom (9 KB at 284.3 KB/sec)
Downloading: https://repo.eclipse.org/content/repositories/maven_central/commons-logging/commons-logging/1.0.4/commons-logging-1.0.4.pom
Downloaded: https://repo.eclipse.org/content/repositories/maven_central/commons-logging/commons-logging/1.0.4/commons-logging-1.0.4.pom (6 KB at 233.7 KB/sec)
Downloading: https://repo.eclipse.org/content/repositories/maven_central/dom4j/dom4j/1.1/dom4j-1.1.pom
Downloaded: https://repo.eclipse.org/content/repositories/maven_central/dom4j/dom4j/1.1/dom4j-1.1.pom (142 B at 5.3 KB/sec)
Downloading: https://repo.eclipse.org/content/repositories/maven_central/sslext/sslext/1.2-0/sslext-1.2-0.pom
Downloaded: https://repo.eclipse.org/content/repositories/maven_central/sslext/sslext/1.2-0/sslext-1.2-0.pom (653 B at 24.5 KB/sec)
Downloading: https://repo.eclipse.org/content/repositories/maven_central/org/apache/struts/struts-core/1.3.8/struts-core-1.3.8.pom
Downloaded: https://repo.eclipse.org/content/repositories/maven_central/org/apache/struts/struts-core/1.3.8/struts-core-1.3.8.pom (5 KB at 168.4 KB/sec)
Downloading: https://repo.eclipse.org/content/repositories/maven_central/org/apache/struts/struts-parent/1.3.8/struts-parent-1.3.8.pom
Downloaded: https://repo.eclipse.org/content/repositories/maven_central/org/apache/struts/struts-parent/1.3.8/struts-parent-1.3.8.pom (10 KB at 400.3 KB/sec)
Downloading: https://repo.eclipse.org/content/repositories/maven_central/org/apache/struts/struts-master/4/struts-master-4.pom
Downloaded: https://repo.eclipse.org/content/repositories/maven_central/org/apache/struts/struts-master/4/struts-master-4.pom (12 KB at 525.2 KB/sec)
Downloading: https://repo.eclipse.org/content/repositories/maven_central/org/apache/apache/2/apache-2.pom
Downloaded: https://repo.eclipse.org/content/repositories/maven_central/org/apache/apache/2/apache-2.pom (4 KB at 158.5 KB/sec)
Downloading: https://repo.eclipse.org/content/repositories/maven_central/antlr/antlr/2.7.2/antlr-2.7.2.pom
Downloaded: https://repo.eclipse.org/content/repositories/maven_central/antlr/antlr/2.7.2/antlr-2.7.2.pom (145 B at 5.4 KB/sec)
Downloading: https://repo.eclipse.org/content/repositories/maven_central/org/apache/struts/struts-taglib/1.3.8/struts-taglib-1.3.8.pom
Downloaded: https://repo.eclipse.org/content/repositories/maven_central/org/apache/struts/struts-taglib/1.3.8/struts-taglib-1.3.8.pom (4 KB at 125.2 KB/sec)
Downloading: https://repo.eclipse.org/content/repositories/maven_central/org/apache/struts/struts-tiles/1.3.8/struts-tiles-1.3.8.pom
Downloaded: https://repo.eclipse.org/content/repositories/maven_central/org/apache/struts/struts-tiles/1.3.8/struts-tiles-1.3.8.pom (3 KB at 129.0 KB/sec)
Downloading: https://repo.eclipse.org/content/repositories/maven_central/org/apache/velocity/velocity/1.6.2/velocity-1.6.2.pom
Downloaded: https://repo.eclipse.org/content/repositories/maven_central/org/apache/velocity/velocity/1.6.2/velocity-1.6.2.pom (11 KB at 432.1 KB/sec)
Downloading: https://repo.eclipse.org/content/repositories/maven_central/commons-collections/commons-collections/3.2.1/commons-collections-3.2.1.pom
Downloaded: https://repo.eclipse.org/content/repositories/maven_central/commons-collections/commons-collections/3.2.1/commons-collections-3.2.1.pom (13 KB at 508.8 KB/sec)
Downloading: https://repo.eclipse.org/content/repositories/maven_central/commons-validator/commons-validator/1.4.1/commons-validator-1.4.1.pom
Downloaded: https://repo.eclipse.org/content/repositories/maven_central/commons-validator/commons-validator/1.4.1/commons-validator-1.4.1.pom (13 KB at 515.6 KB/sec)
Downloading: https://repo.eclipse.org/content/repositories/maven_central/org/apache/commons/commons-parent/36/commons-parent-36.pom
Downloaded: https://repo.eclipse.org/content/repositories/maven_central/org/apache/commons/commons-parent/36/commons-parent-36.pom (57 KB at 1889.4 KB/sec)
Downloading: https://repo.eclipse.org/content/repositories/maven_central/commons-beanutils/commons-beanutils/1.8.3/commons-beanutils-1.8.3.pom
Downloaded: https://repo.eclipse.org/content/repositories/maven_central/commons-beanutils/commons-beanutils/1.8.3/commons-beanutils-1.8.3.pom (11 KB at 47.1 KB/sec)
Downloading: https://repo.eclipse.org/content/repositories/maven_central/org/apache/commons/commons-parent/14/commons-parent-14.pom
Downloaded: https://repo.eclipse.org/content/repositories/maven_central/org/apache/commons/commons-parent/14/commons-parent-14.pom (31 KB at 901.6 KB/sec)
Downloading: https://repo.eclipse.org/content/repositories/maven_central/commons-digester/commons-digester/1.8.1/commons-digester-1.8.1.pom
Downloaded: https://repo.eclipse.org/content/repositories/maven_central/commons-digester/commons-digester/1.8.1/commons-digester-1.8.1.pom (10 KB at 425.8 KB/sec)
Downloading: https://repo.eclipse.org/content/repositories/maven_central/commons-logging/commons-logging/1.2/commons-logging-1.2.pom
Downloaded: https://repo.eclipse.org/content/repositories/maven_central/commons-logging/commons-logging/1.2/commons-logging-1.2.pom (19 KB at 669.9 KB/sec)
Downloading: https://repo.eclipse.org/content/repositories/maven_central/org/apache/maven/maven-project/2.2.1/maven-project-2.2.1.jar
Downloading: https://repo.eclipse.org/content/repositories/maven_central/org/apache/maven/maven-settings/2.2.1/maven-settings-2.2.1.jar
Downloading: https://repo.eclipse.org/content/repositories/maven_central/org/apache/maven/maven-profile/2.2.1/maven-profile-2.2.1.jar
Downloading: https://repo.eclipse.org/content/repositories/maven_central/org/apache/maven/maven-artifact-manager/2.2.1/maven-artifact-manager-2.2.1.jar
Downloading: https://repo.eclipse.org/content/repositories/maven_central/org/apache/maven/maven-repository-metadata/2.2.1/maven-repository-metadata-2.2.1.jar
Downloaded: https://repo.eclipse.org/content/repositories/maven_central/org/apache/maven/maven-repository-metadata/2.2.1/maven-repository-metadata-2.2.1.jar (26 KB at 472.7 KB/sec)
Downloading: https://repo.eclipse.org/content/repositories/maven_central/backport-util-concurrent/backport-util-concurrent/3.1/backport-util-concurrent-3.1.jar
Downloaded: https://repo.eclipse.org/content/repositories/maven_central/org/apache/maven/maven-project/2.2.1/maven-project-2.2.1.jar (153 KB at 2461.6 KB/sec)
Downloading: https://repo.eclipse.org/content/repositories/maven_central/org/apache/maven/maven-plugin-registry/2.2.1/maven-plugin-registry-2.2.1.jar
Downloaded: https://repo.eclipse.org/content/repositories/maven_central/backport-util-concurrent/backport-util-concurrent/3.1/backport-util-concurrent-3.1.jar (324 KB at 3723.5 KB/sec)
Downloading: https://repo.eclipse.org/content/repositories/maven_central/org/codehaus/plexus/plexus-interpolation/1.11/plexus-interpolation-1.11.jar
Downloaded: https://repo.eclipse.org/content/repositories/maven_central/org/apache/maven/maven-artifact-manager/2.2.1/maven-artifact-manager-2.2.1.jar (66 KB at 666.6 KB/sec)
Downloading: https://repo.eclipse.org/content/repositories/maven_central/org/apache/maven/maven-artifact/2.2.1/maven-artifact-2.2.1.jar
Downloaded: https://repo.eclipse.org/content/repositories/maven_central/org/apache/maven/maven-settings/2.2.1/maven-settings-2.2.1.jar (48 KB at 451.8 KB/sec)
Downloading: https://repo.eclipse.org/content/repositories/maven_central/org/codehaus/plexus/plexus-container-default/1.0-alpha-9-stable-1/plexus-container-default-1.0-alpha-9-stable-1.jar
Downloaded: https://repo.eclipse.org/content/repositories/maven_central/org/codehaus/plexus/plexus-container-default/1.0-alpha-9-stable-1/plexus-container-default-1.0-alpha-9-stable-1.jar (0 B at 0.0 KB/sec)
Downloading: https://repo.eclipse.org/content/repositories/maven_central/junit/junit/4.12/junit-4.12.jar
Downloaded: https://repo.eclipse.org/content/repositories/maven_central/org/apache/maven/maven-artifact/2.2.1/maven-artifact-2.2.1.jar (79 KB at 627.5 KB/sec)
Downloading: https://repo.eclipse.org/content/repositories/maven_central/org/hamcrest/hamcrest-core/1.3/hamcrest-core-1.3.jar
Downloaded: https://repo.eclipse.org/content/repositories/maven_central/org/apache/maven/maven-profile/2.2.1/maven-profile-2.2.1.jar (35 KB at 271.9 KB/sec)
Downloading: https://repo.eclipse.org/content/repositories/maven_central/org/apache/maven/maven-model/2.2.1/maven-model-2.2.1.jar
Downloaded: https://repo.eclipse.org/content/repositories/maven_central/org/hamcrest/hamcrest-core/1.3/hamcrest-core-1.3.jar (44 KB at 299.1 KB/sec)
Downloading: https://repo.eclipse.org/content/repositories/maven_central/org/apache/maven/maven-plugin-api/2.2.1/maven-plugin-api-2.2.1.jar
Downloaded: https://repo.eclipse.org/content/repositories/maven_central/org/apache/maven/maven-model/2.2.1/maven-model-2.2.1.jar (86 KB at 541.4 KB/sec)
Downloading: https://repo.eclipse.org/content/repositories/maven_central/org/apache/maven/plugin-tools/maven-plugin-annotations/3.3/maven-plugin-annotations-3.3.jar
Downloaded: https://repo.eclipse.org/content/repositories/maven_central/junit/junit/4.12/junit-4.12.jar (308 KB at 1777.8 KB/sec)
Downloading: https://repo.eclipse.org/content/repositories/maven_central/org/apache/maven/surefire/surefire-report-parser/2.19.1/surefire-report-parser-2.19.1.jar
Downloaded: https://repo.eclipse.org/content/repositories/maven_central/org/apache/maven/plugin-tools/maven-plugin-annotations/3.3/maven-plugin-annotations-3.3.jar (14 KB at 73.3 KB/sec)
Downloading: https://repo.eclipse.org/content/repositories/maven_central/org/apache/maven/reporting/maven-reporting-api/3.0/maven-reporting-api-3.0.jar
Downloaded: https://repo.eclipse.org/content/repositories/maven_central/org/apache/maven/reporting/maven-reporting-api/3.0/maven-reporting-api-3.0.jar (11 KB at 49.9 KB/sec)
Downloading: https://repo.eclipse.org/content/repositories/maven_central/org/apache/maven/reporting/maven-reporting-impl/2.4/maven-reporting-impl-2.4.jar
Downloaded: https://repo.eclipse.org/content/repositories/maven_central/org/apache/maven/reporting/maven-reporting-impl/2.4/maven-reporting-impl-2.4.jar (20 KB at 80.4 KB/sec)
Downloading: https://repo.eclipse.org/content/repositories/maven_central/org/apache/maven/doxia/doxia-core/1.6/doxia-core-1.6.jar
Downloaded: https://repo.eclipse.org/content/repositories/maven_central/org/apache/maven/doxia/doxia-core/1.6/doxia-core-1.6.jar (159 KB at 586.3 KB/sec)
Downloading: https://repo.eclipse.org/content/repositories/maven_central/xerces/xercesImpl/2.9.1/xercesImpl-2.9.1.jar
Downloaded: https://repo.eclipse.org/content/repositories/maven_central/org/apache/maven/maven-plugin-registry/2.2.1/maven-plugin-registry-2.2.1.jar (30 KB at 98.0 KB/sec)
Downloading: https://repo.eclipse.org/content/repositories/maven_central/xml-apis/xml-apis/1.3.04/xml-apis-1.3.04.jar
Downloaded: https://repo.eclipse.org/content/repositories/maven_central/org/apache/maven/maven-plugin-api/2.2.1/maven-plugin-api-2.2.1.jar (13 KB at 38.7 KB/sec)
Downloaded: https://repo.eclipse.org/content/repositories/maven_central/org/apache/maven/surefire/surefire-report-parser/2.19.1/surefire-report-parser-2.19.1.jar (62 KB at 196.5 KB/sec)
Downloading: https://repo.eclipse.org/content/repositories/maven_central/commons-lang/commons-lang/2.4/commons-lang-2.4.jar
Downloading: https://repo.eclipse.org/content/repositories/maven_central/org/apache/httpcomponents/httpclient/4.0.2/httpclient-4.0.2.jar
Downloaded: https://repo.eclipse.org/content/repositories/maven_central/org/codehaus/plexus/plexus-interpolation/1.11/plexus-interpolation-1.11.jar (50 KB at 159.4 KB/sec)
Downloading: https://repo.eclipse.org/content/repositories/maven_central/org/apache/httpcomponents/httpcore/4.0.1/httpcore-4.0.1.jar
Downloaded: https://repo.eclipse.org/content/repositories/maven_central/xerces/xercesImpl/2.9.1/xercesImpl-2.9.1.jar (1201 KB at 3509.7 KB/sec)
Downloading: https://repo.eclipse.org/content/repositories/maven_central/xmlunit/xmlunit/1.5/xmlunit-1.5.jar
Downloaded: https://repo.eclipse.org/content/repositories/maven_central/commons-lang/commons-lang/2.4/commons-lang-2.4.jar (256 KB at 745.4 KB/sec)
Downloading: https://repo.eclipse.org/content/repositories/maven_central/commons-validator/commons-validator/1.4.1/commons-validator-1.4.1.jar
Downloaded: https://repo.eclipse.org/content/repositories/maven_central/org/apache/httpcomponents/httpclient/4.0.2/httpclient-4.0.2.jar (287 KB at 824.3 KB/sec)
Downloading: https://repo.eclipse.org/content/repositories/maven_central/commons-beanutils/commons-beanutils/1.8.3/commons-beanutils-1.8.3.jar
Downloaded: https://repo.eclipse.org/content/repositories/maven_central/org/apache/httpcomponents/httpcore/4.0.1/httpcore-4.0.1.jar (169 KB at 483.8 KB/sec)
Downloading: https://repo.eclipse.org/content/repositories/maven_central/commons-digester/commons-digester/1.8.1/commons-digester-1.8.1.jar
Downloaded: https://repo.eclipse.org/content/repositories/maven_central/commons-validator/commons-validator/1.4.1/commons-validator-1.4.1.jar (186 KB at 500.4 KB/sec)
Downloading: https://repo.eclipse.org/content/repositories/maven_central/commons-logging/commons-logging/1.2/commons-logging-1.2.jar
Downloaded: https://repo.eclipse.org/content/repositories/maven_central/xmlunit/xmlunit/1.5/xmlunit-1.5.jar (96 KB at 253.7 KB/sec)
Downloading: https://repo.eclipse.org/content/repositories/maven_central/org/apache/maven/doxia/doxia-sink-api/1.6/doxia-sink-api-1.6.jar
Downloaded: https://repo.eclipse.org/content/repositories/maven_central/commons-digester/commons-digester/1.8.1/commons-digester-1.8.1.jar (143 KB at 377.5 KB/sec)
Downloading: https://repo.eclipse.org/content/repositories/maven_central/org/apache/maven/doxia/doxia-logging-api/1.6/doxia-logging-api-1.6.jar
Downloaded: https://repo.eclipse.org/content/repositories/maven_central/commons-beanutils/commons-beanutils/1.8.3/commons-beanutils-1.8.3.jar (227 KB at 599.4 KB/sec)
Downloading: https://repo.eclipse.org/content/repositories/maven_central/org/apache/maven/doxia/doxia-site-renderer/1.6/doxia-site-renderer-1.6.jar
Downloaded: https://repo.eclipse.org/content/repositories/maven_central/commons-logging/commons-logging/1.2/commons-logging-1.2.jar (61 KB at 153.2 KB/sec)
Downloading: https://repo.eclipse.org/content/repositories/maven_central/org/apache/maven/doxia/doxia-decoration-model/1.6/doxia-decoration-model-1.6.jar
Downloaded: https://repo.eclipse.org/content/repositories/maven_central/org/apache/maven/doxia/doxia-logging-api/1.6/doxia-logging-api-1.6.jar (12 KB at 27.6 KB/sec)
Downloading: https://repo.eclipse.org/content/repositories/maven_central/org/apache/maven/doxia/doxia-module-xhtml/1.6/doxia-module-xhtml-1.6.jar
Downloaded: https://repo.eclipse.org/content/repositories/maven_central/org/apache/maven/doxia/doxia-sink-api/1.6/doxia-sink-api-1.6.jar (11 KB at 26.9 KB/sec)
Downloading: https://repo.eclipse.org/content/repositories/maven_central/org/apache/maven/doxia/doxia-module-fml/1.6/doxia-module-fml-1.6.jar
Downloaded: https://repo.eclipse.org/content/repositories/maven_central/org/apache/maven/doxia/doxia-site-renderer/1.6/doxia-site-renderer-1.6.jar (56 KB at 135.0 KB/sec)
Downloading: https://repo.eclipse.org/content/repositories/maven_central/org/codehaus/plexus/plexus-i18n/1.0-beta-7/plexus-i18n-1.0-beta-7.jar
Downloaded: https://repo.eclipse.org/content/repositories/maven_central/org/apache/maven/doxia/doxia-decoration-model/1.6/doxia-decoration-model-1.6.jar (56 KB at 133.1 KB/sec)
Downloading: https://repo.eclipse.org/content/repositories/maven_central/org/codehaus/plexus/plexus-velocity/1.1.7/plexus-velocity-1.1.7.jar
Downloaded: https://repo.eclipse.org/content/repositories/maven_central/org/apache/maven/doxia/doxia-module-xhtml/1.6/doxia-module-xhtml-1.6.jar (16 KB at 37.4 KB/sec)
Downloading: https://repo.eclipse.org/content/repositories/maven_central/org/apache/velocity/velocity/1.5/velocity-1.5.jar
Downloaded: https://repo.eclipse.org/content/repositories/maven_central/org/codehaus/plexus/plexus-i18n/1.0-beta-7/plexus-i18n-1.0-beta-7.jar (11 KB at 23.8 KB/sec)
Downloading: https://repo.eclipse.org/content/repositories/maven_central/oro/oro/2.0.8/oro-2.0.8.jar
Downloaded: https://repo.eclipse.org/content/repositories/maven_central/org/apache/maven/doxia/doxia-module-fml/1.6/doxia-module-fml-1.6.jar (38 KB at 87.0 KB/sec)
Downloading: https://repo.eclipse.org/content/repositories/maven_central/org/apache/velocity/velocity-tools/2.0/velocity-tools-2.0.jar
Downloaded: https://repo.eclipse.org/content/repositories/maven_central/org/codehaus/plexus/plexus-velocity/1.1.7/plexus-velocity-1.1.7.jar (8 KB at 16.9 KB/sec)
Downloading: https://repo.eclipse.org/content/repositories/maven_central/commons-chain/commons-chain/1.1/commons-chain-1.1.jar
Downloaded: https://repo.eclipse.org/content/repositories/maven_central/org/apache/velocity/velocity/1.5/velocity-1.5.jar (383 KB at 839.8 KB/sec)
Downloading: https://repo.eclipse.org/content/repositories/maven_central/dom4j/dom4j/1.1/dom4j-1.1.jar
Downloaded: https://repo.eclipse.org/content/repositories/maven_central/org/apache/velocity/velocity-tools/2.0/velocity-tools-2.0.jar (339 KB at 729.4 KB/sec)
Downloading: https://repo.eclipse.org/content/repositories/maven_central/sslext/sslext/1.2-0/sslext-1.2-0.jar
Downloaded: https://repo.eclipse.org/content/repositories/maven_central/oro/oro/2.0.8/oro-2.0.8.jar (64 KB at 136.5 KB/sec)
Downloading: https://repo.eclipse.org/content/repositories/maven_central/org/apache/struts/struts-core/1.3.8/struts-core-1.3.8.jar
Downloaded: https://repo.eclipse.org/content/repositories/maven_central/commons-chain/commons-chain/1.1/commons-chain-1.1.jar (88 KB at 183.9 KB/sec)
Downloading: https://repo.eclipse.org/content/repositories/maven_central/antlr/antlr/2.7.2/antlr-2.7.2.jar
Downloaded: https://repo.eclipse.org/content/repositories/maven_central/sslext/sslext/1.2-0/sslext-1.2-0.jar (26 KB at 51.3 KB/sec)
Downloading: https://repo.eclipse.org/content/repositories/maven_central/org/apache/struts/struts-taglib/1.3.8/struts-taglib-1.3.8.jar
Downloaded: https://repo.eclipse.org/content/repositories/maven_central/org/apache/struts/struts-core/1.3.8/struts-core-1.3.8.jar (322 KB at 636.0 KB/sec)
Downloading: https://repo.eclipse.org/content/repositories/maven_central/org/apache/struts/struts-tiles/1.3.8/struts-tiles-1.3.8.jar
Downloaded: https://repo.eclipse.org/content/repositories/maven_central/dom4j/dom4j/1.1/dom4j-1.1.jar (447 KB at 868.1 KB/sec)
Downloading: https://repo.eclipse.org/content/repositories/maven_central/commons-collections/commons-collections/3.2.1/commons-collections-3.2.1.jar
Downloaded: https://repo.eclipse.org/content/repositories/maven_central/antlr/antlr/2.7.2/antlr-2.7.2.jar (350 KB at 669.0 KB/sec)
Downloading: https://repo.eclipse.org/content/repositories/maven_central/org/codehaus/plexus/plexus-utils/3.0.15/plexus-utils-3.0.15.jar
Downloaded: https://repo.eclipse.org/content/repositories/maven_central/org/apache/struts/struts-taglib/1.3.8/struts-taglib-1.3.8.jar (246 KB at 464.3 KB/sec)
Downloading: https://repo.eclipse.org/content/repositories/maven_central/org/apache/maven/shared/maven-shared-utils/0.9/maven-shared-utils-0.9.jar
Downloaded: https://repo.eclipse.org/content/repositories/maven_central/org/apache/struts/struts-tiles/1.3.8/struts-tiles-1.3.8.jar (117 KB at 216.8 KB/sec)
Downloaded: https://repo.eclipse.org/content/repositories/maven_central/org/codehaus/plexus/plexus-utils/3.0.15/plexus-utils-3.0.15.jar (234 KB at 426.6 KB/sec)
Downloaded: https://repo.eclipse.org/content/repositories/maven_central/commons-collections/commons-collections/3.2.1/commons-collections-3.2.1.jar (562 KB at 1008.8 KB/sec)
Downloaded: https://repo.eclipse.org/content/repositories/maven_central/org/apache/maven/shared/maven-shared-utils/0.9/maven-shared-utils-0.9.jar (168 KB at 299.9 KB/sec)
Downloaded: https://repo.eclipse.org/content/repositories/maven_central/xml-apis/xml-apis/1.3.04/xml-apis-1.3.04.jar (190 KB at 244.6 KB/sec)
[WARNING] Unable to locate Test Source XRef to link to - DISABLED
[INFO] 
[INFO] --- maven-install-plugin:2.4:install (default-install) @ parent ---
Downloading: https://repo.eclipse.org/content/repositories/maven_central/org/apache/maven/maven-project/2.0.6/maven-project-2.0.6.pom
Downloaded: https://repo.eclipse.org/content/repositories/maven_central/org/apache/maven/maven-project/2.0.6/maven-project-2.0.6.pom (0 B at 0.0 KB/sec)
Downloading: https://repo.eclipse.org/content/repositories/maven_central/org/apache/maven/maven-model/2.0.6/maven-model-2.0.6.pom
Downloaded: https://repo.eclipse.org/content/repositories/maven_central/org/apache/maven/maven-model/2.0.6/maven-model-2.0.6.pom (0 B at 0.0 KB/sec)
Downloading: https://repo.eclipse.org/content/repositories/maven_central/org/apache/maven/maven-artifact/2.0.6/maven-artifact-2.0.6.pom
Downloaded: https://repo.eclipse.org/content/repositories/maven_central/org/apache/maven/maven-artifact/2.0.6/maven-artifact-2.0.6.pom (0 B at 0.0 KB/sec)
Downloading: https://repo.eclipse.org/content/repositories/maven_central/org/apache/maven/maven-plugin-registry/2.0.6/maven-plugin-registry-2.0.6.pom
Downloaded: https://repo.eclipse.org/content/repositories/maven_central/org/apache/maven/maven-plugin-registry/2.0.6/maven-plugin-registry-2.0.6.pom (0 B at 0.0 KB/sec)
Downloading: https://repo.eclipse.org/content/repositories/maven_central/org/codehaus/plexus/plexus-utils/3.0.5/plexus-utils-3.0.5.pom
Downloaded: https://repo.eclipse.org/content/repositories/maven_central/org/codehaus/plexus/plexus-utils/3.0.5/plexus-utils-3.0.5.pom (0 B at 0.0 KB/sec)
Downloading: https://repo.eclipse.org/content/repositories/maven_central/org/codehaus/plexus/plexus-digest/1.0/plexus-digest-1.0.pom
Downloaded: https://repo.eclipse.org/content/repositories/maven_central/org/codehaus/plexus/plexus-digest/1.0/plexus-digest-1.0.pom (0 B at 0.0 KB/sec)
Downloading: https://repo.eclipse.org/content/repositories/maven_central/org/codehaus/plexus/plexus-components/1.1.7/plexus-components-1.1.7.pom
Downloaded: https://repo.eclipse.org/content/repositories/maven_central/org/codehaus/plexus/plexus-components/1.1.7/plexus-components-1.1.7.pom (0 B at 0.0 KB/sec)
Downloading: https://repo.eclipse.org/content/repositories/maven_central/org/apache/maven/maven-project/2.0.6/maven-project-2.0.6.jar
Downloading: https://repo.eclipse.org/content/repositories/maven_central/org/apache/maven/maven-settings/2.0.6/maven-settings-2.0.6.jar
Downloading: https://repo.eclipse.org/content/repositories/maven_central/org/apache/maven/maven-profile/2.0.6/maven-profile-2.0.6.jar
Downloading: https://repo.eclipse.org/content/repositories/maven_central/org/apache/maven/maven-plugin-registry/2.0.6/maven-plugin-registry-2.0.6.jar
Downloading: https://repo.eclipse.org/content/repositories/maven_central/org/apache/maven/maven-model/2.0.6/maven-model-2.0.6.jar
Downloaded: https://repo.eclipse.org/content/repositories/maven_central/org/apache/maven/maven-project/2.0.6/maven-project-2.0.6.jar (0 B at 0.0 KB/sec)
Downloading: https://repo.eclipse.org/content/repositories/maven_central/org/apache/maven/maven-artifact-manager/2.0.6/maven-artifact-manager-2.0.6.jar
Downloaded: https://repo.eclipse.org/content/repositories/maven_central/org/apache/maven/maven-plugin-registry/2.0.6/maven-plugin-registry-2.0.6.jar (0 B at 0.0 KB/sec)
Downloading: https://repo.eclipse.org/content/repositories/maven_central/org/apache/maven/maven-repository-metadata/2.0.6/maven-repository-metadata-2.0.6.jar
Downloaded: https://repo.eclipse.org/content/repositories/maven_central/org/apache/maven/maven-profile/2.0.6/maven-profile-2.0.6.jar (0 B at 0.0 KB/sec)
Downloading: https://repo.eclipse.org/content/repositories/maven_central/org/apache/maven/maven-artifact/2.0.6/maven-artifact-2.0.6.jar
Downloaded: https://repo.eclipse.org/content/repositories/maven_central/org/apache/maven/maven-model/2.0.6/maven-model-2.0.6.jar (0 B at 0.0 KB/sec)
Downloading: https://repo.eclipse.org/content/repositories/maven_central/org/codehaus/plexus/plexus-utils/3.0.5/plexus-utils-3.0.5.jar
Downloaded: https://repo.eclipse.org/content/repositories/maven_central/org/apache/maven/maven-settings/2.0.6/maven-settings-2.0.6.jar (0 B at 0.0 KB/sec)
Downloading: https://repo.eclipse.org/content/repositories/maven_central/org/codehaus/plexus/plexus-digest/1.0/plexus-digest-1.0.jar
Downloaded: https://repo.eclipse.org/content/repositories/maven_central/org/apache/maven/maven-artifact-manager/2.0.6/maven-artifact-manager-2.0.6.jar (0 B at 0.0 KB/sec)
Downloaded: https://repo.eclipse.org/content/repositories/maven_central/org/apache/maven/maven-artifact/2.0.6/maven-artifact-2.0.6.jar (0 B at 0.0 KB/sec)
Downloaded: https://repo.eclipse.org/content/repositories/maven_central/org/codehaus/plexus/plexus-utils/3.0.5/plexus-utils-3.0.5.jar (0 B at 0.0 KB/sec)
Downloaded: https://repo.eclipse.org/content/repositories/maven_central/org/apache/maven/maven-repository-metadata/2.0.6/maven-repository-metadata-2.0.6.jar (0 B at 0.0 KB/sec)
Downloaded: https://repo.eclipse.org/content/repositories/maven_central/org/codehaus/plexus/plexus-digest/1.0/plexus-digest-1.0.jar (0 B at 0.0 KB/sec)
[INFO] Installing /jobs/genie.capra/build-src-develop-no-tests/workspace/pom.xml to /home/hudson/genie.capra/.hudson/jobs/build-src-develop-no-tests/workspace/.maven/repo/org/eclipse/capra/parent/0.7.0-SNAPSHOT/parent-0.7.0-SNAPSHOT.pom
[INFO]                                                                         
[INFO] ------------------------------------------------------------------------
[INFO] Building org.eclipse.capra.core 0.7.0-SNAPSHOT
[INFO] ------------------------------------------------------------------------
[INFO] 
[INFO] --- maven-clean-plugin:2.5:clean (default-clean) @ org.eclipse.capra.core ---
[INFO] Deleting /jobs/genie.capra/build-src-develop-no-tests/workspace/org.eclipse.capra.core/target
[INFO] 
[INFO] >>> maven-surefire-report-plugin:2.19.1:report (default-cli) > [surefire]test @ org.eclipse.capra.core >>>
[INFO] 
[INFO] --- tycho-packaging-plugin:0.24.0:build-qualifier (default-build-qualifier) @ org.eclipse.capra.core ---
[INFO] The project's OSGi version is 0.7.0.201703241300
[INFO] 
[INFO] --- tycho-packaging-plugin:0.24.0:validate-id (default-validate-id) @ org.eclipse.capra.core ---
[INFO] 
[INFO] --- tycho-packaging-plugin:0.24.0:validate-version (default-validate-version) @ org.eclipse.capra.core ---
[INFO] 
[INFO] --- maven-resources-plugin:2.4.3:resources (default-resources) @ org.eclipse.capra.core ---
Downloading: https://repo.eclipse.org/content/repositories/maven_central/org/apache/maven/shared/maven-filtering/1.0-beta-4/maven-filtering-1.0-beta-4.pom
Downloaded: https://repo.eclipse.org/content/repositories/maven_central/org/apache/maven/shared/maven-filtering/1.0-beta-4/maven-filtering-1.0-beta-4.pom (0 B at 0.0 KB/sec)
Downloading: https://repo.eclipse.org/content/repositories/maven_central/org/codehaus/plexus/plexus-interpolation/1.12/plexus-interpolation-1.12.pom
Downloaded: https://repo.eclipse.org/content/repositories/maven_central/org/codehaus/plexus/plexus-interpolation/1.12/plexus-interpolation-1.12.pom (0 B at 0.0 KB/sec)
Downloading: https://repo.eclipse.org/content/repositories/maven_central/org/sonatype/plexus/plexus-build-api/0.0.4/plexus-build-api-0.0.4.pom
Downloaded: https://repo.eclipse.org/content/repositories/maven_central/org/sonatype/plexus/plexus-build-api/0.0.4/plexus-build-api-0.0.4.pom (0 B at 0.0 KB/sec)
Downloading: https://repo.eclipse.org/content/repositories/maven_central/org/sonatype/spice/spice-parent/10/spice-parent-10.pom
Downloaded: https://repo.eclipse.org/content/repositories/maven_central/org/sonatype/spice/spice-parent/10/spice-parent-10.pom (0 B at 0.0 KB/sec)
Downloading: https://repo.eclipse.org/content/repositories/maven_central/org/sonatype/forge/forge-parent/3/forge-parent-3.pom
Downloaded: https://repo.eclipse.org/content/repositories/maven_central/org/sonatype/forge/forge-parent/3/forge-parent-3.pom (0 B at 0.0 KB/sec)
Downloading: https://repo.eclipse.org/content/repositories/maven_central/org/codehaus/plexus/plexus-utils/1.5.8/plexus-utils-1.5.8.pom
Downloaded: https://repo.eclipse.org/content/repositories/maven_central/org/codehaus/plexus/plexus-utils/1.5.8/plexus-utils-1.5.8.pom (0 B at 0.0 KB/sec)
Downloading: https://repo.eclipse.org/content/repositories/maven_central/org/codehaus/plexus/plexus-interpolation/1.13/plexus-interpolation-1.13.pom
Downloaded: https://repo.eclipse.org/content/repositories/maven_central/org/codehaus/plexus/plexus-interpolation/1.13/plexus-interpolation-1.13.pom (0 B at 0.0 KB/sec)
Downloading: https://repo.eclipse.org/content/repositories/maven_central/org/codehaus/plexus/plexus-components/1.1.15/plexus-components-1.1.15.pom
Downloaded: https://repo.eclipse.org/content/repositories/maven_central/org/codehaus/plexus/plexus-components/1.1.15/plexus-components-1.1.15.pom (0 B at 0.0 KB/sec)
Downloading: https://repo.eclipse.org/content/repositories/maven_central/org/apache/maven/maven-core/2.0.6/maven-core-2.0.6.jar
Downloading: https://repo.eclipse.org/content/repositories/maven_central/org/apache/maven/maven-plugin-parameter-documenter/2.0.6/maven-plugin-parameter-documenter-2.0.6.jar
Downloading: https://repo.eclipse.org/content/repositories/maven_central/org/apache/maven/reporting/maven-reporting-api/2.0.6/maven-reporting-api-2.0.6.jar
Downloading: https://repo.eclipse.org/content/repositories/maven_central/org/apache/maven/doxia/doxia-sink-api/1.0-alpha-7/doxia-sink-api-1.0-alpha-7.jar
Downloading: https://repo.eclipse.org/content/repositories/maven_central/org/apache/maven/maven-error-diagnostics/2.0.6/maven-error-diagnostics-2.0.6.jar
Downloaded: https://repo.eclipse.org/content/repositories/maven_central/org/apache/maven/reporting/maven-reporting-api/2.0.6/maven-reporting-api-2.0.6.jar (0 B at 0.0 KB/sec)
Downloading: https://repo.eclipse.org/content/repositories/maven_central/commons-cli/commons-cli/1.0/commons-cli-1.0.jar
Downloaded: https://repo.eclipse.org/content/repositories/maven_central/org/apache/maven/maven-plugin-parameter-documenter/2.0.6/maven-plugin-parameter-documenter-2.0.6.jar (0 B at 0.0 KB/sec)
Downloading: https://repo.eclipse.org/content/repositories/maven_central/org/apache/maven/maven-plugin-descriptor/2.0.6/maven-plugin-descriptor-2.0.6.jar
Downloaded: https://repo.eclipse.org/content/repositories/maven_central/org/apache/maven/maven-core/2.0.6/maven-core-2.0.6.jar (0 B at 0.0 KB/sec)
Downloading: https://repo.eclipse.org/content/repositories/maven_central/org/codehaus/plexus/plexus-interactivity-api/1.0-alpha-4/plexus-interactivity-api-1.0-alpha-4.jar
Downloaded: https://repo.eclipse.org/content/repositories/maven_central/org/apache/maven/maven-error-diagnostics/2.0.6/maven-error-diagnostics-2.0.6.jar (0 B at 0.0 KB/sec)
Downloading: https://repo.eclipse.org/content/repositories/maven_central/classworlds/classworlds/1.1/classworlds-1.1.jar
Downloaded: https://repo.eclipse.org/content/repositories/maven_central/org/apache/maven/doxia/doxia-sink-api/1.0-alpha-7/doxia-sink-api-1.0-alpha-7.jar (0 B at 0.0 KB/sec)
Downloading: https://repo.eclipse.org/content/repositories/maven_central/org/apache/maven/maven-monitor/2.0.6/maven-monitor-2.0.6.jar
Downloaded: https://repo.eclipse.org/content/repositories/maven_central/org/codehaus/plexus/plexus-interactivity-api/1.0-alpha-4/plexus-interactivity-api-1.0-alpha-4.jar (0 B at 0.0 KB/sec)
Downloading: https://repo.eclipse.org/content/repositories/maven_central/org/codehaus/plexus/plexus-utils/2.0.5/plexus-utils-2.0.5.jar
Downloaded: https://repo.eclipse.org/content/repositories/maven_central/classworlds/classworlds/1.1/classworlds-1.1.jar (0 B at 0.0 KB/sec)
Downloading: https://repo.eclipse.org/content/repositories/maven_central/org/apache/maven/shared/maven-filtering/1.0-beta-4/maven-filtering-1.0-beta-4.jar
Downloaded: https://repo.eclipse.org/content/repositories/maven_central/commons-cli/commons-cli/1.0/commons-cli-1.0.jar (0 B at 0.0 KB/sec)
Downloading: https://repo.eclipse.org/content/repositories/maven_central/org/sonatype/plexus/plexus-build-api/0.0.4/plexus-build-api-0.0.4.jar
Downloaded: https://repo.eclipse.org/content/repositories/maven_central/org/apache/maven/maven-plugin-descriptor/2.0.6/maven-plugin-descriptor-2.0.6.jar (0 B at 0.0 KB/sec)
Downloading: https://repo.eclipse.org/content/repositories/maven_central/org/codehaus/plexus/plexus-interpolation/1.13/plexus-interpolation-1.13.jar
Downloaded: https://repo.eclipse.org/content/repositories/maven_central/org/apache/maven/maven-monitor/2.0.6/maven-monitor-2.0.6.jar (0 B at 0.0 KB/sec)
Downloaded: https://repo.eclipse.org/content/repositories/maven_central/org/codehaus/plexus/plexus-utils/2.0.5/plexus-utils-2.0.5.jar (0 B at 0.0 KB/sec)
Downloaded: https://repo.eclipse.org/content/repositories/maven_central/org/sonatype/plexus/plexus-build-api/0.0.4/plexus-build-api-0.0.4.jar (0 B at 0.0 KB/sec)
Downloaded: https://repo.eclipse.org/content/repositories/maven_central/org/apache/maven/shared/maven-filtering/1.0-beta-4/maven-filtering-1.0-beta-4.jar (0 B at 0.0 KB/sec)
Downloaded: https://repo.eclipse.org/content/repositories/maven_central/org/codehaus/plexus/plexus-interpolation/1.13/plexus-interpolation-1.13.jar (0 B at 0.0 KB/sec)
[INFO] Using 'UTF-8' encoding to copy filtered resources.
[INFO] skip non existing resourceDirectory /jobs/genie.capra/build-src-develop-no-tests/workspace/org.eclipse.capra.core/src/main/resources
[INFO] 
[INFO] --- tycho-compiler-plugin:0.24.0:compile (default-compile) @ org.eclipse.capra.core ---
Downloading: https://repo.eclipse.org/content/repositories/maven_central/org/apache/maven/maven-compat/3.0/maven-compat-3.0.pom
Downloaded: https://repo.eclipse.org/content/repositories/maven_central/org/apache/maven/maven-compat/3.0/maven-compat-3.0.pom (0 B at 0.0 KB/sec)
Downloading: https://repo.eclipse.org/content/repositories/maven_central/org/apache/maven/wagon/wagon-provider-api/1.0-beta-6/wagon-provider-api-1.0-beta-6.pom
Downloaded: https://repo.eclipse.org/content/repositories/maven_central/org/apache/maven/wagon/wagon-provider-api/1.0-beta-6/wagon-provider-api-1.0-beta-6.pom (0 B at 0.0 KB/sec)
Downloading: https://repo.eclipse.org/content/repositories/maven_central/org/apache/maven/wagon/wagon/1.0-beta-6/wagon-1.0-beta-6.pom
Downloaded: https://repo.eclipse.org/content/repositories/maven_central/org/apache/maven/wagon/wagon/1.0-beta-6/wagon-1.0-beta-6.pom (0 B at 0.0 KB/sec)
Downloading: https://repo.eclipse.org/content/repositories/maven_central/org/codehaus/plexus/plexus-compiler-manager/2.2/plexus-compiler-manager-2.2.pom
Downloaded: https://repo.eclipse.org/content/repositories/maven_central/org/codehaus/plexus/plexus-compiler-manager/2.2/plexus-compiler-manager-2.2.pom (0 B at 0.0 KB/sec)
Downloading: https://repo.eclipse.org/content/repositories/maven_central/org/codehaus/plexus/plexus-compiler/2.2/plexus-compiler-2.2.pom
Downloaded: https://repo.eclipse.org/content/repositories/maven_central/org/codehaus/plexus/plexus-compiler/2.2/plexus-compiler-2.2.pom (0 B at 0.0 KB/sec)
Downloading: https://repo.eclipse.org/content/repositories/maven_central/org/codehaus/plexus/plexus-components/1.3.1/plexus-components-1.3.1.pom
Downloaded: https://repo.eclipse.org/content/repositories/maven_central/org/codehaus/plexus/plexus-components/1.3.1/plexus-components-1.3.1.pom (0 B at 0.0 KB/sec)
Downloading: https://repo.eclipse.org/content/repositories/maven_central/org/codehaus/plexus/plexus-compiler-api/2.2/plexus-compiler-api-2.2.pom
Downloaded: https://repo.eclipse.org/content/repositories/maven_central/org/codehaus/plexus/plexus-compiler-api/2.2/plexus-compiler-api-2.2.pom (0 B at 0.0 KB/sec)
Downloading: https://repo.eclipse.org/content/repositories/maven_central/org/eclipse/tycho/tycho-compiler-jdt/0.24.0/tycho-compiler-jdt-0.24.0.pom
Downloaded: https://repo.eclipse.org/content/repositories/maven_central/org/eclipse/tycho/tycho-compiler-jdt/0.24.0/tycho-compiler-jdt-0.24.0.pom (0 B at 0.0 KB/sec)
Downloading: https://repo.eclipse.org/content/repositories/maven_central/org/eclipse/tycho/org.eclipse.jdt.core/3.11.1.v20150902-1521/org.eclipse.jdt.core-3.11.1.v20150902-1521.pom
Downloaded: https://repo.eclipse.org/content/repositories/maven_central/org/eclipse/tycho/org.eclipse.jdt.core/3.11.1.v20150902-1521/org.eclipse.jdt.core-3.11.1.v20150902-1521.pom (0 B at 0.0 KB/sec)
Downloading: https://repo.eclipse.org/content/repositories/maven_central/org/eclipse/tycho/org.eclipse.jdt.compiler.apt/1.2.0.v20150514-0146/org.eclipse.jdt.compiler.apt-1.2.0.v20150514-0146.pom
Downloaded: https://repo.eclipse.org/content/repositories/maven_central/org/eclipse/tycho/org.eclipse.jdt.compiler.apt/1.2.0.v20150514-0146/org.eclipse.jdt.compiler.apt-1.2.0.v20150514-0146.pom (0 B at 0.0 KB/sec)
Downloading: https://repo.eclipse.org/content/repositories/maven_central/org/apache/maven/maven-compat/3.0/maven-compat-3.0.jar
Downloading: https://repo.eclipse.org/content/repositories/maven_central/org/apache/maven/wagon/wagon-provider-api/1.0-beta-6/wagon-provider-api-1.0-beta-6.jar
Downloading: https://repo.eclipse.org/content/repositories/maven_central/org/codehaus/plexus/plexus-compiler-manager/2.2/plexus-compiler-manager-2.2.jar
Downloading: https://repo.eclipse.org/content/repositories/maven_central/org/codehaus/plexus/plexus-compiler-api/2.2/plexus-compiler-api-2.2.jar
Downloading: https://repo.eclipse.org/content/repositories/maven_central/org/eclipse/tycho/tycho-compiler-jdt/0.24.0/tycho-compiler-jdt-0.24.0.jar
Downloaded: https://repo.eclipse.org/content/repositories/maven_central/org/codehaus/plexus/plexus-compiler-api/2.2/plexus-compiler-api-2.2.jar (0 B at 0.0 KB/sec)
Downloading: https://repo.eclipse.org/content/repositories/maven_central/org/eclipse/tycho/org.eclipse.jdt.core/3.11.1.v20150902-1521/org.eclipse.jdt.core-3.11.1.v20150902-1521.jar
Downloaded: https://repo.eclipse.org/content/repositories/maven_central/org/codehaus/plexus/plexus-compiler-manager/2.2/plexus-compiler-manager-2.2.jar (0 B at 0.0 KB/sec)
Downloading: https://repo.eclipse.org/content/repositories/maven_central/org/eclipse/tycho/org.eclipse.jdt.compiler.apt/1.2.0.v20150514-0146/org.eclipse.jdt.compiler.apt-1.2.0.v20150514-0146.jar
Downloaded: https://repo.eclipse.org/content/repositories/maven_central/org/apache/maven/wagon/wagon-provider-api/1.0-beta-6/wagon-provider-api-1.0-beta-6.jar (0 B at 0.0 KB/sec)
Downloaded: https://repo.eclipse.org/content/repositories/maven_central/org/apache/maven/maven-compat/3.0/maven-compat-3.0.jar (0 B at 0.0 KB/sec)
Downloaded: https://repo.eclipse.org/content/repositories/maven_central/org/eclipse/tycho/org.eclipse.jdt.core/3.11.1.v20150902-1521/org.eclipse.jdt.core-3.11.1.v20150902-1521.jar (0 B at 0.0 KB/sec)
Downloaded: https://repo.eclipse.org/content/repositories/maven_central/org/eclipse/tycho/org.eclipse.jdt.compiler.apt/1.2.0.v20150514-0146/org.eclipse.jdt.compiler.apt-1.2.0.v20150514-0146.jar (0 B at 0.0 KB/sec)
Downloaded: https://repo.eclipse.org/content/repositories/maven_central/org/eclipse/tycho/tycho-compiler-jdt/0.24.0/tycho-compiler-jdt-0.24.0.jar (0 B at 0.0 KB/sec)
[INFO] Compiling 14 source files to /jobs/genie.capra/build-src-develop-no-tests/workspace/org.eclipse.capra.core/target/classes
[INFO] 
[INFO] --- maven-resources-plugin:2.4.3:testResources (default-testResources) @ org.eclipse.capra.core ---
[INFO] Using 'UTF-8' encoding to copy filtered resources.
[INFO] skip non existing resourceDirectory /jobs/genie.capra/build-src-develop-no-tests/workspace/org.eclipse.capra.core/src/test/resources
[INFO] 
[INFO] <<< maven-surefire-report-plugin:2.19.1:report (default-cli) < [surefire]test @ org.eclipse.capra.core <<<
[INFO] 
[INFO] --- maven-surefire-report-plugin:2.19.1:report (default-cli) @ org.eclipse.capra.core ---
[INFO] 
[INFO] --- tycho-packaging-plugin:0.24.0:build-qualifier (default-build-qualifier) @ org.eclipse.capra.core ---
[INFO] The project's OSGi version is 0.7.0.201703241300
[INFO] 
[INFO] --- tycho-packaging-plugin:0.24.0:validate-id (default-validate-id) @ org.eclipse.capra.core ---
[INFO] 
[INFO] --- tycho-packaging-plugin:0.24.0:validate-version (default-validate-version) @ org.eclipse.capra.core ---
[INFO] 
[INFO] --- maven-resources-plugin:2.4.3:resources (default-resources) @ org.eclipse.capra.core ---
[INFO] Using 'UTF-8' encoding to copy filtered resources.
[INFO] skip non existing resourceDirectory /jobs/genie.capra/build-src-develop-no-tests/workspace/org.eclipse.capra.core/src/main/resources
[INFO] 
[INFO] --- tycho-compiler-plugin:0.24.0:compile (default-compile) @ org.eclipse.capra.core ---
[INFO] Nothing to compile - all classes are up to date
[INFO] 
[INFO] --- maven-resources-plugin:2.4.3:testResources (default-testResources) @ org.eclipse.capra.core ---
[INFO] Using 'UTF-8' encoding to copy filtered resources.
[INFO] skip non existing resourceDirectory /jobs/genie.capra/build-src-develop-no-tests/workspace/org.eclipse.capra.core/src/test/resources
[INFO] 
[INFO] --- target-platform-configuration:0.24.0:target-platform (default-target-platform) @ org.eclipse.capra.core ---
[INFO] 
[INFO] --- tycho-packaging-plugin:0.24.0:package-plugin (default-package-plugin) @ org.eclipse.capra.core ---
[INFO] Building jar: /jobs/genie.capra/build-src-develop-no-tests/workspace/org.eclipse.capra.core/target/org.eclipse.capra.core-0.7.0-SNAPSHOT.jar
[INFO] 
[INFO] --- tycho-p2-plugin:0.24.0:p2-metadata-default (default-p2-metadata-default) @ org.eclipse.capra.core ---
[INFO] 
[INFO] --- maven-install-plugin:2.3.1:install (default-install) @ org.eclipse.capra.core ---
[INFO] Installing /jobs/genie.capra/build-src-develop-no-tests/workspace/org.eclipse.capra.core/target/org.eclipse.capra.core-0.7.0-SNAPSHOT.jar to /home/hudson/genie.capra/.hudson/jobs/build-src-develop-no-tests/workspace/.maven/repo/org/eclipse/capra/org.eclipse.capra.core/0.7.0-SNAPSHOT/org.eclipse.capra.core-0.7.0-SNAPSHOT.jar
[INFO] Installing /jobs/genie.capra/build-src-develop-no-tests/workspace/org.eclipse.capra.core/pom.xml to /home/hudson/genie.capra/.hudson/jobs/build-src-develop-no-tests/workspace/.maven/repo/org/eclipse/capra/org.eclipse.capra.core/0.7.0-SNAPSHOT/org.eclipse.capra.core-0.7.0-SNAPSHOT.pom
[INFO] Installing /jobs/genie.capra/build-src-develop-no-tests/workspace/org.eclipse.capra.core/target/p2content.xml to /home/hudson/genie.capra/.hudson/jobs/build-src-develop-no-tests/workspace/.maven/repo/org/eclipse/capra/org.eclipse.capra.core/0.7.0-SNAPSHOT/org.eclipse.capra.core-0.7.0-SNAPSHOT-p2metadata.xml
[INFO] Installing /jobs/genie.capra/build-src-develop-no-tests/workspace/org.eclipse.capra.core/target/p2artifacts.xml to /home/hudson/genie.capra/.hudson/jobs/build-src-develop-no-tests/workspace/.maven/repo/org/eclipse/capra/org.eclipse.capra.core/0.7.0-SNAPSHOT/org.eclipse.capra.core-0.7.0-SNAPSHOT-p2artifacts.xml
[INFO] 
[INFO] --- tycho-p2-plugin:0.24.0:update-local-index (default-update-local-index) @ org.eclipse.capra.core ---
[INFO]                                                                         
[INFO] ------------------------------------------------------------------------
[INFO] Building org.eclipse.capra.handler.emf 0.7.0-SNAPSHOT
[INFO] ------------------------------------------------------------------------
[INFO] 
[INFO] --- maven-clean-plugin:2.5:clean (default-clean) @ org.eclipse.capra.handler.emf ---
[INFO] Deleting /jobs/genie.capra/build-src-develop-no-tests/workspace/org.eclipse.capra.handler.emf/target
[INFO] 
[INFO] >>> maven-surefire-report-plugin:2.19.1:report (default-cli) > [surefire]test @ org.eclipse.capra.handler.emf >>>
[INFO] 
[INFO] --- tycho-packaging-plugin:0.24.0:build-qualifier (default-build-qualifier) @ org.eclipse.capra.handler.emf ---
[INFO] The project's OSGi version is 0.7.0.201703241300
[INFO] 
[INFO] --- tycho-packaging-plugin:0.24.0:validate-id (default-validate-id) @ org.eclipse.capra.handler.emf ---
[INFO] 
[INFO] --- tycho-packaging-plugin:0.24.0:validate-version (default-validate-version) @ org.eclipse.capra.handler.emf ---
[INFO] 
[INFO] --- maven-resources-plugin:2.4.3:resources (default-resources) @ org.eclipse.capra.handler.emf ---
[INFO] Using 'UTF-8' encoding to copy filtered resources.
[INFO] skip non existing resourceDirectory /jobs/genie.capra/build-src-develop-no-tests/workspace/org.eclipse.capra.handler.emf/src/main/resources
[INFO] 
[INFO] --- tycho-compiler-plugin:0.24.0:compile (default-compile) @ org.eclipse.capra.handler.emf ---
[INFO] Compiling 1 source file to /jobs/genie.capra/build-src-develop-no-tests/workspace/org.eclipse.capra.handler.emf/target/classes
[INFO] 
[INFO] --- maven-resources-plugin:2.4.3:testResources (default-testResources) @ org.eclipse.capra.handler.emf ---
[INFO] Using 'UTF-8' encoding to copy filtered resources.
[INFO] skip non existing resourceDirectory /jobs/genie.capra/build-src-develop-no-tests/workspace/org.eclipse.capra.handler.emf/src/test/resources
[INFO] 
[INFO] <<< maven-surefire-report-plugin:2.19.1:report (default-cli) < [surefire]test @ org.eclipse.capra.handler.emf <<<
[INFO] 
[INFO] --- maven-surefire-report-plugin:2.19.1:report (default-cli) @ org.eclipse.capra.handler.emf ---
[INFO] 
[INFO] --- tycho-packaging-plugin:0.24.0:build-qualifier (default-build-qualifier) @ org.eclipse.capra.handler.emf ---
[INFO] The project's OSGi version is 0.7.0.201703241300
[INFO] 
[INFO] --- tycho-packaging-plugin:0.24.0:validate-id (default-validate-id) @ org.eclipse.capra.handler.emf ---
[INFO] 
[INFO] --- tycho-packaging-plugin:0.24.0:validate-version (default-validate-version) @ org.eclipse.capra.handler.emf ---
[INFO] 
[INFO] --- maven-resources-plugin:2.4.3:resources (default-resources) @ org.eclipse.capra.handler.emf ---
[INFO] Using 'UTF-8' encoding to copy filtered resources.
[INFO] skip non existing resourceDirectory /jobs/genie.capra/build-src-develop-no-tests/workspace/org.eclipse.capra.handler.emf/src/main/resources
[INFO] 
[INFO] --- tycho-compiler-plugin:0.24.0:compile (default-compile) @ org.eclipse.capra.handler.emf ---
[INFO] Nothing to compile - all classes are up to date
[INFO] 
[INFO] --- maven-resources-plugin:2.4.3:testResources (default-testResources) @ org.eclipse.capra.handler.emf ---
[INFO] Using 'UTF-8' encoding to copy filtered resources.
[INFO] skip non existing resourceDirectory /jobs/genie.capra/build-src-develop-no-tests/workspace/org.eclipse.capra.handler.emf/src/test/resources
[INFO] 
[INFO] --- target-platform-configuration:0.24.0:target-platform (default-target-platform) @ org.eclipse.capra.handler.emf ---
[INFO] 
[INFO] --- tycho-packaging-plugin:0.24.0:package-plugin (default-package-plugin) @ org.eclipse.capra.handler.emf ---
[INFO] Building jar: /jobs/genie.capra/build-src-develop-no-tests/workspace/org.eclipse.capra.handler.emf/target/org.eclipse.capra.handler.emf-0.7.0-SNAPSHOT.jar
[INFO] 
[INFO] --- tycho-p2-plugin:0.24.0:p2-metadata-default (default-p2-metadata-default) @ org.eclipse.capra.handler.emf ---
[INFO] 
[INFO] --- maven-install-plugin:2.3.1:install (default-install) @ org.eclipse.capra.handler.emf ---
[INFO] Installing /jobs/genie.capra/build-src-develop-no-tests/workspace/org.eclipse.capra.handler.emf/target/org.eclipse.capra.handler.emf-0.7.0-SNAPSHOT.jar to /home/hudson/genie.capra/.hudson/jobs/build-src-develop-no-tests/workspace/.maven/repo/org/eclipse/capra/org.eclipse.capra.handler.emf/0.7.0-SNAPSHOT/org.eclipse.capra.handler.emf-0.7.0-SNAPSHOT.jar
[INFO] Installing /jobs/genie.capra/build-src-develop-no-tests/workspace/org.eclipse.capra.handler.emf/pom.xml to /home/hudson/genie.capra/.hudson/jobs/build-src-develop-no-tests/workspace/.maven/repo/org/eclipse/capra/org.eclipse.capra.handler.emf/0.7.0-SNAPSHOT/org.eclipse.capra.handler.emf-0.7.0-SNAPSHOT.pom
[INFO] Installing /jobs/genie.capra/build-src-develop-no-tests/workspace/org.eclipse.capra.handler.emf/target/p2content.xml to /home/hudson/genie.capra/.hudson/jobs/build-src-develop-no-tests/workspace/.maven/repo/org/eclipse/capra/org.eclipse.capra.handler.emf/0.7.0-SNAPSHOT/org.eclipse.capra.handler.emf-0.7.0-SNAPSHOT-p2metadata.xml
[INFO] Installing /jobs/genie.capra/build-src-develop-no-tests/workspace/org.eclipse.capra.handler.emf/target/p2artifacts.xml to /home/hudson/genie.capra/.hudson/jobs/build-src-develop-no-tests/workspace/.maven/repo/org/eclipse/capra/org.eclipse.capra.handler.emf/0.7.0-SNAPSHOT/org.eclipse.capra.handler.emf-0.7.0-SNAPSHOT-p2artifacts.xml
[INFO] 
[INFO] --- tycho-p2-plugin:0.24.0:update-local-index (default-update-local-index) @ org.eclipse.capra.handler.emf ---
[INFO]                                                                         
[INFO] ------------------------------------------------------------------------
[INFO] Building org.eclipse.capra.handler.file 0.7.0-SNAPSHOT
[INFO] ------------------------------------------------------------------------
[INFO] 
[INFO] --- maven-clean-plugin:2.5:clean (default-clean) @ org.eclipse.capra.handler.file ---
[INFO] Deleting /jobs/genie.capra/build-src-develop-no-tests/workspace/org.eclipse.capra.handler.file/target
[INFO] 
[INFO] >>> maven-surefire-report-plugin:2.19.1:report (default-cli) > [surefire]test @ org.eclipse.capra.handler.file >>>
[INFO] 
[INFO] --- tycho-packaging-plugin:0.24.0:build-qualifier (default-build-qualifier) @ org.eclipse.capra.handler.file ---
[INFO] The project's OSGi version is 0.7.0.201703241300
[INFO] 
[INFO] --- tycho-packaging-plugin:0.24.0:validate-id (default-validate-id) @ org.eclipse.capra.handler.file ---
[INFO] 
[INFO] --- tycho-packaging-plugin:0.24.0:validate-version (default-validate-version) @ org.eclipse.capra.handler.file ---
[INFO] 
[INFO] --- maven-resources-plugin:2.4.3:resources (default-resources) @ org.eclipse.capra.handler.file ---
[INFO] Using 'UTF-8' encoding to copy filtered resources.
[INFO] skip non existing resourceDirectory /jobs/genie.capra/build-src-develop-no-tests/workspace/org.eclipse.capra.handler.file/src/main/resources
[INFO] 
[INFO] --- tycho-compiler-plugin:0.24.0:compile (default-compile) @ org.eclipse.capra.handler.file ---
[INFO] Compiling 1 source file to /jobs/genie.capra/build-src-develop-no-tests/workspace/org.eclipse.capra.handler.file/target/classes
[INFO] 
[INFO] --- maven-resources-plugin:2.4.3:testResources (default-testResources) @ org.eclipse.capra.handler.file ---
[INFO] Using 'UTF-8' encoding to copy filtered resources.
[INFO] skip non existing resourceDirectory /jobs/genie.capra/build-src-develop-no-tests/workspace/org.eclipse.capra.handler.file/src/test/resources
[INFO] 
[INFO] <<< maven-surefire-report-plugin:2.19.1:report (default-cli) < [surefire]test @ org.eclipse.capra.handler.file <<<
[INFO] 
[INFO] --- maven-surefire-report-plugin:2.19.1:report (default-cli) @ org.eclipse.capra.handler.file ---
[INFO] 
[INFO] --- tycho-packaging-plugin:0.24.0:build-qualifier (default-build-qualifier) @ org.eclipse.capra.handler.file ---
[INFO] The project's OSGi version is 0.7.0.201703241300
[INFO] 
[INFO] --- tycho-packaging-plugin:0.24.0:validate-id (default-validate-id) @ org.eclipse.capra.handler.file ---
[INFO] 
[INFO] --- tycho-packaging-plugin:0.24.0:validate-version (default-validate-version) @ org.eclipse.capra.handler.file ---
[INFO] 
[INFO] --- maven-resources-plugin:2.4.3:resources (default-resources) @ org.eclipse.capra.handler.file ---
[INFO] Using 'UTF-8' encoding to copy filtered resources.
[INFO] skip non existing resourceDirectory /jobs/genie.capra/build-src-develop-no-tests/workspace/org.eclipse.capra.handler.file/src/main/resources
[INFO] 
[INFO] --- tycho-compiler-plugin:0.24.0:compile (default-compile) @ org.eclipse.capra.handler.file ---
[INFO] Nothing to compile - all classes are up to date
[INFO] 
[INFO] --- maven-resources-plugin:2.4.3:testResources (default-testResources) @ org.eclipse.capra.handler.file ---
[INFO] Using 'UTF-8' encoding to copy filtered resources.
[INFO] skip non existing resourceDirectory /jobs/genie.capra/build-src-develop-no-tests/workspace/org.eclipse.capra.handler.file/src/test/resources
[INFO] 
[INFO] --- target-platform-configuration:0.24.0:target-platform (default-target-platform) @ org.eclipse.capra.handler.file ---
[INFO] 
[INFO] --- tycho-packaging-plugin:0.24.0:package-plugin (default-package-plugin) @ org.eclipse.capra.handler.file ---
[INFO] Building jar: /jobs/genie.capra/build-src-develop-no-tests/workspace/org.eclipse.capra.handler.file/target/org.eclipse.capra.handler.file-0.7.0-SNAPSHOT.jar
[INFO] 
[INFO] --- tycho-p2-plugin:0.24.0:p2-metadata-default (default-p2-metadata-default) @ org.eclipse.capra.handler.file ---
[INFO] 
[INFO] --- maven-install-plugin:2.3.1:install (default-install) @ org.eclipse.capra.handler.file ---
[INFO] Installing /jobs/genie.capra/build-src-develop-no-tests/workspace/org.eclipse.capra.handler.file/target/org.eclipse.capra.handler.file-0.7.0-SNAPSHOT.jar to /home/hudson/genie.capra/.hudson/jobs/build-src-develop-no-tests/workspace/.maven/repo/org/eclipse/capra/org.eclipse.capra.handler.file/0.7.0-SNAPSHOT/org.eclipse.capra.handler.file-0.7.0-SNAPSHOT.jar
[INFO] Installing /jobs/genie.capra/build-src-develop-no-tests/workspace/org.eclipse.capra.handler.file/pom.xml to /home/hudson/genie.capra/.hudson/jobs/build-src-develop-no-tests/workspace/.maven/repo/org/eclipse/capra/org.eclipse.capra.handler.file/0.7.0-SNAPSHOT/org.eclipse.capra.handler.file-0.7.0-SNAPSHOT.pom
[INFO] Installing /jobs/genie.capra/build-src-develop-no-tests/workspace/org.eclipse.capra.handler.file/target/p2content.xml to /home/hudson/genie.capra/.hudson/jobs/build-src-develop-no-tests/workspace/.maven/repo/org/eclipse/capra/org.eclipse.capra.handler.file/0.7.0-SNAPSHOT/org.eclipse.capra.handler.file-0.7.0-SNAPSHOT-p2metadata.xml
[INFO] Installing /jobs/genie.capra/build-src-develop-no-tests/workspace/org.eclipse.capra.handler.file/target/p2artifacts.xml to /home/hudson/genie.capra/.hudson/jobs/build-src-develop-no-tests/workspace/.maven/repo/org/eclipse/capra/org.eclipse.capra.handler.file/0.7.0-SNAPSHOT/org.eclipse.capra.handler.file-0.7.0-SNAPSHOT-p2artifacts.xml
[INFO] 
[INFO] --- tycho-p2-plugin:0.24.0:update-local-index (default-update-local-index) @ org.eclipse.capra.handler.file ---
[INFO]                                                                         
[INFO] ------------------------------------------------------------------------
[INFO] Building org.eclipse.capra.ui 0.7.0-SNAPSHOT
[INFO] ------------------------------------------------------------------------
[INFO] 
[INFO] --- maven-clean-plugin:2.5:clean (default-clean) @ org.eclipse.capra.ui ---
[INFO] Deleting /jobs/genie.capra/build-src-develop-no-tests/workspace/org.eclipse.capra.ui/target
[INFO] 
[INFO] >>> maven-surefire-report-plugin:2.19.1:report (default-cli) > [surefire]test @ org.eclipse.capra.ui >>>
[INFO] 
[INFO] --- tycho-packaging-plugin:0.24.0:build-qualifier (default-build-qualifier) @ org.eclipse.capra.ui ---
[INFO] The project's OSGi version is 0.7.0.201703241300
[INFO] 
[INFO] --- tycho-packaging-plugin:0.24.0:validate-id (default-validate-id) @ org.eclipse.capra.ui ---
[INFO] 
[INFO] --- tycho-packaging-plugin:0.24.0:validate-version (default-validate-version) @ org.eclipse.capra.ui ---
[INFO] 
[INFO] --- maven-resources-plugin:2.4.3:resources (default-resources) @ org.eclipse.capra.ui ---
[INFO] Using 'UTF-8' encoding to copy filtered resources.
[INFO] skip non existing resourceDirectory /jobs/genie.capra/build-src-develop-no-tests/workspace/org.eclipse.capra.ui/src/main/resources
[INFO] 
[INFO] --- tycho-compiler-plugin:0.24.0:compile (default-compile) @ org.eclipse.capra.ui ---
[INFO] Compiling 8 source files to /jobs/genie.capra/build-src-develop-no-tests/workspace/org.eclipse.capra.ui/target/classes
[INFO] 
[INFO] --- maven-resources-plugin:2.4.3:testResources (default-testResources) @ org.eclipse.capra.ui ---
[INFO] Using 'UTF-8' encoding to copy filtered resources.
[INFO] skip non existing resourceDirectory /jobs/genie.capra/build-src-develop-no-tests/workspace/org.eclipse.capra.ui/src/test/resources
[INFO] 
[INFO] <<< maven-surefire-report-plugin:2.19.1:report (default-cli) < [surefire]test @ org.eclipse.capra.ui <<<
[INFO] 
[INFO] --- maven-surefire-report-plugin:2.19.1:report (default-cli) @ org.eclipse.capra.ui ---
[INFO] 
[INFO] --- tycho-packaging-plugin:0.24.0:build-qualifier (default-build-qualifier) @ org.eclipse.capra.ui ---
[INFO] The project's OSGi version is 0.7.0.201703241300
[INFO] 
[INFO] --- tycho-packaging-plugin:0.24.0:validate-id (default-validate-id) @ org.eclipse.capra.ui ---
[INFO] 
[INFO] --- tycho-packaging-plugin:0.24.0:validate-version (default-validate-version) @ org.eclipse.capra.ui ---
[INFO] 
[INFO] --- maven-resources-plugin:2.4.3:resources (default-resources) @ org.eclipse.capra.ui ---
[INFO] Using 'UTF-8' encoding to copy filtered resources.
[INFO] skip non existing resourceDirectory /jobs/genie.capra/build-src-develop-no-tests/workspace/org.eclipse.capra.ui/src/main/resources
[INFO] 
[INFO] --- tycho-compiler-plugin:0.24.0:compile (default-compile) @ org.eclipse.capra.ui ---
[INFO] Nothing to compile - all classes are up to date
[INFO] 
[INFO] --- maven-resources-plugin:2.4.3:testResources (default-testResources) @ org.eclipse.capra.ui ---
[INFO] Using 'UTF-8' encoding to copy filtered resources.
[INFO] skip non existing resourceDirectory /jobs/genie.capra/build-src-develop-no-tests/workspace/org.eclipse.capra.ui/src/test/resources
[INFO] 
[INFO] --- target-platform-configuration:0.24.0:target-platform (default-target-platform) @ org.eclipse.capra.ui ---
[INFO] 
[INFO] --- tycho-packaging-plugin:0.24.0:package-plugin (default-package-plugin) @ org.eclipse.capra.ui ---
[INFO] Building jar: /jobs/genie.capra/build-src-develop-no-tests/workspace/org.eclipse.capra.ui/target/org.eclipse.capra.ui-0.7.0-SNAPSHOT.jar
[INFO] 
[INFO] --- tycho-p2-plugin:0.24.0:p2-metadata-default (default-p2-metadata-default) @ org.eclipse.capra.ui ---
[INFO] 
[INFO] --- maven-install-plugin:2.3.1:install (default-install) @ org.eclipse.capra.ui ---
[INFO] Installing /jobs/genie.capra/build-src-develop-no-tests/workspace/org.eclipse.capra.ui/target/org.eclipse.capra.ui-0.7.0-SNAPSHOT.jar to /home/hudson/genie.capra/.hudson/jobs/build-src-develop-no-tests/workspace/.maven/repo/org/eclipse/capra/org.eclipse.capra.ui/0.7.0-SNAPSHOT/org.eclipse.capra.ui-0.7.0-SNAPSHOT.jar
[INFO] Installing /jobs/genie.capra/build-src-develop-no-tests/workspace/org.eclipse.capra.ui/pom.xml to /home/hudson/genie.capra/.hudson/jobs/build-src-develop-no-tests/workspace/.maven/repo/org/eclipse/capra/org.eclipse.capra.ui/0.7.0-SNAPSHOT/org.eclipse.capra.ui-0.7.0-SNAPSHOT.pom
[INFO] Installing /jobs/genie.capra/build-src-develop-no-tests/workspace/org.eclipse.capra.ui/target/p2content.xml to /home/hudson/genie.capra/.hudson/jobs/build-src-develop-no-tests/workspace/.maven/repo/org/eclipse/capra/org.eclipse.capra.ui/0.7.0-SNAPSHOT/org.eclipse.capra.ui-0.7.0-SNAPSHOT-p2metadata.xml
[INFO] Installing /jobs/genie.capra/build-src-develop-no-tests/workspace/org.eclipse.capra.ui/target/p2artifacts.xml to /home/hudson/genie.capra/.hudson/jobs/build-src-develop-no-tests/workspace/.maven/repo/org/eclipse/capra/org.eclipse.capra.ui/0.7.0-SNAPSHOT/org.eclipse.capra.ui-0.7.0-SNAPSHOT-p2artifacts.xml
[INFO] 
[INFO] --- tycho-p2-plugin:0.24.0:update-local-index (default-update-local-index) @ org.eclipse.capra.ui ---
[INFO]                                                                         
[INFO] ------------------------------------------------------------------------
[INFO] Building org.eclipse.capra.handler.gef 0.7.0-SNAPSHOT
[INFO] ------------------------------------------------------------------------
[INFO] 
[INFO] --- maven-clean-plugin:2.5:clean (default-clean) @ org.eclipse.capra.handler.gef ---
[INFO] Deleting /jobs/genie.capra/build-src-develop-no-tests/workspace/org.eclipse.capra.handler.gef/target
[INFO] 
[INFO] >>> maven-surefire-report-plugin:2.19.1:report (default-cli) > [surefire]test @ org.eclipse.capra.handler.gef >>>
[INFO] 
[INFO] --- tycho-packaging-plugin:0.24.0:build-qualifier (default-build-qualifier) @ org.eclipse.capra.handler.gef ---
[INFO] The project's OSGi version is 0.7.0.201703241300
[INFO] 
[INFO] --- tycho-packaging-plugin:0.24.0:validate-id (default-validate-id) @ org.eclipse.capra.handler.gef ---
[INFO] 
[INFO] --- tycho-packaging-plugin:0.24.0:validate-version (default-validate-version) @ org.eclipse.capra.handler.gef ---
[INFO] 
[INFO] --- maven-resources-plugin:2.4.3:resources (default-resources) @ org.eclipse.capra.handler.gef ---
[INFO] Using 'UTF-8' encoding to copy filtered resources.
[INFO] skip non existing resourceDirectory /jobs/genie.capra/build-src-develop-no-tests/workspace/org.eclipse.capra.handler.gef/src/main/resources
[INFO] 
[INFO] --- tycho-compiler-plugin:0.24.0:compile (default-compile) @ org.eclipse.capra.handler.gef ---
[INFO] Compiling 1 source file to /jobs/genie.capra/build-src-develop-no-tests/workspace/org.eclipse.capra.handler.gef/target/classes
[INFO] 
[INFO] --- maven-resources-plugin:2.4.3:testResources (default-testResources) @ org.eclipse.capra.handler.gef ---
[INFO] Using 'UTF-8' encoding to copy filtered resources.
[INFO] skip non existing resourceDirectory /jobs/genie.capra/build-src-develop-no-tests/workspace/org.eclipse.capra.handler.gef/src/test/resources
[INFO] 
[INFO] <<< maven-surefire-report-plugin:2.19.1:report (default-cli) < [surefire]test @ org.eclipse.capra.handler.gef <<<
[INFO] 
[INFO] --- maven-surefire-report-plugin:2.19.1:report (default-cli) @ org.eclipse.capra.handler.gef ---
[INFO] 
[INFO] --- tycho-packaging-plugin:0.24.0:build-qualifier (default-build-qualifier) @ org.eclipse.capra.handler.gef ---
[INFO] The project's OSGi version is 0.7.0.201703241300
[INFO] 
[INFO] --- tycho-packaging-plugin:0.24.0:validate-id (default-validate-id) @ org.eclipse.capra.handler.gef ---
[INFO] 
[INFO] --- tycho-packaging-plugin:0.24.0:validate-version (default-validate-version) @ org.eclipse.capra.handler.gef ---
[INFO] 
[INFO] --- maven-resources-plugin:2.4.3:resources (default-resources) @ org.eclipse.capra.handler.gef ---
[INFO] Using 'UTF-8' encoding to copy filtered resources.
[INFO] skip non existing resourceDirectory /jobs/genie.capra/build-src-develop-no-tests/workspace/org.eclipse.capra.handler.gef/src/main/resources
[INFO] 
[INFO] --- tycho-compiler-plugin:0.24.0:compile (default-compile) @ org.eclipse.capra.handler.gef ---
[INFO] Nothing to compile - all classes are up to date
[INFO] 
[INFO] --- maven-resources-plugin:2.4.3:testResources (default-testResources) @ org.eclipse.capra.handler.gef ---
[INFO] Using 'UTF-8' encoding to copy filtered resources.
[INFO] skip non existing resourceDirectory /jobs/genie.capra/build-src-develop-no-tests/workspace/org.eclipse.capra.handler.gef/src/test/resources
[INFO] 
[INFO] --- target-platform-configuration:0.24.0:target-platform (default-target-platform) @ org.eclipse.capra.handler.gef ---
[INFO] 
[INFO] --- tycho-packaging-plugin:0.24.0:package-plugin (default-package-plugin) @ org.eclipse.capra.handler.gef ---
[INFO] Building jar: /jobs/genie.capra/build-src-develop-no-tests/workspace/org.eclipse.capra.handler.gef/target/org.eclipse.capra.handler.gef-0.7.0-SNAPSHOT.jar
[INFO] 
[INFO] --- tycho-p2-plugin:0.24.0:p2-metadata-default (default-p2-metadata-default) @ org.eclipse.capra.handler.gef ---
[INFO] 
[INFO] --- maven-install-plugin:2.3.1:install (default-install) @ org.eclipse.capra.handler.gef ---
[INFO] Installing /jobs/genie.capra/build-src-develop-no-tests/workspace/org.eclipse.capra.handler.gef/target/org.eclipse.capra.handler.gef-0.7.0-SNAPSHOT.jar to /home/hudson/genie.capra/.hudson/jobs/build-src-develop-no-tests/workspace/.maven/repo/org/eclipse/capra/org.eclipse.capra.handler.gef/0.7.0-SNAPSHOT/org.eclipse.capra.handler.gef-0.7.0-SNAPSHOT.jar
[INFO] Installing /jobs/genie.capra/build-src-develop-no-tests/workspace/org.eclipse.capra.handler.gef/pom.xml to /home/hudson/genie.capra/.hudson/jobs/build-src-develop-no-tests/workspace/.maven/repo/org/eclipse/capra/org.eclipse.capra.handler.gef/0.7.0-SNAPSHOT/org.eclipse.capra.handler.gef-0.7.0-SNAPSHOT.pom
[INFO] Installing /jobs/genie.capra/build-src-develop-no-tests/workspace/org.eclipse.capra.handler.gef/target/p2content.xml to /home/hudson/genie.capra/.hudson/jobs/build-src-develop-no-tests/workspace/.maven/repo/org/eclipse/capra/org.eclipse.capra.handler.gef/0.7.0-SNAPSHOT/org.eclipse.capra.handler.gef-0.7.0-SNAPSHOT-p2metadata.xml
[INFO] Installing /jobs/genie.capra/build-src-develop-no-tests/workspace/org.eclipse.capra.handler.gef/target/p2artifacts.xml to /home/hudson/genie.capra/.hudson/jobs/build-src-develop-no-tests/workspace/.maven/repo/org/eclipse/capra/org.eclipse.capra.handler.gef/0.7.0-SNAPSHOT/org.eclipse.capra.handler.gef-0.7.0-SNAPSHOT-p2artifacts.xml
[INFO] 
[INFO] --- tycho-p2-plugin:0.24.0:update-local-index (default-update-local-index) @ org.eclipse.capra.handler.gef ---
[INFO]                                                                         
[INFO] ------------------------------------------------------------------------
[INFO] Building org.eclipse.capra.handler.hudson 0.7.0-SNAPSHOT
[INFO] ------------------------------------------------------------------------
[INFO] 
[INFO] --- maven-clean-plugin:2.5:clean (default-clean) @ org.eclipse.capra.handler.hudson ---
[INFO] Deleting /jobs/genie.capra/build-src-develop-no-tests/workspace/org.eclipse.capra.handler.hudson/target
[INFO] 
[INFO] >>> maven-surefire-report-plugin:2.19.1:report (default-cli) > [surefire]test @ org.eclipse.capra.handler.hudson >>>
[INFO] 
[INFO] --- tycho-packaging-plugin:0.24.0:build-qualifier (default-build-qualifier) @ org.eclipse.capra.handler.hudson ---
[INFO] The project's OSGi version is 0.7.0.201703241300
[INFO] 
[INFO] --- tycho-packaging-plugin:0.24.0:validate-id (default-validate-id) @ org.eclipse.capra.handler.hudson ---
[INFO] 
[INFO] --- tycho-packaging-plugin:0.24.0:validate-version (default-validate-version) @ org.eclipse.capra.handler.hudson ---
[INFO] 
[INFO] --- maven-resources-plugin:2.4.3:resources (default-resources) @ org.eclipse.capra.handler.hudson ---
[INFO] Using 'UTF-8' encoding to copy filtered resources.
[INFO] skip non existing resourceDirectory /jobs/genie.capra/build-src-develop-no-tests/workspace/org.eclipse.capra.handler.hudson/src/main/resources
[INFO] 
[INFO] --- tycho-compiler-plugin:0.24.0:compile (default-compile) @ org.eclipse.capra.handler.hudson ---
[INFO] Compiling 2 source files to /jobs/genie.capra/build-src-develop-no-tests/workspace/org.eclipse.capra.handler.hudson/target/classes
[INFO] 
[INFO] --- maven-resources-plugin:2.4.3:testResources (default-testResources) @ org.eclipse.capra.handler.hudson ---
[INFO] Using 'UTF-8' encoding to copy filtered resources.
[INFO] skip non existing resourceDirectory /jobs/genie.capra/build-src-develop-no-tests/workspace/org.eclipse.capra.handler.hudson/src/test/resources
[INFO] 
[INFO] <<< maven-surefire-report-plugin:2.19.1:report (default-cli) < [surefire]test @ org.eclipse.capra.handler.hudson <<<
[INFO] 
[INFO] --- maven-surefire-report-plugin:2.19.1:report (default-cli) @ org.eclipse.capra.handler.hudson ---
[INFO] 
[INFO] --- tycho-packaging-plugin:0.24.0:build-qualifier (default-build-qualifier) @ org.eclipse.capra.handler.hudson ---
[INFO] The project's OSGi version is 0.7.0.201703241300
[INFO] 
[INFO] --- tycho-packaging-plugin:0.24.0:validate-id (default-validate-id) @ org.eclipse.capra.handler.hudson ---
[INFO] 
[INFO] --- tycho-packaging-plugin:0.24.0:validate-version (default-validate-version) @ org.eclipse.capra.handler.hudson ---
[INFO] 
[INFO] --- maven-resources-plugin:2.4.3:resources (default-resources) @ org.eclipse.capra.handler.hudson ---
[INFO] Using 'UTF-8' encoding to copy filtered resources.
[INFO] skip non existing resourceDirectory /jobs/genie.capra/build-src-develop-no-tests/workspace/org.eclipse.capra.handler.hudson/src/main/resources
[INFO] 
[INFO] --- tycho-compiler-plugin:0.24.0:compile (default-compile) @ org.eclipse.capra.handler.hudson ---
[INFO] Nothing to compile - all classes are up to date
[INFO] 
[INFO] --- maven-resources-plugin:2.4.3:testResources (default-testResources) @ org.eclipse.capra.handler.hudson ---
[INFO] Using 'UTF-8' encoding to copy filtered resources.
[INFO] skip non existing resourceDirectory /jobs/genie.capra/build-src-develop-no-tests/workspace/org.eclipse.capra.handler.hudson/src/test/resources
[INFO] 
[INFO] --- target-platform-configuration:0.24.0:target-platform (default-target-platform) @ org.eclipse.capra.handler.hudson ---
[INFO] 
[INFO] --- tycho-packaging-plugin:0.24.0:package-plugin (default-package-plugin) @ org.eclipse.capra.handler.hudson ---
[INFO] Building jar: /jobs/genie.capra/build-src-develop-no-tests/workspace/org.eclipse.capra.handler.hudson/target/org.eclipse.capra.handler.hudson-0.7.0-SNAPSHOT.jar
[INFO] 
[INFO] --- tycho-p2-plugin:0.24.0:p2-metadata-default (default-p2-metadata-default) @ org.eclipse.capra.handler.hudson ---
[INFO] 
[INFO] --- maven-install-plugin:2.3.1:install (default-install) @ org.eclipse.capra.handler.hudson ---
[INFO] Installing /jobs/genie.capra/build-src-develop-no-tests/workspace/org.eclipse.capra.handler.hudson/target/org.eclipse.capra.handler.hudson-0.7.0-SNAPSHOT.jar to /home/hudson/genie.capra/.hudson/jobs/build-src-develop-no-tests/workspace/.maven/repo/org/eclipse/capra/org.eclipse.capra.handler.hudson/0.7.0-SNAPSHOT/org.eclipse.capra.handler.hudson-0.7.0-SNAPSHOT.jar
[INFO] Installing /jobs/genie.capra/build-src-develop-no-tests/workspace/org.eclipse.capra.handler.hudson/pom.xml to /home/hudson/genie.capra/.hudson/jobs/build-src-develop-no-tests/workspace/.maven/repo/org/eclipse/capra/org.eclipse.capra.handler.hudson/0.7.0-SNAPSHOT/org.eclipse.capra.handler.hudson-0.7.0-SNAPSHOT.pom
[INFO] Installing /jobs/genie.capra/build-src-develop-no-tests/workspace/org.eclipse.capra.handler.hudson/target/p2content.xml to /home/hudson/genie.capra/.hudson/jobs/build-src-develop-no-tests/workspace/.maven/repo/org/eclipse/capra/org.eclipse.capra.handler.hudson/0.7.0-SNAPSHOT/org.eclipse.capra.handler.hudson-0.7.0-SNAPSHOT-p2metadata.xml
[INFO] Installing /jobs/genie.capra/build-src-develop-no-tests/workspace/org.eclipse.capra.handler.hudson/target/p2artifacts.xml to /home/hudson/genie.capra/.hudson/jobs/build-src-develop-no-tests/workspace/.maven/repo/org/eclipse/capra/org.eclipse.capra.handler.hudson/0.7.0-SNAPSHOT/org.eclipse.capra.handler.hudson-0.7.0-SNAPSHOT-p2artifacts.xml
[INFO] 
[INFO] --- tycho-p2-plugin:0.24.0:update-local-index (default-update-local-index) @ org.eclipse.capra.handler.hudson ---
[INFO]                                                                         
[INFO] ------------------------------------------------------------------------
[INFO] Building org.eclipse.capra.handler.mylyn 0.7.0-SNAPSHOT
[INFO] ------------------------------------------------------------------------
[INFO] 
[INFO] --- maven-clean-plugin:2.5:clean (default-clean) @ org.eclipse.capra.handler.mylyn ---
[INFO] Deleting /jobs/genie.capra/build-src-develop-no-tests/workspace/org.eclipse.capra.handler.mylyn/target
[INFO] 
[INFO] >>> maven-surefire-report-plugin:2.19.1:report (default-cli) > [surefire]test @ org.eclipse.capra.handler.mylyn >>>
[INFO] 
[INFO] --- tycho-packaging-plugin:0.24.0:build-qualifier (default-build-qualifier) @ org.eclipse.capra.handler.mylyn ---
[INFO] The project's OSGi version is 0.7.0.201703241300
[INFO] 
[INFO] --- tycho-packaging-plugin:0.24.0:validate-id (default-validate-id) @ org.eclipse.capra.handler.mylyn ---
[INFO] 
[INFO] --- tycho-packaging-plugin:0.24.0:validate-version (default-validate-version) @ org.eclipse.capra.handler.mylyn ---
[INFO] 
[INFO] --- maven-resources-plugin:2.4.3:resources (default-resources) @ org.eclipse.capra.handler.mylyn ---
[INFO] Using 'UTF-8' encoding to copy filtered resources.
[INFO] skip non existing resourceDirectory /jobs/genie.capra/build-src-develop-no-tests/workspace/org.eclipse.capra.handler.mylyn/src/main/resources
[INFO] 
[INFO] --- tycho-compiler-plugin:0.24.0:compile (default-compile) @ org.eclipse.capra.handler.mylyn ---
[INFO] Compiling 1 source file to /jobs/genie.capra/build-src-develop-no-tests/workspace/org.eclipse.capra.handler.mylyn/target/classes
[INFO] 
[INFO] --- maven-resources-plugin:2.4.3:testResources (default-testResources) @ org.eclipse.capra.handler.mylyn ---
[INFO] Using 'UTF-8' encoding to copy filtered resources.
[INFO] skip non existing resourceDirectory /jobs/genie.capra/build-src-develop-no-tests/workspace/org.eclipse.capra.handler.mylyn/src/test/resources
[INFO] 
[INFO] <<< maven-surefire-report-plugin:2.19.1:report (default-cli) < [surefire]test @ org.eclipse.capra.handler.mylyn <<<
[INFO] 
[INFO] --- maven-surefire-report-plugin:2.19.1:report (default-cli) @ org.eclipse.capra.handler.mylyn ---
[INFO] 
[INFO] --- tycho-packaging-plugin:0.24.0:build-qualifier (default-build-qualifier) @ org.eclipse.capra.handler.mylyn ---
[INFO] The project's OSGi version is 0.7.0.201703241300
[INFO] 
[INFO] --- tycho-packaging-plugin:0.24.0:validate-id (default-validate-id) @ org.eclipse.capra.handler.mylyn ---
[INFO] 
[INFO] --- tycho-packaging-plugin:0.24.0:validate-version (default-validate-version) @ org.eclipse.capra.handler.mylyn ---
[INFO] 
[INFO] --- maven-resources-plugin:2.4.3:resources (default-resources) @ org.eclipse.capra.handler.mylyn ---
[INFO] Using 'UTF-8' encoding to copy filtered resources.
[INFO] skip non existing resourceDirectory /jobs/genie.capra/build-src-develop-no-tests/workspace/org.eclipse.capra.handler.mylyn/src/main/resources
[INFO] 
[INFO] --- tycho-compiler-plugin:0.24.0:compile (default-compile) @ org.eclipse.capra.handler.mylyn ---
[INFO] Nothing to compile - all classes are up to date
[INFO] 
[INFO] --- maven-resources-plugin:2.4.3:testResources (default-testResources) @ org.eclipse.capra.handler.mylyn ---
[INFO] Using 'UTF-8' encoding to copy filtered resources.
[INFO] skip non existing resourceDirectory /jobs/genie.capra/build-src-develop-no-tests/workspace/org.eclipse.capra.handler.mylyn/src/test/resources
[INFO] 
[INFO] --- target-platform-configuration:0.24.0:target-platform (default-target-platform) @ org.eclipse.capra.handler.mylyn ---
[INFO] 
[INFO] --- tycho-packaging-plugin:0.24.0:package-plugin (default-package-plugin) @ org.eclipse.capra.handler.mylyn ---
[INFO] Building jar: /jobs/genie.capra/build-src-develop-no-tests/workspace/org.eclipse.capra.handler.mylyn/target/org.eclipse.capra.handler.mylyn-0.7.0-SNAPSHOT.jar
[INFO] 
[INFO] --- tycho-p2-plugin:0.24.0:p2-metadata-default (default-p2-metadata-default) @ org.eclipse.capra.handler.mylyn ---
[INFO] 
[INFO] --- maven-install-plugin:2.3.1:install (default-install) @ org.eclipse.capra.handler.mylyn ---
[INFO] Installing /jobs/genie.capra/build-src-develop-no-tests/workspace/org.eclipse.capra.handler.mylyn/target/org.eclipse.capra.handler.mylyn-0.7.0-SNAPSHOT.jar to /home/hudson/genie.capra/.hudson/jobs/build-src-develop-no-tests/workspace/.maven/repo/org/eclipse/capra/org.eclipse.capra.handler.mylyn/0.7.0-SNAPSHOT/org.eclipse.capra.handler.mylyn-0.7.0-SNAPSHOT.jar
[INFO] Installing /jobs/genie.capra/build-src-develop-no-tests/workspace/org.eclipse.capra.handler.mylyn/pom.xml to /home/hudson/genie.capra/.hudson/jobs/build-src-develop-no-tests/workspace/.maven/repo/org/eclipse/capra/org.eclipse.capra.handler.mylyn/0.7.0-SNAPSHOT/org.eclipse.capra.handler.mylyn-0.7.0-SNAPSHOT.pom
[INFO] Installing /jobs/genie.capra/build-src-develop-no-tests/workspace/org.eclipse.capra.handler.mylyn/target/p2content.xml to /home/hudson/genie.capra/.hudson/jobs/build-src-develop-no-tests/workspace/.maven/repo/org/eclipse/capra/org.eclipse.capra.handler.mylyn/0.7.0-SNAPSHOT/org.eclipse.capra.handler.mylyn-0.7.0-SNAPSHOT-p2metadata.xml
[INFO] Installing /jobs/genie.capra/build-src-develop-no-tests/workspace/org.eclipse.capra.handler.mylyn/target/p2artifacts.xml to /home/hudson/genie.capra/.hudson/jobs/build-src-develop-no-tests/workspace/.maven/repo/org/eclipse/capra/org.eclipse.capra.handler.mylyn/0.7.0-SNAPSHOT/org.eclipse.capra.handler.mylyn-0.7.0-SNAPSHOT-p2artifacts.xml
[INFO] 
[INFO] --- tycho-p2-plugin:0.24.0:update-local-index (default-update-local-index) @ org.eclipse.capra.handler.mylyn ---
[INFO]                                                                         
[INFO] ------------------------------------------------------------------------
[INFO] Building org.eclipse.capra.core.feature 0.7.0-SNAPSHOT
[INFO] ------------------------------------------------------------------------
[INFO] 
[INFO] --- maven-clean-plugin:2.5:clean (default-clean) @ org.eclipse.capra.core.feature ---
[INFO] 
[INFO] >>> maven-surefire-report-plugin:2.19.1:report (default-cli) > [surefire]test @ org.eclipse.capra.core.feature >>>
[INFO] 
[INFO] --- tycho-packaging-plugin:0.24.0:build-qualifier-aggregator (default-build-qualifier-aggregator) @ org.eclipse.capra.core.feature ---
[INFO] The project's OSGi version is 0.7.0.201703241300
[INFO] 
[INFO] --- tycho-packaging-plugin:0.24.0:validate-id (default-validate-id) @ org.eclipse.capra.core.feature ---
[INFO] 
[INFO] --- tycho-packaging-plugin:0.24.0:validate-version (default-validate-version) @ org.eclipse.capra.core.feature ---
[INFO] 
[INFO] <<< maven-surefire-report-plugin:2.19.1:report (default-cli) < [surefire]test @ org.eclipse.capra.core.feature <<<
[INFO] 
[INFO] --- maven-surefire-report-plugin:2.19.1:report (default-cli) @ org.eclipse.capra.core.feature ---
[INFO] 
[INFO] --- tycho-packaging-plugin:0.24.0:build-qualifier-aggregator (default-build-qualifier-aggregator) @ org.eclipse.capra.core.feature ---
[INFO] The project's OSGi version is 0.7.0.201703241300
[INFO] 
[INFO] --- tycho-packaging-plugin:0.24.0:validate-id (default-validate-id) @ org.eclipse.capra.core.feature ---
[INFO] 
[INFO] --- tycho-packaging-plugin:0.24.0:validate-version (default-validate-version) @ org.eclipse.capra.core.feature ---
[INFO] 
[INFO] --- target-platform-configuration:0.24.0:target-platform (default-target-platform) @ org.eclipse.capra.core.feature ---
[INFO] 
[INFO] --- tycho-packaging-plugin:0.24.0:package-feature (default-package-feature) @ org.eclipse.capra.core.feature ---
[INFO] Building jar: /jobs/genie.capra/build-src-develop-no-tests/workspace/org.eclipse.capra.core.feature/target/org.eclipse.capra.core.feature-0.7.0-SNAPSHOT.jar
[INFO] 
[INFO] --- tycho-p2-plugin:0.24.0:p2-metadata-default (default-p2-metadata-default) @ org.eclipse.capra.core.feature ---
[INFO] 
[INFO] --- tycho-p2-plugin:0.24.0:feature-p2-metadata (default-feature-p2-metadata) @ org.eclipse.capra.core.feature ---
[INFO] 
[INFO] --- maven-install-plugin:2.3.1:install (default-install) @ org.eclipse.capra.core.feature ---
[INFO] Installing /jobs/genie.capra/build-src-develop-no-tests/workspace/org.eclipse.capra.core.feature/target/org.eclipse.capra.core.feature-0.7.0-SNAPSHOT.jar to /home/hudson/genie.capra/.hudson/jobs/build-src-develop-no-tests/workspace/.maven/repo/org/eclipse/capra/org.eclipse.capra.core.feature/0.7.0-SNAPSHOT/org.eclipse.capra.core.feature-0.7.0-SNAPSHOT.jar
[INFO] Installing /jobs/genie.capra/build-src-develop-no-tests/workspace/org.eclipse.capra.core.feature/pom.xml to /home/hudson/genie.capra/.hudson/jobs/build-src-develop-no-tests/workspace/.maven/repo/org/eclipse/capra/org.eclipse.capra.core.feature/0.7.0-SNAPSHOT/org.eclipse.capra.core.feature-0.7.0-SNAPSHOT.pom
[INFO] Installing /jobs/genie.capra/build-src-develop-no-tests/workspace/org.eclipse.capra.core.feature/target/p2content.xml to /home/hudson/genie.capra/.hudson/jobs/build-src-develop-no-tests/workspace/.maven/repo/org/eclipse/capra/org.eclipse.capra.core.feature/0.7.0-SNAPSHOT/org.eclipse.capra.core.feature-0.7.0-SNAPSHOT-p2metadata.xml
[INFO] Installing /jobs/genie.capra/build-src-develop-no-tests/workspace/org.eclipse.capra.core.feature/target/p2artifacts.xml to /home/hudson/genie.capra/.hudson/jobs/build-src-develop-no-tests/workspace/.maven/repo/org/eclipse/capra/org.eclipse.capra.core.feature/0.7.0-SNAPSHOT/org.eclipse.capra.core.feature-0.7.0-SNAPSHOT-p2artifacts.xml
[INFO] 
[INFO] --- tycho-p2-plugin:0.24.0:update-local-index (default-update-local-index) @ org.eclipse.capra.core.feature ---
[INFO]                                                                         
[INFO] ------------------------------------------------------------------------
[INFO] Building org.eclipse.capra.documentation 0.7.0-SNAPSHOT
[INFO] ------------------------------------------------------------------------
[INFO] 
[INFO] --- maven-clean-plugin:2.5:clean (default-clean) @ org.eclipse.capra.documentation ---
[INFO] Deleting /jobs/genie.capra/build-src-develop-no-tests/workspace/org.eclipse.capra.documentation/target
[INFO] 
[INFO] >>> maven-surefire-report-plugin:2.19.1:report (default-cli) > [surefire]test @ org.eclipse.capra.documentation >>>
[INFO] 
[INFO] --- tycho-packaging-plugin:0.24.0:build-qualifier (default-build-qualifier) @ org.eclipse.capra.documentation ---
[INFO] The project's OSGi version is 0.7.0.201703241300
[INFO] 
[INFO] --- tycho-packaging-plugin:0.24.0:validate-id (default-validate-id) @ org.eclipse.capra.documentation ---
[INFO] 
[INFO] --- tycho-packaging-plugin:0.24.0:validate-version (default-validate-version) @ org.eclipse.capra.documentation ---
[INFO] 
[INFO] --- maven-resources-plugin:2.4.3:resources (default-resources) @ org.eclipse.capra.documentation ---
[INFO] Using 'UTF-8' encoding to copy filtered resources.
[INFO] skip non existing resourceDirectory /jobs/genie.capra/build-src-develop-no-tests/workspace/org.eclipse.capra.documentation/src/main/resources
[INFO] 
[INFO] --- tycho-compiler-plugin:0.24.0:compile (default-compile) @ org.eclipse.capra.documentation ---
[INFO] Nothing to compile - all classes are up to date
[INFO] 
[INFO] --- maven-resources-plugin:2.4.3:testResources (default-testResources) @ org.eclipse.capra.documentation ---
[INFO] Using 'UTF-8' encoding to copy filtered resources.
[INFO] skip non existing resourceDirectory /jobs/genie.capra/build-src-develop-no-tests/workspace/org.eclipse.capra.documentation/src/test/resources
[INFO] 
[INFO] <<< maven-surefire-report-plugin:2.19.1:report (default-cli) < [surefire]test @ org.eclipse.capra.documentation <<<
[INFO] 
[INFO] --- maven-surefire-report-plugin:2.19.1:report (default-cli) @ org.eclipse.capra.documentation ---
[INFO] 
[INFO] --- tycho-packaging-plugin:0.24.0:build-qualifier (default-build-qualifier) @ org.eclipse.capra.documentation ---
[INFO] The project's OSGi version is 0.7.0.201703241300
[INFO] 
[INFO] --- tycho-packaging-plugin:0.24.0:validate-id (default-validate-id) @ org.eclipse.capra.documentation ---
[INFO] 
[INFO] --- tycho-packaging-plugin:0.24.0:validate-version (default-validate-version) @ org.eclipse.capra.documentation ---
[INFO] 
[INFO] --- maven-resources-plugin:2.4.3:resources (default-resources) @ org.eclipse.capra.documentation ---
[INFO] Using 'UTF-8' encoding to copy filtered resources.
[INFO] skip non existing resourceDirectory /jobs/genie.capra/build-src-develop-no-tests/workspace/org.eclipse.capra.documentation/src/main/resources
[INFO] 
[INFO] --- tycho-compiler-plugin:0.24.0:compile (default-compile) @ org.eclipse.capra.documentation ---
[INFO] Nothing to compile - all classes are up to date
[INFO] 
[INFO] --- maven-resources-plugin:2.4.3:testResources (default-testResources) @ org.eclipse.capra.documentation ---
[INFO] Using 'UTF-8' encoding to copy filtered resources.
[INFO] skip non existing resourceDirectory /jobs/genie.capra/build-src-develop-no-tests/workspace/org.eclipse.capra.documentation/src/test/resources
[INFO] 
[INFO] --- target-platform-configuration:0.24.0:target-platform (default-target-platform) @ org.eclipse.capra.documentation ---
[INFO] 
[INFO] --- tycho-packaging-plugin:0.24.0:package-plugin (default-package-plugin) @ org.eclipse.capra.documentation ---
[INFO] Building jar: /jobs/genie.capra/build-src-develop-no-tests/workspace/org.eclipse.capra.documentation/target/org.eclipse.capra.documentation-0.7.0-SNAPSHOT.jar
[INFO] 
[INFO] --- tycho-p2-plugin:0.24.0:p2-metadata-default (default-p2-metadata-default) @ org.eclipse.capra.documentation ---
[INFO] 
[INFO] --- maven-install-plugin:2.3.1:install (default-install) @ org.eclipse.capra.documentation ---
[INFO] Installing /jobs/genie.capra/build-src-develop-no-tests/workspace/org.eclipse.capra.documentation/target/org.eclipse.capra.documentation-0.7.0-SNAPSHOT.jar to /home/hudson/genie.capra/.hudson/jobs/build-src-develop-no-tests/workspace/.maven/repo/org/eclipse/capra/org.eclipse.capra.documentation/0.7.0-SNAPSHOT/org.eclipse.capra.documentation-0.7.0-SNAPSHOT.jar
[INFO] Installing /jobs/genie.capra/build-src-develop-no-tests/workspace/org.eclipse.capra.documentation/pom.xml to /home/hudson/genie.capra/.hudson/jobs/build-src-develop-no-tests/workspace/.maven/repo/org/eclipse/capra/org.eclipse.capra.documentation/0.7.0-SNAPSHOT/org.eclipse.capra.documentation-0.7.0-SNAPSHOT.pom
[INFO] Installing /jobs/genie.capra/build-src-develop-no-tests/workspace/org.eclipse.capra.documentation/target/p2content.xml to /home/hudson/genie.capra/.hudson/jobs/build-src-develop-no-tests/workspace/.maven/repo/org/eclipse/capra/org.eclipse.capra.documentation/0.7.0-SNAPSHOT/org.eclipse.capra.documentation-0.7.0-SNAPSHOT-p2metadata.xml
[INFO] Installing /jobs/genie.capra/build-src-develop-no-tests/workspace/org.eclipse.capra.documentation/target/p2artifacts.xml to /home/hudson/genie.capra/.hudson/jobs/build-src-develop-no-tests/workspace/.maven/repo/org/eclipse/capra/org.eclipse.capra.documentation/0.7.0-SNAPSHOT/org.eclipse.capra.documentation-0.7.0-SNAPSHOT-p2artifacts.xml
[INFO] 
[INFO] --- tycho-p2-plugin:0.24.0:update-local-index (default-update-local-index) @ org.eclipse.capra.documentation ---
[INFO]                                                                         
[INFO] ------------------------------------------------------------------------
[INFO] Building org.eclipse.capra.generic.persistence 0.7.0-SNAPSHOT
[INFO] ------------------------------------------------------------------------
[INFO] 
[INFO] --- maven-clean-plugin:2.5:clean (default-clean) @ org.eclipse.capra.generic.persistence ---
[INFO] Deleting /jobs/genie.capra/build-src-develop-no-tests/workspace/org.eclipse.capra.generic.persistence/target
[INFO] 
[INFO] >>> maven-surefire-report-plugin:2.19.1:report (default-cli) > [surefire]test @ org.eclipse.capra.generic.persistence >>>
[INFO] 
[INFO] --- tycho-packaging-plugin:0.24.0:build-qualifier (default-build-qualifier) @ org.eclipse.capra.generic.persistence ---
[INFO] The project's OSGi version is 0.7.0.201703241300
[INFO] 
[INFO] --- tycho-packaging-plugin:0.24.0:validate-id (default-validate-id) @ org.eclipse.capra.generic.persistence ---
[INFO] 
[INFO] --- tycho-packaging-plugin:0.24.0:validate-version (default-validate-version) @ org.eclipse.capra.generic.persistence ---
[INFO] 
[INFO] --- maven-resources-plugin:2.4.3:resources (default-resources) @ org.eclipse.capra.generic.persistence ---
[INFO] Using 'UTF-8' encoding to copy filtered resources.
[INFO] skip non existing resourceDirectory /jobs/genie.capra/build-src-develop-no-tests/workspace/org.eclipse.capra.generic.persistence/src/main/resources
[INFO] 
[INFO] --- tycho-compiler-plugin:0.24.0:compile (default-compile) @ org.eclipse.capra.generic.persistence ---
[INFO] Compiling 1 source file to /jobs/genie.capra/build-src-develop-no-tests/workspace/org.eclipse.capra.generic.persistence/target/classes
[INFO] 
[INFO] --- maven-resources-plugin:2.4.3:testResources (default-testResources) @ org.eclipse.capra.generic.persistence ---
[INFO] Using 'UTF-8' encoding to copy filtered resources.
[INFO] skip non existing resourceDirectory /jobs/genie.capra/build-src-develop-no-tests/workspace/org.eclipse.capra.generic.persistence/src/test/resources
[INFO] 
[INFO] <<< maven-surefire-report-plugin:2.19.1:report (default-cli) < [surefire]test @ org.eclipse.capra.generic.persistence <<<
[INFO] 
[INFO] --- maven-surefire-report-plugin:2.19.1:report (default-cli) @ org.eclipse.capra.generic.persistence ---
[INFO] 
[INFO] --- tycho-packaging-plugin:0.24.0:build-qualifier (default-build-qualifier) @ org.eclipse.capra.generic.persistence ---
[INFO] The project's OSGi version is 0.7.0.201703241300
[INFO] 
[INFO] --- tycho-packaging-plugin:0.24.0:validate-id (default-validate-id) @ org.eclipse.capra.generic.persistence ---
[INFO] 
[INFO] --- tycho-packaging-plugin:0.24.0:validate-version (default-validate-version) @ org.eclipse.capra.generic.persistence ---
[INFO] 
[INFO] --- maven-resources-plugin:2.4.3:resources (default-resources) @ org.eclipse.capra.generic.persistence ---
[INFO] Using 'UTF-8' encoding to copy filtered resources.
[INFO] skip non existing resourceDirectory /jobs/genie.capra/build-src-develop-no-tests/workspace/org.eclipse.capra.generic.persistence/src/main/resources
[INFO] 
[INFO] --- tycho-compiler-plugin:0.24.0:compile (default-compile) @ org.eclipse.capra.generic.persistence ---
[INFO] Nothing to compile - all classes are up to date
[INFO] 
[INFO] --- maven-resources-plugin:2.4.3:testResources (default-testResources) @ org.eclipse.capra.generic.persistence ---
[INFO] Using 'UTF-8' encoding to copy filtered resources.
[INFO] skip non existing resourceDirectory /jobs/genie.capra/build-src-develop-no-tests/workspace/org.eclipse.capra.generic.persistence/src/test/resources
[INFO] 
[INFO] --- target-platform-configuration:0.24.0:target-platform (default-target-platform) @ org.eclipse.capra.generic.persistence ---
[INFO] 
[INFO] --- tycho-packaging-plugin:0.24.0:package-plugin (default-package-plugin) @ org.eclipse.capra.generic.persistence ---
[INFO] Building jar: /jobs/genie.capra/build-src-develop-no-tests/workspace/org.eclipse.capra.generic.persistence/target/org.eclipse.capra.generic.persistence-0.7.0-SNAPSHOT.jar
[INFO] 
[INFO] --- tycho-p2-plugin:0.24.0:p2-metadata-default (default-p2-metadata-default) @ org.eclipse.capra.generic.persistence ---
[INFO] 
[INFO] --- maven-install-plugin:2.3.1:install (default-install) @ org.eclipse.capra.generic.persistence ---
[INFO] Installing /jobs/genie.capra/build-src-develop-no-tests/workspace/org.eclipse.capra.generic.persistence/target/org.eclipse.capra.generic.persistence-0.7.0-SNAPSHOT.jar to /home/hudson/genie.capra/.hudson/jobs/build-src-develop-no-tests/workspace/.maven/repo/org/eclipse/capra/org.eclipse.capra.generic.persistence/0.7.0-SNAPSHOT/org.eclipse.capra.generic.persistence-0.7.0-SNAPSHOT.jar
[INFO] Installing /jobs/genie.capra/build-src-develop-no-tests/workspace/org.eclipse.capra.generic.persistence/pom.xml to /home/hudson/genie.capra/.hudson/jobs/build-src-develop-no-tests/workspace/.maven/repo/org/eclipse/capra/org.eclipse.capra.generic.persistence/0.7.0-SNAPSHOT/org.eclipse.capra.generic.persistence-0.7.0-SNAPSHOT.pom
[INFO] Installing /jobs/genie.capra/build-src-develop-no-tests/workspace/org.eclipse.capra.generic.persistence/target/p2content.xml to /home/hudson/genie.capra/.hudson/jobs/build-src-develop-no-tests/workspace/.maven/repo/org/eclipse/capra/org.eclipse.capra.generic.persistence/0.7.0-SNAPSHOT/org.eclipse.capra.generic.persistence-0.7.0-SNAPSHOT-p2metadata.xml
[INFO] Installing /jobs/genie.capra/build-src-develop-no-tests/workspace/org.eclipse.capra.generic.persistence/target/p2artifacts.xml to /home/hudson/genie.capra/.hudson/jobs/build-src-develop-no-tests/workspace/.maven/repo/org/eclipse/capra/org.eclipse.capra.generic.persistence/0.7.0-SNAPSHOT/org.eclipse.capra.generic.persistence-0.7.0-SNAPSHOT-p2artifacts.xml
[INFO] 
[INFO] --- tycho-p2-plugin:0.24.0:update-local-index (default-update-local-index) @ org.eclipse.capra.generic.persistence ---
[INFO]                                                                         
[INFO] ------------------------------------------------------------------------
[INFO] Building org.eclipse.capra.generic.priority 0.7.0-SNAPSHOT
[INFO] ------------------------------------------------------------------------
[INFO] 
[INFO] --- maven-clean-plugin:2.5:clean (default-clean) @ org.eclipse.capra.generic.priority ---
[INFO] Deleting /jobs/genie.capra/build-src-develop-no-tests/workspace/org.eclipse.capra.generic.priority/target
[INFO] 
[INFO] >>> maven-surefire-report-plugin:2.19.1:report (default-cli) > [surefire]test @ org.eclipse.capra.generic.priority >>>
[INFO] 
[INFO] --- tycho-packaging-plugin:0.24.0:build-qualifier (default-build-qualifier) @ org.eclipse.capra.generic.priority ---
[INFO] The project's OSGi version is 0.7.0.201703241300
[INFO] 
[INFO] --- tycho-packaging-plugin:0.24.0:validate-id (default-validate-id) @ org.eclipse.capra.generic.priority ---
[INFO] 
[INFO] --- tycho-packaging-plugin:0.24.0:validate-version (default-validate-version) @ org.eclipse.capra.generic.priority ---
[INFO] 
[INFO] --- maven-resources-plugin:2.4.3:resources (default-resources) @ org.eclipse.capra.generic.priority ---
[INFO] Using 'UTF-8' encoding to copy filtered resources.
[INFO] skip non existing resourceDirectory /jobs/genie.capra/build-src-develop-no-tests/workspace/org.eclipse.capra.generic.priority/src/main/resources
[INFO] 
[INFO] --- tycho-compiler-plugin:0.24.0:compile (default-compile) @ org.eclipse.capra.generic.priority ---
[INFO] Compiling 1 source file to /jobs/genie.capra/build-src-develop-no-tests/workspace/org.eclipse.capra.generic.priority/target/classes
[INFO] 
[INFO] --- maven-resources-plugin:2.4.3:testResources (default-testResources) @ org.eclipse.capra.generic.priority ---
[INFO] Using 'UTF-8' encoding to copy filtered resources.
[INFO] skip non existing resourceDirectory /jobs/genie.capra/build-src-develop-no-tests/workspace/org.eclipse.capra.generic.priority/src/test/resources
[INFO] 
[INFO] <<< maven-surefire-report-plugin:2.19.1:report (default-cli) < [surefire]test @ org.eclipse.capra.generic.priority <<<
[INFO] 
[INFO] --- maven-surefire-report-plugin:2.19.1:report (default-cli) @ org.eclipse.capra.generic.priority ---
[INFO] 
[INFO] --- tycho-packaging-plugin:0.24.0:build-qualifier (default-build-qualifier) @ org.eclipse.capra.generic.priority ---
[INFO] The project's OSGi version is 0.7.0.201703241300
[INFO] 
[INFO] --- tycho-packaging-plugin:0.24.0:validate-id (default-validate-id) @ org.eclipse.capra.generic.priority ---
[INFO] 
[INFO] --- tycho-packaging-plugin:0.24.0:validate-version (default-validate-version) @ org.eclipse.capra.generic.priority ---
[INFO] 
[INFO] --- maven-resources-plugin:2.4.3:resources (default-resources) @ org.eclipse.capra.generic.priority ---
[INFO] Using 'UTF-8' encoding to copy filtered resources.
[INFO] skip non existing resourceDirectory /jobs/genie.capra/build-src-develop-no-tests/workspace/org.eclipse.capra.generic.priority/src/main/resources
[INFO] 
[INFO] --- tycho-compiler-plugin:0.24.0:compile (default-compile) @ org.eclipse.capra.generic.priority ---
[INFO] Nothing to compile - all classes are up to date
[INFO] 
[INFO] --- maven-resources-plugin:2.4.3:testResources (default-testResources) @ org.eclipse.capra.generic.priority ---
[INFO] Using 'UTF-8' encoding to copy filtered resources.
[INFO] skip non existing resourceDirectory /jobs/genie.capra/build-src-develop-no-tests/workspace/org.eclipse.capra.generic.priority/src/test/resources
[INFO] 
[INFO] --- target-platform-configuration:0.24.0:target-platform (default-target-platform) @ org.eclipse.capra.generic.priority ---
[INFO] 
[INFO] --- tycho-packaging-plugin:0.24.0:package-plugin (default-package-plugin) @ org.eclipse.capra.generic.priority ---
[INFO] Building jar: /jobs/genie.capra/build-src-develop-no-tests/workspace/org.eclipse.capra.generic.priority/target/org.eclipse.capra.generic.priority-0.7.0-SNAPSHOT.jar
[INFO] 
[INFO] --- tycho-p2-plugin:0.24.0:p2-metadata-default (default-p2-metadata-default) @ org.eclipse.capra.generic.priority ---
[INFO] 
[INFO] --- maven-install-plugin:2.3.1:install (default-install) @ org.eclipse.capra.generic.priority ---
[INFO] Installing /jobs/genie.capra/build-src-develop-no-tests/workspace/org.eclipse.capra.generic.priority/target/org.eclipse.capra.generic.priority-0.7.0-SNAPSHOT.jar to /home/hudson/genie.capra/.hudson/jobs/build-src-develop-no-tests/workspace/.maven/repo/org/eclipse/capra/org.eclipse.capra.generic.priority/0.7.0-SNAPSHOT/org.eclipse.capra.generic.priority-0.7.0-SNAPSHOT.jar
[INFO] Installing /jobs/genie.capra/build-src-develop-no-tests/workspace/org.eclipse.capra.generic.priority/pom.xml to /home/hudson/genie.capra/.hudson/jobs/build-src-develop-no-tests/workspace/.maven/repo/org/eclipse/capra/org.eclipse.capra.generic.priority/0.7.0-SNAPSHOT/org.eclipse.capra.generic.priority-0.7.0-SNAPSHOT.pom
[INFO] Installing /jobs/genie.capra/build-src-develop-no-tests/workspace/org.eclipse.capra.generic.priority/target/p2content.xml to /home/hudson/genie.capra/.hudson/jobs/build-src-develop-no-tests/workspace/.maven/repo/org/eclipse/capra/org.eclipse.capra.generic.priority/0.7.0-SNAPSHOT/org.eclipse.capra.generic.priority-0.7.0-SNAPSHOT-p2metadata.xml
[INFO] Installing /jobs/genie.capra/build-src-develop-no-tests/workspace/org.eclipse.capra.generic.priority/target/p2artifacts.xml to /home/hudson/genie.capra/.hudson/jobs/build-src-develop-no-tests/workspace/.maven/repo/org/eclipse/capra/org.eclipse.capra.generic.priority/0.7.0-SNAPSHOT/org.eclipse.capra.generic.priority-0.7.0-SNAPSHOT-p2artifacts.xml
[INFO] 
[INFO] --- tycho-p2-plugin:0.24.0:update-local-index (default-update-local-index) @ org.eclipse.capra.generic.priority ---
[INFO]                                                                         
[INFO] ------------------------------------------------------------------------
[INFO] Building org.eclipse.capra.generic.tracemodels 0.7.0-SNAPSHOT
[INFO] ------------------------------------------------------------------------
[INFO] 
[INFO] --- maven-clean-plugin:2.5:clean (default-clean) @ org.eclipse.capra.generic.tracemodels ---
[INFO] Deleting /jobs/genie.capra/build-src-develop-no-tests/workspace/org.eclipse.capra.generic.tracemodels/target
[INFO] 
[INFO] >>> maven-surefire-report-plugin:2.19.1:report (default-cli) > [surefire]test @ org.eclipse.capra.generic.tracemodels >>>
[INFO] 
[INFO] --- tycho-packaging-plugin:0.24.0:build-qualifier (default-build-qualifier) @ org.eclipse.capra.generic.tracemodels ---
[INFO] The project's OSGi version is 0.7.0.201703241300
[INFO] 
[INFO] --- tycho-packaging-plugin:0.24.0:validate-id (default-validate-id) @ org.eclipse.capra.generic.tracemodels ---
[INFO] 
[INFO] --- tycho-packaging-plugin:0.24.0:validate-version (default-validate-version) @ org.eclipse.capra.generic.tracemodels ---
[INFO] 
[INFO] --- maven-resources-plugin:2.4.3:resources (default-resources) @ org.eclipse.capra.generic.tracemodels ---
[INFO] Using 'UTF-8' encoding to copy filtered resources.
[INFO] skip non existing resourceDirectory /jobs/genie.capra/build-src-develop-no-tests/workspace/org.eclipse.capra.generic.tracemodels/src/main/resources
[INFO] 
[INFO] --- tycho-compiler-plugin:0.24.0:compile (default-compile) @ org.eclipse.capra.generic.tracemodels ---
[INFO] Compiling 22 source files to /jobs/genie.capra/build-src-develop-no-tests/workspace/org.eclipse.capra.generic.tracemodels/target/classes
[INFO] 
[INFO] --- maven-resources-plugin:2.4.3:testResources (default-testResources) @ org.eclipse.capra.generic.tracemodels ---
[INFO] Using 'UTF-8' encoding to copy filtered resources.
[INFO] skip non existing resourceDirectory /jobs/genie.capra/build-src-develop-no-tests/workspace/org.eclipse.capra.generic.tracemodels/src/test/resources
[INFO] 
[INFO] <<< maven-surefire-report-plugin:2.19.1:report (default-cli) < [surefire]test @ org.eclipse.capra.generic.tracemodels <<<
[INFO] 
[INFO] --- maven-surefire-report-plugin:2.19.1:report (default-cli) @ org.eclipse.capra.generic.tracemodels ---
[INFO] 
[INFO] --- tycho-packaging-plugin:0.24.0:build-qualifier (default-build-qualifier) @ org.eclipse.capra.generic.tracemodels ---
[INFO] The project's OSGi version is 0.7.0.201703241300
[INFO] 
[INFO] --- tycho-packaging-plugin:0.24.0:validate-id (default-validate-id) @ org.eclipse.capra.generic.tracemodels ---
[INFO] 
[INFO] --- tycho-packaging-plugin:0.24.0:validate-version (default-validate-version) @ org.eclipse.capra.generic.tracemodels ---
[INFO] 
[INFO] --- maven-resources-plugin:2.4.3:resources (default-resources) @ org.eclipse.capra.generic.tracemodels ---
[INFO] Using 'UTF-8' encoding to copy filtered resources.
[INFO] skip non existing resourceDirectory /jobs/genie.capra/build-src-develop-no-tests/workspace/org.eclipse.capra.generic.tracemodels/src/main/resources
[INFO] 
[INFO] --- tycho-compiler-plugin:0.24.0:compile (default-compile) @ org.eclipse.capra.generic.tracemodels ---
[INFO] Nothing to compile - all classes are up to date
[INFO] 
[INFO] --- maven-resources-plugin:2.4.3:testResources (default-testResources) @ org.eclipse.capra.generic.tracemodels ---
[INFO] Using 'UTF-8' encoding to copy filtered resources.
[INFO] skip non existing resourceDirectory /jobs/genie.capra/build-src-develop-no-tests/workspace/org.eclipse.capra.generic.tracemodels/src/test/resources
[INFO] 
[INFO] --- target-platform-configuration:0.24.0:target-platform (default-target-platform) @ org.eclipse.capra.generic.tracemodels ---
[INFO] 
[INFO] --- tycho-packaging-plugin:0.24.0:package-plugin (default-package-plugin) @ org.eclipse.capra.generic.tracemodels ---
[INFO] Building jar: /jobs/genie.capra/build-src-develop-no-tests/workspace/org.eclipse.capra.generic.tracemodels/target/org.eclipse.capra.generic.tracemodels-0.7.0-SNAPSHOT.jar
[INFO] 
[INFO] --- tycho-p2-plugin:0.24.0:p2-metadata-default (default-p2-metadata-default) @ org.eclipse.capra.generic.tracemodels ---
[INFO] 
[INFO] --- maven-install-plugin:2.3.1:install (default-install) @ org.eclipse.capra.generic.tracemodels ---
[INFO] Installing /jobs/genie.capra/build-src-develop-no-tests/workspace/org.eclipse.capra.generic.tracemodels/target/org.eclipse.capra.generic.tracemodels-0.7.0-SNAPSHOT.jar to /home/hudson/genie.capra/.hudson/jobs/build-src-develop-no-tests/workspace/.maven/repo/org/eclipse/capra/org.eclipse.capra.generic.tracemodels/0.7.0-SNAPSHOT/org.eclipse.capra.generic.tracemodels-0.7.0-SNAPSHOT.jar
[INFO] Installing /jobs/genie.capra/build-src-develop-no-tests/workspace/org.eclipse.capra.generic.tracemodels/pom.xml to /home/hudson/genie.capra/.hudson/jobs/build-src-develop-no-tests/workspace/.maven/repo/org/eclipse/capra/org.eclipse.capra.generic.tracemodels/0.7.0-SNAPSHOT/org.eclipse.capra.generic.tracemodels-0.7.0-SNAPSHOT.pom
[INFO] Installing /jobs/genie.capra/build-src-develop-no-tests/workspace/org.eclipse.capra.generic.tracemodels/target/p2content.xml to /home/hudson/genie.capra/.hudson/jobs/build-src-develop-no-tests/workspace/.maven/repo/org/eclipse/capra/org.eclipse.capra.generic.tracemodels/0.7.0-SNAPSHOT/org.eclipse.capra.generic.tracemodels-0.7.0-SNAPSHOT-p2metadata.xml
[INFO] Installing /jobs/genie.capra/build-src-develop-no-tests/workspace/org.eclipse.capra.generic.tracemodels/target/p2artifacts.xml to /home/hudson/genie.capra/.hudson/jobs/build-src-develop-no-tests/workspace/.maven/repo/org/eclipse/capra/org.eclipse.capra.generic.tracemodels/0.7.0-SNAPSHOT/org.eclipse.capra.generic.tracemodels-0.7.0-SNAPSHOT-p2artifacts.xml
[INFO] 
[INFO] --- tycho-p2-plugin:0.24.0:update-local-index (default-update-local-index) @ org.eclipse.capra.generic.tracemodels ---
[INFO]                                                                         
[INFO] ------------------------------------------------------------------------
[INFO] Building org.eclipse.capra.generic.feature 0.7.0-SNAPSHOT
[INFO] ------------------------------------------------------------------------
[INFO] 
[INFO] --- maven-clean-plugin:2.5:clean (default-clean) @ org.eclipse.capra.generic.feature ---
[INFO] 
[INFO] >>> maven-surefire-report-plugin:2.19.1:report (default-cli) > [surefire]test @ org.eclipse.capra.generic.feature >>>
[INFO] 
[INFO] --- tycho-packaging-plugin:0.24.0:build-qualifier-aggregator (default-build-qualifier-aggregator) @ org.eclipse.capra.generic.feature ---
[INFO] The project's OSGi version is 0.7.0.201703241300
[INFO] 
[INFO] --- tycho-packaging-plugin:0.24.0:validate-id (default-validate-id) @ org.eclipse.capra.generic.feature ---
[INFO] 
[INFO] --- tycho-packaging-plugin:0.24.0:validate-version (default-validate-version) @ org.eclipse.capra.generic.feature ---
[INFO] 
[INFO] <<< maven-surefire-report-plugin:2.19.1:report (default-cli) < [surefire]test @ org.eclipse.capra.generic.feature <<<
[INFO] 
[INFO] --- maven-surefire-report-plugin:2.19.1:report (default-cli) @ org.eclipse.capra.generic.feature ---
[INFO] 
[INFO] --- tycho-packaging-plugin:0.24.0:build-qualifier-aggregator (default-build-qualifier-aggregator) @ org.eclipse.capra.generic.feature ---
[INFO] The project's OSGi version is 0.7.0.201703241300
[INFO] 
[INFO] --- tycho-packaging-plugin:0.24.0:validate-id (default-validate-id) @ org.eclipse.capra.generic.feature ---
[INFO] 
[INFO] --- tycho-packaging-plugin:0.24.0:validate-version (default-validate-version) @ org.eclipse.capra.generic.feature ---
[INFO] 
[INFO] --- target-platform-configuration:0.24.0:target-platform (default-target-platform) @ org.eclipse.capra.generic.feature ---
[INFO] 
[INFO] --- tycho-packaging-plugin:0.24.0:package-feature (default-package-feature) @ org.eclipse.capra.generic.feature ---
[INFO] Building jar: /jobs/genie.capra/build-src-develop-no-tests/workspace/org.eclipse.capra.generic.feature/target/org.eclipse.capra.generic.feature-0.7.0-SNAPSHOT.jar
[INFO] 
[INFO] --- tycho-p2-plugin:0.24.0:p2-metadata-default (default-p2-metadata-default) @ org.eclipse.capra.generic.feature ---
[INFO] 
[INFO] --- tycho-p2-plugin:0.24.0:feature-p2-metadata (default-feature-p2-metadata) @ org.eclipse.capra.generic.feature ---
[INFO] 
[INFO] --- maven-install-plugin:2.3.1:install (default-install) @ org.eclipse.capra.generic.feature ---
[INFO] Installing /jobs/genie.capra/build-src-develop-no-tests/workspace/org.eclipse.capra.generic.feature/target/org.eclipse.capra.generic.feature-0.7.0-SNAPSHOT.jar to /home/hudson/genie.capra/.hudson/jobs/build-src-develop-no-tests/workspace/.maven/repo/org/eclipse/capra/org.eclipse.capra.generic.feature/0.7.0-SNAPSHOT/org.eclipse.capra.generic.feature-0.7.0-SNAPSHOT.jar
[INFO] Installing /jobs/genie.capra/build-src-develop-no-tests/workspace/org.eclipse.capra.generic.feature/pom.xml to /home/hudson/genie.capra/.hudson/jobs/build-src-develop-no-tests/workspace/.maven/repo/org/eclipse/capra/org.eclipse.capra.generic.feature/0.7.0-SNAPSHOT/org.eclipse.capra.generic.feature-0.7.0-SNAPSHOT.pom
[INFO] Installing /jobs/genie.capra/build-src-develop-no-tests/workspace/org.eclipse.capra.generic.feature/target/p2content.xml to /home/hudson/genie.capra/.hudson/jobs/build-src-develop-no-tests/workspace/.maven/repo/org/eclipse/capra/org.eclipse.capra.generic.feature/0.7.0-SNAPSHOT/org.eclipse.capra.generic.feature-0.7.0-SNAPSHOT-p2metadata.xml
[INFO] Installing /jobs/genie.capra/build-src-develop-no-tests/workspace/org.eclipse.capra.generic.feature/target/p2artifacts.xml to /home/hudson/genie.capra/.hudson/jobs/build-src-develop-no-tests/workspace/.maven/repo/org/eclipse/capra/org.eclipse.capra.generic.feature/0.7.0-SNAPSHOT/org.eclipse.capra.generic.feature-0.7.0-SNAPSHOT-p2artifacts.xml
[INFO] 
[INFO] --- tycho-p2-plugin:0.24.0:update-local-index (default-update-local-index) @ org.eclipse.capra.generic.feature ---
[INFO]                                                                         
[INFO] ------------------------------------------------------------------------
[INFO] Building org.eclipse.capra.handler.cdt 0.7.0-SNAPSHOT
[INFO] ------------------------------------------------------------------------
[INFO] 
[INFO] --- maven-clean-plugin:2.5:clean (default-clean) @ org.eclipse.capra.handler.cdt ---
[INFO] Deleting /jobs/genie.capra/build-src-develop-no-tests/workspace/org.eclipse.capra.handler.cdt/target
[INFO] 
[INFO] >>> maven-surefire-report-plugin:2.19.1:report (default-cli) > [surefire]test @ org.eclipse.capra.handler.cdt >>>
[INFO] 
[INFO] --- tycho-packaging-plugin:0.24.0:build-qualifier (default-build-qualifier) @ org.eclipse.capra.handler.cdt ---
[INFO] The project's OSGi version is 0.7.0.201703241300
[INFO] 
[INFO] --- tycho-packaging-plugin:0.24.0:validate-id (default-validate-id) @ org.eclipse.capra.handler.cdt ---
[INFO] 
[INFO] --- tycho-packaging-plugin:0.24.0:validate-version (default-validate-version) @ org.eclipse.capra.handler.cdt ---
[INFO] 
[INFO] --- maven-resources-plugin:2.4.3:resources (default-resources) @ org.eclipse.capra.handler.cdt ---
[INFO] Using 'UTF-8' encoding to copy filtered resources.
[INFO] skip non existing resourceDirectory /jobs/genie.capra/build-src-develop-no-tests/workspace/org.eclipse.capra.handler.cdt/src/main/resources
[INFO] 
[INFO] --- tycho-compiler-plugin:0.24.0:compile (default-compile) @ org.eclipse.capra.handler.cdt ---
[INFO] Compiling 4 source files to /jobs/genie.capra/build-src-develop-no-tests/workspace/org.eclipse.capra.handler.cdt/target/classes
[INFO] 
[INFO] --- maven-resources-plugin:2.4.3:testResources (default-testResources) @ org.eclipse.capra.handler.cdt ---
[INFO] Using 'UTF-8' encoding to copy filtered resources.
[INFO] skip non existing resourceDirectory /jobs/genie.capra/build-src-develop-no-tests/workspace/org.eclipse.capra.handler.cdt/src/test/resources
[INFO] 
[INFO] <<< maven-surefire-report-plugin:2.19.1:report (default-cli) < [surefire]test @ org.eclipse.capra.handler.cdt <<<
[INFO] 
[INFO] --- maven-surefire-report-plugin:2.19.1:report (default-cli) @ org.eclipse.capra.handler.cdt ---
[INFO] 
[INFO] --- tycho-packaging-plugin:0.24.0:build-qualifier (default-build-qualifier) @ org.eclipse.capra.handler.cdt ---
[INFO] The project's OSGi version is 0.7.0.201703241300
[INFO] 
[INFO] --- tycho-packaging-plugin:0.24.0:validate-id (default-validate-id) @ org.eclipse.capra.handler.cdt ---
[INFO] 
[INFO] --- tycho-packaging-plugin:0.24.0:validate-version (default-validate-version) @ org.eclipse.capra.handler.cdt ---
[INFO] 
[INFO] --- maven-resources-plugin:2.4.3:resources (default-resources) @ org.eclipse.capra.handler.cdt ---
[INFO] Using 'UTF-8' encoding to copy filtered resources.
[INFO] skip non existing resourceDirectory /jobs/genie.capra/build-src-develop-no-tests/workspace/org.eclipse.capra.handler.cdt/src/main/resources
[INFO] 
[INFO] --- tycho-compiler-plugin:0.24.0:compile (default-compile) @ org.eclipse.capra.handler.cdt ---
[INFO] Nothing to compile - all classes are up to date
[INFO] 
[INFO] --- maven-resources-plugin:2.4.3:testResources (default-testResources) @ org.eclipse.capra.handler.cdt ---
[INFO] Using 'UTF-8' encoding to copy filtered resources.
[INFO] skip non existing resourceDirectory /jobs/genie.capra/build-src-develop-no-tests/workspace/org.eclipse.capra.handler.cdt/src/test/resources
[INFO] 
[INFO] --- target-platform-configuration:0.24.0:target-platform (default-target-platform) @ org.eclipse.capra.handler.cdt ---
[INFO] 
[INFO] --- tycho-packaging-plugin:0.24.0:package-plugin (default-package-plugin) @ org.eclipse.capra.handler.cdt ---
[INFO] Building jar: /jobs/genie.capra/build-src-develop-no-tests/workspace/org.eclipse.capra.handler.cdt/target/org.eclipse.capra.handler.cdt-0.7.0-SNAPSHOT.jar
[INFO] 
[INFO] --- tycho-p2-plugin:0.24.0:p2-metadata-default (default-p2-metadata-default) @ org.eclipse.capra.handler.cdt ---
[INFO] 
[INFO] --- maven-install-plugin:2.3.1:install (default-install) @ org.eclipse.capra.handler.cdt ---
[INFO] Installing /jobs/genie.capra/build-src-develop-no-tests/workspace/org.eclipse.capra.handler.cdt/target/org.eclipse.capra.handler.cdt-0.7.0-SNAPSHOT.jar to /home/hudson/genie.capra/.hudson/jobs/build-src-develop-no-tests/workspace/.maven/repo/org/eclipse/capra/org.eclipse.capra.handler.cdt/0.7.0-SNAPSHOT/org.eclipse.capra.handler.cdt-0.7.0-SNAPSHOT.jar
[INFO] Installing /jobs/genie.capra/build-src-develop-no-tests/workspace/org.eclipse.capra.handler.cdt/pom.xml to /home/hudson/genie.capra/.hudson/jobs/build-src-develop-no-tests/workspace/.maven/repo/org/eclipse/capra/org.eclipse.capra.handler.cdt/0.7.0-SNAPSHOT/org.eclipse.capra.handler.cdt-0.7.0-SNAPSHOT.pom
[INFO] Installing /jobs/genie.capra/build-src-develop-no-tests/workspace/org.eclipse.capra.handler.cdt/target/p2content.xml to /home/hudson/genie.capra/.hudson/jobs/build-src-develop-no-tests/workspace/.maven/repo/org/eclipse/capra/org.eclipse.capra.handler.cdt/0.7.0-SNAPSHOT/org.eclipse.capra.handler.cdt-0.7.0-SNAPSHOT-p2metadata.xml
[INFO] Installing /jobs/genie.capra/build-src-develop-no-tests/workspace/org.eclipse.capra.handler.cdt/target/p2artifacts.xml to /home/hudson/genie.capra/.hudson/jobs/build-src-develop-no-tests/workspace/.maven/repo/org/eclipse/capra/org.eclipse.capra.handler.cdt/0.7.0-SNAPSHOT/org.eclipse.capra.handler.cdt-0.7.0-SNAPSHOT-p2artifacts.xml
[INFO] 
[INFO] --- tycho-p2-plugin:0.24.0:update-local-index (default-update-local-index) @ org.eclipse.capra.handler.cdt ---
[INFO]                                                                         
[INFO] ------------------------------------------------------------------------
[INFO] Building org.eclipse.capra.handler.cdt.tests 0.7.0-SNAPSHOT
[INFO] ------------------------------------------------------------------------
[INFO] 
[INFO] --- maven-clean-plugin:2.5:clean (default-clean) @ org.eclipse.capra.handler.cdt.tests ---
[INFO] 
[INFO] >>> maven-surefire-report-plugin:2.19.1:report (default-cli) > [surefire]test @ org.eclipse.capra.handler.cdt.tests >>>
[INFO] 
[INFO] --- tycho-packaging-plugin:0.24.0:build-qualifier (default-build-qualifier) @ org.eclipse.capra.handler.cdt.tests ---
[INFO] The project's OSGi version is 0.7.0.201703241300
[INFO] 
[INFO] --- tycho-packaging-plugin:0.24.0:validate-id (default-validate-id) @ org.eclipse.capra.handler.cdt.tests ---
[INFO] 
[INFO] --- tycho-packaging-plugin:0.24.0:validate-version (default-validate-version) @ org.eclipse.capra.handler.cdt.tests ---
[INFO] 
[INFO] --- maven-resources-plugin:2.4.3:resources (default-resources) @ org.eclipse.capra.handler.cdt.tests ---
[INFO] Using 'UTF-8' encoding to copy filtered resources.
[INFO] skip non existing resourceDirectory /jobs/genie.capra/build-src-develop-no-tests/workspace/org.eclipse.capra.handler.cdt.tests/src/main/resources
[INFO] 
[INFO] --- tycho-compiler-plugin:0.24.0:compile (default-compile) @ org.eclipse.capra.handler.cdt.tests ---
[INFO] Compiling 2 source files to /jobs/genie.capra/build-src-develop-no-tests/workspace/org.eclipse.capra.handler.cdt.tests/target/classes
[INFO] 
[INFO] --- maven-resources-plugin:2.4.3:testResources (default-testResources) @ org.eclipse.capra.handler.cdt.tests ---
[INFO] Using 'UTF-8' encoding to copy filtered resources.
[INFO] skip non existing resourceDirectory /jobs/genie.capra/build-src-develop-no-tests/workspace/org.eclipse.capra.handler.cdt.tests/src/test/resources
[INFO] 
[INFO] <<< maven-surefire-report-plugin:2.19.1:report (default-cli) < [surefire]test @ org.eclipse.capra.handler.cdt.tests <<<
[INFO] 
[INFO] --- maven-surefire-report-plugin:2.19.1:report (default-cli) @ org.eclipse.capra.handler.cdt.tests ---
[INFO] 
[INFO] --- tycho-packaging-plugin:0.24.0:build-qualifier (default-build-qualifier) @ org.eclipse.capra.handler.cdt.tests ---
[INFO] The project's OSGi version is 0.7.0.201703241300
[INFO] 
[INFO] --- tycho-packaging-plugin:0.24.0:validate-id (default-validate-id) @ org.eclipse.capra.handler.cdt.tests ---
[INFO] 
[INFO] --- tycho-packaging-plugin:0.24.0:validate-version (default-validate-version) @ org.eclipse.capra.handler.cdt.tests ---
[INFO] 
[INFO] --- maven-resources-plugin:2.4.3:resources (default-resources) @ org.eclipse.capra.handler.cdt.tests ---
[INFO] Using 'UTF-8' encoding to copy filtered resources.
[INFO] skip non existing resourceDirectory /jobs/genie.capra/build-src-develop-no-tests/workspace/org.eclipse.capra.handler.cdt.tests/src/main/resources
[INFO] 
[INFO] --- tycho-compiler-plugin:0.24.0:compile (default-compile) @ org.eclipse.capra.handler.cdt.tests ---
[INFO] Nothing to compile - all classes are up to date
[INFO] 
[INFO] --- maven-resources-plugin:2.4.3:testResources (default-testResources) @ org.eclipse.capra.handler.cdt.tests ---
[INFO] Using 'UTF-8' encoding to copy filtered resources.
[INFO] skip non existing resourceDirectory /jobs/genie.capra/build-src-develop-no-tests/workspace/org.eclipse.capra.handler.cdt.tests/src/test/resources
[INFO] 
[INFO] --- target-platform-configuration:0.24.0:target-platform (default-target-platform) @ org.eclipse.capra.handler.cdt.tests ---
[INFO] 
[INFO] --- tycho-packaging-plugin:0.24.0:package-plugin (default-package-plugin) @ org.eclipse.capra.handler.cdt.tests ---
[INFO] Building jar: /jobs/genie.capra/build-src-develop-no-tests/workspace/org.eclipse.capra.handler.cdt.tests/target/org.eclipse.capra.handler.cdt.tests-0.7.0-SNAPSHOT.jar
[INFO] 
[INFO] --- tycho-p2-plugin:0.24.0:p2-metadata-default (default-p2-metadata-default) @ org.eclipse.capra.handler.cdt.tests ---
[INFO] 
[INFO] --- tycho-surefire-plugin:0.24.0:test (default-test) @ org.eclipse.capra.handler.cdt.tests ---
[INFO] Fetching org.eclipse.equinox.event_1.3.200.v20160324-1850.jar.pack.gz from http://download.eclipse.org/releases/neon/201703231000/plugins/ (0B of 16.25kB at 0B/s)
[INFO] Expected eclipse log file: /jobs/genie.capra/build-src-develop-no-tests/workspace/org.eclipse.capra.handler.cdt.tests/target/work/data/.metadata/.log
[INFO] Command line:
	[/opt/public/common/jdk1.8.0_121.x64/jre/bin/java, -Dosgi.noShutdown=false, -Dosgi.os=linux, -Dosgi.ws=gtk, -Dosgi.arch=x86_64, -Dosgi.clean=true, -jar, /jobs/genie.capra/build-src-develop-no-tests/workspace/.maven/repo/p2/osgi/bundle/org.eclipse.equinox.launcher/1.3.201.v20161025-1711/org.eclipse.equinox.launcher-1.3.201.v20161025-1711.jar, -data, /jobs/genie.capra/build-src-develop-no-tests/workspace/org.eclipse.capra.handler.cdt.tests/target/work/data, -install, /jobs/genie.capra/build-src-develop-no-tests/workspace/org.eclipse.capra.handler.cdt.tests/target/work, -configuration, /jobs/genie.capra/build-src-develop-no-tests/workspace/org.eclipse.capra.handler.cdt.tests/target/work/configuration, -application, org.eclipse.tycho.surefire.osgibooter.uitest, -testproperties, /jobs/genie.capra/build-src-develop-no-tests/workspace/org.eclipse.capra.handler.cdt.tests/target/surefire.properties]
Unable to init server: Could not connect: Connection refused
An error has occurred. See the log file
/jobs/genie.capra/build-src-develop-no-tests/workspace/org.eclipse.capra.handler.cdt.tests/target/work/data/.metadata/.log.
[INFO] ------------------------------------------------------------------------
[INFO] Reactor Summary:
[INFO] 
[INFO] Capra .............................................. SUCCESS [  9.023 s]
[INFO] org.eclipse.capra.core ............................. SUCCESS [  8.469 s]
[INFO] org.eclipse.capra.handler.emf ...................... SUCCESS [  0.370 s]
[INFO] org.eclipse.capra.handler.file ..................... SUCCESS [  0.313 s]
[INFO] org.eclipse.capra.ui ............................... SUCCESS [  0.646 s]
[INFO] org.eclipse.capra.handler.gef ...................... SUCCESS [  0.731 s]
[INFO] org.eclipse.capra.handler.hudson ................... SUCCESS [  0.442 s]
[INFO] org.eclipse.capra.handler.mylyn .................... SUCCESS [  0.540 s]
[INFO] org.eclipse.capra.core.feature ..................... SUCCESS [  0.371 s]
[INFO] org.eclipse.capra.documentation .................... SUCCESS [  1.142 s]
[INFO] org.eclipse.capra.generic.persistence .............. SUCCESS [  0.426 s]
[INFO] org.eclipse.capra.generic.priority ................. SUCCESS [  0.593 s]
[INFO] org.eclipse.capra.generic.tracemodels .............. SUCCESS [  0.758 s]
[INFO] org.eclipse.capra.generic.feature .................. SUCCESS [  0.298 s]
[INFO] org.eclipse.capra.handler.cdt ...................... SUCCESS [  0.441 s]
[INFO] org.eclipse.capra.handler.cdt.tests ................ FAILURE [  3.424 s]
[INFO] org.eclipse.capra.ui.cdt ........................... SKIPPED
[INFO] org.eclipse.capra.handler.cdt.feature .............. SKIPPED
[INFO] org.eclipse.capra.handler.jdt ...................... SKIPPED
[INFO] org.eclipse.capra.handler.hudson.feature ........... SKIPPED
[INFO] org.eclipse.capra.ui.office ........................ SKIPPED
[INFO] org.eclipse.capra.handler.office ................... SKIPPED
[INFO] org.eclipse.capra.ui.notification .................. SKIPPED
[INFO] org.eclipse.capra.ui.feature ....................... SKIPPED
[INFO] org.eclipse.capra.feature .......................... SKIPPED
[INFO] org.eclipse.capra.handler.office.feature ........... SKIPPED
[INFO] org.eclipse.capra.handler.jdt.tests ................ SKIPPED
[INFO] org.eclipse.capra.ui.jdt ........................... SKIPPED
[INFO] org.eclipse.capra.handler.jdt.feature .............. SKIPPED
[INFO] org.eclipse.capra.handler.reqIf .................... SKIPPED
[INFO] org.eclipse.capra.handler.reqif.feature ............ SKIPPED
[INFO] org.eclipse.capra.handler.papyrus .................. SKIPPED
[INFO] org.eclipse.capra.handler.papyrus.feature .......... SKIPPED
[INFO] org.eclipse.capra.handler.php ...................... SKIPPED
[INFO] org.eclipse.capra.handler.php.feature .............. SKIPPED
[INFO] org.eclipse.capra.ui.plantuml ...................... SKIPPED
[INFO] org.eclipse.capra.ui.plantuml.feature .............. SKIPPED
[INFO] org.eclipse.capra.ui.zest .......................... SKIPPED
[INFO] org.eclipse.capra.ui.zest.feature .................. SKIPPED
[INFO] Capra .............................................. SKIPPED
[INFO] Capra update site .................................. SKIPPED
[INFO] org.eclipse.capra.testsuite ........................ SKIPPED
[INFO] ------------------------------------------------------------------------
[INFO] BUILD FAILURE
[INFO] ------------------------------------------------------------------------
[INFO] Total time: 06:40 min
[INFO] Finished at: 2017-03-24T09:00:35-04:00
[INFO] Final Memory: 376M/12168M
[INFO] ------------------------------------------------------------------------
[INFO] o.h.m.e.h.MavenExecutionResultHandler - Build failed with exception(s)
[INFO] o.h.m.e.h.MavenExecutionResultHandler - [1] org.apache.maven.lifecycle.LifecycleExecutionException: Failed to execute goal org.eclipse.tycho:tycho-surefire-plugin:0.24.0:test (default-test) on project org.eclipse.capra.handler.cdt.tests: An unexpected error occured while launching the test runtime (return code 13). See log for details.
[DEBUG] Closing connection to remote
[ERROR] Failed to execute goal org.eclipse.tycho:tycho-surefire-plugin:0.24.0:test (default-test) on project org.eclipse.capra.handler.cdt.tests: An unexpected error occured while launching the test runtime (return code 13). See log for details. -> [Help 1]
org.apache.maven.lifecycle.LifecycleExecutionException: Failed to execute goal org.eclipse.tycho:tycho-surefire-plugin:0.24.0:test (default-test) on project org.eclipse.capra.handler.cdt.tests: An unexpected error occured while launching the test runtime (return code 13). See log for details.
	at org.apache.maven.lifecycle.internal.MojoExecutor.execute(MojoExecutor.java:212)
	at org.apache.maven.lifecycle.internal.MojoExecutor.execute(MojoExecutor.java:153)
	at org.apache.maven.lifecycle.internal.MojoExecutor.execute(MojoExecutor.java:145)
	at org.apache.maven.lifecycle.internal.LifecycleModuleBuilder.buildProject(LifecycleModuleBuilder.java:116)
	at org.apache.maven.lifecycle.internal.LifecycleModuleBuilder.buildProject(LifecycleModuleBuilder.java:80)
	at org.apache.maven.lifecycle.internal.builder.singlethreaded.SingleThreadedBuilder.build(SingleThreadedBuilder.java:51)
	at org.apache.maven.lifecycle.internal.LifecycleStarter.execute(LifecycleStarter.java:128)
	at org.apache.maven.DefaultMaven.doExecute(DefaultMaven.java:307)
	at org.apache.maven.DefaultMaven.doExecute(DefaultMaven.java:193)
	at org.apache.maven.DefaultMaven.execute(DefaultMaven.java:106)
	at org.apache.maven.cli.MavenCli.execute(MavenCli.java:863)
	at org.apache.maven.cli.MavenCli.doMain(MavenCli.java:288)
	at org.apache.maven.cli.MavenCli.main(MavenCli.java:199)
	at sun.reflect.NativeMethodAccessorImpl.invoke0(Native Method)
	at sun.reflect.NativeMethodAccessorImpl.invoke(NativeMethodAccessorImpl.java:62)
	at sun.reflect.DelegatingMethodAccessorImpl.invoke(DelegatingMethodAccessorImpl.java:43)
	at java.lang.reflect.Method.invoke(Method.java:498)
	at org.codehaus.plexus.classworlds.launcher.Launcher.launchEnhanced(Launcher.java:289)
	at org.codehaus.plexus.classworlds.launcher.Launcher.launch(Launcher.java:229)
	at org.codehaus.plexus.classworlds.launcher.Launcher.mainWithExitCode(Launcher.java:415)
	at org.codehaus.plexus.classworlds.launcher.Launcher.main(Launcher.java:356)
Caused by: org.apache.maven.plugin.MojoFailureException: An unexpected error occured while launching the test runtime (return code 13). See log for details.
	at org.eclipse.tycho.surefire.TestMojo.runTest(TestMojo.java:958)
	at org.eclipse.tycho.surefire.TestMojo.execute(TestMojo.java:630)
	at org.apache.maven.plugin.DefaultBuildPluginManager.executeMojo(DefaultBuildPluginManager.java:134)
	at org.apache.maven.lifecycle.internal.MojoExecutor.execute(MojoExecutor.java:207)
	... 20 more
[ERROR] 
[ERROR] Re-run Maven using the -X switch to enable full debug logging.
[ERROR] 
[ERROR] For more information about the errors and possible solutions, please read the following articles:
[ERROR] [Help 1] http://cwiki.apache.org/confluence/display/MAVEN/MojoFailureException
[ERROR] 
[ERROR] After correcting the problems, you can resume the build with the command
[ERROR]   mvn <goals> -rf :org.eclipse.capra.handler.cdt.tests
[DEBUG] Waiting for process to finish
[DEBUG] Result: 1
Archiving artifacts
Finished: FAILURE