Skip to content
Unstable

Console Output

Skipping 3,410 KB.. Full Log
org.eclipse.jst.jsp.tests.encoding.jsp.TestContentTypeDetectionForJSP.testFile106 -- Time elapsed: 0.002 s
04:37:03 org.eclipse.jst.jsp.tests.encoding.jsp.TestContentTypeDetectionForJSP.testFile65 -- Time elapsed: 0.001 s
04:37:03 org.eclipse.jst.jsp.tests.encoding.jsp.TestContentTypeDetectionForJSP.testFile66 -- Time elapsed: 0.001 s
04:37:03 org.eclipse.jst.jsp.tests.encoding.jsp.TestContentTypeDetectionForJSP.testFile67 -- Time elapsed: 0.009 s
04:37:03 org.eclipse.jst.jsp.tests.encoding.jsp.TestContentTypeDetectionForJSP.testFile68 -- Time elapsed: 0.001 s
04:37:03 org.eclipse.jst.jsp.tests.encoding.jsp.TestContentTypeDetectionForJSP.testFile69 -- Time elapsed: 0.001 s
04:37:03 org.eclipse.jst.jsp.tests.encoding.jsp.TestContentTypeDetectionForJSP.testFile70 -- Time elapsed: 0.001 s
04:37:03 org.eclipse.jst.jsp.tests.encoding.jsp.TestContentTypeDetectionForJSP.testFile71 -- Time elapsed: 0.001 s
04:37:03 org.eclipse.jst.jsp.tests.encoding.jsp.TestContentTypeDetectionForJSP.testFile72 -- Time elapsed: 0.001 s
04:37:03 org.eclipse.jst.jsp.tests.encoding.jsp.TestContentTypeDetectionForJSP.testFile73 -- Time elapsed: 0.001 s
04:37:03 org.eclipse.jst.jsp.tests.encoding.jsp.TestContentTypeDetectionForJSP.testFile74 -- Time elapsed: 0.001 s
04:37:03 org.eclipse.jst.jsp.tests.encoding.jsp.TestContentTypeDetectionForJSP.testFile75 -- Time elapsed: 0.001 s
04:37:03 org.eclipse.jst.jsp.tests.encoding.jsp.TestContentTypeDetectionForJSP.testFile76 -- Time elapsed: 0.001 s
04:37:03 org.eclipse.jst.jsp.tests.encoding.jsp.TestContentTypeDetectionForJSP.testFile77 -- Time elapsed: 0.001 s
04:37:03 org.eclipse.jst.jsp.tests.encoding.jsp.TestContentTypeDetectionForJSP.testFile78 -- Time elapsed: 0.001 s
04:37:03 org.eclipse.jst.jsp.tests.encoding.jsp.TestContentTypeDetectionForJSP.testFile79 -- Time elapsed: 0.001 s
04:37:03 org.eclipse.jst.jsp.tests.encoding.jsp.TestContentTypeDetectionForJSP.testFile80 -- Time elapsed: 0.003 s
04:37:03 org.eclipse.jst.jsp.tests.encoding.jsp.TestContentTypeDetectionForJSP.testFile81 -- Time elapsed: 0 s
04:37:03 org.eclipse.jst.jsp.tests.encoding.jsp.TestContentTypeDetectionForJSP.testFile82 -- Time elapsed: 0.003 s
04:37:03 org.eclipse.jst.jsp.tests.encoding.jsp.TestContentTypeDetectionForJSP.testFile83 -- Time elapsed: 0.003 s
04:37:03 org.eclipse.jst.jsp.tests.encoding.jsp.TestContentTypeDetectionForJSP.testFile84 -- Time elapsed: 0 s
04:37:03 org.eclipse.jst.jsp.tests.encoding.jsp.TestContentTypeDetectionForJSP.testFile85 -- Time elapsed: 0 s
04:37:03 org.eclipse.jst.jsp.tests.encoding.jsp.TestContentTypeDetectionForJSP.testFile86 -- Time elapsed: 0.001 s
04:37:03 org.eclipse.jst.jsp.tests.encoding.jsp.TestContentTypeDetectionForJSP.testFile87 -- Time elapsed: 0.001 s
04:37:03 org.eclipse.jst.jsp.tests.encoding.jsp.TestContentTypeDetectionForJSP.testFile88 -- Time elapsed: 0 s
04:37:03 org.eclipse.jst.jsp.tests.encoding.jsp.TestContentTypeDetectionForJSP.testFile89 -- Time elapsed: 0.001 s
04:37:03 org.eclipse.jst.jsp.tests.encoding.jsp.TestContentTypeDetectionForJSP.testFile90 -- Time elapsed: 0.001 s
04:37:03 org.eclipse.jst.jsp.tests.encoding.jsp.TestContentTypeDetectionForJSP.testFile91 -- Time elapsed: 0.004 s
04:37:03 org.eclipse.jst.jsp.tests.encoding.jsp.TestContentTypeDetectionForJSP.testFile92 -- Time elapsed: 0 s
04:37:03 org.eclipse.jst.jsp.tests.encoding.jsp.TestContentTypeDetectionForJSP.testFile93 -- Time elapsed: 0.001 s
04:37:03 org.eclipse.jst.jsp.tests.encoding.jsp.TestContentTypeDetectionForJSP.testFile94 -- Time elapsed: 0.001 s
04:37:03 org.eclipse.jst.jsp.tests.encoding.jsp.TestContentTypeDetectionForJSP.testFile95 -- Time elapsed: 0 s
04:37:03 org.eclipse.jst.jsp.tests.encoding.jsp.TestContentTypeDetectionForJSP.testFile96 -- Time elapsed: 0.001 s
04:37:03 org.eclipse.jst.jsp.tests.encoding.jsp.TestContentTypeDetectionForJSP.testFile97 -- Time elapsed: 0 s
04:37:03 org.eclipse.jst.jsp.tests.encoding.jsp.TestContentTypeDetectionForJSP.testFile98 -- Time elapsed: 0.001 s
04:37:03 org.eclipse.jst.jsp.tests.encoding.jsp.TestContentTypeDetectionForJSP.testFile99 -- Time elapsed: 0.002 s
04:37:03 
04:37:03 Results:
04:37:03 
04:37:03 Tests run: 74, Failures: 0, Errors: 0, Skipped: 0
04:37:03 
04:37:04 [INFO] All tests passed
04:37:04 [INFO] 
04:37:04 [INFO] --- eclipse-jarsigner:1.4.3:sign (sign) @ org.eclipse.jst.jsp.tests.encoding ---
04:37:04 [INFO] Signing jar: /home/jenkins/agent/workspace/webtools-sourceediting_master/web/tests/org.eclipse.jst.jsp.tests.encoding/target/org.eclipse.jst.jsp.tests.encoding-1.1.0-SNAPSHOT.jar
04:37:11 [INFO] Signing jar: /home/jenkins/agent/workspace/webtools-sourceediting_master/web/tests/org.eclipse.jst.jsp.tests.encoding/target/org.eclipse.jst.jsp.tests.encoding-1.1.0-SNAPSHOT-sources.jar
04:37:19 [INFO] 
04:37:19 [INFO] --- tycho-p2:4.0.8:p2-metadata (p2-metadata) @ org.eclipse.jst.jsp.tests.encoding ---
04:37:19 [INFO] No baseline version org.eclipse.webtools.sourceediting:org.eclipse.jst.jsp.tests.encoding:eclipse-test-plugin:1.1.0-SNAPSHOT
04:37:19 [INFO] 
04:37:19 [INFO] --- install:3.1.1:install (default-install) @ org.eclipse.jst.jsp.tests.encoding ---
04:37:19 [INFO] Installing /home/jenkins/agent/workspace/webtools-sourceediting_master/web/tests/org.eclipse.jst.jsp.tests.encoding/.tycho-consumer-pom.xml to /home/jenkins/agent/workspace/webtools-sourceediting_master/.repository/org/eclipse/webtools/sourceediting/org.eclipse.jst.jsp.tests.encoding/1.1.0-SNAPSHOT/org.eclipse.jst.jsp.tests.encoding-1.1.0-SNAPSHOT.pom
04:37:19 [INFO] Installing /home/jenkins/agent/workspace/webtools-sourceediting_master/web/tests/org.eclipse.jst.jsp.tests.encoding/target/org.eclipse.jst.jsp.tests.encoding-1.1.0-SNAPSHOT.jar to /home/jenkins/agent/workspace/webtools-sourceediting_master/.repository/org/eclipse/webtools/sourceediting/org.eclipse.jst.jsp.tests.encoding/1.1.0-SNAPSHOT/org.eclipse.jst.jsp.tests.encoding-1.1.0-SNAPSHOT.jar
04:37:19 [INFO] Installing /home/jenkins/agent/workspace/webtools-sourceediting_master/web/tests/org.eclipse.jst.jsp.tests.encoding/target/org.eclipse.jst.jsp.tests.encoding-1.1.0-SNAPSHOT-sources.jar to /home/jenkins/agent/workspace/webtools-sourceediting_master/.repository/org/eclipse/webtools/sourceediting/org.eclipse.jst.jsp.tests.encoding/1.1.0-SNAPSHOT/org.eclipse.jst.jsp.tests.encoding-1.1.0-SNAPSHOT-sources.jar
04:37:19 [INFO] Installing /home/jenkins/agent/workspace/webtools-sourceediting_master/web/tests/org.eclipse.jst.jsp.tests.encoding/target/p2content.xml to /home/jenkins/agent/workspace/webtools-sourceediting_master/.repository/org/eclipse/webtools/sourceediting/org.eclipse.jst.jsp.tests.encoding/1.1.0-SNAPSHOT/org.eclipse.jst.jsp.tests.encoding-1.1.0-SNAPSHOT-p2metadata.xml
04:37:19 [INFO] Installing /home/jenkins/agent/workspace/webtools-sourceediting_master/web/tests/org.eclipse.jst.jsp.tests.encoding/target/p2artifacts.xml to /home/jenkins/agent/workspace/webtools-sourceediting_master/.repository/org/eclipse/webtools/sourceediting/org.eclipse.jst.jsp.tests.encoding/1.1.0-SNAPSHOT/org.eclipse.jst.jsp.tests.encoding-1.1.0-SNAPSHOT-p2artifacts.xml
04:37:19 [INFO] 
04:37:19 [INFO] --- tycho-p2:4.0.8:update-local-index (default-update-local-index) @ org.eclipse.jst.jsp.tests.encoding ---
04:37:19 [INFO] 
04:37:19 [INFO] --< org.eclipse.webtools.sourceediting:org.eclipse.jst.jsp.ui.tests >---
04:37:19 [INFO] Building org.eclipse.jst.jsp.ui.tests 1.2.0-SNAPSHOT           [156/157]
04:37:19 [INFO]   from web/tests/org.eclipse.jst.jsp.ui.tests/pom.xml
04:37:19 [INFO] ------------------------[ eclipse-test-plugin ]-------------------------
04:37:20 [WARNING] Problems resolving provisioning plan.:
04:37:20    Unable to satisfy dependency from org.apache.felix.scr 2.1.24.v20200924-1939 to java.package; org.osgi.service.component [1.4.0,1.5.0).
04:37:20    Unable to satisfy dependency from org.apache.felix.scr 2.1.24.v20200924-1939 to java.package; org.osgi.service.component.runtime [1.4.0,1.5.0).
04:37:20    Unable to satisfy dependency from org.apache.felix.scr 2.1.24.v20200924-1939 to java.package; org.osgi.service.component.runtime.dto [1.4.0,1.5.0).
04:37:22 [INFO] 
04:37:22 [INFO] --- clean:3.2.0:clean (default-clean) @ org.eclipse.jst.jsp.ui.tests ---
04:37:22 [INFO] 
04:37:22 [INFO] --- tycho-packaging:4.0.8:build-qualifier (default-build-qualifier) @ org.eclipse.jst.jsp.ui.tests ---
04:37:22 [INFO] The project's OSGi version is 1.2.0.v202308160453
04:37:22 [INFO] 
04:37:22 [INFO] --- tycho-packaging:4.0.8:validate-id (default-validate-id) @ org.eclipse.jst.jsp.ui.tests ---
04:37:22 [INFO] 
04:37:22 [INFO] --- tycho-packaging:4.0.8:validate-version (default-validate-version) @ org.eclipse.jst.jsp.ui.tests ---
04:37:22 [INFO] 
04:37:22 [INFO] --- build-helper:3.0.0:regex-property (regex-property) @ org.eclipse.jst.jsp.ui.tests ---
04:37:22 [INFO] 
04:37:22 [INFO] --- target-platform-configuration:4.0.8:target-platform (default-target-platform) @ org.eclipse.jst.jsp.ui.tests ---
04:37:22 [INFO] 
04:37:22 [INFO] --- tycho-compiler:4.0.8:validate-classpath (default-validate-classpath) @ org.eclipse.jst.jsp.ui.tests ---
04:37:22 [INFO] Resolving class path of org.eclipse.jst.jsp.ui.tests
04:37:22 [INFO] 
04:37:22 [INFO] --- resources:3.3.1:resources (default-resources) @ org.eclipse.jst.jsp.ui.tests ---
04:37:22 [WARNING] Using platform encoding (UTF-8 actually) to copy filtered resources, i.e. build is platform dependent!
04:37:22 [INFO] skip non existing resourceDirectory /home/jenkins/agent/workspace/webtools-sourceediting_master/web/tests/org.eclipse.jst.jsp.ui.tests/src/main/resources
04:37:22 [INFO] 
04:37:22 [INFO] --- tycho-compiler:4.0.8:compile (default-compile) @ org.eclipse.jst.jsp.ui.tests ---
04:37:23 [INFO] Compiling 74 source files to /home/jenkins/agent/workspace/webtools-sourceediting_master/web/tests/org.eclipse.jst.jsp.ui.tests/target/classes using Eclipse Compiler for Java(TM) 3.37.0.v20240215-1558
04:37:23 [INFO] 
04:37:23 [INFO] --- tycho-ds:4.0.8:declarative-services (default-declarative-services) @ org.eclipse.jst.jsp.ui.tests ---
04:37:23 [INFO] 
04:37:23 [INFO] --- resources:3.3.1:testResources (default-testResources) @ org.eclipse.jst.jsp.ui.tests ---
04:37:23 [WARNING] Using platform encoding (UTF-8 actually) to copy filtered resources, i.e. build is platform dependent!
04:37:23 [INFO] skip non existing resourceDirectory /home/jenkins/agent/workspace/webtools-sourceediting_master/web/tests/org.eclipse.jst.jsp.ui.tests/src/test/resources
04:37:23 [INFO] 
04:37:23 [INFO] --- tycho-packaging:4.0.8:update-consumer-pom (default-update-consumer-pom) @ org.eclipse.jst.jsp.ui.tests ---
04:37:23 [INFO] 226 system scoped dependencies were not mapped to maven artifacts
04:37:23 [INFO] 
04:37:23 [INFO] --- tycho-source:4.0.8:plugin-source (plugin-source) @ org.eclipse.jst.jsp.ui.tests ---
04:37:23 [INFO] Building jar: /home/jenkins/agent/workspace/webtools-sourceediting_master/web/tests/org.eclipse.jst.jsp.ui.tests/target/org.eclipse.jst.jsp.ui.tests-1.2.0-SNAPSHOT-sources.jar
04:37:23 [INFO] 
04:37:23 [INFO] --- tycho-packaging:4.0.8:package-plugin (default-package-plugin) @ org.eclipse.jst.jsp.ui.tests ---
04:37:24 [INFO] Building jar: /home/jenkins/agent/workspace/webtools-sourceediting_master/web/tests/org.eclipse.jst.jsp.ui.tests/target/org.eclipse.jst.jsp.ui.tests-1.2.0-SNAPSHOT.jar
04:37:24 [INFO] 
04:37:24 [INFO] --- tycho-p2:4.0.8:p2-metadata-default (default-p2-metadata-default) @ org.eclipse.jst.jsp.ui.tests ---
04:37:24 [INFO] 
04:37:24 [INFO] --- tycho-surefire:4.0.8:test (default-test) @ org.eclipse.jst.jsp.ui.tests ---
04:37:28 [INFO] Executing test runtime with timeout (seconds): 2700000, logs, if any, will be placed at: /home/jenkins/agent/workspace/webtools-sourceediting_master/web/tests/org.eclipse.jst.jsp.ui.tests/target/work/data/.metadata/.log
04:37:28 [INFO] Command line:
04:37:28 	[/opt/tools/java/openjdk/jdk-21/latest/bin/java, -Dosgi.noShutdown=false, -Dosgi.os=linux, -Dosgi.ws=gtk, -Dosgi.arch=x86_64, -Dosgi.clean=true, -jar, /home/jenkins/agent/workspace/webtools-sourceediting_master/.repository/p2/osgi/bundle/org.eclipse.equinox.launcher/1.6.900.v20240613-2009/org.eclipse.equinox.launcher-1.6.900.v20240613-2009.jar, -data, /home/jenkins/agent/workspace/webtools-sourceediting_master/web/tests/org.eclipse.jst.jsp.ui.tests/target/work/data, -install, /home/jenkins/agent/workspace/webtools-sourceediting_master/web/tests/org.eclipse.jst.jsp.ui.tests/target/work, -configuration, /home/jenkins/agent/workspace/webtools-sourceediting_master/web/tests/org.eclipse.jst.jsp.ui.tests/target/work/configuration, -application, org.eclipse.tycho.surefire.osgibooter.uitest, -testproperties, /home/jenkins/agent/workspace/webtools-sourceediting_master/web/tests/org.eclipse.jst.jsp.ui.tests/target/surefire.properties, -timeout, 2700000000]
04:37:31 SLF4J(W): No SLF4J providers were found.
04:37:31 SLF4J(W): Defaulting to no-operation (NOP) logger implementation
04:37:31 SLF4J(W): See https://www.slf4j.org/codes.html#noProviders for further details.
04:37:32 WARNING: Annotation classes from the 'javax.inject' or 'javax.annotation' package found.
04:37:32 It is recommended to migrate to the corresponding replacements in the jakarta namespace.
04:37:32 The Eclipse E4 Platform will remove support for those javax-annotations in a future release.
04:37:32 To suppress this warning, set the VM property: -Declipse.e4.inject.javax.warning=false
04:37:32 To disable processing of 'javax' annotations entirely, set the VM property: -Declipse.e4.inject.javax.disabled=true
04:37:32 
04:37:36 Running org.eclipse.jst.jsp.ui.tests.JSPUITestSuite
04:38:08 Tests run: 356, Failures: 0, Errors: 17, Skipped: 0, Time elapsed: 31.95 s <<< FAILURE! -- in org.eclipse.jst.jsp.ui.tests.JSPUITestSuite
04:38:08 org.eclipse.jst.jsp.ui.tests.other.ScannerUnitTests.testEmbeddedJSPScriptlet -- Time elapsed: 0.082 s
04:38:08 org.eclipse.jst.jsp.ui.tests.other.ScannerUnitTests.testCommentEmbeddedCustomTag -- Time elapsed: 0.001 s
04:38:08 org.eclipse.jst.jsp.ui.tests.other.ScannerUnitTests.testBlockScanBufferBoundariesForHTML -- Time elapsed: 0.220 s
04:38:08 org.eclipse.jst.jsp.ui.tests.other.ScannerUnitTests.testSimpleTag_JSP -- Time elapsed: 0 s
04:38:08 org.eclipse.jst.jsp.ui.tests.other.ScannerUnitTests.testSimpleTag_XML -- Time elapsed: 0.001 s
04:38:08 org.eclipse.jst.jsp.ui.tests.other.ScannerUnitTests.testELtolerance_transparency_Squote -- Time elapsed: 0.001 s
04:38:08 org.eclipse.jst.jsp.ui.tests.other.ScannerUnitTests.testEmbeddedJSPDeclaration -- Time elapsed: 0.001 s
04:38:08 org.eclipse.jst.jsp.ui.tests.other.ScannerUnitTests.testCommentMarkupLike -- Time elapsed: 0 s
04:38:08 org.eclipse.jst.jsp.ui.tests.other.ScannerUnitTests.testJSPGreaterThanInAttValue -- Time elapsed: 0.001 s
04:38:08 org.eclipse.jst.jsp.ui.tests.other.ScannerUnitTests.testEmbeddedJSPScriptletInCDATA -- Time elapsed: 0 s
04:38:08 org.eclipse.jst.jsp.ui.tests.other.ScannerUnitTests.testNothinginBlockJSP9 -- Time elapsed: 0.001 s
04:38:08 org.eclipse.jst.jsp.ui.tests.other.ScannerUnitTests.testNothinginBlockXML9 -- Time elapsed: 0 s
04:38:08 org.eclipse.jst.jsp.ui.tests.other.ScannerUnitTests.testDollarsign_Leading -- Time elapsed: 0 s
04:38:08 org.eclipse.jst.jsp.ui.tests.other.ScannerUnitTests.testBlockTag_JSP -- Time elapsed: 0 s
04:38:08 org.eclipse.jst.jsp.ui.tests.other.ScannerUnitTests.testBlockTag_XML -- Time elapsed: 0.001 s
04:38:08 org.eclipse.jst.jsp.ui.tests.other.ScannerUnitTests.testJSPCommentinXMLTag -- Time elapsed: 0.001 s
04:38:08 org.eclipse.jst.jsp.ui.tests.other.ScannerUnitTests.testVBLinContent -- Time elapsed: 0 s
04:38:08 org.eclipse.jst.jsp.ui.tests.other.ScannerUnitTests.testVBLtolerance_transparency_Dquote -- Time elapsed: 0.001 s
04:38:08 org.eclipse.jst.jsp.ui.tests.other.ScannerUnitTests.testXMLDollarsign_Trailing -- Time elapsed: 0 s
04:38:08 org.eclipse.jst.jsp.ui.tests.other.ScannerUnitTests.testVBLtolerance_transparency_Squote -- Time elapsed: 0 s
04:38:08 org.eclipse.jst.jsp.ui.tests.other.ScannerUnitTests.testBlockTagWithJSPExpressions -- Time elapsed: 0 s
04:38:08 org.eclipse.jst.jsp.ui.tests.other.ScannerUnitTests.testContentJSP -- Time elapsed: 0.001 s
04:38:08 org.eclipse.jst.jsp.ui.tests.other.ScannerUnitTests.testContentXML -- Time elapsed: 0 s
04:38:08 org.eclipse.jst.jsp.ui.tests.other.ScannerUnitTests.testDirectiveInTagBody -- Time elapsed: 0.001 s
04:38:08 org.eclipse.jst.jsp.ui.tests.other.ScannerUnitTests.testJSPLessThanInAttValue -- Time elapsed: 0 s
04:38:08 org.eclipse.jst.jsp.ui.tests.other.ScannerUnitTests.testBlockScanBufferBoundariesForJSP -- Time elapsed: 0.182 s
04:38:08 org.eclipse.jst.jsp.ui.tests.other.ScannerUnitTests.testCDATAinBlockJSP2a -- Time elapsed: 0.001 s
04:38:08 org.eclipse.jst.jsp.ui.tests.other.ScannerUnitTests.testCDATAinBlockJSP2b -- Time elapsed: 0.001 s
04:38:08 org.eclipse.jst.jsp.ui.tests.other.ScannerUnitTests.testJSPAmpersandInTagNameInAttValue -- Time elapsed: 0 s
04:38:08 org.eclipse.jst.jsp.ui.tests.other.ScannerUnitTests.testJSPDirectiveTags -- Time elapsed: 0 s
04:38:08 org.eclipse.jst.jsp.ui.tests.other.ScannerUnitTests.testEmbeddedTagInAttr -- Time elapsed: 0.001 s
04:38:08 org.eclipse.jst.jsp.ui.tests.other.ScannerUnitTests.testEmbeddedJSPDeclarationInCDATA -- Time elapsed: 0 s
04:38:08 org.eclipse.jst.jsp.ui.tests.other.ScannerUnitTests.testCommentMarkup -- Time elapsed: 0.001 s
04:38:08 org.eclipse.jst.jsp.ui.tests.other.ScannerUnitTests.testJSPInvalidTagNameInAttValue -- Time elapsed: 0 s
04:38:08 org.eclipse.jst.jsp.ui.tests.other.ScannerUnitTests.testCDATA_JSP -- Time elapsed: 0.001 s
04:38:08 org.eclipse.jst.jsp.ui.tests.other.ScannerUnitTests.testCDATA_XML -- Time elapsed: 0 s
04:38:08 org.eclipse.jst.jsp.ui.tests.other.ScannerUnitTests.testCDATAinBlockJSP1 -- Time elapsed: 0 s
04:38:08 org.eclipse.jst.jsp.ui.tests.other.ScannerUnitTests.testCDATAinBlockJSP2 -- Time elapsed: 0 s
04:38:08 org.eclipse.jst.jsp.ui.tests.other.ScannerUnitTests.testCDATAinBlockJSP3 -- Time elapsed: 0 s
04:38:08 org.eclipse.jst.jsp.ui.tests.other.ScannerUnitTests.testCDATAinBlockJSP4 -- Time elapsed: 0.001 s
04:38:08 org.eclipse.jst.jsp.ui.tests.other.ScannerUnitTests.testCDATAinBlockJSP5 -- Time elapsed: 0 s
04:38:08 org.eclipse.jst.jsp.ui.tests.other.ScannerUnitTests.testCDATAinBlockJSP6 -- Time elapsed: 0.001 s
04:38:08 org.eclipse.jst.jsp.ui.tests.other.ScannerUnitTests.testCDATAinBlockJSP7 -- Time elapsed: 0 s
04:38:08 org.eclipse.jst.jsp.ui.tests.other.ScannerUnitTests.testCDATAinBlockJSP8 -- Time elapsed: 0.001 s
04:38:08 org.eclipse.jst.jsp.ui.tests.other.ScannerUnitTests.testCDATAinBlockXML1 -- Time elapsed: 0 s
04:38:08 org.eclipse.jst.jsp.ui.tests.other.ScannerUnitTests.testCDATAinBlockXML2 -- Time elapsed: 0.001 s
04:38:08 org.eclipse.jst.jsp.ui.tests.other.ScannerUnitTests.testCDATAinBlockXML3 -- Time elapsed: 0 s
04:38:08 org.eclipse.jst.jsp.ui.tests.other.ScannerUnitTests.testCDATAinBlockXML4 -- Time elapsed: 0.001 s
04:38:08 org.eclipse.jst.jsp.ui.tests.other.ScannerUnitTests.testCDATAinBlockXML5 -- Time elapsed: 0 s
04:38:08 org.eclipse.jst.jsp.ui.tests.other.ScannerUnitTests.testCDATAinBlockXML6 -- Time elapsed: 0 s
04:38:08 org.eclipse.jst.jsp.ui.tests.other.ScannerUnitTests.testCDATAinBlockXML7 -- Time elapsed: 0.001 s
04:38:08 org.eclipse.jst.jsp.ui.tests.other.ScannerUnitTests.testCDATAinBlockXML8 -- Time elapsed: 0 s
04:38:08 org.eclipse.jst.jsp.ui.tests.other.ScannerUnitTests.testELtolerance_transparency_DquoteWithSpaces -- Time elapsed: 0.001 s
04:38:08 org.eclipse.jst.jsp.ui.tests.other.ScannerUnitTests.testBufferUnderRun_1_JSP -- Time elapsed: 0 s
04:38:08 org.eclipse.jst.jsp.ui.tests.other.ScannerUnitTests.testBufferUnderRun_1_XML -- Time elapsed: 0.001 s
04:38:08 org.eclipse.jst.jsp.ui.tests.other.ScannerUnitTests.testBufferUnderRun_2_JSP -- Time elapsed: 0 s
04:38:08 org.eclipse.jst.jsp.ui.tests.other.ScannerUnitTests.testBufferUnderRun_2_XML -- Time elapsed: 0 s
04:38:08 org.eclipse.jst.jsp.ui.tests.other.ScannerUnitTests.testVBLtolerance_transparency_DquoteWithSpaces -- Time elapsed: 0.001 s
04:38:08 org.eclipse.jst.jsp.ui.tests.other.ScannerUnitTests.testELinContent -- Time elapsed: 0 s
04:38:08 org.eclipse.jst.jsp.ui.tests.other.ScannerUnitTests.testJSPCommentAtStartOfXMLCommentAndBlockTag -- Time elapsed: 0 s
04:38:08 org.eclipse.jst.jsp.ui.tests.other.ScannerUnitTests.testJSPRootTag -- Time elapsed: 0.001 s
04:38:08 org.eclipse.jst.jsp.ui.tests.other.ScannerUnitTests.testEmbeddedJSPExpression -- Time elapsed: 0 s
04:38:08 org.eclipse.jst.jsp.ui.tests.other.ScannerUnitTests.testXML_DHTMLimport -- Time elapsed: 0 s
04:38:08 org.eclipse.jst.jsp.ui.tests.other.ScannerUnitTests.testJSPExpression -- Time elapsed: 0 s
04:38:08 org.eclipse.jst.jsp.ui.tests.other.ScannerUnitTests.testJSPDollarsign_TrailingInContent -- Time elapsed: 0.001 s
04:38:08 org.eclipse.jst.jsp.ui.tests.other.ScannerUnitTests.testELinTag -- Time elapsed: 0 s
04:38:08 org.eclipse.jst.jsp.ui.tests.other.ScannerUnitTests.testDollarsign_SingleWithSpaces -- Time elapsed: 0 s
04:38:08 org.eclipse.jst.jsp.ui.tests.other.ScannerUnitTests.testJSP_PI -- Time elapsed: 0 s
04:38:08 org.eclipse.jst.jsp.ui.tests.other.ScannerUnitTests.testJSPDollarsign_Trailing -- Time elapsed: 0.001 s
04:38:08 org.eclipse.jst.jsp.ui.tests.other.ScannerUnitTests.testDollarsign_Single -- Time elapsed: 0 s
04:38:08 org.eclipse.jst.jsp.ui.tests.other.ScannerUnitTests.testJSP_DHTMLimport -- Time elapsed: 0.001 s
04:38:08 org.eclipse.jst.jsp.ui.tests.other.ScannerUnitTests.testJSPCommentInXMLComment -- Time elapsed: 0 s
04:38:08 org.eclipse.jst.jsp.ui.tests.other.ScannerUnitTests.testEmbeddedJSPExpressionInCDATA -- Time elapsed: 0.001 s
04:38:08 org.eclipse.jst.jsp.ui.tests.other.ScannerUnitTests.testXML_PI -- Time elapsed: 0.011 s
04:38:08 org.eclipse.jst.jsp.ui.tests.other.ScannerUnitTests.testComments_JSP -- Time elapsed: 0.001 s
04:38:08 org.eclipse.jst.jsp.ui.tests.other.ScannerUnitTests.testComments_XML -- Time elapsed: 0 s
04:38:08 org.eclipse.jst.jsp.ui.tests.other.ScannerUnitTests.testJSPTagInAttValue -- Time elapsed: 0.001 s
04:38:08 org.eclipse.jst.jsp.ui.tests.other.ScannerUnitTests.testELtolerance_transparency_Dquote -- Time elapsed: 0 s
04:38:08 org.eclipse.jst.jsp.ui.tests.other.ScannerUnitTests.testUndefinedRegionContainer -- Time elapsed: 0.003 s
04:38:08 org.eclipse.jst.jsp.ui.tests.other.UnitTests.testEmbeddedJSP2 -- Time elapsed: 0.027 s
04:38:08 org.eclipse.jst.jsp.ui.tests.other.UnitTests.testTagReDetection -- Time elapsed: 0.003 s
04:38:08 org.eclipse.jst.jsp.ui.tests.other.UnitTests.testSimiliarEnd -- Time elapsed: 0.002 s
04:38:08 org.eclipse.jst.jsp.ui.tests.other.UnitTests.testJSP1 -- Time elapsed: 0 s
04:38:08 org.eclipse.jst.jsp.ui.tests.other.UnitTests.testJSP2 -- Time elapsed: 0.001 s
04:38:08 org.eclipse.jst.jsp.ui.tests.other.UnitTests.testJSP3 -- Time elapsed: 0.001 s
04:38:08 org.eclipse.jst.jsp.ui.tests.other.UnitTests.testJSP4 -- Time elapsed: 0 s
04:38:08 org.eclipse.jst.jsp.ui.tests.other.UnitTests.testJSP5 -- Time elapsed: 0.001 s
04:38:08 org.eclipse.jst.jsp.ui.tests.other.UnitTests.testJSP6 -- Time elapsed: 0.001 s
04:38:08 org.eclipse.jst.jsp.ui.tests.other.UnitTests.testDeepEmbeddedJSP -- Time elapsed: 0.001 s
04:38:08 org.eclipse.jst.jsp.ui.tests.other.UnitTests.testDeleteBeginning -- Time elapsed: 0.001 s
04:38:08 org.eclipse.jst.jsp.ui.tests.other.UnitTests.testMethod10 -- Time elapsed: 0.001 s
04:38:08 org.eclipse.jst.jsp.ui.tests.other.UnitTests.testMethod11 -- Time elapsed: 0.001 s
04:38:08 org.eclipse.jst.jsp.ui.tests.other.UnitTests.testMethod12 -- Time elapsed: 0.001 s
04:38:08 org.eclipse.jst.jsp.ui.tests.other.UnitTests.testMethod13 -- Time elapsed: 0.001 s
04:38:08 org.eclipse.jst.jsp.ui.tests.other.UnitTests.testMethod14 -- Time elapsed: 0 s
04:38:08 org.eclipse.jst.jsp.ui.tests.other.UnitTests.testMethod15 -- Time elapsed: 0 s
04:38:08 org.eclipse.jst.jsp.ui.tests.other.UnitTests.testMethod16 -- Time elapsed: 0.001 s
04:38:08 org.eclipse.jst.jsp.ui.tests.other.UnitTests.testMethod17 -- Time elapsed: 0.002 s
04:38:08 org.eclipse.jst.jsp.ui.tests.other.UnitTests.testMethod18 -- Time elapsed: 0.001 s
04:38:08 org.eclipse.jst.jsp.ui.tests.other.UnitTests.testMethod19 -- Time elapsed: 0.001 s
04:38:08 org.eclipse.jst.jsp.ui.tests.other.UnitTests.testMethod20 -- Time elapsed: 0.002 s
04:38:08 org.eclipse.jst.jsp.ui.tests.other.UnitTests.testMethod21 -- Time elapsed: 0.002 s
04:38:08 org.eclipse.jst.jsp.ui.tests.other.UnitTests.testDeleteEnd -- Time elapsed: 0.001 s
04:38:08 org.eclipse.jst.jsp.ui.tests.other.UnitTests.testMethod9 -- Time elapsed: 0.001 s
04:38:08 org.eclipse.jst.jsp.ui.tests.other.UnitTests.testDeepEmbeddedJSP2 -- Time elapsed: 0.001 s
04:38:08 org.eclipse.jst.jsp.ui.tests.other.UnitTests.testDeepEmbeddedJSP3 -- Time elapsed: 0.001 s
04:38:08 org.eclipse.jst.jsp.ui.tests.other.UnitTests.testPageDirective -- Time elapsed: 0.001 s
04:38:08 org.eclipse.jst.jsp.ui.tests.other.UnitTests.testSimilarStart -- Time elapsed: 0.001 s
04:38:08 org.eclipse.jst.jsp.ui.tests.other.UnitTests.testModifyMiddle -- Time elapsed: 0.001 s
04:38:08 org.eclipse.jst.jsp.ui.tests.other.UnitTests.testJSPDirective -- Time elapsed: 0 s
04:38:08 org.eclipse.jst.jsp.ui.tests.other.UnitTests.testEmbedded -- Time elapsed: 0.002 s
04:38:08 org.eclipse.jst.jsp.ui.tests.other.UnitTests.testSimilarStartEnd -- Time elapsed: 0 s
04:38:08 org.eclipse.jst.jsp.ui.tests.other.UnitTests.testMethodAttributeNameReplace1 -- Time elapsed: 0.001 s
04:38:08 org.eclipse.jst.jsp.ui.tests.other.UnitTests.testTagReDetection2 -- Time elapsed: 0 s
04:38:08 org.eclipse.jst.jsp.ui.tests.other.UnitTests.testTagReDetection3 -- Time elapsed: 0 s
04:38:08 org.eclipse.jst.jsp.ui.tests.other.UnitTests.testNoChange1 -- Time elapsed: 0.001 s
04:38:08 org.eclipse.jst.jsp.ui.tests.other.UnitTests.testNoChange2 -- Time elapsed: 0 s
04:38:08 org.eclipse.jst.jsp.ui.tests.partitioning.TestStructuredPartitionerJSP.testEmpty -- Time elapsed: 0.044 s
04:38:08 org.eclipse.jst.jsp.ui.tests.partitioning.TestStructuredPartitionerJSP.testJSP1 -- Time elapsed: 0.114 s
04:38:08 org.eclipse.jst.jsp.ui.tests.partitioning.TestStructuredPartitionerJSP.testJSP2 -- Time elapsed: 0.008 s
04:38:08 org.eclipse.jst.jsp.ui.tests.partitioning.TestStructuredPartitionerJSP.testJSP3 -- Time elapsed: 0.003 s
04:38:08 org.eclipse.jst.jsp.ui.tests.partitioning.TestStructuredPartitionerJSP.testJSP4 -- Time elapsed: 0.002 s
04:38:08 org.eclipse.jst.jsp.ui.tests.partitioning.TestStructuredPartitionerJSP.testJSP5 -- Time elapsed: 0.179 s
04:38:08 org.eclipse.jst.jsp.ui.tests.partitioning.TestStructuredPartitionerJSP.testJSP6 -- Time elapsed: 0.004 s
04:38:08 org.eclipse.jst.jsp.ui.tests.partitioning.TestStructuredPartitionerJSP.testPerfJSP -- Time elapsed: 0.641 s
04:38:08 org.eclipse.jst.jsp.ui.tests.partitioning.TestStructuredPartitionerJSP.testBug131463 -- Time elapsed: 0.004 s
04:38:08 org.eclipse.jst.jsp.ui.tests.partitioning.TestStructuredPartitionerJSP.testBug365346 -- Time elapsed: 0.002 s
04:38:08 org.eclipse.jst.jsp.ui.tests.format.TestContentFormatter.testFormatBug358545a -- Time elapsed: 1.848 s
04:38:08 org.eclipse.jst.jsp.ui.tests.format.TestContentFormatter.testFormatBug358545b -- Time elapsed: 0.405 s
04:38:08 org.eclipse.jst.jsp.ui.tests.format.TestContentFormatter.testFormatBug102495 -- Time elapsed: 0.214 s
04:38:08 org.eclipse.jst.jsp.ui.tests.format.TestContentFormatter.testFormatBug124070 -- Time elapsed: 0.074 s
04:38:08 org.eclipse.jst.jsp.ui.tests.format.TestContentFormatter.testFormatBug383387 -- Time elapsed: 0.298 s
04:38:08 org.eclipse.jst.jsp.ui.tests.format.TestContentFormatter.testFormatBug384126 -- Time elapsed: 0.521 s
04:38:08 org.eclipse.jst.jsp.ui.tests.format.TestContentFormatter.testFormatJava1 -- Time elapsed: 0.331 s
04:38:08 org.eclipse.jst.jsp.ui.tests.format.TestContentFormatter.testFormatJava2 -- Time elapsed: 0.246 s
04:38:08 org.eclipse.jst.jsp.ui.tests.format.TestContentFormatter.testFormatJava3 -- Time elapsed: 0.195 s
04:38:08 org.eclipse.jst.jsp.ui.tests.format.TestContentFormatter.testFormatJava4 -- Time elapsed: 0.228 s
04:38:08 org.eclipse.jst.jsp.ui.tests.format.TestContentFormatter.testFormatJava5 -- Time elapsed: 0.208 s
04:38:08 org.eclipse.jst.jsp.ui.tests.format.TestContentFormatter.testFormatJava6 -- Time elapsed: 0.265 s
04:38:08 org.eclipse.jst.jsp.ui.tests.format.TestContentFormatter.testFormatBug102495_1 -- Time elapsed: 0.024 s
04:38:08 org.eclipse.jst.jsp.ui.tests.format.TestContentFormatter.testFormatBug102495_2 -- Time elapsed: 0.071 s
04:38:08 org.eclipse.jst.jsp.ui.tests.format.TestContentFormatter.testFormatBug102495_3 -- Time elapsed: 0.011 s
04:38:08 org.eclipse.jst.jsp.ui.tests.format.TestContentFormatter.testFormatBug102495_4 -- Time elapsed: 0.011 s
04:38:08 org.eclipse.jst.jsp.ui.tests.modelquery.ModelQueryTester.testBodyElement -- Time elapsed: 0.009 s
04:38:08 org.eclipse.jst.jsp.ui.tests.modelquery.ModelQueryTester.testHtmlChildren -- Time elapsed: 0.021 s
04:38:08 org.eclipse.jst.jsp.ui.tests.modelquery.ModelQueryTester.testDTDLoadFromSystemID_1 -- Time elapsed: 0 s
04:38:08 org.eclipse.jst.jsp.ui.tests.modelquery.ModelQueryTester.testDTDLoadFromSystemID_2 -- Time elapsed: 0 s
04:38:08 org.eclipse.jst.jsp.ui.tests.modelquery.ModelQueryTester.testFormMethodAttr -- Time elapsed: 0.002 s
04:38:08 org.eclipse.jst.jsp.ui.tests.modelquery.ModelQueryTester.testDTDLoadFromPublicID -- Time elapsed: 0 s
04:38:08 org.eclipse.jst.jsp.ui.tests.contentassist.JSPJavaTranslatorTest.testAllFiles -- Time elapsed: 0.047 s
04:38:08 org.eclipse.jst.jsp.ui.tests.contentassist.JSPJavaTranslatorTest.testMultipleJSPSectionsInJavascript -- Time elapsed: 0.006 s
04:38:08 org.eclipse.jst.jsp.ui.tests.TestEmailNotice.testEmail -- Time elapsed: 0 s
04:38:08 org.eclipse.jst.jsp.ui.tests.contentassist.BeanInfoProviderTest.testAll -- Time elapsed: 9.892 s
04:38:08 org.eclipse.jst.jsp.ui.tests.contentassist.JSPTranslationTest.testXMLJSPTranslationText -- Time elapsed: 0.101 s
04:38:08 org.eclipse.jst.jsp.ui.tests.contentassist.JSPTranslationTest.testUseBeanNoSpace -- Time elapsed: 0.182 s
04:38:08 org.eclipse.jst.jsp.ui.tests.contentassist.JSPTranslationTest.testPageDirectiveSessionVariableInFile -- Time elapsed: 0.150 s
04:38:08 org.eclipse.jst.jsp.ui.tests.contentassist.JSPTranslationTest.testJSPTranslationAdapter -- Time elapsed: 0.065 s
04:38:08 org.eclipse.jst.jsp.ui.tests.contentassist.JSPTranslationTest.testPageDirectiveSessionVariableInSegment -- Time elapsed: 0.039 s
04:38:08 org.eclipse.jst.jsp.ui.tests.contentassist.JSPTranslationTest.testJSPTranslationText -- Time elapsed: 0.036 s
04:38:08 org.eclipse.jst.jsp.ui.tests.contentassist.JSPTranslationTest.testXMLJSPCDATAText -- Time elapsed: 0.044 s
04:38:08 org.eclipse.jst.jsp.ui.tests.contentassist.JSPTranslationTest.testTranslatePositions -- Time elapsed: 0.037 s
04:38:08 org.eclipse.jst.jsp.ui.tests.contentassist.JSPTranslationTest.testXMLJSPMapping -- Time elapsed: 0.061 s
04:38:08 org.eclipse.jst.jsp.ui.tests.contentassist.JSPELContentAssistTest.testELProposals_0 -- Time elapsed: 1.100 s
04:38:08 org.eclipse.jst.jsp.ui.tests.contentassist.JSPELContentAssistTest.testELProposals_1 -- Time elapsed: 0.303 s
04:38:08 org.eclipse.jst.jsp.ui.tests.contentassist.JSPELContentAssistTest.testELProposals_2 -- Time elapsed: 0.293 s
04:38:08 org.eclipse.jst.jsp.ui.tests.contentassist.JSPELContentAssistTest.testELChosenProposalCompletion -- Time elapsed: 0.208 s
04:38:08 org.eclipse.jst.jsp.ui.tests.contentassist.TestJSPContentAssistComputers.testELInAttributeProposals -- Time elapsed: 0.515 s
04:38:08 org.eclipse.jst.jsp.ui.tests.contentassist.TestJSPContentAssistComputers.testBodyTagChildElementProposals -- Time elapsed: 0.282 s
04:38:08 org.eclipse.jst.jsp.ui.tests.contentassist.TestJSPContentAssistComputers.testCommentTagChildElementProposals -- Time elapsed: 0.011 s
04:38:08 org.eclipse.jst.jsp.ui.tests.contentassist.TestJSPContentAssistComputers.testAfterXMLDeclarationBeforeEmptyDocProposals -- Time elapsed: 0.277 s
04:38:08 org.eclipse.jst.jsp.ui.tests.contentassist.TestJSPContentAssistComputers.testJSPTagProposalsAtDocumentRootLevel -- Time elapsed: 0.200 s
04:38:08 org.eclipse.jst.jsp.ui.tests.contentassist.TestJSPContentAssistComputers.testFinishClosingHTMLTagPropsoals -- Time elapsed: 0.204 s
04:38:08 org.eclipse.jst.jsp.ui.tests.contentassist.TestJSPContentAssistComputers.testFinishClosingJSPTagNamePropsoals -- Time elapsed: 0.171 s
04:38:08 org.eclipse.jst.jsp.ui.tests.contentassist.TestJSPContentAssistComputers.testJSPTagAttributeNameProposals -- Time elapsed: 0.030 s
04:38:08 org.eclipse.jst.jsp.ui.tests.contentassist.TestJSPContentAssistComputers.testAfterXMLDeclarationBeforeHTMLTagProposals -- Time elapsed: 0.013 s
04:38:08 org.eclipse.jst.jsp.ui.tests.contentassist.TestJSPContentAssistComputers.testDIVTagChildElementProposals -- Time elapsed: 0.027 s
04:38:08 org.eclipse.jst.jsp.ui.tests.contentassist.TestJSPContentAssistComputers.testPTagChildElementProposals -- Time elapsed: 0.052 s
04:38:08 org.eclipse.jst.jsp.ui.tests.contentassist.TestJSPContentAssistComputers.testDIVTagAttributeNameProposals -- Time elapsed: 0.016 s
04:38:08 org.eclipse.jst.jsp.ui.tests.contentassist.TestJSPContentAssistComputers.testAfterJSPTaglibsBeforeDocType -- Time elapsed: 0.012 s
04:38:08 org.eclipse.jst.jsp.ui.tests.contentassist.TestJSPContentAssistComputers.testFinishClosingJSPTagPropsoals -- Time elapsed: 0.012 s
04:38:08 org.eclipse.jst.jsp.ui.tests.contentassist.TestJSPContentAssistComputers.testELProposals -- Time elapsed: 0.164 s
04:38:08 org.eclipse.jst.jsp.ui.tests.contentassist.TestJSPContentAssistComputers.testJSPRegionProposals -- Time elapsed: 0.125 s
04:38:08 org.eclipse.jst.jsp.ui.tests.contentassist.TestJSPContentAssistComputers.testFinishClosingHTMLTagNamePropsoals -- Time elapsed: 0.013 s
04:38:08 org.eclipse.jst.jsp.ui.tests.registry.AdapterFactoryRegistryTest.testGetFactoriesHTML -- Time elapsed: 0.001 s
04:38:08 org.eclipse.jst.jsp.ui.tests.registry.AdapterFactoryRegistryTest.testGetFactoriesCSS -- Time elapsed: 0 s
04:38:08 org.eclipse.jst.jsp.ui.tests.registry.AdapterFactoryRegistryTest.testGetFactoriesDTD -- Time elapsed: 0.001 s
04:38:08 org.eclipse.jst.jsp.ui.tests.registry.AdapterFactoryRegistryTest.testGetFactoriesJSP -- Time elapsed: 0 s
04:38:08 org.eclipse.jst.jsp.ui.tests.registry.AdapterFactoryRegistryTest.testGetFactoriesXML -- Time elapsed: 0 s
04:38:08 org.eclipse.jst.jsp.ui.tests.registry.AdapterFactoryRegistryTest.testGetAllFactories -- Time elapsed: 0 s
04:38:08 org.eclipse.jst.jsp.ui.tests.registry.AdapterFactoryRegistryTest.testCreate -- Time elapsed: 0 s
04:38:08 org.eclipse.jst.jsp.ui.tests.JSPUIPreferencesTest.testPluginSetPreferences -- Time elapsed: 0.005 s
04:38:08 org.eclipse.jst.jsp.ui.tests.JSPUIPreferencesTest.testBundleGetPreferences -- Time elapsed: 0.001 s
04:38:08 org.eclipse.jst.jsp.ui.tests.JSPUIPreferencesTest.testJavaSeverityPageIDsMatch -- Time elapsed: 0 s
04:38:08 org.eclipse.jst.jsp.ui.tests.JSPUIPreferencesTest.testPluginGetDefaultPreferences -- Time elapsed: 0 s
04:38:08 org.eclipse.jst.jsp.ui.tests.viewer.TestViewerConfigurationJSP.testGetReconciler -- Time elapsed: 0.002 s
04:38:08 org.eclipse.jst.jsp.ui.tests.viewer.TestViewerConfigurationJSP.testGetInformationControlCreator -- Time elapsed: 0.002 s
04:38:08 org.eclipse.jst.jsp.ui.tests.viewer.TestViewerConfigurationJSP.testGetInformationPresenter -- Time elapsed: 0.002 s
04:38:08 org.eclipse.jst.jsp.ui.tests.viewer.TestViewerConfigurationJSP.testGetHyperlinkDetectors -- Time elapsed: 0.001 s
04:38:08 org.eclipse.jst.jsp.ui.tests.viewer.TestViewerConfigurationJSP.testGetDoubleClickStrategy -- Time elapsed: 0.002 s
04:38:08 org.eclipse.jst.jsp.ui.tests.viewer.TestViewerConfigurationJSP.testGetAutoEditStrategies -- Time elapsed: 0.001 s
04:38:08 org.eclipse.jst.jsp.ui.tests.viewer.TestViewerConfigurationJSP.testGetConfiguredContentTypes -- Time elapsed: 0.001 s
04:38:08 org.eclipse.jst.jsp.ui.tests.viewer.TestViewerConfigurationJSP.testGetAnnotationHover -- Time elapsed: 0.002 s
04:38:08 org.eclipse.jst.jsp.ui.tests.viewer.TestViewerConfigurationJSP.testGetLineStyleProviders -- Time elapsed: 0.001 s
04:38:08 org.eclipse.jst.jsp.ui.tests.viewer.TestViewerConfigurationJSP.testGetTextHover -- Time elapsed: 0.002 s
04:38:08 org.eclipse.jst.jsp.ui.tests.viewer.TestViewerConfigurationJSP.testGetContentAssistant -- Time elapsed: 0.002 s
04:38:08 org.eclipse.jst.jsp.ui.tests.viewer.TestViewerConfigurationJSP.testGetIndentPrefixes -- Time elapsed: 0.001 s
04:38:08 org.eclipse.jst.jsp.ui.tests.viewer.TestViewerConfigurationJSP.testGetContentFormatter -- Time elapsed: 0.001 s
04:38:08 org.eclipse.jst.jsp.ui.tests.TestEditorConfigurationJSP.testGetDocumentationTextHover -- Time elapsed: 0.002 s
04:38:08 org.eclipse.jst.jsp.ui.tests.TestEditorConfigurationJSP.testGetPropertySheetConfiguration -- Time elapsed: 0.001 s
04:38:08 org.eclipse.jst.jsp.ui.tests.TestEditorConfigurationJSP.testGetContentOutlineViewerConfiguration -- Time elapsed: 0 s
04:38:08 org.eclipse.jst.jsp.ui.tests.TestEditorConfigurationJSP.testGetSourceViewerConfiguration -- Time elapsed: 0 s
04:38:08 org.eclipse.jst.jsp.ui.tests.pagedirective.TestPageDirective.testAdapt -- Time elapsed: 0.001 s
04:38:08 org.eclipse.jst.jsp.ui.tests.pagedirective.TestPageDirective.testBasicChangedPDBack -- Time elapsed: 0.001 s
04:38:08 org.eclipse.jst.jsp.ui.tests.pagedirective.TestPageDirective.testBasicPD -- Time elapsed: 0.001 s
04:38:08 org.eclipse.jst.jsp.ui.tests.pagedirective.TestPageDirective.testSetEmbeddedType -- Time elapsed: 0 s
04:38:08 org.eclipse.jst.jsp.ui.tests.pagedirective.TestPageDirective.testSetLanguage -- Time elapsed: 0.001 s
04:38:08 org.eclipse.jst.jsp.ui.tests.pagedirective.TestPageDirective.testRelease -- Time elapsed: 0 s
04:38:08 org.eclipse.jst.jsp.ui.tests.pagedirective.TestPageDirective.testAddEmbeddedFactory -- Time elapsed: 0.001 s
04:38:08 org.eclipse.jst.jsp.ui.tests.pagedirective.TestPageDirective.testGetTarget -- Time elapsed: 0.001 s
04:38:08 org.eclipse.jst.jsp.ui.tests.pagedirective.TestPageDirective.testBasicChangedPD -- Time elapsed: 0 s
04:38:08 org.eclipse.jst.jsp.ui.tests.document.FileBufferDocumentTester.testFile100 -- Time elapsed: 0.451 s
04:38:08 org.eclipse.jst.jsp.ui.tests.document.FileBufferDocumentTester.testFile101 -- Time elapsed: 0.002 s
04:38:08 org.eclipse.jst.jsp.ui.tests.document.FileBufferDocumentTester.testFile102 -- Time elapsed: 0.008 s
04:38:08 org.eclipse.jst.jsp.ui.tests.document.FileBufferDocumentTester.testFile70 -- Time elapsed: 0.003 s
04:38:08 org.eclipse.jst.jsp.ui.tests.document.FileBufferDocumentTester.testFile71 -- Time elapsed: 0.001 s
04:38:08 org.eclipse.jst.jsp.ui.tests.document.FileBufferDocumentTester.testFile72 -- Time elapsed: 0.001 s
04:38:08 org.eclipse.jst.jsp.ui.tests.document.FileBufferDocumentTester.testFile73 -- Time elapsed: 0.004 s
04:38:08 org.eclipse.jst.jsp.ui.tests.document.FileBufferDocumentTester.testFile74 -- Time elapsed: 0 s
04:38:08 org.eclipse.jst.jsp.ui.tests.document.FileBufferDocumentTester.testFile75 -- Time elapsed: 0.001 s
04:38:08 org.eclipse.jst.jsp.ui.tests.document.FileBufferDocumentTester.testFile76 -- Time elapsed: 0 s
04:38:08 org.eclipse.jst.jsp.ui.tests.document.FileBufferDocumentTester.testFile77 -- Time elapsed: 0.002 s
04:38:08 org.eclipse.jst.jsp.ui.tests.document.FileBufferDocumentTester.testFile78 -- Time elapsed: 0 s
04:38:08 org.eclipse.jst.jsp.ui.tests.document.FileBufferDocumentTester.testFile79 -- Time elapsed: 0.001 s
04:38:08 org.eclipse.jst.jsp.ui.tests.document.FileBufferDocumentTester.testFile80 -- Time elapsed: 0.051 s
04:38:08 org.eclipse.jst.jsp.ui.tests.document.FileBufferDocumentTester.testFile81 -- Time elapsed: 0.001 s
04:38:08 org.eclipse.jst.jsp.ui.tests.document.FileBufferDocumentTester.testFile82 -- Time elapsed: 0.002 s
04:38:08 org.eclipse.jst.jsp.ui.tests.document.FileBufferDocumentTester.testFile83 -- Time elapsed: 0.001 s
04:38:08 org.eclipse.jst.jsp.ui.tests.document.FileBufferDocumentTester.testFile84 -- Time elapsed: 0.001 s
04:38:08 org.eclipse.jst.jsp.ui.tests.document.FileBufferDocumentTester.testFile85 -- Time elapsed: 0.001 s
04:38:08 org.eclipse.jst.jsp.ui.tests.document.FileBufferDocumentTester.testFile86 -- Time elapsed: 0.001 s
04:38:08 org.eclipse.jst.jsp.ui.tests.document.FileBufferDocumentTester.testFile87 -- Time elapsed: 0 s
04:38:08 org.eclipse.jst.jsp.ui.tests.document.FileBufferDocumentTester.testFile88 -- Time elapsed: 0.001 s
04:38:08 org.eclipse.jst.jsp.ui.tests.document.FileBufferDocumentTester.testFile89 -- Time elapsed: 0.001 s
04:38:08 org.eclipse.jst.jsp.ui.tests.document.FileBufferDocumentTester.testFile90 -- Time elapsed: 0.001 s
04:38:08 org.eclipse.jst.jsp.ui.tests.document.FileBufferDocumentTester.testFile91 -- Time elapsed: 0.004 s
04:38:08 org.eclipse.jst.jsp.ui.tests.document.FileBufferDocumentTester.testFile92 -- Time elapsed: 0 s
04:38:08 org.eclipse.jst.jsp.ui.tests.document.FileBufferDocumentTester.testFile93 -- Time elapsed: 0.001 s
04:38:08 org.eclipse.jst.jsp.ui.tests.document.FileBufferDocumentTester.testFile94 -- Time elapsed: 0.001 s
04:38:08 org.eclipse.jst.jsp.ui.tests.document.FileBufferDocumentTester.testFile95 -- Time elapsed: 0.001 s
04:38:08 org.eclipse.jst.jsp.ui.tests.document.FileBufferDocumentTester.testFile96 -- Time elapsed: 0.001 s
04:38:08 org.eclipse.jst.jsp.ui.tests.document.FileBufferDocumentTester.testFile97 -- Time elapsed: 0.001 s
04:38:08 org.eclipse.jst.jsp.ui.tests.document.FileBufferDocumentTester.testFile98 -- Time elapsed: 0.001 s
04:38:08 org.eclipse.jst.jsp.ui.tests.document.FileBufferDocumentTester.testFile99 -- Time elapsed: 0.003 s
04:38:08 org.eclipse.jst.jsp.ui.tests.TestModelClone.testCreateStructuredModelJSP -- Time elapsed: 0.004 s
04:38:08 org.eclipse.jst.jsp.ui.tests.TestModelClone.testCreateStructuredModelJSPWML -- Time elapsed: 0.071 s
04:38:08 org.eclipse.jst.jsp.ui.tests.TestModelClone.testCreateStructuredModelJSPXML -- Time elapsed: 0.008 s
04:38:08 org.eclipse.jst.jsp.ui.tests.TestModelClone.testCreateStructuredModelJSPXHTML2 -- Time elapsed: 0.002 s
04:38:08 org.eclipse.jst.jsp.ui.tests.TestModelClone.testCloneStructuredModelJSP -- Time elapsed: 0.001 s
04:38:08 org.eclipse.jst.jsp.ui.tests.TestModelClone.testCloneStructuredModelXML -- Time elapsed: 0 s
04:38:08 org.eclipse.jst.jsp.ui.tests.TestModelClone.testCreateStructuredModelHTML -- Time elapsed: 0.002 s
04:38:08 org.eclipse.jst.jsp.ui.tests.TestModelClone.testCreateStructuredModelJSPXHTMnoDoctype -- Time elapsed: 0.001 s
04:38:08 org.eclipse.jst.jsp.ui.tests.TestModelClone.testCreateStructuredModelJSPXHTML -- Time elapsed: 0.001 s
04:38:08 org.eclipse.jst.jsp.ui.tests.TestModelClone.testCloneStructuredModelJSPXML -- Time elapsed: 0.001 s
04:38:08 org.eclipse.jst.jsp.ui.tests.TestModelClone.testCloneStructuredModelHTML -- Time elapsed: 0 s
04:38:08 org.eclipse.jst.jsp.ui.tests.model.TestModelsFromFiles.testSimpleCase -- Time elapsed: 0.004 s
04:38:08 org.eclipse.jst.jsp.ui.tests.model.TestModelsFromFiles.testXHTMLTransitional1 -- Time elapsed: 0.081 s
04:38:08 org.eclipse.jst.jsp.ui.tests.model.TestModelsFromFiles.testXHTMLTransitional2 -- Time elapsed: 0.004 s
04:38:08 org.eclipse.jst.jsp.ui.tests.model.TestModelsFromFiles.testXHTMLTransitional3 -- Time elapsed: 0.003 s
04:38:08 org.eclipse.jst.jsp.ui.tests.model.TestModelsFromFiles.testNonExistentJSPModel -- Time elapsed: 0.003 s
04:38:08 org.eclipse.jst.jsp.ui.tests.model.TestModelsFromFiles.testSimpleDocumentCaseJSP -- Time elapsed: 0.003 s
04:38:08 org.eclipse.jst.jsp.ui.tests.model.TestModelsFromFiles.testSimpleDocumentCaseXML -- Time elapsed: 0.001 s
04:38:08 org.eclipse.jst.jsp.ui.tests.model.TestModelsFromFiles.testComplexCase -- Time elapsed: 0.008 s
04:38:08 org.eclipse.jst.jsp.ui.tests.model.TestModelsFromFiles.testNonExistentXMLModel -- Time elapsed: 0.010 s
04:38:08 org.eclipse.jst.jsp.ui.tests.model.TestModelsFromFiles.testJSPWithXMLOutput -- Time elapsed: 0.004 s
04:38:08 org.eclipse.jst.jsp.ui.tests.model.TestModelsFromFiles.testNonExistentJSP -- Time elapsed: 0.001 s
04:38:08 org.eclipse.jst.jsp.ui.tests.model.TestModelsFromFiles.testNonExistentXML -- Time elapsed: 0.060 s
04:38:08 org.eclipse.jst.jsp.ui.tests.model.TestModelsFromFiles.testHTMLTransitional1 -- Time elapsed: 0.003 s
04:38:08 org.eclipse.jst.jsp.ui.tests.model.TestModelsFromFiles.testHTMLTransitional2 -- Time elapsed: 0.004 s
04:38:08 org.eclipse.jst.jsp.ui.tests.model.TestModelsFromFiles.testNonExistentJSPDocument -- Time elapsed: 0.001 s
04:38:08 org.eclipse.jst.jsp.ui.tests.model.TestModelsFromFiles.testReload -- Time elapsed: 0.009 s
04:38:08 org.eclipse.jst.jsp.ui.tests.model.TestModelsFromFiles.testNonExistentXMLDocument -- Time elapsed: 0.001 s
04:38:08 org.eclipse.jst.jsp.ui.tests.TestModelEmbeddedContentType.testStructuredModelEmbeddedHTML -- Time elapsed: 0 s
04:38:08 org.eclipse.jst.jsp.ui.tests.TestModelEmbeddedContentType.testStructuredModelEmbeddedJSP -- Time elapsed: 0.002 s
04:38:08 org.eclipse.jst.jsp.ui.tests.TestModelEmbeddedContentType.testStructuredModelEmbeddedXML -- Time elapsed: 0 s
04:38:08 org.eclipse.jst.jsp.ui.tests.TestModelEmbeddedContentType.testStructuredModelEmbeddedJSPChange -- Time elapsed: 0.001 s
04:38:08 org.eclipse.jst.jsp.ui.tests.contentdescription.TestContentDescription.testJSPWithHTMLOutput -- Time elapsed: 0.001 s
04:38:08 org.eclipse.jst.jsp.ui.tests.contentdescription.TestContentDescription.testWithXMLPIWithXMLSyntax -- Time elapsed: 0 s
04:38:08 org.eclipse.jst.jsp.ui.tests.contentdescription.TestContentDescription.testJSPWithXHTMLOutput -- Time elapsed: 0 s
04:38:08 org.eclipse.jst.jsp.ui.tests.contentdescription.TestContentDescription.testWithXMLPIWithJSPSyntax -- Time elapsed: 0.001 s
04:38:08 org.eclipse.jst.jsp.ui.tests.contentdescription.TestContentDescription.testNoXMLPIWithJSPSyntax -- Time elapsed: 0 s
04:38:08 org.eclipse.jst.jsp.ui.tests.contentdescription.TestContentDescription.testJSPWithXMLOutput -- Time elapsed: 0.001 s
04:38:08 org.eclipse.jst.jsp.ui.tests.validation.JSPHTMLValidatorTest.testJSPinAttributes -- Time elapsed: 0.217 s
04:38:08 org.eclipse.jst.jsp.ui.tests.validation.JSPHTMLValidatorTest.testRemoveAndAddBackCommentEndTag -- Time elapsed: 0.111 s
04:38:08 org.eclipse.jst.jsp.ui.tests.validation.JSPHTMLValidatorTest.testJSPinAttributesHTML -- Time elapsed: 0.007 s
04:38:08 org.eclipse.jst.jsp.ui.tests.validation.JSPHTMLValidatorTest.testBadAttributeName -- Time elapsed: 0.002 s
04:38:08 org.eclipse.jst.jsp.ui.tests.breakpointproviders.BreakpointProvidersTest.testNoAdditionalProviders -- Time elapsed: 0 s
04:38:08 org.eclipse.jst.jsp.ui.tests.breakpointproviders.BreakpointProvidersTest.testMultipleProviders -- Time elapsed: 0.001 s
04:38:08 org.eclipse.jst.jsp.ui.tests.breakpointproviders.BreakpointProvidersTest.testAdditionalProviders -- Time elapsed: 0 s
04:38:08 org.eclipse.jst.jsp.ui.tests.search.JSPSearchTests.testSearchLocalVariable_DISABLED -- Time elapsed: 0.115 s
04:38:08 org.eclipse.jst.jsp.ui.tests.search.JSPSearchTests.testSearchField -- Time elapsed: 1.642 s
04:38:08 org.eclipse.jst.jsp.ui.tests.search.JSPSearchTests.testIndexWorkspace -- Time elapsed: 0.090 s
04:38:08 org.eclipse.jst.jsp.ui.tests.search.JSPSearchTests.testSearchProjectClasses -- Time elapsed: 1.203 s
04:38:08 org.eclipse.jst.jsp.ui.tests.search.JSPSearchTests.testSearchMethod -- Time elapsed: 0.905 s
04:38:08 org.eclipse.jst.jsp.ui.tests.search.JSPSearchTests.testSearchPatternMatch -- Time elapsed: 1.025 s
04:38:08 org.eclipse.jface.text.tests.DefaultUndoManagerTest.testLoopRandomAccessAsUnclosedCompound -- Time elapsed: 0.329 s
04:38:08 org.eclipse.jface.text.tests.DefaultUndoManagerTest.testRepeatableAccessWithMixedAndEmptyCompound -- Time elapsed: 0.094 s
04:38:08 org.eclipse.jface.text.tests.DefaultUndoManagerTest.testDocumentStamp -- Time elapsed: 0.005 s
04:38:08 org.eclipse.jface.text.tests.DefaultUndoManagerTest.testConvertLineDelimiters -- Time elapsed: 0.006 s
04:38:08 org.eclipse.jface.text.tests.DefaultUndoManagerTest.testRandomAccessAsUnclosedCompound -- Time elapsed: 0.024 s
04:38:08 org.eclipse.jface.text.tests.DefaultUndoManagerTest.testLoopRandomAccess -- Time elapsed: 0.930 s
04:38:08 org.eclipse.jface.text.tests.DefaultUndoManagerTest.testRepeatableAccessAsUnclosedCompound -- Time elapsed: 0.010 s
04:38:08 org.eclipse.jface.text.tests.DefaultUndoManagerTest.testLoopRandomAccessWithMixedCompound -- Time elapsed: 1.194 s
04:38:08 org.eclipse.jface.text.tests.DefaultUndoManagerTest.testLoopRandomAccessAsCompound -- Time elapsed: 0.096 s
04:38:08 org.eclipse.jface.text.tests.DefaultUndoManagerTest.testRandomAccessWithMixedCompound -- Time elapsed: 0.071 s
04:38:08 org.eclipse.jface.text.tests.DefaultUndoManagerTest.testRandomAccess -- Time elapsed: 0.035 s
04:38:08 org.eclipse.jface.text.tests.DefaultUndoManagerTest.testDocumentStamp2 -- Time elapsed: 0.005 s
04:38:08 org.eclipse.jface.text.tests.DefaultUndoManagerTest.testLoopConvertLineDelimiters -- Time elapsed: 0.023 s
04:38:08 org.eclipse.jface.text.tests.DefaultUndoManagerTest.testRepeatableAccessAsCompound -- Time elapsed: 0.008 s
04:38:08 org.eclipse.jface.text.tests.DefaultUndoManagerTest.testRepeatableAccess -- Time elapsed: 0.038 s
04:38:08 org.eclipse.jface.text.tests.DefaultUndoManagerTest.testRandomAccessAsCompound -- Time elapsed: 0.011 s
04:38:08 org.eclipse.jface.text.tests.TextViewerUndoManagerTest.testCanUndo -- Time elapsed: 0.027 s
04:38:08 org.eclipse.jface.text.tests.TextViewerUndoManagerTest.testTransferUndoableNonTextOp -- Time elapsed: 0.006 s
04:38:08 org.eclipse.jface.text.tests.TextViewerUndoManagerTest.testTransferNonUndoableNonTextOp -- Time elapsed: 0.005 s
04:38:08 org.eclipse.jface.text.tests.TextViewerUndoManagerTest.testLoopRandomAccessAsUnclosedCompound -- Time elapsed: 0.121 s
04:38:08 org.eclipse.jface.text.tests.TextViewerUndoManagerTest.testRepeatableAccessWithMixedAndEmptyCompound -- Time elapsed: 0.017 s
04:38:08 org.eclipse.jface.text.tests.TextViewerUndoManagerTest.testDocumentStamp -- Time elapsed: 0.005 s
04:38:08 org.eclipse.jface.text.tests.TextViewerUndoManagerTest.testConvertLineDelimiters -- Time elapsed: 0.004 s
04:38:08 org.eclipse.jface.text.tests.TextViewerUndoManagerTest.testRandomAccessAsUnclosedCompound -- Time elapsed: 0.008 s
04:38:08 org.eclipse.jface.text.tests.TextViewerUndoManagerTest.testLoopRandomAccess -- Time elapsed: 0.155 s
04:38:08 org.eclipse.jface.text.tests.TextViewerUndoManagerTest.testRepeatableAccessAsUnclosedCompound -- Time elapsed: 0.008 s
04:38:08 org.eclipse.jface.text.tests.TextViewerUndoManagerTest.testLoopRandomAccessWithMixedCompound -- Time elapsed: 0.272 s
04:38:08 org.eclipse.jface.text.tests.TextViewerUndoManagerTest.testLoopRandomAccessAsCompound -- Time elapsed: 0.070 s
04:38:08 org.eclipse.jface.text.tests.TextViewerUndoManagerTest.testRandomAccessWithMixedCompound -- Time elapsed: 0.014 s
04:38:08 org.eclipse.jface.text.tests.TextViewerUndoManagerTest.testRandomAccess -- Time elapsed: 0.009 s
04:38:08 org.eclipse.jface.text.tests.TextViewerUndoManagerTest.testDocumentStamp2 -- Time elapsed: 0.005 s
04:38:08 org.eclipse.jface.text.tests.TextViewerUndoManagerTest.testLoopConvertLineDelimiters -- Time elapsed: 0.013 s
04:38:08 org.eclipse.jface.text.tests.TextViewerUndoManagerTest.testRepeatableAccessAsCompound -- Time elapsed: 0.008 s
04:38:08 org.eclipse.jface.text.tests.TextViewerUndoManagerTest.testRepeatableAccess -- Time elapsed: 0.010 s
04:38:08 org.eclipse.jface.text.tests.TextViewerUndoManagerTest.testRandomAccessAsCompound -- Time elapsed: 0.007 s
04:38:08 org.eclipse.text.tests.PositionUpdatingCornerCasesTest.testInsert -- Time elapsed: 0.002 s <<< ERROR!
04:38:08 java.lang.NullPointerException: Cannot invoke "org.eclipse.wst.sse.core.internal.ltk.modelhandler.IModelHandler.getDocumentLoader()" because "handler" is null
04:38:08 	at org.eclipse.text.tests.PositionUpdatingCornerCasesTest.createDocument(PositionUpdatingCornerCasesTest.java:59)
04:38:08 	at org.eclipse.text.tests.PositionUpdatingCornerCasesTest.setUp(PositionUpdatingCornerCasesTest.java:50)
04:38:08 	at junit.framework.TestCase.runBare(TestCase.java:140)
04:38:08 	at junit.framework.TestResult$1.protect(TestResult.java:122)
04:38:08 	at junit.framework.TestResult.runProtected(TestResult.java:142)
04:38:08 	at junit.framework.TestResult.run(TestResult.java:125)
04:38:08 	at junit.framework.TestCase.run(TestCase.java:130)
04:38:08 	at junit.framework.TestSuite.runTest(TestSuite.java:241)
04:38:08 	at junit.framework.TestSuite.run(TestSuite.java:236)
04:38:08 	at junit.framework.TestSuite.runTest(TestSuite.java:241)
04:38:08 	at junit.framework.TestSuite.run(TestSuite.java:236)
04:38:08 	at junit.framework.TestSuite.runTest(TestSuite.java:241)
04:38:08 	at junit.framework.TestSuite.run(TestSuite.java:236)
04:38:08 	at org.junit.internal.runners.JUnit38ClassRunner.run(JUnit38ClassRunner.java:90)
04:38:08 	at org.apache.maven.surefire.junit4.JUnit4Provider.execute(JUnit4Provider.java:316)
04:38:08 	at org.apache.maven.surefire.junit4.JUnit4Provider.executeWithRerun(JUnit4Provider.java:240)
04:38:08 	at org.apache.maven.surefire.junit4.JUnit4Provider.executeTestSet(JUnit4Provider.java:214)
04:38:08 	at org.apache.maven.surefire.junit4.JUnit4Provider.invoke(JUnit4Provider.java:155)
04:38:08 	at java.base/jdk.internal.reflect.DirectMethodHandleAccessor.invoke(DirectMethodHandleAccessor.java:103)
04:38:08 	at java.base/java.lang.reflect.Method.invoke(Method.java:580)
04:38:08 	at org.apache.maven.surefire.api.util.ReflectionUtils.invokeMethodWithArray2(ReflectionUtils.java:137)
04:38:08 	at org.apache.maven.surefire.booter.ProviderFactory$ProviderProxy.invoke(ProviderFactory.java:148)
04:38:08 	at org.apache.maven.surefire.booter.ProviderFactory.invokeProvider(ProviderFactory.java:88)
04:38:08 	at org.eclipse.tycho.surefire.osgibooter.OsgiSurefireBooter.run(OsgiSurefireBooter.java:140)
04:38:08 	at org.eclipse.tycho.surefire.osgibooter.AbstractUITestApplication$1.run(AbstractUITestApplication.java:42)
04:38:08 	at org.eclipse.e4.ui.internal.workbench.swt.E4Testable.lambda$1(E4Testable.java:127)
04:38:08 	at org.eclipse.swt.widgets.RunnableLock.run(RunnableLock.java:40)
04:38:08 	at org.eclipse.swt.widgets.Synchronizer.runAsyncMessages(Synchronizer.java:132)
04:38:08 	at org.eclipse.swt.widgets.Display.runAsyncMessages(Display.java:5040)
04:38:08 	at org.eclipse.swt.widgets.Display.readAndDispatch(Display.java:4520)
04:38:08 	at org.eclipse.e4.ui.internal.workbench.swt.PartRenderingEngine$5.run(PartRenderingEngine.java:1151)
04:38:08 	at org.eclipse.core.databinding.observable.Realm.runWithDefault(Realm.java:339)
04:38:08 	at org.eclipse.e4.ui.internal.workbench.swt.PartRenderingEngine.run(PartRenderingEngine.java:1042)
04:38:08 	at org.eclipse.e4.ui.internal.workbench.E4Workbench.createAndRunUI(E4Workbench.java:152)
04:38:08 	at org.eclipse.ui.internal.Workbench.lambda$3(Workbench.java:639)
04:38:08 	at org.eclipse.core.databinding.observable.Realm.runWithDefault(Realm.java:339)
04:38:08 	at org.eclipse.ui.internal.Workbench.createAndRunWorkbench(Workbench.java:546)
04:38:08 	at org.eclipse.ui.PlatformUI.createAndRunWorkbench(PlatformUI.java:173)
04:38:08 	at org.eclipse.ui.internal.ide.application.IDEApplication.start(IDEApplication.java:152)
04:38:08 	at org.eclipse.tycho.surefire.osgibooter.UITestApplication.runApplication(UITestApplication.java:34)
04:38:08 	at org.eclipse.tycho.surefire.osgibooter.AbstractUITestApplication.run(AbstractUITestApplication.java:129)
04:38:08 	at org.eclipse.tycho.surefire.osgibooter.UITestApplication.start(UITestApplication.java:44)
04:38:08 	at org.eclipse.equinox.internal.app.EclipseAppHandle.run(EclipseAppHandle.java:208)
04:38:08 	at org.eclipse.core.runtime.internal.adaptor.EclipseAppLauncher.runApplication(EclipseAppLauncher.java:143)
04:38:08 	at org.eclipse.core.runtime.internal.adaptor.EclipseAppLauncher.start(EclipseAppLauncher.java:109)
04:38:08 	at org.eclipse.core.runtime.adaptor.EclipseStarter.run(EclipseStarter.java:439)
04:38:08 	at org.eclipse.core.runtime.adaptor.EclipseStarter.run(EclipseStarter.java:271)
04:38:08 	at java.base/jdk.internal.reflect.DirectMethodHandleAccessor.invoke(DirectMethodHandleAccessor.java:103)
04:38:08 	at java.base/java.lang.reflect.Method.invoke(Method.java:580)
04:38:08 	at org.eclipse.equinox.launcher.Main.invokeFramework(Main.java:668)
04:38:08 	at org.eclipse.equinox.launcher.Main.basicRun(Main.java:605)
04:38:08 	at org.eclipse.equinox.launcher.Main.run(Main.java:1481)
04:38:08 	at org.eclipse.equinox.launcher.Main.main(Main.java:1454)
04:38:08 
04:38:08 org.eclipse.text.tests.ExclusivePositionUpdaterTest.testDeleteAfter -- Time elapsed: 0 s <<< ERROR!
04:38:08 java.lang.NullPointerException: Cannot invoke "org.eclipse.wst.sse.core.internal.ltk.modelhandler.IModelHandler.getDocumentLoader()" because "handler" is null
04:38:08 	at org.eclipse.text.tests.ExclusivePositionUpdaterTest.createDocument(ExclusivePositionUpdaterTest.java:56)
04:38:08 	at org.eclipse.text.tests.ExclusivePositionUpdaterTest.setUp(ExclusivePositionUpdaterTest.java:47)
04:38:08 	at junit.framework.TestCase.runBare(TestCase.java:140)
04:38:08 	at junit.framework.TestResult$1.protect(TestResult.java:122)
04:38:08 	at junit.framework.TestResult.runProtected(TestResult.java:142)
04:38:08 	at junit.framework.TestResult.run(TestResult.java:125)
04:38:08 	at junit.framework.TestCase.run(TestCase.java:130)
04:38:08 	at junit.framework.TestSuite.runTest(TestSuite.java:241)
04:38:08 	at junit.framework.TestSuite.run(TestSuite.java:236)
04:38:08 	at junit.framework.TestSuite.runTest(TestSuite.java:241)
04:38:08 	at junit.framework.TestSuite.run(TestSuite.java:236)
04:38:08 	at junit.framework.TestSuite.runTest(TestSuite.java:241)
04:38:08 	at junit.framework.TestSuite.run(TestSuite.java:236)
04:38:08 	at org.junit.internal.runners.JUnit38ClassRunner.run(JUnit38ClassRunner.java:90)
04:38:08 	at org.apache.maven.surefire.junit4.JUnit4Provider.execute(JUnit4Provider.java:316)
04:38:08 	at org.apache.maven.surefire.junit4.JUnit4Provider.executeWithRerun(JUnit4Provider.java:240)
04:38:08 	at org.apache.maven.surefire.junit4.JUnit4Provider.executeTestSet(JUnit4Provider.java:214)
04:38:08 	at org.apache.maven.surefire.junit4.JUnit4Provider.invoke(JUnit4Provider.java:155)
04:38:08 	at java.base/jdk.internal.reflect.DirectMethodHandleAccessor.invoke(DirectMethodHandleAccessor.java:103)
04:38:08 	at java.base/java.lang.reflect.Method.invoke(Method.java:580)
04:38:08 	at org.apache.maven.surefire.api.util.ReflectionUtils.invokeMethodWithArray2(ReflectionUtils.java:137)
04:38:08 	at org.apache.maven.surefire.booter.ProviderFactory$ProviderProxy.invoke(ProviderFactory.java:148)
04:38:08 	at org.apache.maven.surefire.booter.ProviderFactory.invokeProvider(ProviderFactory.java:88)
04:38:08 	at org.eclipse.tycho.surefire.osgibooter.OsgiSurefireBooter.run(OsgiSurefireBooter.java:140)
04:38:08 	at org.eclipse.tycho.surefire.osgibooter.AbstractUITestApplication$1.run(AbstractUITestApplication.java:42)
04:38:08 	at org.eclipse.e4.ui.internal.workbench.swt.E4Testable.lambda$1(E4Testable.java:127)
04:38:08 	at org.eclipse.swt.widgets.RunnableLock.run(RunnableLock.java:40)
04:38:08 	at org.eclipse.swt.widgets.Synchronizer.runAsyncMessages(Synchronizer.java:132)
04:38:08 	at org.eclipse.swt.widgets.Display.runAsyncMessages(Display.java:5040)
04:38:08 	at org.eclipse.swt.widgets.Display.readAndDispatch(Display.java:4520)
04:38:08 	at org.eclipse.e4.ui.internal.workbench.swt.PartRenderingEngine$5.run(PartRenderingEngine.java:1151)
04:38:08 	at org.eclipse.core.databinding.observable.Realm.runWithDefault(Realm.java:339)
04:38:08 	at org.eclipse.e4.ui.internal.workbench.swt.PartRenderingEngine.run(PartRenderingEngine.java:1042)
04:38:08 	at org.eclipse.e4.ui.internal.workbench.E4Workbench.createAndRunUI(E4Workbench.java:152)
04:38:08 	at org.eclipse.ui.internal.Workbench.lambda$3(Workbench.java:639)
04:38:08 	at org.eclipse.core.databinding.observable.Realm.runWithDefault(Realm.java:339)
04:38:08 	at org.eclipse.ui.internal.Workbench.createAndRunWorkbench(Workbench.java:546)
04:38:08 	at org.eclipse.ui.PlatformUI.createAndRunWorkbench(PlatformUI.java:173)
04:38:08 	at org.eclipse.ui.internal.ide.application.IDEApplication.start(IDEApplication.java:152)
04:38:08 	at org.eclipse.tycho.surefire.osgibooter.UITestApplication.runApplication(UITestApplication.java:34)
04:38:08 	at org.eclipse.tycho.surefire.osgibooter.AbstractUITestApplication.run(AbstractUITestApplication.java:129)
04:38:08 	at org.eclipse.tycho.surefire.osgibooter.UITestApplication.start(UITestApplication.java:44)
04:38:08 	at org.eclipse.equinox.internal.app.EclipseAppHandle.run(EclipseAppHandle.java:208)
04:38:08 	at org.eclipse.core.runtime.internal.adaptor.EclipseAppLauncher.runApplication(EclipseAppLauncher.java:143)
04:38:08 	at org.eclipse.core.runtime.internal.adaptor.EclipseAppLauncher.start(EclipseAppLauncher.java:109)
04:38:08 	at org.eclipse.core.runtime.adaptor.EclipseStarter.run(EclipseStarter.java:439)
04:38:08 	at org.eclipse.core.runtime.adaptor.EclipseStarter.run(EclipseStarter.java:271)
04:38:08 	at java.base/jdk.internal.reflect.DirectMethodHandleAccessor.invoke(DirectMethodHandleAccessor.java:103)
04:38:08 	at java.base/java.lang.reflect.Method.invoke(Method.java:580)
04:38:08 	at org.eclipse.equinox.launcher.Main.invokeFramework(Main.java:668)
04:38:08 	at org.eclipse.equinox.launcher.Main.basicRun(Main.java:605)
04:38:08 	at org.eclipse.equinox.launcher.Main.run(Main.java:1481)
04:38:08 	at org.eclipse.equinox.launcher.Main.main(Main.java:1454)
04:38:08 
04:38:08 org.eclipse.text.tests.ExclusivePositionUpdaterTest.testReplaceRightBorder -- Time elapsed: 0 s <<< ERROR!
04:38:08 java.lang.NullPointerException: Cannot invoke "org.eclipse.wst.sse.core.internal.ltk.modelhandler.IModelHandler.getDocumentLoader()" because "handler" is null
04:38:08 	at org.eclipse.text.tests.ExclusivePositionUpdaterTest.createDocument(ExclusivePositionUpdaterTest.java:56)
04:38:08 	at org.eclipse.text.tests.ExclusivePositionUpdaterTest.setUp(ExclusivePositionUpdaterTest.java:47)
04:38:08 	at junit.framework.TestCase.runBare(TestCase.java:140)
04:38:08 	at junit.framework.TestResult$1.protect(TestResult.java:122)
04:38:08 	at junit.framework.TestResult.runProtected(TestResult.java:142)
04:38:08 	at junit.framework.TestResult.run(TestResult.java:125)
04:38:08 	at junit.framework.TestCase.run(TestCase.java:130)
04:38:08 	at junit.framework.TestSuite.runTest(TestSuite.java:241)
04:38:08 	at junit.framework.TestSuite.run(TestSuite.java:236)
04:38:08 	at junit.framework.TestSuite.runTest(TestSuite.java:241)
04:38:08 	at junit.framework.TestSuite.run(TestSuite.java:236)
04:38:08 	at junit.framework.TestSuite.runTest(TestSuite.java:241)
04:38:08 	at junit.framework.TestSuite.run(TestSuite.java:236)
04:38:08 	at org.junit.internal.runners.JUnit38ClassRunner.run(JUnit38ClassRunner.java:90)
04:38:08 	at org.apache.maven.surefire.junit4.JUnit4Provider.execute(JUnit4Provider.java:316)
04:38:08 	at org.apache.maven.surefire.junit4.JUnit4Provider.executeWithRerun(JUnit4Provider.java:240)
04:38:08 	at org.apache.maven.surefire.junit4.JUnit4Provider.executeTestSet(JUnit4Provider.java:214)
04:38:08 	at org.apache.maven.surefire.junit4.JUnit4Provider.invoke(JUnit4Provider.java:155)
04:38:08 	at java.base/jdk.internal.reflect.DirectMethodHandleAccessor.invoke(DirectMethodHandleAccessor.java:103)
04:38:08 	at java.base/java.lang.reflect.Method.invoke(Method.java:580)
04:38:08 	at org.apache.maven.surefire.api.util.ReflectionUtils.invokeMethodWithArray2(ReflectionUtils.java:137)
04:38:08 	at org.apache.maven.surefire.booter.ProviderFactory$ProviderProxy.invoke(ProviderFactory.java:148)
04:38:08 	at org.apache.maven.surefire.booter.ProviderFactory.invokeProvider(ProviderFactory.java:88)
04:38:08 	at org.eclipse.tycho.surefire.osgibooter.OsgiSurefireBooter.run(OsgiSurefireBooter.java:140)
04:38:08 	at org.eclipse.tycho.surefire.osgibooter.AbstractUITestApplication$1.run(AbstractUITestApplication.java:42)
04:38:08 	at org.eclipse.e4.ui.internal.workbench.swt.E4Testable.lambda$1(E4Testable.java:127)
04:38:08 	at org.eclipse.swt.widgets.RunnableLock.run(RunnableLock.java:40)
04:38:08 	at org.eclipse.swt.widgets.Synchronizer.runAsyncMessages(Synchronizer.java:132)
04:38:08 	at org.eclipse.swt.widgets.Display.runAsyncMessages(Display.java:5040)
04:38:08 	at org.eclipse.swt.widgets.Display.readAndDispatch(Display.java:4520)
04:38:08 	at org.eclipse.e4.ui.internal.workbench.swt.PartRenderingEngine$5.run(PartRenderingEngine.java:1151)
04:38:08 	at org.eclipse.core.databinding.observable.Realm.runWithDefault(Realm.java:339)
04:38:08 	at org.eclipse.e4.ui.internal.workbench.swt.PartRenderingEngine.run(PartRenderingEngine.java:1042)
04:38:08 	at org.eclipse.e4.ui.internal.workbench.E4Workbench.createAndRunUI(E4Workbench.java:152)
04:38:08 	at org.eclipse.ui.internal.Workbench.lambda$3(Workbench.java:639)
04:38:08 	at org.eclipse.core.databinding.observable.Realm.runWithDefault(Realm.java:339)
04:38:08 	at org.eclipse.ui.internal.Workbench.createAndRunWorkbench(Workbench.java:546)
04:38:08 	at org.eclipse.ui.PlatformUI.createAndRunWorkbench(PlatformUI.java:173)
04:38:08 	at org.eclipse.ui.internal.ide.application.IDEApplication.start(IDEApplication.java:152)
04:38:08 	at org.eclipse.tycho.surefire.osgibooter.UITestApplication.runApplication(UITestApplication.java:34)
04:38:08 	at org.eclipse.tycho.surefire.osgibooter.AbstractUITestApplication.run(AbstractUITestApplication.java:129)
04:38:08 	at org.eclipse.tycho.surefire.osgibooter.UITestApplication.start(UITestApplication.java:44)
04:38:08 	at org.eclipse.equinox.internal.app.EclipseAppHandle.run(EclipseAppHandle.java:208)
04:38:08 	at org.eclipse.core.runtime.internal.adaptor.EclipseAppLauncher.runApplication(EclipseAppLauncher.java:143)
04:38:08 	at org.eclipse.core.runtime.internal.adaptor.EclipseAppLauncher.start(EclipseAppLauncher.java:109)
04:38:08 	at org.eclipse.core.runtime.adaptor.EclipseStarter.run(EclipseStarter.java:439)
04:38:08 	at org.eclipse.core.runtime.adaptor.EclipseStarter.run(EclipseStarter.java:271)
04:38:08 	at java.base/jdk.internal.reflect.DirectMethodHandleAccessor.invoke(DirectMethodHandleAccessor.java:103)
04:38:08 	at java.base/java.lang.reflect.Method.invoke(Method.java:580)
04:38:08 	at org.eclipse.equinox.launcher.Main.invokeFramework(Main.java:668)
04:38:08 	at org.eclipse.equinox.launcher.Main.basicRun(Main.java:605)
04:38:08 	at org.eclipse.equinox.launcher.Main.run(Main.java:1481)
04:38:08 	at org.eclipse.equinox.launcher.Main.main(Main.java:1454)
04:38:08 
04:38:08 org.eclipse.text.tests.ExclusivePositionUpdaterTest.testAddRightBefore -- Time elapsed: 0 s <<< ERROR!
04:38:08 java.lang.NullPointerException: Cannot invoke "org.eclipse.wst.sse.core.internal.ltk.modelhandler.IModelHandler.getDocumentLoader()" because "handler" is null
04:38:08 	at org.eclipse.text.tests.ExclusivePositionUpdaterTest.createDocument(ExclusivePositionUpdaterTest.java:56)
04:38:08 	at org.eclipse.text.tests.ExclusivePositionUpdaterTest.setUp(ExclusivePositionUpdaterTest.java:47)
04:38:08 	at junit.framework.TestCase.runBare(TestCase.java:140)
04:38:08 	at junit.framework.TestResult$1.protect(TestResult.java:122)
04:38:08 	at junit.framework.TestResult.runProtected(TestResult.java:142)
04:38:08 	at junit.framework.TestResult.run(TestResult.java:125)
04:38:08 	at junit.framework.TestCase.run(TestCase.java:130)
04:38:08 	at junit.framework.TestSuite.runTest(TestSuite.java:241)
04:38:08 	at junit.framework.TestSuite.run(TestSuite.java:236)
04:38:08 	at junit.framework.TestSuite.runTest(TestSuite.java:241)
04:38:08 	at junit.framework.TestSuite.run(TestSuite.java:236)
04:38:08 	at junit.framework.TestSuite.runTest(TestSuite.java:241)
04:38:08 	at junit.framework.TestSuite.run(TestSuite.java:236)
04:38:08 	at org.junit.internal.runners.JUnit38ClassRunner.run(JUnit38ClassRunner.java:90)
04:38:08 	at org.apache.maven.surefire.junit4.JUnit4Provider.execute(JUnit4Provider.java:316)
04:38:08 	at org.apache.maven.surefire.junit4.JUnit4Provider.executeWithRerun(JUnit4Provider.java:240)
04:38:08 	at org.apache.maven.surefire.junit4.JUnit4Provider.executeTestSet(JUnit4Provider.java:214)
04:38:08 	at org.apache.maven.surefire.junit4.JUnit4Provider.invoke(JUnit4Provider.java:155)
04:38:08 	at java.base/jdk.internal.reflect.DirectMethodHandleAccessor.invoke(DirectMethodHandleAccessor.java:103)
04:38:08 	at java.base/java.lang.reflect.Method.invoke(Method.java:580)
04:38:08 	at org.apache.maven.surefire.api.util.ReflectionUtils.invokeMethodWithArray2(ReflectionUtils.java:137)
04:38:08 	at org.apache.maven.surefire.booter.ProviderFactory$ProviderProxy.invoke(ProviderFactory.java:148)
04:38:08 	at org.apache.maven.surefire.booter.ProviderFactory.invokeProvider(ProviderFactory.java:88)
04:38:08 	at org.eclipse.tycho.surefire.osgibooter.OsgiSurefireBooter.run(OsgiSurefireBooter.java:140)
04:38:08 	at org.eclipse.tycho.surefire.osgibooter.AbstractUITestApplication$1.run(AbstractUITestApplication.java:42)
04:38:08 	at org.eclipse.e4.ui.internal.workbench.swt.E4Testable.lambda$1(E4Testable.java:127)
04:38:08 	at org.eclipse.swt.widgets.RunnableLock.run(RunnableLock.java:40)
04:38:08 	at org.eclipse.swt.widgets.Synchronizer.runAsyncMessages(Synchronizer.java:132)
04:38:08 	at org.eclipse.swt.widgets.Display.runAsyncMessages(Display.java:5040)
04:38:08 	at org.eclipse.swt.widgets.Display.readAndDispatch(Display.java:4520)
04:38:08 	at org.eclipse.e4.ui.internal.workbench.swt.PartRenderingEngine$5.run(PartRenderingEngine.java:1151)
04:38:08 	at org.eclipse.core.databinding.observable.Realm.runWithDefault(Realm.java:339)
04:38:08 	at org.eclipse.e4.ui.internal.workbench.swt.PartRenderingEngine.run(PartRenderingEngine.java:1042)
04:38:08 	at org.eclipse.e4.ui.internal.workbench.E4Workbench.createAndRunUI(E4Workbench.java:152)
04:38:08 	at org.eclipse.ui.internal.Workbench.lambda$3(Workbench.java:639)
04:38:08 	at org.eclipse.core.databinding.observable.Realm.runWithDefault(Realm.java:339)
04:38:08 	at org.eclipse.ui.internal.Workbench.createAndRunWorkbench(Workbench.java:546)
04:38:08 	at org.eclipse.ui.PlatformUI.createAndRunWorkbench(PlatformUI.java:173)
04:38:08 	at org.eclipse.ui.internal.ide.application.IDEApplication.start(IDEApplication.java:152)
04:38:08 	at org.eclipse.tycho.surefire.osgibooter.UITestApplication.runApplication(UITestApplication.java:34)
04:38:08 	at org.eclipse.tycho.surefire.osgibooter.AbstractUITestApplication.run(AbstractUITestApplication.java:129)
04:38:08 	at org.eclipse.tycho.surefire.osgibooter.UITestApplication.start(UITestApplication.java:44)
04:38:08 	at org.eclipse.equinox.internal.app.EclipseAppHandle.run(EclipseAppHandle.java:208)
04:38:08 	at org.eclipse.core.runtime.internal.adaptor.EclipseAppLauncher.runApplication(EclipseAppLauncher.java:143)
04:38:08 	at org.eclipse.core.runtime.internal.adaptor.EclipseAppLauncher.start(EclipseAppLauncher.java:109)
04:38:08 	at org.eclipse.core.runtime.adaptor.EclipseStarter.run(EclipseStarter.java:439)
04:38:08 	at org.eclipse.core.runtime.adaptor.EclipseStarter.run(EclipseStarter.java:271)
04:38:08 	at java.base/jdk.internal.reflect.DirectMethodHandleAccessor.invoke(DirectMethodHandleAccessor.java:103)
04:38:08 	at java.base/java.lang.reflect.Method.invoke(Method.java:580)
04:38:08 	at org.eclipse.equinox.launcher.Main.invokeFramework(Main.java:668)
04:38:08 	at org.eclipse.equinox.launcher.Main.basicRun(Main.java:605)
04:38:08 	at org.eclipse.equinox.launcher.Main.run(Main.java:1481)
04:38:08 	at org.eclipse.equinox.launcher.Main.main(Main.java:1454)
04:38:08 
04:38:08 org.eclipse.text.tests.ExclusivePositionUpdaterTest.testDeleteOverRightBorder -- Time elapsed: 0 s <<< ERROR!
04:38:08 java.lang.NullPointerException: Cannot invoke "org.eclipse.wst.sse.core.internal.ltk.modelhandler.IModelHandler.getDocumentLoader()" because "handler" is null
04:38:08 	at org.eclipse.text.tests.ExclusivePositionUpdaterTest.createDocument(ExclusivePositionUpdaterTest.java:56)
04:38:08 	at org.eclipse.text.tests.ExclusivePositionUpdaterTest.setUp(ExclusivePositionUpdaterTest.java:47)
04:38:08 	at junit.framework.TestCase.runBare(TestCase.java:140)
04:38:08 	at junit.framework.TestResult$1.protect(TestResult.java:122)
04:38:08 	at junit.framework.TestResult.runProtected(TestResult.java:142)
04:38:08 	at junit.framework.TestResult.run(TestResult.java:125)
04:38:08 	at junit.framework.TestCase.run(TestCase.java:130)
04:38:08 	at junit.framework.TestSuite.runTest(TestSuite.java:241)
04:38:08 	at junit.framework.TestSuite.run(TestSuite.java:236)
04:38:08 	at junit.framework.TestSuite.runTest(TestSuite.java:241)
04:38:08 	at junit.framework.TestSuite.run(TestSuite.java:236)
04:38:08 	at junit.framework.TestSuite.runTest(TestSuite.java:241)
04:38:08 	at junit.framework.TestSuite.run(TestSuite.java:236)
04:38:08 	at org.junit.internal.runners.JUnit38ClassRunner.run(JUnit38ClassRunner.java:90)
04:38:08 	at org.apache.maven.surefire.junit4.JUnit4Provider.execute(JUnit4Provider.java:316)
04:38:08 	at org.apache.maven.surefire.junit4.JUnit4Provider.executeWithRerun(JUnit4Provider.java:240)
04:38:08 	at org.apache.maven.surefire.junit4.JUnit4Provider.executeTestSet(JUnit4Provider.java:214)
04:38:08 	at org.apache.maven.surefire.junit4.JUnit4Provider.invoke(JUnit4Provider.java:155)
04:38:08 	at java.base/jdk.internal.reflect.DirectMethodHandleAccessor.invoke(DirectMethodHandleAccessor.java:103)
04:38:08 	at java.base/java.lang.reflect.Method.invoke(Method.java:580)
04:38:08 	at org.apache.maven.surefire.api.util.ReflectionUtils.invokeMethodWithArray2(ReflectionUtils.java:137)
04:38:08 	at org.apache.maven.surefire.booter.ProviderFactory$ProviderProxy.invoke(ProviderFactory.java:148)
04:38:08 	at org.apache.maven.surefire.booter.ProviderFactory.invokeProvider(ProviderFactory.java:88)
04:38:08 	at org.eclipse.tycho.surefire.osgibooter.OsgiSurefireBooter.run(OsgiSurefireBooter.java:140)
04:38:08 	at org.eclipse.tycho.surefire.osgibooter.AbstractUITestApplication$1.run(AbstractUITestApplication.java:42)
04:38:08 	at org.eclipse.e4.ui.internal.workbench.swt.E4Testable.lambda$1(E4Testable.java:127)
04:38:08 	at org.eclipse.swt.widgets.RunnableLock.run(RunnableLock.java:40)
04:38:08 	at org.eclipse.swt.widgets.Synchronizer.runAsyncMessages(Synchronizer.java:132)
04:38:08 	at org.eclipse.swt.widgets.Display.runAsyncMessages(Display.java:5040)
04:38:08 	at org.eclipse.swt.widgets.Display.readAndDispatch(Display.java:4520)
04:38:08 	at org.eclipse.e4.ui.internal.workbench.swt.PartRenderingEngine$5.run(PartRenderingEngine.java:1151)
04:38:08 	at org.eclipse.core.databinding.observable.Realm.runWithDefault(Realm.java:339)
04:38:08 	at org.eclipse.e4.ui.internal.workbench.swt.PartRenderingEngine.run(PartRenderingEngine.java:1042)
04:38:08 	at org.eclipse.e4.ui.internal.workbench.E4Workbench.createAndRunUI(E4Workbench.java:152)
04:38:08 	at org.eclipse.ui.internal.Workbench.lambda$3(Workbench.java:639)
04:38:08 	at org.eclipse.core.databinding.observable.Realm.runWithDefault(Realm.java:339)
04:38:08 	at org.eclipse.ui.internal.Workbench.createAndRunWorkbench(Workbench.java:546)
04:38:08 	at org.eclipse.ui.PlatformUI.createAndRunWorkbench(PlatformUI.java:173)
04:38:08 	at org.eclipse.ui.internal.ide.application.IDEApplication.start(IDEApplication.java:152)
04:38:08 	at org.eclipse.tycho.surefire.osgibooter.UITestApplication.runApplication(UITestApplication.java:34)
04:38:08 	at org.eclipse.tycho.surefire.osgibooter.AbstractUITestApplication.run(AbstractUITestApplication.java:129)
04:38:08 	at org.eclipse.tycho.surefire.osgibooter.UITestApplication.start(UITestApplication.java:44)
04:38:08 	at org.eclipse.equinox.internal.app.EclipseAppHandle.run(EclipseAppHandle.java:208)
04:38:08 	at org.eclipse.core.runtime.internal.adaptor.EclipseAppLauncher.runApplication(EclipseAppLauncher.java:143)
04:38:08 	at org.eclipse.core.runtime.internal.adaptor.EclipseAppLauncher.start(EclipseAppLauncher.java:109)
04:38:08 	at org.eclipse.core.runtime.adaptor.EclipseStarter.run(EclipseStarter.java:439)
04:38:08 	at org.eclipse.core.runtime.adaptor.EclipseStarter.run(EclipseStarter.java:271)
04:38:08 	at java.base/jdk.internal.reflect.DirectMethodHandleAccessor.invoke(DirectMethodHandleAccessor.java:103)
04:38:08 	at java.base/java.lang.reflect.Method.invoke(Method.java:580)
04:38:08 	at org.eclipse.equinox.launcher.Main.invokeFramework(Main.java:668)
04:38:08 	at org.eclipse.equinox.launcher.Main.basicRun(Main.java:605)
04:38:08 	at org.eclipse.equinox.launcher.Main.run(Main.java:1481)
04:38:08 	at org.eclipse.equinox.launcher.Main.main(Main.java:1454)
04:38:08 
04:38:08 org.eclipse.text.tests.ExclusivePositionUpdaterTest.testAddAfter -- Time elapsed: 0 s <<< ERROR!
04:38:08 java.lang.NullPointerException: Cannot invoke "org.eclipse.wst.sse.core.internal.ltk.modelhandler.IModelHandler.getDocumentLoader()" because "handler" is null
04:38:08 	at org.eclipse.text.tests.ExclusivePositionUpdaterTest.createDocument(ExclusivePositionUpdaterTest.java:56)
04:38:08 	at org.eclipse.text.tests.ExclusivePositionUpdaterTest.setUp(ExclusivePositionUpdaterTest.java:47)
04:38:08 	at junit.framework.TestCase.runBare(TestCase.java:140)
04:38:08 	at junit.framework.TestResult$1.protect(TestResult.java:122)
04:38:08 	at junit.framework.TestResult.runProtected(TestResult.java:142)
04:38:08 	at junit.framework.TestResult.run(TestResult.java:125)
04:38:08 	at junit.framework.TestCase.run(TestCase.java:130)
04:38:08 	at junit.framework.TestSuite.runTest(TestSuite.java:241)
04:38:08 	at junit.framework.TestSuite.run(TestSuite.java:236)
04:38:08 	at junit.framework.TestSuite.runTest(TestSuite.java:241)
04:38:08 	at junit.framework.TestSuite.run(TestSuite.java:236)
04:38:08 	at junit.framework.TestSuite.runTest(TestSuite.java:241)
04:38:08 	at junit.framework.TestSuite.run(TestSuite.java:236)
04:38:08 	at org.junit.internal.runners.JUnit38ClassRunner.run(JUnit38ClassRunner.java:90)
04:38:08 	at org.apache.maven.surefire.junit4.JUnit4Provider.execute(JUnit4Provider.java:316)
04:38:08 	at org.apache.maven.surefire.junit4.JUnit4Provider.executeWithRerun(JUnit4Provider.java:240)
04:38:08 	at org.apache.maven.surefire.junit4.JUnit4Provider.executeTestSet(JUnit4Provider.java:214)
04:38:08 	at org.apache.maven.surefire.junit4.JUnit4Provider.invoke(JUnit4Provider.java:155)
04:38:08 	at java.base/jdk.internal.reflect.DirectMethodHandleAccessor.invoke(DirectMethodHandleAccessor.java:103)
04:38:08 	at java.base/java.lang.reflect.Method.invoke(Method.java:580)
04:38:08 	at org.apache.maven.surefire.api.util.ReflectionUtils.invokeMethodWithArray2(ReflectionUtils.java:137)
04:38:08 	at org.apache.maven.surefire.booter.ProviderFactory$ProviderProxy.invoke(ProviderFactory.java:148)
04:38:08 	at org.apache.maven.surefire.booter.ProviderFactory.invokeProvider(ProviderFactory.java:88)
04:38:08 	at org.eclipse.tycho.surefire.osgibooter.OsgiSurefireBooter.run(OsgiSurefireBooter.java:140)
04:38:08 	at org.eclipse.tycho.surefire.osgibooter.AbstractUITestApplication$1.run(AbstractUITestApplication.java:42)
04:38:08 	at org.eclipse.e4.ui.internal.workbench.swt.E4Testable.lambda$1(E4Testable.java:127)
04:38:08 	at org.eclipse.swt.widgets.RunnableLock.run(RunnableLock.java:40)
04:38:08 	at org.eclipse.swt.widgets.Synchronizer.runAsyncMessages(Synchronizer.java:132)
04:38:08 	at org.eclipse.swt.widgets.Display.runAsyncMessages(Display.java:5040)
04:38:08 	at org.eclipse.swt.widgets.Display.readAndDispatch(Display.java:4520)
04:38:08 	at org.eclipse.e4.ui.internal.workbench.swt.PartRenderingEngine$5.run(PartRenderingEngine.java:1151)
04:38:08 	at org.eclipse.core.databinding.observable.Realm.runWithDefault(Realm.java:339)
04:38:08 	at org.eclipse.e4.ui.internal.workbench.swt.PartRenderingEngine.run(PartRenderingEngine.java:1042)
04:38:08 	at org.eclipse.e4.ui.internal.workbench.E4Workbench.createAndRunUI(E4Workbench.java:152)
04:38:08 	at org.eclipse.ui.internal.Workbench.lambda$3(Workbench.java:639)
04:38:08 	at org.eclipse.core.databinding.observable.Realm.runWithDefault(Realm.java:339)
04:38:08 	at org.eclipse.ui.internal.Workbench.createAndRunWorkbench(Workbench.java:546)
04:38:08 	at org.eclipse.ui.PlatformUI.createAndRunWorkbench(PlatformUI.java:173)
04:38:08 	at org.eclipse.ui.internal.ide.application.IDEApplication.start(IDEApplication.java:152)
04:38:08 	at org.eclipse.tycho.surefire.osgibooter.UITestApplication.runApplication(UITestApplication.java:34)
04:38:08 	at org.eclipse.tycho.surefire.osgibooter.AbstractUITestApplication.run(AbstractUITestApplication.java:129)
04:38:08 	at org.eclipse.tycho.surefire.osgibooter.UITestApplication.start(UITestApplication.java:44)
04:38:08 	at org.eclipse.equinox.internal.app.EclipseAppHandle.run(EclipseAppHandle.java:208)
04:38:08 	at org.eclipse.core.runtime.internal.adaptor.EclipseAppLauncher.runApplication(EclipseAppLauncher.java:143)
04:38:08 	at org.eclipse.core.runtime.internal.adaptor.EclipseAppLauncher.start(EclipseAppLauncher.java:109)
04:38:08 	at org.eclipse.core.runtime.adaptor.EclipseStarter.run(EclipseStarter.java:439)
04:38:08 	at org.eclipse.core.runtime.adaptor.EclipseStarter.run(EclipseStarter.java:271)
04:38:08 	at java.base/jdk.internal.reflect.DirectMethodHandleAccessor.invoke(DirectMethodHandleAccessor.java:103)
04:38:08 	at java.base/java.lang.reflect.Method.invoke(Method.java:580)
04:38:08 	at org.eclipse.equinox.launcher.Main.invokeFramework(Main.java:668)
04:38:08 	at org.eclipse.equinox.launcher.Main.basicRun(Main.java:605)
04:38:08 	at org.eclipse.equinox.launcher.Main.run(Main.java:1481)
04:38:08 	at org.eclipse.equinox.launcher.Main.main(Main.java:1454)
04:38:08 
04:38:08 org.eclipse.text.tests.ExclusivePositionUpdaterTest.testReplaceLeftBorder -- Time elapsed: 0.001 s <<< ERROR!
04:38:08 java.lang.NullPointerException: Cannot invoke "org.eclipse.wst.sse.core.internal.ltk.modelhandler.IModelHandler.getDocumentLoader()" because "handler" is null
04:38:08 	at org.eclipse.text.tests.ExclusivePositionUpdaterTest.createDocument(ExclusivePositionUpdaterTest.java:56)
04:38:08 	at org.eclipse.text.tests.ExclusivePositionUpdaterTest.setUp(ExclusivePositionUpdaterTest.java:47)
04:38:08 	at junit.framework.TestCase.runBare(TestCase.java:140)
04:38:08 	at junit.framework.TestResult$1.protect(TestResult.java:122)
04:38:08 	at junit.framework.TestResult.runProtected(TestResult.java:142)
04:38:08 	at junit.framework.TestResult.run(TestResult.java:125)
04:38:08 	at junit.framework.TestCase.run(TestCase.java:130)
04:38:08 	at junit.framework.TestSuite.runTest(TestSuite.java:241)
04:38:08 	at junit.framework.TestSuite.run(TestSuite.java:236)
04:38:08 	at junit.framework.TestSuite.runTest(TestSuite.java:241)
04:38:08 	at junit.framework.TestSuite.run(TestSuite.java:236)
04:38:08 	at junit.framework.TestSuite.runTest(TestSuite.java:241)
04:38:08 	at junit.framework.TestSuite.run(TestSuite.java:236)
04:38:08 	at org.junit.internal.runners.JUnit38ClassRunner.run(JUnit38ClassRunner.java:90)
04:38:08 	at org.apache.maven.surefire.junit4.JUnit4Provider.execute(JUnit4Provider.java:316)
04:38:08 	at org.apache.maven.surefire.junit4.JUnit4Provider.executeWithRerun(JUnit4Provider.java:240)
04:38:08 	at org.apache.maven.surefire.junit4.JUnit4Provider.executeTestSet(JUnit4Provider.java:214)
04:38:08 	at org.apache.maven.surefire.junit4.JUnit4Provider.invoke(JUnit4Provider.java:155)
04:38:08 	at java.base/jdk.internal.reflect.DirectMethodHandleAccessor.invoke(DirectMethodHandleAccessor.java:103)
04:38:08 	at java.base/java.lang.reflect.Method.invoke(Method.java:580)
04:38:08 	at org.apache.maven.surefire.api.util.ReflectionUtils.invokeMethodWithArray2(ReflectionUtils.java:137)
04:38:08 	at org.apache.maven.surefire.booter.ProviderFactory$ProviderProxy.invoke(ProviderFactory.java:148)
04:38:08 	at org.apache.maven.surefire.booter.ProviderFactory.invokeProvider(ProviderFactory.java:88)
04:38:08 	at org.eclipse.tycho.surefire.osgibooter.OsgiSurefireBooter.run(OsgiSurefireBooter.java:140)
04:38:08 	at org.eclipse.tycho.surefire.osgibooter.AbstractUITestApplication$1.run(AbstractUITestApplication.java:42)
04:38:08 	at org.eclipse.e4.ui.internal.workbench.swt.E4Testable.lambda$1(E4Testable.java:127)
04:38:08 	at org.eclipse.swt.widgets.RunnableLock.run(RunnableLock.java:40)
04:38:08 	at org.eclipse.swt.widgets.Synchronizer.runAsyncMessages(Synchronizer.java:132)
04:38:08 	at org.eclipse.swt.widgets.Display.runAsyncMessages(Display.java:5040)
04:38:08 	at org.eclipse.swt.widgets.Display.readAndDispatch(Display.java:4520)
04:38:08 	at org.eclipse.e4.ui.internal.workbench.swt.PartRenderingEngine$5.run(PartRenderingEngine.java:1151)
04:38:08 	at org.eclipse.core.databinding.observable.Realm.runWithDefault(Realm.java:339)
04:38:08 	at org.eclipse.e4.ui.internal.workbench.swt.PartRenderingEngine.run(PartRenderingEngine.java:1042)
04:38:08 	at org.eclipse.e4.ui.internal.workbench.E4Workbench.createAndRunUI(E4Workbench.java:152)
04:38:08 	at org.eclipse.ui.internal.Workbench.lambda$3(Workbench.java:639)
04:38:08 	at org.eclipse.core.databinding.observable.Realm.runWithDefault(Realm.java:339)
04:38:08 	at org.eclipse.ui.internal.Workbench.createAndRunWorkbench(Workbench.java:546)
04:38:08 	at org.eclipse.ui.PlatformUI.createAndRunWorkbench(PlatformUI.java:173)
04:38:08 	at org.eclipse.ui.internal.ide.application.IDEApplication.start(IDEApplication.java:152)
04:38:08 	at org.eclipse.tycho.surefire.osgibooter.UITestApplication.runApplication(UITestApplication.java:34)
04:38:08 	at org.eclipse.tycho.surefire.osgibooter.AbstractUITestApplication.run(AbstractUITestApplication.java:129)
04:38:08 	at org.eclipse.tycho.surefire.osgibooter.UITestApplication.start(UITestApplication.java:44)
04:38:08 	at org.eclipse.equinox.internal.app.EclipseAppHandle.run(EclipseAppHandle.java:208)
04:38:08 	at org.eclipse.core.runtime.internal.adaptor.EclipseAppLauncher.runApplication(EclipseAppLauncher.java:143)
04:38:08 	at org.eclipse.core.runtime.internal.adaptor.EclipseAppLauncher.start(EclipseAppLauncher.java:109)
04:38:08 	at org.eclipse.core.runtime.adaptor.EclipseStarter.run(EclipseStarter.java:439)
04:38:08 	at org.eclipse.core.runtime.adaptor.EclipseStarter.run(EclipseStarter.java:271)
04:38:08 	at java.base/jdk.internal.reflect.DirectMethodHandleAccessor.invoke(DirectMethodHandleAccessor.java:103)
04:38:08 	at java.base/java.lang.reflect.Method.invoke(Method.java:580)
04:38:08 	at org.eclipse.equinox.launcher.Main.invokeFramework(Main.java:668)
04:38:08 	at org.eclipse.equinox.launcher.Main.basicRun(Main.java:605)
04:38:08 	at org.eclipse.equinox.launcher.Main.run(Main.java:1481)
04:38:08 	at org.eclipse.equinox.launcher.Main.main(Main.java:1454)
04:38:08 
04:38:08 org.eclipse.text.tests.ExclusivePositionUpdaterTest.testDeleteBefore -- Time elapsed: 0 s <<< ERROR!
04:38:08 java.lang.NullPointerException: Cannot invoke "org.eclipse.wst.sse.core.internal.ltk.modelhandler.IModelHandler.getDocumentLoader()" because "handler" is null
04:38:08 	at org.eclipse.text.tests.ExclusivePositionUpdaterTest.createDocument(ExclusivePositionUpdaterTest.java:56)
04:38:08 	at org.eclipse.text.tests.ExclusivePositionUpdaterTest.setUp(ExclusivePositionUpdaterTest.java:47)
04:38:08 	at junit.framework.TestCase.runBare(TestCase.java:140)
04:38:08 	at junit.framework.TestResult$1.protect(TestResult.java:122)
04:38:08 	at junit.framework.TestResult.runProtected(TestResult.java:142)
04:38:08 	at junit.framework.TestResult.run(TestResult.java:125)
04:38:08 	at junit.framework.TestCase.run(TestCase.java:130)
04:38:08 	at junit.framework.TestSuite.runTest(TestSuite.java:241)
04:38:08 	at junit.framework.TestSuite.run(TestSuite.java:236)
04:38:08 	at junit.framework.TestSuite.runTest(TestSuite.java:241)
04:38:08 	at junit.framework.TestSuite.run(TestSuite.java:236)
04:38:08 	at junit.framework.TestSuite.runTest(TestSuite.java:241)
04:38:08 	at junit.framework.TestSuite.run(TestSuite.java:236)
04:38:08 	at org.junit.internal.runners.JUnit38ClassRunner.run(JUnit38ClassRunner.java:90)
04:38:08 	at org.apache.maven.surefire.junit4.JUnit4Provider.execute(JUnit4Provider.java:316)
04:38:08 	at org.apache.maven.surefire.junit4.JUnit4Provider.executeWithRerun(JUnit4Provider.java:240)
04:38:08 	at org.apache.maven.surefire.junit4.JUnit4Provider.executeTestSet(JUnit4Provider.java:214)
04:38:08 	at org.apache.maven.surefire.junit4.JUnit4Provider.invoke(JUnit4Provider.java:155)
04:38:08 	at java.base/jdk.internal.reflect.DirectMethodHandleAccessor.invoke(DirectMethodHandleAccessor.java:103)
04:38:08 	at java.base/java.lang.reflect.Method.invoke(Method.java:580)
04:38:08 	at org.apache.maven.surefire.api.util.ReflectionUtils.invokeMethodWithArray2(ReflectionUtils.java:137)
04:38:08 	at org.apache.maven.surefire.booter.ProviderFactory$ProviderProxy.invoke(ProviderFactory.java:148)
04:38:08 	at org.apache.maven.surefire.booter.ProviderFactory.invokeProvider(ProviderFactory.java:88)
04:38:08 	at org.eclipse.tycho.surefire.osgibooter.OsgiSurefireBooter.run(OsgiSurefireBooter.java:140)
04:38:08 	at org.eclipse.tycho.surefire.osgibooter.AbstractUITestApplication$1.run(AbstractUITestApplication.java:42)
04:38:08 	at org.eclipse.e4.ui.internal.workbench.swt.E4Testable.lambda$1(E4Testable.java:127)
04:38:08 	at org.eclipse.swt.widgets.RunnableLock.run(RunnableLock.java:40)
04:38:08 	at org.eclipse.swt.widgets.Synchronizer.runAsyncMessages(Synchronizer.java:132)
04:38:08 	at org.eclipse.swt.widgets.Display.runAsyncMessages(Display.java:5040)
04:38:08 	at org.eclipse.swt.widgets.Display.readAndDispatch(Display.java:4520)
04:38:08 	at org.eclipse.e4.ui.internal.workbench.swt.PartRenderingEngine$5.run(PartRenderingEngine.java:1151)
04:38:08 	at org.eclipse.core.databinding.observable.Realm.runWithDefault(Realm.java:339)
04:38:08 	at org.eclipse.e4.ui.internal.workbench.swt.PartRenderingEngine.run(PartRenderingEngine.java:1042)
04:38:08 	at org.eclipse.e4.ui.internal.workbench.E4Workbench.createAndRunUI(E4Workbench.java:152)
04:38:08 	at org.eclipse.ui.internal.Workbench.lambda$3(Workbench.java:639)
04:38:08 	at org.eclipse.core.databinding.observable.Realm.runWithDefault(Realm.java:339)
04:38:08 	at org.eclipse.ui.internal.Workbench.createAndRunWorkbench(Workbench.java:546)
04:38:08 	at org.eclipse.ui.PlatformUI.createAndRunWorkbench(PlatformUI.java:173)
04:38:08 	at org.eclipse.ui.internal.ide.application.IDEApplication.start(IDEApplication.java:152)
04:38:08 	at org.eclipse.tycho.surefire.osgibooter.UITestApplication.runApplication(UITestApplication.java:34)
04:38:08 	at org.eclipse.tycho.surefire.osgibooter.AbstractUITestApplication.run(AbstractUITestApplication.java:129)
04:38:08 	at org.eclipse.tycho.surefire.osgibooter.UITestApplication.start(UITestApplication.java:44)
04:38:08 	at org.eclipse.equinox.internal.app.EclipseAppHandle.run(EclipseAppHandle.java:208)
04:38:08 	at org.eclipse.core.runtime.internal.adaptor.EclipseAppLauncher.runApplication(EclipseAppLauncher.java:143)
04:38:08 	at org.eclipse.core.runtime.internal.adaptor.EclipseAppLauncher.start(EclipseAppLauncher.java:109)
04:38:08 	at org.eclipse.core.runtime.adaptor.EclipseStarter.run(EclipseStarter.java:439)
04:38:08 	at org.eclipse.core.runtime.adaptor.EclipseStarter.run(EclipseStarter.java:271)
04:38:08 	at java.base/jdk.internal.reflect.DirectMethodHandleAccessor.invoke(DirectMethodHandleAccessor.java:103)
04:38:08 	at java.base/java.lang.reflect.Method.invoke(Method.java:580)
04:38:08 	at org.eclipse.equinox.launcher.Main.invokeFramework(Main.java:668)
04:38:08 	at org.eclipse.equinox.launcher.Main.basicRun(Main.java:605)
04:38:08 	at org.eclipse.equinox.launcher.Main.run(Main.java:1481)
04:38:08 	at org.eclipse.equinox.launcher.Main.main(Main.java:1454)
04:38:08 
04:38:08 org.eclipse.text.tests.ExclusivePositionUpdaterTest.testAddBefore -- Time elapsed: 0 s <<< ERROR!
04:38:08 java.lang.NullPointerException: Cannot invoke "org.eclipse.wst.sse.core.internal.ltk.modelhandler.IModelHandler.getDocumentLoader()" because "handler" is null
04:38:08 	at org.eclipse.text.tests.ExclusivePositionUpdaterTest.createDocument(ExclusivePositionUpdaterTest.java:56)
04:38:08 	at org.eclipse.text.tests.ExclusivePositionUpdaterTest.setUp(ExclusivePositionUpdaterTest.java:47)
04:38:08 	at junit.framework.TestCase.runBare(TestCase.java:140)
04:38:08 	at junit.framework.TestResult$1.protect(TestResult.java:122)
04:38:08 	at junit.framework.TestResult.runProtected(TestResult.java:142)
04:38:08 	at junit.framework.TestResult.run(TestResult.java:125)
04:38:08 	at junit.framework.TestCase.run(TestCase.java:130)
04:38:08 	at junit.framework.TestSuite.runTest(TestSuite.java:241)
04:38:08 	at junit.framework.TestSuite.run(TestSuite.java:236)
04:38:08 	at junit.framework.TestSuite.runTest(TestSuite.java:241)
04:38:08 	at junit.framework.TestSuite.run(TestSuite.java:236)
04:38:08 	at junit.framework.TestSuite.runTest(TestSuite.java:241)
04:38:08 	at junit.framework.TestSuite.run(TestSuite.java:236)
04:38:08 	at org.junit.internal.runners.JUnit38ClassRunner.run(JUnit38ClassRunner.java:90)
04:38:08 	at org.apache.maven.surefire.junit4.JUnit4Provider.execute(JUnit4Provider.java:316)
04:38:08 	at org.apache.maven.surefire.junit4.JUnit4Provider.executeWithRerun(JUnit4Provider.java:240)
04:38:08 	at org.apache.maven.surefire.junit4.JUnit4Provider.executeTestSet(JUnit4Provider.java:214)
04:38:08 	at org.apache.maven.surefire.junit4.JUnit4Provider.invoke(JUnit4Provider.java:155)
04:38:08 	at java.base/jdk.internal.reflect.DirectMethodHandleAccessor.invoke(DirectMethodHandleAccessor.java:103)
04:38:08 	at java.base/java.lang.reflect.Method.invoke(Method.java:580)
04:38:08 	at org.apache.maven.surefire.api.util.ReflectionUtils.invokeMethodWithArray2(ReflectionUtils.java:137)
04:38:08 	at org.apache.maven.surefire.booter.ProviderFactory$ProviderProxy.invoke(ProviderFactory.java:148)
04:38:08 	at org.apache.maven.surefire.booter.ProviderFactory.invokeProvider(ProviderFactory.java:88)
04:38:08 	at org.eclipse.tycho.surefire.osgibooter.OsgiSurefireBooter.run(OsgiSurefireBooter.java:140)
04:38:08 	at org.eclipse.tycho.surefire.osgibooter.AbstractUITestApplication$1.run(AbstractUITestApplication.java:42)
04:38:08 	at org.eclipse.e4.ui.internal.workbench.swt.E4Testable.lambda$1(E4Testable.java:127)
04:38:08 	at org.eclipse.swt.widgets.RunnableLock.run(RunnableLock.java:40)
04:38:08 	at org.eclipse.swt.widgets.Synchronizer.runAsyncMessages(Synchronizer.java:132)
04:38:08 	at org.eclipse.swt.widgets.Display.runAsyncMessages(Display.java:5040)
04:38:08 	at org.eclipse.swt.widgets.Display.readAndDispatch(Display.java:4520)
04:38:08 	at org.eclipse.e4.ui.internal.workbench.swt.PartRenderingEngine$5.run(PartRenderingEngine.java:1151)
04:38:08 	at org.eclipse.core.databinding.observable.Realm.runWithDefault(Realm.java:339)
04:38:08 	at org.eclipse.e4.ui.internal.workbench.swt.PartRenderingEngine.run(PartRenderingEngine.java:1042)
04:38:08 	at org.eclipse.e4.ui.internal.workbench.E4Workbench.createAndRunUI(E4Workbench.java:152)
04:38:08 	at org.eclipse.ui.internal.Workbench.lambda$3(Workbench.java:639)
04:38:08 	at org.eclipse.core.databinding.observable.Realm.runWithDefault(Realm.java:339)
04:38:08 	at org.eclipse.ui.internal.Workbench.createAndRunWorkbench(Workbench.java:546)
04:38:08 	at org.eclipse.ui.PlatformUI.createAndRunWorkbench(PlatformUI.java:173)
04:38:08 	at org.eclipse.ui.internal.ide.application.IDEApplication.start(IDEApplication.java:152)
04:38:08 	at org.eclipse.tycho.surefire.osgibooter.UITestApplication.runApplication(UITestApplication.java:34)
04:38:08 	at org.eclipse.tycho.surefire.osgibooter.AbstractUITestApplication.run(AbstractUITestApplication.java:129)
04:38:08 	at org.eclipse.tycho.surefire.osgibooter.UITestApplication.start(UITestApplication.java:44)
04:38:08 	at org.eclipse.equinox.internal.app.EclipseAppHandle.run(EclipseAppHandle.java:208)
04:38:08 	at org.eclipse.core.runtime.internal.adaptor.EclipseAppLauncher.runApplication(EclipseAppLauncher.java:143)
04:38:08 	at org.eclipse.core.runtime.internal.adaptor.EclipseAppLauncher.start(EclipseAppLauncher.java:109)
04:38:08 	at org.eclipse.core.runtime.adaptor.EclipseStarter.run(EclipseStarter.java:439)
04:38:08 	at org.eclipse.core.runtime.adaptor.EclipseStarter.run(EclipseStarter.java:271)
04:38:08 	at java.base/jdk.internal.reflect.DirectMethodHandleAccessor.invoke(DirectMethodHandleAccessor.java:103)
04:38:08 	at java.base/java.lang.reflect.Method.invoke(Method.java:580)
04:38:08 	at org.eclipse.equinox.launcher.Main.invokeFramework(Main.java:668)
04:38:08 	at org.eclipse.equinox.launcher.Main.basicRun(Main.java:605)
04:38:08 	at org.eclipse.equinox.launcher.Main.run(Main.java:1481)
04:38:08 	at org.eclipse.equinox.launcher.Main.main(Main.java:1454)
04:38:08 
04:38:08 org.eclipse.text.tests.ExclusivePositionUpdaterTest.testReplaced -- Time elapsed: 0 s <<< ERROR!
04:38:08 java.lang.NullPointerException: Cannot invoke "org.eclipse.wst.sse.core.internal.ltk.modelhandler.IModelHandler.getDocumentLoader()" because "handler" is null
04:38:08 	at org.eclipse.text.tests.ExclusivePositionUpdaterTest.createDocument(ExclusivePositionUpdaterTest.java:56)
04:38:08 	at org.eclipse.text.tests.ExclusivePositionUpdaterTest.setUp(ExclusivePositionUpdaterTest.java:47)
04:38:08 	at junit.framework.TestCase.runBare(TestCase.java:140)
04:38:08 	at junit.framework.TestResult$1.protect(TestResult.java:122)
04:38:08 	at junit.framework.TestResult.runProtected(TestResult.java:142)
04:38:08 	at junit.framework.TestResult.run(TestResult.java:125)
04:38:08 	at junit.framework.TestCase.run(TestCase.java:130)
04:38:08 	at junit.framework.TestSuite.runTest(TestSuite.java:241)
04:38:08 	at junit.framework.TestSuite.run(TestSuite.java:236)
04:38:08 	at junit.framework.TestSuite.runTest(TestSuite.java:241)
04:38:08 	at junit.framework.TestSuite.run(TestSuite.java:236)
04:38:08 	at junit.framework.TestSuite.runTest(TestSuite.java:241)
04:38:08 	at junit.framework.TestSuite.run(TestSuite.java:236)
04:38:08 	at org.junit.internal.runners.JUnit38ClassRunner.run(JUnit38ClassRunner.java:90)
04:38:08 	at org.apache.maven.surefire.junit4.JUnit4Provider.execute(JUnit4Provider.java:316)
04:38:08 	at org.apache.maven.surefire.junit4.JUnit4Provider.executeWithRerun(JUnit4Provider.java:240)
04:38:08 	at org.apache.maven.surefire.junit4.JUnit4Provider.executeTestSet(JUnit4Provider.java:214)
04:38:08 	at org.apache.maven.surefire.junit4.JUnit4Provider.invoke(JUnit4Provider.java:155)
04:38:08 	at java.base/jdk.internal.reflect.DirectMethodHandleAccessor.invoke(DirectMethodHandleAccessor.java:103)
04:38:08 	at java.base/java.lang.reflect.Method.invoke(Method.java:580)
04:38:08 	at org.apache.maven.surefire.api.util.ReflectionUtils.invokeMethodWithArray2(ReflectionUtils.java:137)
04:38:08 	at org.apache.maven.surefire.booter.ProviderFactory$ProviderProxy.invoke(ProviderFactory.java:148)
04:38:08 	at org.apache.maven.surefire.booter.ProviderFactory.invokeProvider(ProviderFactory.java:88)
04:38:08 	at org.eclipse.tycho.surefire.osgibooter.OsgiSurefireBooter.run(OsgiSurefireBooter.java:140)
04:38:08 	at org.eclipse.tycho.surefire.osgibooter.AbstractUITestApplication$1.run(AbstractUITestApplication.java:42)
04:38:08 	at org.eclipse.e4.ui.internal.workbench.swt.E4Testable.lambda$1(E4Testable.java:127)
04:38:08 	at org.eclipse.swt.widgets.RunnableLock.run(RunnableLock.java:40)
04:38:08 	at org.eclipse.swt.widgets.Synchronizer.runAsyncMessages(Synchronizer.java:132)
04:38:08 	at org.eclipse.swt.widgets.Display.runAsyncMessages(Display.java:5040)
04:38:08 	at org.eclipse.swt.widgets.Display.readAndDispatch(Display.java:4520)
04:38:08 	at org.eclipse.e4.ui.internal.workbench.swt.PartRenderingEngine$5.run(PartRenderingEngine.java:1151)
04:38:08 	at org.eclipse.core.databinding.observable.Realm.runWithDefault(Realm.java:339)
04:38:08 	at org.eclipse.e4.ui.internal.workbench.swt.PartRenderingEngine.run(PartRenderingEngine.java:1042)
04:38:08 	at org.eclipse.e4.ui.internal.workbench.E4Workbench.createAndRunUI(E4Workbench.java:152)
04:38:08 	at org.eclipse.ui.internal.Workbench.lambda$3(Workbench.java:639)
04:38:08 	at org.eclipse.core.databinding.observable.Realm.runWithDefault(Realm.java:339)
04:38:08 	at org.eclipse.ui.internal.Workbench.createAndRunWorkbench(Workbench.java:546)
04:38:08 	at org.eclipse.ui.PlatformUI.createAndRunWorkbench(PlatformUI.java:173)
04:38:08 	at org.eclipse.ui.internal.ide.application.IDEApplication.start(IDEApplication.java:152)
04:38:08 	at org.eclipse.tycho.surefire.osgibooter.UITestApplication.runApplication(UITestApplication.java:34)
04:38:08 	at org.eclipse.tycho.surefire.osgibooter.AbstractUITestApplication.run(AbstractUITestApplication.java:129)
04:38:08 	at org.eclipse.tycho.surefire.osgibooter.UITestApplication.start(UITestApplication.java:44)
04:38:08 	at org.eclipse.equinox.internal.app.EclipseAppHandle.run(EclipseAppHandle.java:208)
04:38:08 	at org.eclipse.core.runtime.internal.adaptor.EclipseAppLauncher.runApplication(EclipseAppLauncher.java:143)
04:38:08 	at org.eclipse.core.runtime.internal.adaptor.EclipseAppLauncher.start(EclipseAppLauncher.java:109)
04:38:08 	at org.eclipse.core.runtime.adaptor.EclipseStarter.run(EclipseStarter.java:439)
04:38:08 	at org.eclipse.core.runtime.adaptor.EclipseStarter.run(EclipseStarter.java:271)
04:38:08 	at java.base/jdk.internal.reflect.DirectMethodHandleAccessor.invoke(DirectMethodHandleAccessor.java:103)
04:38:08 	at java.base/java.lang.reflect.Method.invoke(Method.java:580)
04:38:08 	at org.eclipse.equinox.launcher.Main.invokeFramework(Main.java:668)
04:38:08 	at org.eclipse.equinox.launcher.Main.basicRun(Main.java:605)
04:38:08 	at org.eclipse.equinox.launcher.Main.run(Main.java:1481)
04:38:08 	at org.eclipse.equinox.launcher.Main.main(Main.java:1454)
04:38:08 
04:38:08 org.eclipse.text.tests.ExclusivePositionUpdaterTest.testDeleteRightAfter -- Time elapsed: 0 s <<< ERROR!
04:38:08 java.lang.NullPointerException: Cannot invoke "org.eclipse.wst.sse.core.internal.ltk.modelhandler.IModelHandler.getDocumentLoader()" because "handler" is null
04:38:08 	at org.eclipse.text.tests.ExclusivePositionUpdaterTest.createDocument(ExclusivePositionUpdaterTest.java:56)
04:38:08 	at org.eclipse.text.tests.ExclusivePositionUpdaterTest.setUp(ExclusivePositionUpdaterTest.java:47)
04:38:08 	at junit.framework.TestCase.runBare(TestCase.java:140)
04:38:08 	at junit.framework.TestResult$1.protect(TestResult.java:122)
04:38:08 	at junit.framework.TestResult.runProtected(TestResult.java:142)
04:38:08 	at junit.framework.TestResult.run(TestResult.java:125)
04:38:08 	at junit.framework.TestCase.run(TestCase.java:130)
04:38:08 	at junit.framework.TestSuite.runTest(TestSuite.java:241)
04:38:08 	at junit.framework.TestSuite.run(TestSuite.java:236)
04:38:08 	at junit.framework.TestSuite.runTest(TestSuite.java:241)
04:38:08 	at junit.framework.TestSuite.run(TestSuite.java:236)
04:38:08 	at junit.framework.TestSuite.runTest(TestSuite.java:241)
04:38:08 	at junit.framework.TestSuite.run(TestSuite.java:236)
04:38:08 	at org.junit.internal.runners.JUnit38ClassRunner.run(JUnit38ClassRunner.java:90)
04:38:08 	at org.apache.maven.surefire.junit4.JUnit4Provider.execute(JUnit4Provider.java:316)
04:38:08 	at org.apache.maven.surefire.junit4.JUnit4Provider.executeWithRerun(JUnit4Provider.java:240)
04:38:08 	at org.apache.maven.surefire.junit4.JUnit4Provider.executeTestSet(JUnit4Provider.java:214)
04:38:08 	at org.apache.maven.surefire.junit4.JUnit4Provider.invoke(JUnit4Provider.java:155)
04:38:08 	at java.base/jdk.internal.reflect.DirectMethodHandleAccessor.invoke(DirectMethodHandleAccessor.java:103)
04:38:08 	at java.base/java.lang.reflect.Method.invoke(Method.java:580)
04:38:08 	at org.apache.maven.surefire.api.util.ReflectionUtils.invokeMethodWithArray2(ReflectionUtils.java:137)
04:38:08 	at org.apache.maven.surefire.booter.ProviderFactory$ProviderProxy.invoke(ProviderFactory.java:148)
04:38:08 	at org.apache.maven.surefire.booter.ProviderFactory.invokeProvider(ProviderFactory.java:88)
04:38:08 	at org.eclipse.tycho.surefire.osgibooter.OsgiSurefireBooter.run(OsgiSurefireBooter.java:140)
04:38:08 	at org.eclipse.tycho.surefire.osgibooter.AbstractUITestApplication$1.run(AbstractUITestApplication.java:42)
04:38:08 	at org.eclipse.e4.ui.internal.workbench.swt.E4Testable.lambda$1(E4Testable.java:127)
04:38:08 	at org.eclipse.swt.widgets.RunnableLock.run(RunnableLock.java:40)
04:38:08 	at org.eclipse.swt.widgets.Synchronizer.runAsyncMessages(Synchronizer.java:132)
04:38:08 	at org.eclipse.swt.widgets.Display.runAsyncMessages(Display.java:5040)
04:38:08 	at org.eclipse.swt.widgets.Display.readAndDispatch(Display.java:4520)
04:38:08 	at org.eclipse.e4.ui.internal.workbench.swt.PartRenderingEngine$5.run(PartRenderingEngine.java:1151)
04:38:08 	at org.eclipse.core.databinding.observable.Realm.runWithDefault(Realm.java:339)
04:38:08 	at org.eclipse.e4.ui.internal.workbench.swt.PartRenderingEngine.run(PartRenderingEngine.java:1042)
04:38:08 	at org.eclipse.e4.ui.internal.workbench.E4Workbench.createAndRunUI(E4Workbench.java:152)
04:38:08 	at org.eclipse.ui.internal.Workbench.lambda$3(Workbench.java:639)
04:38:08 	at org.eclipse.core.databinding.observable.Realm.runWithDefault(Realm.java:339)
04:38:08 	at org.eclipse.ui.internal.Workbench.createAndRunWorkbench(Workbench.java:546)
04:38:08 	at org.eclipse.ui.PlatformUI.createAndRunWorkbench(PlatformUI.java:173)
04:38:08 	at org.eclipse.ui.internal.ide.application.IDEApplication.start(IDEApplication.java:152)
04:38:08 	at org.eclipse.tycho.surefire.osgibooter.UITestApplication.runApplication(UITestApplication.java:34)
04:38:08 	at org.eclipse.tycho.surefire.osgibooter.AbstractUITestApplication.run(AbstractUITestApplication.java:129)
04:38:08 	at org.eclipse.tycho.surefire.osgibooter.UITestApplication.start(UITestApplication.java:44)
04:38:08 	at org.eclipse.equinox.internal.app.EclipseAppHandle.run(EclipseAppHandle.java:208)
04:38:08 	at org.eclipse.core.runtime.internal.adaptor.EclipseAppLauncher.runApplication(EclipseAppLauncher.java:143)
04:38:08 	at org.eclipse.core.runtime.internal.adaptor.EclipseAppLauncher.start(EclipseAppLauncher.java:109)
04:38:08 	at org.eclipse.core.runtime.adaptor.EclipseStarter.run(EclipseStarter.java:439)
04:38:08 	at org.eclipse.core.runtime.adaptor.EclipseStarter.run(EclipseStarter.java:271)
04:38:08 	at java.base/jdk.internal.reflect.DirectMethodHandleAccessor.invoke(DirectMethodHandleAccessor.java:103)
04:38:08 	at java.base/java.lang.reflect.Method.invoke(Method.java:580)
04:38:08 	at org.eclipse.equinox.launcher.Main.invokeFramework(Main.java:668)
04:38:08 	at org.eclipse.equinox.launcher.Main.basicRun(Main.java:605)
04:38:08 	at org.eclipse.equinox.launcher.Main.run(Main.java:1481)
04:38:08 	at org.eclipse.equinox.launcher.Main.main(Main.java:1454)
04:38:08 
04:38:08 org.eclipse.text.tests.ExclusivePositionUpdaterTest.testDeleteWithin -- Time elapsed: 0 s <<< ERROR!
04:38:08 java.lang.NullPointerException: Cannot invoke "org.eclipse.wst.sse.core.internal.ltk.modelhandler.IModelHandler.getDocumentLoader()" because "handler" is null
04:38:08 	at org.eclipse.text.tests.ExclusivePositionUpdaterTest.createDocument(ExclusivePositionUpdaterTest.java:56)
04:38:08 	at org.eclipse.text.tests.ExclusivePositionUpdaterTest.setUp(ExclusivePositionUpdaterTest.java:47)
04:38:08 	at junit.framework.TestCase.runBare(TestCase.java:140)
04:38:08 	at junit.framework.TestResult$1.protect(TestResult.java:122)
04:38:08 	at junit.framework.TestResult.runProtected(TestResult.java:142)
04:38:08 	at junit.framework.TestResult.run(TestResult.java:125)
04:38:08 	at junit.framework.TestCase.run(TestCase.java:130)
04:38:08 	at junit.framework.TestSuite.runTest(TestSuite.java:241)
04:38:08 	at junit.framework.TestSuite.run(TestSuite.java:236)
04:38:08 	at junit.framework.TestSuite.runTest(TestSuite.java:241)
04:38:08 	at junit.framework.TestSuite.run(TestSuite.java:236)
04:38:08 	at junit.framework.TestSuite.runTest(TestSuite.java:241)
04:38:08 	at junit.framework.TestSuite.run(TestSuite.java:236)
04:38:08 	at org.junit.internal.runners.JUnit38ClassRunner.run(JUnit38ClassRunner.java:90)
04:38:08 	at org.apache.maven.surefire.junit4.JUnit4Provider.execute(JUnit4Provider.java:316)
04:38:08 	at org.apache.maven.surefire.junit4.JUnit4Provider.executeWithRerun(JUnit4Provider.java:240)
04:38:08 	at org.apache.maven.surefire.junit4.JUnit4Provider.executeTestSet(JUnit4Provider.java:214)
04:38:08 	at org.apache.maven.surefire.junit4.JUnit4Provider.invoke(JUnit4Provider.java:155)
04:38:08 	at java.base/jdk.internal.reflect.DirectMethodHandleAccessor.invoke(DirectMethodHandleAccessor.java:103)
04:38:08 	at java.base/java.lang.reflect.Method.invoke(Method.java:580)
04:38:08 	at org.apache.maven.surefire.api.util.ReflectionUtils.invokeMethodWithArray2(ReflectionUtils.java:137)
04:38:08 	at org.apache.maven.surefire.booter.ProviderFactory$ProviderProxy.invoke(ProviderFactory.java:148)
04:38:08 	at org.apache.maven.surefire.booter.ProviderFactory.invokeProvider(ProviderFactory.java:88)
04:38:08 	at org.eclipse.tycho.surefire.osgibooter.OsgiSurefireBooter.run(OsgiSurefireBooter.java:140)
04:38:08 	at org.eclipse.tycho.surefire.osgibooter.AbstractUITestApplication$1.run(AbstractUITestApplication.java:42)
04:38:08 	at org.eclipse.e4.ui.internal.workbench.swt.E4Testable.lambda$1(E4Testable.java:127)
04:38:08 	at org.eclipse.swt.widgets.RunnableLock.run(RunnableLock.java:40)
04:38:08 	at org.eclipse.swt.widgets.Synchronizer.runAsyncMessages(Synchronizer.java:132)
04:38:08 	at org.eclipse.swt.widgets.Display.runAsyncMessages(Display.java:5040)
04:38:08 	at org.eclipse.swt.widgets.Display.readAndDispatch(Display.java:4520)
04:38:08 	at org.eclipse.e4.ui.internal.workbench.swt.PartRenderingEngine$5.run(PartRenderingEngine.java:1151)
04:38:08 	at org.eclipse.core.databinding.observable.Realm.runWithDefault(Realm.java:339)
04:38:08 	at org.eclipse.e4.ui.internal.workbench.swt.PartRenderingEngine.run(PartRenderingEngine.java:1042)
04:38:08 	at org.eclipse.e4.ui.internal.workbench.E4Workbench.createAndRunUI(E4Workbench.java:152)
04:38:08 	at org.eclipse.ui.internal.Workbench.lambda$3(Workbench.java:639)
04:38:08 	at org.eclipse.core.databinding.observable.Realm.runWithDefault(Realm.java:339)
04:38:08 	at org.eclipse.ui.internal.Workbench.createAndRunWorkbench(Workbench.java:546)
04:38:08 	at org.eclipse.ui.PlatformUI.createAndRunWorkbench(PlatformUI.java:173)
04:38:08 	at org.eclipse.ui.internal.ide.application.IDEApplication.start(IDEApplication.java:152)
04:38:08 	at org.eclipse.tycho.surefire.osgibooter.UITestApplication.runApplication(UITestApplication.java:34)
04:38:08 	at org.eclipse.tycho.surefire.osgibooter.AbstractUITestApplication.run(AbstractUITestApplication.java:129)
04:38:08 	at org.eclipse.tycho.surefire.osgibooter.UITestApplication.start(UITestApplication.java:44)
04:38:08 	at org.eclipse.equinox.internal.app.EclipseAppHandle.run(EclipseAppHandle.java:208)
04:38:08 	at org.eclipse.core.runtime.internal.adaptor.EclipseAppLauncher.runApplication(EclipseAppLauncher.java:143)
04:38:08 	at org.eclipse.core.runtime.internal.adaptor.EclipseAppLauncher.start(EclipseAppLauncher.java:109)
04:38:08 	at org.eclipse.core.runtime.adaptor.EclipseStarter.run(EclipseStarter.java:439)
04:38:08 	at org.eclipse.core.runtime.adaptor.EclipseStarter.run(EclipseStarter.java:271)
04:38:08 	at java.base/jdk.internal.reflect.DirectMethodHandleAccessor.invoke(DirectMethodHandleAccessor.java:103)
04:38:08 	at java.base/java.lang.reflect.Method.invoke(Method.java:580)
04:38:08 	at org.eclipse.equinox.launcher.Main.invokeFramework(Main.java:668)
04:38:08 	at org.eclipse.equinox.launcher.Main.basicRun(Main.java:605)
04:38:08 	at org.eclipse.equinox.launcher.Main.run(Main.java:1481)
04:38:08 	at org.eclipse.equinox.launcher.Main.main(Main.java:1454)
04:38:08 
04:38:08 org.eclipse.text.tests.ExclusivePositionUpdaterTest.testDeleteAtOffset -- Time elapsed: 0 s <<< ERROR!
04:38:08 java.lang.NullPointerException: Cannot invoke "org.eclipse.wst.sse.core.internal.ltk.modelhandler.IModelHandler.getDocumentLoader()" because "handler" is null
04:38:08 	at org.eclipse.text.tests.ExclusivePositionUpdaterTest.createDocument(ExclusivePositionUpdaterTest.java:56)
04:38:08 	at org.eclipse.text.tests.ExclusivePositionUpdaterTest.setUp(ExclusivePositionUpdaterTest.java:47)
04:38:08 	at junit.framework.TestCase.runBare(TestCase.java:140)
04:38:08 	at junit.framework.TestResult$1.protect(TestResult.java:122)
04:38:08 	at junit.framework.TestResult.runProtected(TestResult.java:142)
04:38:08 	at junit.framework.TestResult.run(TestResult.java:125)
04:38:08 	at junit.framework.TestCase.run(TestCase.java:130)
04:38:08 	at junit.framework.TestSuite.runTest(TestSuite.java:241)
04:38:08 	at junit.framework.TestSuite.run(TestSuite.java:236)
04:38:08 	at junit.framework.TestSuite.runTest(TestSuite.java:241)
04:38:08 	at junit.framework.TestSuite.run(TestSuite.java:236)
04:38:08 	at junit.framework.TestSuite.runTest(TestSuite.java:241)
04:38:08 	at junit.framework.TestSuite.run(TestSuite.java:236)
04:38:08 	at org.junit.internal.runners.JUnit38ClassRunner.run(JUnit38ClassRunner.java:90)
04:38:08 	at org.apache.maven.surefire.junit4.JUnit4Provider.execute(JUnit4Provider.java:316)
04:38:08 	at org.apache.maven.surefire.junit4.JUnit4Provider.executeWithRerun(JUnit4Provider.java:240)
04:38:08 	at org.apache.maven.surefire.junit4.JUnit4Provider.executeTestSet(JUnit4Provider.java:214)
04:38:08 	at org.apache.maven.surefire.junit4.JUnit4Provider.invoke(JUnit4Provider.java:155)
04:38:08 	at java.base/jdk.internal.reflect.DirectMethodHandleAccessor.invoke(DirectMethodHandleAccessor.java:103)
04:38:08 	at java.base/java.lang.reflect.Method.invoke(Method.java:580)
04:38:08 	at org.apache.maven.surefire.api.util.ReflectionUtils.invokeMethodWithArray2(ReflectionUtils.java:137)
04:38:08 	at org.apache.maven.surefire.booter.ProviderFactory$ProviderProxy.invoke(ProviderFactory.java:148)
04:38:08 	at org.apache.maven.surefire.booter.ProviderFactory.invokeProvider(ProviderFactory.java:88)
04:38:08 	at org.eclipse.tycho.surefire.osgibooter.OsgiSurefireBooter.run(OsgiSurefireBooter.java:140)
04:38:08 	at org.eclipse.tycho.surefire.osgibooter.AbstractUITestApplication$1.run(AbstractUITestApplication.java:42)
04:38:08 	at org.eclipse.e4.ui.internal.workbench.swt.E4Testable.lambda$1(E4Testable.java:127)
04:38:08 	at org.eclipse.swt.widgets.RunnableLock.run(RunnableLock.java:40)
04:38:08 	at org.eclipse.swt.widgets.Synchronizer.runAsyncMessages(Synchronizer.java:132)
04:38:08 	at org.eclipse.swt.widgets.Display.runAsyncMessages(Display.java:5040)
04:38:08 	at org.eclipse.swt.widgets.Display.readAndDispatch(Display.java:4520)
04:38:08 	at org.eclipse.e4.ui.internal.workbench.swt.PartRenderingEngine$5.run(PartRenderingEngine.java:1151)
04:38:08 	at org.eclipse.core.databinding.observable.Realm.runWithDefault(Realm.java:339)
04:38:08 	at org.eclipse.e4.ui.internal.workbench.swt.PartRenderingEngine.run(PartRenderingEngine.java:1042)
04:38:08 	at org.eclipse.e4.ui.internal.workbench.E4Workbench.createAndRunUI(E4Workbench.java:152)
04:38:08 	at org.eclipse.ui.internal.Workbench.lambda$3(Workbench.java:639)
04:38:08 	at org.eclipse.core.databinding.observable.Realm.runWithDefault(Realm.java:339)
04:38:08 	at org.eclipse.ui.internal.Workbench.createAndRunWorkbench(Workbench.java:546)
04:38:08 	at org.eclipse.ui.PlatformUI.createAndRunWorkbench(PlatformUI.java:173)
04:38:08 	at org.eclipse.ui.internal.ide.application.IDEApplication.start(IDEApplication.java:152)
04:38:08 	at org.eclipse.tycho.surefire.osgibooter.UITestApplication.runApplication(UITestApplication.java:34)
04:38:08 	at org.eclipse.tycho.surefire.osgibooter.AbstractUITestApplication.run(AbstractUITestApplication.java:129)
04:38:08 	at org.eclipse.tycho.surefire.osgibooter.UITestApplication.start(UITestApplication.java:44)
04:38:08 	at org.eclipse.equinox.internal.app.EclipseAppHandle.run(EclipseAppHandle.java:208)
04:38:08 	at org.eclipse.core.runtime.internal.adaptor.EclipseAppLauncher.runApplication(EclipseAppLauncher.java:143)
04:38:08 	at org.eclipse.core.runtime.internal.adaptor.EclipseAppLauncher.start(EclipseAppLauncher.java:109)
04:38:08 	at org.eclipse.core.runtime.adaptor.EclipseStarter.run(EclipseStarter.java:439)
04:38:08 	at org.eclipse.core.runtime.adaptor.EclipseStarter.run(EclipseStarter.java:271)
04:38:08 	at java.base/jdk.internal.reflect.DirectMethodHandleAccessor.invoke(DirectMethodHandleAccessor.java:103)
04:38:08 	at java.base/java.lang.reflect.Method.invoke(Method.java:580)
04:38:08 	at org.eclipse.equinox.launcher.Main.invokeFramework(Main.java:668)
04:38:08 	at org.eclipse.equinox.launcher.Main.basicRun(Main.java:605)
04:38:08 	at org.eclipse.equinox.launcher.Main.run(Main.java:1481)
04:38:08 	at org.eclipse.equinox.launcher.Main.main(Main.java:1454)
04:38:08 
04:38:08 org.eclipse.text.tests.ExclusivePositionUpdaterTest.testAddRightAfter -- Time elapsed: 0 s <<< ERROR!
04:38:08 java.lang.NullPointerException: Cannot invoke "org.eclipse.wst.sse.core.internal.ltk.modelhandler.IModelHandler.getDocumentLoader()" because "handler" is null
04:38:08 	at org.eclipse.text.tests.ExclusivePositionUpdaterTest.createDocument(ExclusivePositionUpdaterTest.java:56)
04:38:08 	at org.eclipse.text.tests.ExclusivePositionUpdaterTest.setUp(ExclusivePositionUpdaterTest.java:47)
04:38:08 	at junit.framework.TestCase.runBare(TestCase.java:140)
04:38:08 	at junit.framework.TestResult$1.protect(TestResult.java:122)
04:38:08 	at junit.framework.TestResult.runProtected(TestResult.java:142)
04:38:08 	at junit.framework.TestResult.run(TestResult.java:125)
04:38:08 	at junit.framework.TestCase.run(TestCase.java:130)
04:38:08 	at junit.framework.TestSuite.runTest(TestSuite.java:241)
04:38:08 	at junit.framework.TestSuite.run(TestSuite.java:236)
04:38:08 	at junit.framework.TestSuite.runTest(TestSuite.java:241)
04:38:08 	at junit.framework.TestSuite.run(TestSuite.java:236)
04:38:08 	at junit.framework.TestSuite.runTest(TestSuite.java:241)
04:38:08 	at junit.framework.TestSuite.run(TestSuite.java:236)
04:38:08 	at org.junit.internal.runners.JUnit38ClassRunner.run(JUnit38ClassRunner.java:90)
04:38:08 	at org.apache.maven.surefire.junit4.JUnit4Provider.execute(JUnit4Provider.java:316)
04:38:08 	at org.apache.maven.surefire.junit4.JUnit4Provider.executeWithRerun(JUnit4Provider.java:240)
04:38:08 	at org.apache.maven.surefire.junit4.JUnit4Provider.executeTestSet(JUnit4Provider.java:214)
04:38:08 	at org.apache.maven.surefire.junit4.JUnit4Provider.invoke(JUnit4Provider.java:155)
04:38:08 	at java.base/jdk.internal.reflect.DirectMethodHandleAccessor.invoke(DirectMethodHandleAccessor.java:103)
04:38:08 	at java.base/java.lang.reflect.Method.invoke(Method.java:580)
04:38:08 	at org.apache.maven.surefire.api.util.ReflectionUtils.invokeMethodWithArray2(ReflectionUtils.java:137)
04:38:08 	at org.apache.maven.surefire.booter.ProviderFactory$ProviderProxy.invoke(ProviderFactory.java:148)
04:38:08 	at org.apache.maven.surefire.booter.ProviderFactory.invokeProvider(ProviderFactory.java:88)
04:38:08 	at org.eclipse.tycho.surefire.osgibooter.OsgiSurefireBooter.run(OsgiSurefireBooter.java:140)
04:38:08 	at org.eclipse.tycho.surefire.osgibooter.AbstractUITestApplication$1.run(AbstractUITestApplication.java:42)
04:38:08 	at org.eclipse.e4.ui.internal.workbench.swt.E4Testable.lambda$1(E4Testable.java:127)
04:38:08 	at org.eclipse.swt.widgets.RunnableLock.run(RunnableLock.java:40)
04:38:08 	at org.eclipse.swt.widgets.Synchronizer.runAsyncMessages(Synchronizer.java:132)
04:38:08 	at org.eclipse.swt.widgets.Display.runAsyncMessages(Display.java:5040)
04:38:08 	at org.eclipse.swt.widgets.Display.readAndDispatch(Display.java:4520)
04:38:08 	at org.eclipse.e4.ui.internal.workbench.swt.PartRenderingEngine$5.run(PartRenderingEngine.java:1151)
04:38:08 	at org.eclipse.core.databinding.observable.Realm.runWithDefault(Realm.java:339)
04:38:08 	at org.eclipse.e4.ui.internal.workbench.swt.PartRenderingEngine.run(PartRenderingEngine.java:1042)
04:38:08 	at org.eclipse.e4.ui.internal.workbench.E4Workbench.createAndRunUI(E4Workbench.java:152)
04:38:08 	at org.eclipse.ui.internal.Workbench.lambda$3(Workbench.java:639)
04:38:08 	at org.eclipse.core.databinding.observable.Realm.runWithDefault(Realm.java:339)
04:38:08 	at org.eclipse.ui.internal.Workbench.createAndRunWorkbench(Workbench.java:546)
04:38:08 	at org.eclipse.ui.PlatformUI.createAndRunWorkbench(PlatformUI.java:173)
04:38:08 	at org.eclipse.ui.internal.ide.application.IDEApplication.start(IDEApplication.java:152)
04:38:08 	at org.eclipse.tycho.surefire.osgibooter.UITestApplication.runApplication(UITestApplication.java:34)
04:38:08 	at org.eclipse.tycho.surefire.osgibooter.AbstractUITestApplication.run(AbstractUITestApplication.java:129)
04:38:08 	at org.eclipse.tycho.surefire.osgibooter.UITestApplication.start(UITestApplication.java:44)
04:38:08 	at org.eclipse.equinox.internal.app.EclipseAppHandle.run(EclipseAppHandle.java:208)
04:38:08 	at org.eclipse.core.runtime.internal.adaptor.EclipseAppLauncher.runApplication(EclipseAppLauncher.java:143)
04:38:08 	at org.eclipse.core.runtime.internal.adaptor.EclipseAppLauncher.start(EclipseAppLauncher.java:109)
04:38:08 	at org.eclipse.core.runtime.adaptor.EclipseStarter.run(EclipseStarter.java:439)
04:38:08 	at org.eclipse.core.runtime.adaptor.EclipseStarter.run(EclipseStarter.java:271)
04:38:08 	at java.base/jdk.internal.reflect.DirectMethodHandleAccessor.invoke(DirectMethodHandleAccessor.java:103)
04:38:08 	at java.base/java.lang.reflect.Method.invoke(Method.java:580)
04:38:08 	at org.eclipse.equinox.launcher.Main.invokeFramework(Main.java:668)
04:38:08 	at org.eclipse.equinox.launcher.Main.basicRun(Main.java:605)
04:38:08 	at org.eclipse.equinox.launcher.Main.run(Main.java:1481)
04:38:08 	at org.eclipse.equinox.launcher.Main.main(Main.java:1454)
04:38:08 
04:38:08 org.eclipse.text.tests.ExclusivePositionUpdaterTest.testAddWithin -- Time elapsed: 0 s <<< ERROR!
04:38:08 java.lang.NullPointerException: Cannot invoke "org.eclipse.wst.sse.core.internal.ltk.modelhandler.IModelHandler.getDocumentLoader()" because "handler" is null
04:38:08 	at org.eclipse.text.tests.ExclusivePositionUpdaterTest.createDocument(ExclusivePositionUpdaterTest.java:56)
04:38:08 	at org.eclipse.text.tests.ExclusivePositionUpdaterTest.setUp(ExclusivePositionUpdaterTest.java:47)
04:38:08 	at junit.framework.TestCase.runBare(TestCase.java:140)
04:38:08 	at junit.framework.TestResult$1.protect(TestResult.java:122)
04:38:08 	at junit.framework.TestResult.runProtected(TestResult.java:142)
04:38:08 	at junit.framework.TestResult.run(TestResult.java:125)
04:38:08 	at junit.framework.TestCase.run(TestCase.java:130)
04:38:08 	at junit.framework.TestSuite.runTest(TestSuite.java:241)
04:38:08 	at junit.framework.TestSuite.run(TestSuite.java:236)
04:38:08 	at junit.framework.TestSuite.runTest(TestSuite.java:241)
04:38:08 	at junit.framework.TestSuite.run(TestSuite.java:236)
04:38:08 	at junit.framework.TestSuite.runTest(TestSuite.java:241)
04:38:08 	at junit.framework.TestSuite.run(TestSuite.java:236)
04:38:08 	at org.junit.internal.runners.JUnit38ClassRunner.run(JUnit38ClassRunner.java:90)
04:38:08 	at org.apache.maven.surefire.junit4.JUnit4Provider.execute(JUnit4Provider.java:316)
04:38:08 	at org.apache.maven.surefire.junit4.JUnit4Provider.executeWithRerun(JUnit4Provider.java:240)
04:38:08 	at org.apache.maven.surefire.junit4.JUnit4Provider.executeTestSet(JUnit4Provider.java:214)
04:38:08 	at org.apache.maven.surefire.junit4.JUnit4Provider.invoke(JUnit4Provider.java:155)
04:38:08 	at java.base/jdk.internal.reflect.DirectMethodHandleAccessor.invoke(DirectMethodHandleAccessor.java:103)
04:38:08 	at java.base/java.lang.reflect.Method.invoke(Method.java:580)
04:38:08 	at org.apache.maven.surefire.api.util.ReflectionUtils.invokeMethodWithArray2(ReflectionUtils.java:137)
04:38:08 	at org.apache.maven.surefire.booter.ProviderFactory$ProviderProxy.invoke(ProviderFactory.java:148)
04:38:08 	at org.apache.maven.surefire.booter.ProviderFactory.invokeProvider(ProviderFactory.java:88)
04:38:08 	at org.eclipse.tycho.surefire.osgibooter.OsgiSurefireBooter.run(OsgiSurefireBooter.java:140)
04:38:08 	at org.eclipse.tycho.surefire.osgibooter.AbstractUITestApplication$1.run(AbstractUITestApplication.java:42)
04:38:08 	at org.eclipse.e4.ui.internal.workbench.swt.E4Testable.lambda$1(E4Testable.java:127)
04:38:08 	at org.eclipse.swt.widgets.RunnableLock.run(RunnableLock.java:40)
04:38:08 	at org.eclipse.swt.widgets.Synchronizer.runAsyncMessages(Synchronizer.java:132)
04:38:08 	at org.eclipse.swt.widgets.Display.runAsyncMessages(Display.java:5040)
04:38:08 	at org.eclipse.swt.widgets.Display.readAndDispatch(Display.java:4520)
04:38:08 	at org.eclipse.e4.ui.internal.workbench.swt.PartRenderingEngine$5.run(PartRenderingEngine.java:1151)
04:38:08 	at org.eclipse.core.databinding.observable.Realm.runWithDefault(Realm.java:339)
04:38:08 	at org.eclipse.e4.ui.internal.workbench.swt.PartRenderingEngine.run(PartRenderingEngine.java:1042)
04:38:08 	at org.eclipse.e4.ui.internal.workbench.E4Workbench.createAndRunUI(E4Workbench.java:152)
04:38:08 	at org.eclipse.ui.internal.Workbench.lambda$3(Workbench.java:639)
04:38:08 	at org.eclipse.core.databinding.observable.Realm.runWithDefault(Realm.java:339)
04:38:08 	at org.eclipse.ui.internal.Workbench.createAndRunWorkbench(Workbench.java:546)
04:38:08 	at org.eclipse.ui.PlatformUI.createAndRunWorkbench(PlatformUI.java:173)
04:38:08 	at org.eclipse.ui.internal.ide.application.IDEApplication.start(IDEApplication.java:152)
04:38:08 	at org.eclipse.tycho.surefire.osgibooter.UITestApplication.runApplication(UITestApplication.java:34)
04:38:08 	at org.eclipse.tycho.surefire.osgibooter.AbstractUITestApplication.run(AbstractUITestApplication.java:129)
04:38:08 	at org.eclipse.tycho.surefire.osgibooter.UITestApplication.start(UITestApplication.java:44)
04:38:08 	at org.eclipse.equinox.internal.app.EclipseAppHandle.run(EclipseAppHandle.java:208)
04:38:08 	at org.eclipse.core.runtime.internal.adaptor.EclipseAppLauncher.runApplication(EclipseAppLauncher.java:143)
04:38:08 	at org.eclipse.core.runtime.internal.adaptor.EclipseAppLauncher.start(EclipseAppLauncher.java:109)
04:38:08 	at org.eclipse.core.runtime.adaptor.EclipseStarter.run(EclipseStarter.java:439)
04:38:08 	at org.eclipse.core.runtime.adaptor.EclipseStarter.run(EclipseStarter.java:271)
04:38:08 	at java.base/jdk.internal.reflect.DirectMethodHandleAccessor.invoke(DirectMethodHandleAccessor.java:103)
04:38:08 	at java.base/java.lang.reflect.Method.invoke(Method.java:580)
04:38:08 	at org.eclipse.equinox.launcher.Main.invokeFramework(Main.java:668)
04:38:08 	at org.eclipse.equinox.launcher.Main.basicRun(Main.java:605)
04:38:08 	at org.eclipse.equinox.launcher.Main.run(Main.java:1481)
04:38:08 	at org.eclipse.equinox.launcher.Main.main(Main.java:1454)
04:38:08 
04:38:08 org.eclipse.text.tests.ExclusivePositionUpdaterTest.testDeleted -- Time elapsed: 0 s <<< ERROR!
04:38:08 java.lang.NullPointerException: Cannot invoke "org.eclipse.wst.sse.core.internal.ltk.modelhandler.IModelHandler.getDocumentLoader()" because "handler" is null
04:38:08 	at org.eclipse.text.tests.ExclusivePositionUpdaterTest.createDocument(ExclusivePositionUpdaterTest.java:56)
04:38:08 	at org.eclipse.text.tests.ExclusivePositionUpdaterTest.setUp(ExclusivePositionUpdaterTest.java:47)
04:38:08 	at junit.framework.TestCase.runBare(TestCase.java:140)
04:38:08 	at junit.framework.TestResult$1.protect(TestResult.java:122)
04:38:08 	at junit.framework.TestResult.runProtected(TestResult.java:142)
04:38:08 	at junit.framework.TestResult.run(TestResult.java:125)
04:38:08 	at junit.framework.TestCase.run(TestCase.java:130)
04:38:08 	at junit.framework.TestSuite.runTest(TestSuite.java:241)
04:38:08 	at junit.framework.TestSuite.run(TestSuite.java:236)
04:38:08 	at junit.framework.TestSuite.runTest(TestSuite.java:241)
04:38:08 	at junit.framework.TestSuite.run(TestSuite.java:236)
04:38:08 	at junit.framework.TestSuite.runTest(TestSuite.java:241)
04:38:08 	at junit.framework.TestSuite.run(TestSuite.java:236)
04:38:08 	at org.junit.internal.runners.JUnit38ClassRunner.run(JUnit38ClassRunner.java:90)
04:38:08 	at org.apache.maven.surefire.junit4.JUnit4Provider.execute(JUnit4Provider.java:316)
04:38:08 	at org.apache.maven.surefire.junit4.JUnit4Provider.executeWithRerun(JUnit4Provider.java:240)
04:38:08 	at org.apache.maven.surefire.junit4.JUnit4Provider.executeTestSet(JUnit4Provider.java:214)
04:38:08 	at org.apache.maven.surefire.junit4.JUnit4Provider.invoke(JUnit4Provider.java:155)
04:38:08 	at java.base/jdk.internal.reflect.DirectMethodHandleAccessor.invoke(DirectMethodHandleAccessor.java:103)
04:38:08 	at java.base/java.lang.reflect.Method.invoke(Method.java:580)
04:38:08 	at org.apache.maven.surefire.api.util.ReflectionUtils.invokeMethodWithArray2(ReflectionUtils.java:137)
04:38:08 	at org.apache.maven.surefire.booter.ProviderFactory$ProviderProxy.invoke(ProviderFactory.java:148)
04:38:08 	at org.apache.maven.surefire.booter.ProviderFactory.invokeProvider(ProviderFactory.java:88)
04:38:08 	at org.eclipse.tycho.surefire.osgibooter.OsgiSurefireBooter.run(OsgiSurefireBooter.java:140)
04:38:08 	at org.eclipse.tycho.surefire.osgibooter.AbstractUITestApplication$1.run(AbstractUITestApplication.java:42)
04:38:08 	at org.eclipse.e4.ui.internal.workbench.swt.E4Testable.lambda$1(E4Testable.java:127)
04:38:08 	at org.eclipse.swt.widgets.RunnableLock.run(RunnableLock.java:40)
04:38:08 	at org.eclipse.swt.widgets.Synchronizer.runAsyncMessages(Synchronizer.java:132)
04:38:08 	at org.eclipse.swt.widgets.Display.runAsyncMessages(Display.java:5040)
04:38:08 	at org.eclipse.swt.widgets.Display.readAndDispatch(Display.java:4520)
04:38:08 	at org.eclipse.e4.ui.internal.workbench.swt.PartRenderingEngine$5.run(PartRenderingEngine.java:1151)
04:38:08 	at org.eclipse.core.databinding.observable.Realm.runWithDefault(Realm.java:339)
04:38:08 	at org.eclipse.e4.ui.internal.workbench.swt.PartRenderingEngine.run(PartRenderingEngine.java:1042)
04:38:08 	at org.eclipse.e4.ui.internal.workbench.E4Workbench.createAndRunUI(E4Workbench.java:152)
04:38:08 	at org.eclipse.ui.internal.Workbench.lambda$3(Workbench.java:639)
04:38:08 	at org.eclipse.core.databinding.observable.Realm.runWithDefault(Realm.java:339)
04:38:08 	at org.eclipse.ui.internal.Workbench.createAndRunWorkbench(Workbench.java:546)
04:38:08 	at org.eclipse.ui.PlatformUI.createAndRunWorkbench(PlatformUI.java:173)
04:38:08 	at org.eclipse.ui.internal.ide.application.IDEApplication.start(IDEApplication.java:152)
04:38:08 	at org.eclipse.tycho.surefire.osgibooter.UITestApplication.runApplication(UITestApplication.java:34)
04:38:08 	at org.eclipse.tycho.surefire.osgibooter.AbstractUITestApplication.run(AbstractUITestApplication.java:129)
04:38:08 	at org.eclipse.tycho.surefire.osgibooter.UITestApplication.start(UITestApplication.java:44)
04:38:08 	at org.eclipse.equinox.internal.app.EclipseAppHandle.run(EclipseAppHandle.java:208)
04:38:08 	at org.eclipse.core.runtime.internal.adaptor.EclipseAppLauncher.runApplication(EclipseAppLauncher.java:143)
04:38:08 	at org.eclipse.core.runtime.internal.adaptor.EclipseAppLauncher.start(EclipseAppLauncher.java:109)
04:38:08 	at org.eclipse.core.runtime.adaptor.EclipseStarter.run(EclipseStarter.java:439)
04:38:08 	at org.eclipse.core.runtime.adaptor.EclipseStarter.run(EclipseStarter.java:271)
04:38:08 	at java.base/jdk.internal.reflect.DirectMethodHandleAccessor.invoke(DirectMethodHandleAccessor.java:103)
04:38:08 	at java.base/java.lang.reflect.Method.invoke(Method.java:580)
04:38:08 	at org.eclipse.equinox.launcher.Main.invokeFramework(Main.java:668)
04:38:08 	at org.eclipse.equinox.launcher.Main.basicRun(Main.java:605)
04:38:08 	at org.eclipse.equinox.launcher.Main.run(Main.java:1481)
04:38:08 	at org.eclipse.equinox.launcher.Main.main(Main.java:1454)
04:38:08 
04:38:08 org.eclipse.text.tests.ExclusivePositionUpdaterTest.testDeleteRightBefore -- Time elapsed: 0 s <<< ERROR!
04:38:08 java.lang.NullPointerException: Cannot invoke "org.eclipse.wst.sse.core.internal.ltk.modelhandler.IModelHandler.getDocumentLoader()" because "handler" is null
04:38:08 	at org.eclipse.text.tests.ExclusivePositionUpdaterTest.createDocument(ExclusivePositionUpdaterTest.java:56)
04:38:08 	at org.eclipse.text.tests.ExclusivePositionUpdaterTest.setUp(ExclusivePositionUpdaterTest.java:47)
04:38:08 	at junit.framework.TestCase.runBare(TestCase.java:140)
04:38:08 	at junit.framework.TestResult$1.protect(TestResult.java:122)
04:38:08 	at junit.framework.TestResult.runProtected(TestResult.java:142)
04:38:08 	at junit.framework.TestResult.run(TestResult.java:125)
04:38:08 	at junit.framework.TestCase.run(TestCase.java:130)
04:38:08 	at junit.framework.TestSuite.runTest(TestSuite.java:241)
04:38:08 	at junit.framework.TestSuite.run(TestSuite.java:236)
04:38:08 	at junit.framework.TestSuite.runTest(TestSuite.java:241)
04:38:08 	at junit.framework.TestSuite.run(TestSuite.java:236)
04:38:08 	at junit.framework.TestSuite.runTest(TestSuite.java:241)
04:38:08 	at junit.framework.TestSuite.run(TestSuite.java:236)
04:38:08 	at org.junit.internal.runners.JUnit38ClassRunner.run(JUnit38ClassRunner.java:90)
04:38:08 	at org.apache.maven.surefire.junit4.JUnit4Provider.execute(JUnit4Provider.java:316)
04:38:08 	at org.apache.maven.surefire.junit4.JUnit4Provider.executeWithRerun(JUnit4Provider.java:240)
04:38:08 	at org.apache.maven.surefire.junit4.JUnit4Provider.executeTestSet(JUnit4Provider.java:214)
04:38:08 	at org.apache.maven.surefire.junit4.JUnit4Provider.invoke(JUnit4Provider.java:155)
04:38:08 	at java.base/jdk.internal.reflect.DirectMethodHandleAccessor.invoke(DirectMethodHandleAccessor.java:103)
04:38:08 	at java.base/java.lang.reflect.Method.invoke(Method.java:580)
04:38:08 	at org.apache.maven.surefire.api.util.ReflectionUtils.invokeMethodWithArray2(ReflectionUtils.java:137)
04:38:08 	at org.apache.maven.surefire.booter.ProviderFactory$ProviderProxy.invoke(ProviderFactory.java:148)
04:38:08 	at org.apache.maven.surefire.booter.ProviderFactory.invokeProvider(ProviderFactory.java:88)
04:38:08 	at org.eclipse.tycho.surefire.osgibooter.OsgiSurefireBooter.run(OsgiSurefireBooter.java:140)
04:38:08 	at org.eclipse.tycho.surefire.osgibooter.AbstractUITestApplication$1.run(AbstractUITestApplication.java:42)
04:38:08 	at org.eclipse.e4.ui.internal.workbench.swt.E4Testable.lambda$1(E4Testable.java:127)
04:38:08 	at org.eclipse.swt.widgets.RunnableLock.run(RunnableLock.java:40)
04:38:08 	at org.eclipse.swt.widgets.Synchronizer.runAsyncMessages(Synchronizer.java:132)
04:38:08 	at org.eclipse.swt.widgets.Display.runAsyncMessages(Display.java:5040)
04:38:08 	at org.eclipse.swt.widgets.Display.readAndDispatch(Display.java:4520)
04:38:08 	at org.eclipse.e4.ui.internal.workbench.swt.PartRenderingEngine$5.run(PartRenderingEngine.java:1151)
04:38:08 	at org.eclipse.core.databinding.observable.Realm.runWithDefault(Realm.java:339)
04:38:08 	at org.eclipse.e4.ui.internal.workbench.swt.PartRenderingEngine.run(PartRenderingEngine.java:1042)
04:38:08 	at org.eclipse.e4.ui.internal.workbench.E4Workbench.createAndRunUI(E4Workbench.java:152)
04:38:08 	at org.eclipse.ui.internal.Workbench.lambda$3(Workbench.java:639)
04:38:08 	at org.eclipse.core.databinding.observable.Realm.runWithDefault(Realm.java:339)
04:38:08 	at org.eclipse.ui.internal.Workbench.createAndRunWorkbench(Workbench.java:546)
04:38:08 	at org.eclipse.ui.PlatformUI.createAndRunWorkbench(PlatformUI.java:173)
04:38:08 	at org.eclipse.ui.internal.ide.application.IDEApplication.start(IDEApplication.java:152)
04:38:08 	at org.eclipse.tycho.surefire.osgibooter.UITestApplication.runApplication(UITestApplication.java:34)
04:38:08 	at org.eclipse.tycho.surefire.osgibooter.AbstractUITestApplication.run(AbstractUITestApplication.java:129)
04:38:08 	at org.eclipse.tycho.surefire.osgibooter.UITestApplication.start(UITestApplication.java:44)
04:38:08 	at org.eclipse.equinox.internal.app.EclipseAppHandle.run(EclipseAppHandle.java:208)
04:38:08 	at org.eclipse.core.runtime.internal.adaptor.EclipseAppLauncher.runApplication(EclipseAppLauncher.java:143)
04:38:08 	at org.eclipse.core.runtime.internal.adaptor.EclipseAppLauncher.start(EclipseAppLauncher.java:109)
04:38:08 	at org.eclipse.core.runtime.adaptor.EclipseStarter.run(EclipseStarter.java:439)
04:38:08 	at org.eclipse.core.runtime.adaptor.EclipseStarter.run(EclipseStarter.java:271)
04:38:08 	at java.base/jdk.internal.reflect.DirectMethodHandleAccessor.invoke(DirectMethodHandleAccessor.java:103)
04:38:08 	at java.base/java.lang.reflect.Method.invoke(Method.java:580)
04:38:08 	at org.eclipse.equinox.launcher.Main.invokeFramework(Main.java:668)
04:38:08 	at org.eclipse.equinox.launcher.Main.basicRun(Main.java:605)
04:38:08 	at org.eclipse.equinox.launcher.Main.run(Main.java:1481)
04:38:08 	at org.eclipse.equinox.launcher.Main.main(Main.java:1454)
04:38:08 
04:38:08 
04:38:08 Results:
04:38:08 
04:38:08 Errors: 
04:38:08   ExclusivePositionUpdaterTest.setUp:47->createDocument:56 NullPointer Cannot invoke "org.eclipse.wst.sse.core.internal.ltk.modelhandler.IModelHandler.getDocumentLoader()" because "handler" is null
04:38:08   ExclusivePositionUpdaterTest.setUp:47->createDocument:56 NullPointer Cannot invoke "org.eclipse.wst.sse.core.internal.ltk.modelhandler.IModelHandler.getDocumentLoader()" because "handler" is null
04:38:08   ExclusivePositionUpdaterTest.setUp:47->createDocument:56 NullPointer Cannot invoke "org.eclipse.wst.sse.core.internal.ltk.modelhandler.IModelHandler.getDocumentLoader()" because "handler" is null
04:38:08   ExclusivePositionUpdaterTest.setUp:47->createDocument:56 NullPointer Cannot invoke "org.eclipse.wst.sse.core.internal.ltk.modelhandler.IModelHandler.getDocumentLoader()" because "handler" is null
04:38:08   ExclusivePositionUpdaterTest.setUp:47->createDocument:56 NullPointer Cannot invoke "org.eclipse.wst.sse.core.internal.ltk.modelhandler.IModelHandler.getDocumentLoader()" because "handler" is null
04:38:08   ExclusivePositionUpdaterTest.setUp:47->createDocument:56 NullPointer Cannot invoke "org.eclipse.wst.sse.core.internal.ltk.modelhandler.IModelHandler.getDocumentLoader()" because "handler" is null
04:38:08   ExclusivePositionUpdaterTest.setUp:47->createDocument:56 NullPointer Cannot invoke "org.eclipse.wst.sse.core.internal.ltk.modelhandler.IModelHandler.getDocumentLoader()" because "handler" is null
04:38:08   ExclusivePositionUpdaterTest.setUp:47->createDocument:56 NullPointer Cannot invoke "org.eclipse.wst.sse.core.internal.ltk.modelhandler.IModelHandler.getDocumentLoader()" because "handler" is null
04:38:08   ExclusivePositionUpdaterTest.setUp:47->createDocument:56 NullPointer Cannot invoke "org.eclipse.wst.sse.core.internal.ltk.modelhandler.IModelHandler.getDocumentLoader()" because "handler" is null
04:38:08   ExclusivePositionUpdaterTest.setUp:47->createDocument:56 NullPointer Cannot invoke "org.eclipse.wst.sse.core.internal.ltk.modelhandler.IModelHandler.getDocumentLoader()" because "handler" is null
04:38:08   ExclusivePositionUpdaterTest.setUp:47->createDocument:56 NullPointer Cannot invoke "org.eclipse.wst.sse.core.internal.ltk.modelhandler.IModelHandler.getDocumentLoader()" because "handler" is null
04:38:08   ExclusivePositionUpdaterTest.setUp:47->createDocument:56 NullPointer Cannot invoke "org.eclipse.wst.sse.core.internal.ltk.modelhandler.IModelHandler.getDocumentLoader()" because "handler" is null
04:38:08   ExclusivePositionUpdaterTest.setUp:47->createDocument:56 NullPointer Cannot invoke "org.eclipse.wst.sse.core.internal.ltk.modelhandler.IModelHandler.getDocumentLoader()" because "handler" is null
04:38:08   ExclusivePositionUpdaterTest.setUp:47->createDocument:56 NullPointer Cannot invoke "org.eclipse.wst.sse.core.internal.ltk.modelhandler.IModelHandler.getDocumentLoader()" because "handler" is null
04:38:08   ExclusivePositionUpdaterTest.setUp:47->createDocument:56 NullPointer Cannot invoke "org.eclipse.wst.sse.core.internal.ltk.modelhandler.IModelHandler.getDocumentLoader()" because "handler" is null
04:38:08   ExclusivePositionUpdaterTest.setUp:47->createDocument:56 NullPointer Cannot invoke "org.eclipse.wst.sse.core.internal.ltk.modelhandler.IModelHandler.getDocumentLoader()" because "handler" is null
04:38:08   PositionUpdatingCornerCasesTest.setUp:50->createDocument:59 NullPointer Cannot invoke "org.eclipse.wst.sse.core.internal.ltk.modelhandler.IModelHandler.getDocumentLoader()" because "handler" is null
04:38:08 
04:38:08 Tests run: 356, Failures: 0, Errors: 17, Skipped: 0
04:38:08 
04:38:10 [ERROR] There are test failures.
04:38:10 
04:38:10 Please refer to /home/jenkins/agent/workspace/webtools-sourceediting_master/web/tests/org.eclipse.jst.jsp.ui.tests/target/surefire-reports for the individual test results.
04:38:10 
04:38:10 
04:38:10 [INFO] 
04:38:10 [INFO] --- eclipse-jarsigner:1.4.3:sign (sign) @ org.eclipse.jst.jsp.ui.tests ---
04:38:10 [INFO] Signing of nested jars of '/home/jenkins/agent/workspace/webtools-sourceediting_master/web/tests/org.eclipse.jst.jsp.ui.tests/target/org.eclipse.jst.jsp.ui.tests-1.2.0-SNAPSHOT.jar_unpacked_16432482640223347766/testfiles/116523/struts.jar' is disabled.
04:38:10 [INFO] Signing jar: /home/jenkins/agent/workspace/webtools-sourceediting_master/web/tests/org.eclipse.jst.jsp.ui.tests/target/org.eclipse.jst.jsp.ui.tests-1.2.0-SNAPSHOT.jar_unpacked_16432482640223347766/testfiles/116523/struts.jar
04:38:15 [INFO] Signing jar: /home/jenkins/agent/workspace/webtools-sourceediting_master/web/tests/org.eclipse.jst.jsp.ui.tests/target/org.eclipse.jst.jsp.ui.tests-1.2.0-SNAPSHOT.jar
04:38:20 [INFO] Signing jar: /home/jenkins/agent/workspace/webtools-sourceediting_master/web/tests/org.eclipse.jst.jsp.ui.tests/target/org.eclipse.jst.jsp.ui.tests-1.2.0-SNAPSHOT-sources.jar
04:38:25 [INFO] 
04:38:25 [INFO] --- tycho-p2:4.0.8:p2-metadata (p2-metadata) @ org.eclipse.jst.jsp.ui.tests ---
04:38:25 [INFO] No baseline version org.eclipse.webtools.sourceediting:org.eclipse.jst.jsp.ui.tests:eclipse-test-plugin:1.2.0-SNAPSHOT
04:38:25 [INFO] 
04:38:25 [INFO] --- install:3.1.1:install (default-install) @ org.eclipse.jst.jsp.ui.tests ---
04:38:25 [INFO] Installing /home/jenkins/agent/workspace/webtools-sourceediting_master/web/tests/org.eclipse.jst.jsp.ui.tests/.tycho-consumer-pom.xml to /home/jenkins/agent/workspace/webtools-sourceediting_master/.repository/org/eclipse/webtools/sourceediting/org.eclipse.jst.jsp.ui.tests/1.2.0-SNAPSHOT/org.eclipse.jst.jsp.ui.tests-1.2.0-SNAPSHOT.pom
04:38:25 [INFO] Installing /home/jenkins/agent/workspace/webtools-sourceediting_master/web/tests/org.eclipse.jst.jsp.ui.tests/target/org.eclipse.jst.jsp.ui.tests-1.2.0-SNAPSHOT.jar to /home/jenkins/agent/workspace/webtools-sourceediting_master/.repository/org/eclipse/webtools/sourceediting/org.eclipse.jst.jsp.ui.tests/1.2.0-SNAPSHOT/org.eclipse.jst.jsp.ui.tests-1.2.0-SNAPSHOT.jar
04:38:25 [INFO] Installing /home/jenkins/agent/workspace/webtools-sourceediting_master/web/tests/org.eclipse.jst.jsp.ui.tests/target/org.eclipse.jst.jsp.ui.tests-1.2.0-SNAPSHOT-sources.jar to /home/jenkins/agent/workspace/webtools-sourceediting_master/.repository/org/eclipse/webtools/sourceediting/org.eclipse.jst.jsp.ui.tests/1.2.0-SNAPSHOT/org.eclipse.jst.jsp.ui.tests-1.2.0-SNAPSHOT-sources.jar
04:38:25 [INFO] Installing /home/jenkins/agent/workspace/webtools-sourceediting_master/web/tests/org.eclipse.jst.jsp.ui.tests/target/p2content.xml to /home/jenkins/agent/workspace/webtools-sourceediting_master/.repository/org/eclipse/webtools/sourceediting/org.eclipse.jst.jsp.ui.tests/1.2.0-SNAPSHOT/org.eclipse.jst.jsp.ui.tests-1.2.0-SNAPSHOT-p2metadata.xml
04:38:25 [INFO] Installing /home/jenkins/agent/workspace/webtools-sourceediting_master/web/tests/org.eclipse.jst.jsp.ui.tests/target/p2artifacts.xml to /home/jenkins/agent/workspace/webtools-sourceediting_master/.repository/org/eclipse/webtools/sourceediting/org.eclipse.jst.jsp.ui.tests/1.2.0-SNAPSHOT/org.eclipse.jst.jsp.ui.tests-1.2.0-SNAPSHOT-p2artifacts.xml
04:38:25 [INFO] 
04:38:25 [INFO] --- tycho-p2:4.0.8:update-local-index (default-update-local-index) @ org.eclipse.jst.jsp.ui.tests ---
04:38:25 [INFO] 
04:38:25 [INFO] --< org.eclipse.webtools.sourceediting:org.eclipse.webtools.sourceediting.site >--
04:38:25 [INFO] Building org.eclipse.webtools.sourceediting.site 3.6.0-SNAPSHOT [157/157]
04:38:25 [INFO]   from site/pom.xml
04:38:25 [INFO] -------------------------[ eclipse-repository ]-------------------------
04:38:25 [INFO] Resolving dependencies of MavenProject: org.eclipse.webtools.sourceediting:org.eclipse.webtools.sourceediting.site:3.6.0-SNAPSHOT @ /home/jenkins/agent/workspace/webtools-sourceediting_master/site/pom.xml
04:38:27 [WARNING] Problems resolving provisioning plan.:
04:38:27    Unable to satisfy dependency from org.apache.felix.scr 2.1.24.v20200924-1939 to java.package; org.osgi.service.component [1.4.0,1.5.0).
04:38:27    Unable to satisfy dependency from org.apache.felix.scr 2.1.24.v20200924-1939 to java.package; org.osgi.service.component.runtime [1.4.0,1.5.0).
04:38:27    Unable to satisfy dependency from org.apache.felix.scr 2.1.24.v20200924-1939 to java.package; org.osgi.service.component.runtime.dto [1.4.0,1.5.0).
04:38:33 [INFO] 
04:38:33 [INFO] --- clean:3.2.0:clean (default-clean) @ org.eclipse.webtools.sourceediting.site ---
04:38:33 [INFO] 
04:38:33 [INFO] --- tycho-packaging:4.0.8:build-qualifier-aggregator (default-build-qualifier-aggregator) @ org.eclipse.webtools.sourceediting.site ---
04:38:33 [INFO] The project's OSGi version is 3.6.0.v202405130132
04:38:33 [INFO] 
04:38:33 [INFO] --- build-helper:3.0.0:regex-property (regex-property) @ org.eclipse.webtools.sourceediting.site ---
04:38:33 [INFO] 
04:38:33 [INFO] --- clean:3.2.0:clean (default-clean-1) @ org.eclipse.webtools.sourceediting.site ---
04:38:33 [INFO] 
04:38:33 [INFO] --- target-platform-configuration:4.0.8:target-platform (default-target-platform) @ org.eclipse.webtools.sourceediting.site ---
04:38:33 [INFO] 
04:38:33 [INFO] --- resources:3.3.1:resources (default-resources) @ org.eclipse.webtools.sourceediting.site ---
04:38:33 [WARNING] Using platform encoding (UTF-8 actually) to copy filtered resources, i.e. build is platform dependent!
04:38:33 [INFO] skip non existing resourceDirectory /home/jenkins/agent/workspace/webtools-sourceediting_master/site/src/main/resources
04:38:33 [INFO] 
04:38:33 [INFO] --- tycho-p2-publisher:4.0.8:publish-osgi-ee (default-publish-osgi-ee) @ org.eclipse.webtools.sourceediting.site ---
04:38:33 [INFO] Published profile IUs: [a.jre.javase 11.0.0]
04:38:33 [INFO] Published profile IUs: [a.jre.javase 12.0.0]
04:38:33 [INFO] Published profile IUs: [a.jre.javase 13.0.0]
04:38:33 [INFO] Published profile IUs: [a.jre.javase 14.0.0]
04:38:33 [INFO] Published profile IUs: [a.jre.javase 15.0.0]
04:38:33 [INFO] Published profile IUs: [a.jre.javase 16.0.0]
04:38:33 [INFO] Published profile IUs: [a.jre.javase 17.0.0]
04:38:33 [INFO] Published profile IUs: [a.jre.javase 18.0.0]
04:38:33 [INFO] Published profile IUs: [a.jre.javase 19.0.0]
04:38:33 [INFO] Published profile IUs: [a.jre.javase 20.0.0]
04:38:33 [INFO] Published profile IUs: [a.jre.javase 21.0.0]
04:38:33 [INFO] Published profile IUs: [a.jre.javase 22.0.0]
04:38:33 [INFO] Published profile IUs: [a.jre.javase 23.0.0]
04:38:33 [INFO] 
04:38:33 [INFO] --- tycho-p2-publisher:4.0.8:publish-products (default-publish-products) @ org.eclipse.webtools.sourceediting.site ---
04:38:33 [INFO] 
04:38:33 [INFO] --- tycho-p2-publisher:4.0.8:publish-categories (default-publish-categories) @ org.eclipse.webtools.sourceediting.site ---
04:38:33 [INFO] 
04:38:33 [INFO] --- tycho-p2-publisher:4.0.8:attach-artifacts (default-attach-artifacts) @ org.eclipse.webtools.sourceediting.site ---
04:38:33 [INFO] 
04:38:33 [INFO] --- tycho-p2-repository:4.0.8:assemble-repository (default-assemble-repository) @ org.eclipse.webtools.sourceediting.site ---
04:38:44 [WARNING] [59765ad3-7bcc-460a-8586-df2cc0b9f564][extension>org.eclipse.tycho:tycho-maven-plugin:4.0.8] The digest algorithms (md5) used to verify osgi.bundle,javax.xml,1.3.4.v201005080400 have severely compromised security. Please report this concern to the artifact provider.
04:38:45 [WARNING] [59765ad3-7bcc-460a-8586-df2cc0b9f564][extension>org.eclipse.tycho:tycho-maven-plugin:4.0.8] The digest algorithms (md5) used to verify osgi.bundle,org.apache.xml.serializer,2.7.1.v201005080400 have severely compromised security. Please report this concern to the artifact provider.
04:38:48 [INFO] 
04:38:48 [INFO] --- tycho-source:4.0.8:plugin-source (plugin-source) @ org.eclipse.webtools.sourceediting.site ---
04:38:48 [INFO] 
04:38:48 [INFO] --- tycho-p2-repository:4.0.8:archive-repository (default-archive-repository) @ org.eclipse.webtools.sourceediting.site ---
04:38:48 [INFO] Building zip: /home/jenkins/agent/workspace/webtools-sourceediting_master/site/target/org.eclipse.webtools.sourceediting.site-3.6.0-SNAPSHOT.zip
04:38:49 [INFO] 
04:38:49 [INFO] --- eclipse-jarsigner:1.4.3:sign (sign) @ org.eclipse.webtools.sourceediting.site ---
04:38:49 [INFO] 
04:38:49 [INFO] --- tycho-p2:4.0.8:p2-metadata (p2-metadata) @ org.eclipse.webtools.sourceediting.site ---
04:38:49 [INFO] 
04:38:49 [INFO] --- install:3.1.1:install (default-install) @ org.eclipse.webtools.sourceediting.site ---
04:38:49 [INFO] Installing /home/jenkins/agent/workspace/webtools-sourceediting_master/site/pom.xml to /home/jenkins/agent/workspace/webtools-sourceediting_master/.repository/org/eclipse/webtools/sourceediting/org.eclipse.webtools.sourceediting.site/3.6.0-SNAPSHOT/org.eclipse.webtools.sourceediting.site-3.6.0-SNAPSHOT.pom
04:38:49 [INFO] Installing /home/jenkins/agent/workspace/webtools-sourceediting_master/site/target/org.eclipse.webtools.sourceediting.site-3.6.0-SNAPSHOT.zip to /home/jenkins/agent/workspace/webtools-sourceediting_master/.repository/org/eclipse/webtools/sourceediting/org.eclipse.webtools.sourceediting.site/3.6.0-SNAPSHOT/org.eclipse.webtools.sourceediting.site-3.6.0-SNAPSHOT.zip
04:38:49 [INFO] Installing /home/jenkins/agent/workspace/webtools-sourceediting_master/site/target/p2content.xml to /home/jenkins/agent/workspace/webtools-sourceediting_master/.repository/org/eclipse/webtools/sourceediting/org.eclipse.webtools.sourceediting.site/3.6.0-SNAPSHOT/org.eclipse.webtools.sourceediting.site-3.6.0-SNAPSHOT-p2metadata.xml
04:38:49 [INFO] Installing /home/jenkins/agent/workspace/webtools-sourceediting_master/site/target/p2artifacts.xml to /home/jenkins/agent/workspace/webtools-sourceediting_master/.repository/org/eclipse/webtools/sourceediting/org.eclipse.webtools.sourceediting.site/3.6.0-SNAPSHOT/org.eclipse.webtools.sourceediting.site-3.6.0-SNAPSHOT-p2artifacts.xml
04:38:49 [INFO] 
04:38:49 [INFO] --- tycho-p2:4.0.8:update-local-index (default-update-local-index) @ org.eclipse.webtools.sourceediting.site ---
04:38:49 [INFO] ------------------------------------------------------------------------
04:38:49 [INFO] Reactor Summary:
04:38:49 [INFO] 
04:38:49 [INFO] sourceediting-parent 3.6.0-SNAPSHOT ................ SUCCESS [  4.715 s]
04:38:49 [INFO] sourceediting.core 3.10.0-SNAPSHOT ................. SUCCESS [  0.008 s]
04:38:49 [INFO] sourceediting.core.bundles 3.10.0-SNAPSHOT ......... SUCCESS [  0.006 s]
04:38:49 [INFO] org.eclipse.wst.sse.core 1.2.1400-SNAPSHOT ......... SUCCESS [01:15 min]
04:38:49 [INFO] org.eclipse.wst.sse.ui 1.7.1000-SNAPSHOT ........... SUCCESS [ 36.175 s]
04:38:49 [INFO] sourceediting.core.docs 3.10.0-SNAPSHOT ............ SUCCESS [  0.011 s]
04:38:49 [INFO] org.eclipse.wst.sse.doc.user 1.2.0-SNAPSHOT ........ SUCCESS [ 15.103 s]
04:38:49 [INFO] org.eclipse.wst.sse.ui.infopop 1.0.300-SNAPSHOT .... SUCCESS [ 15.820 s]
04:38:49 [INFO] sourceediting.core.tests 3.10.0-SNAPSHOT ........... SUCCESS [  0.005 s]
04:38:49 [INFO] sourceediting.xml 3.10.0-SNAPSHOT .................. SUCCESS [  0.010 s]
04:38:49 [INFO] sourceediting.xml.bundles 3.10.0-SNAPSHOT .......... SUCCESS [  0.005 s]
04:38:49 [INFO] org.eclipse.wst.xml.core 1.2.900-SNAPSHOT .......... SUCCESS [ 18.042 s]
04:38:49 [INFO] org.eclipse.wst.sse.core.tests 1.1.0-SNAPSHOT ...... SUCCESS [ 23.337 s]
04:38:49 [INFO] org.eclipse.wst.xml.ui 1.2.701-SNAPSHOT ............ SUCCESS [ 21.299 s]
04:38:49 [INFO] org.eclipse.wst.sse.ui.tests 1.1.300-SNAPSHOT ...... SUCCESS [01:09 min]
04:38:49 [INFO] sourceediting.json 3.10.0-SNAPSHOT ................. SUCCESS [  0.009 s]
04:38:49 [INFO] sourceediting.json.bundles 3.10.0-SNAPSHOT ......... SUCCESS [  0.006 s]
04:38:49 [INFO] org.eclipse.json 1.2.0-SNAPSHOT .................... SUCCESS [ 15.749 s]
04:38:49 [INFO] org.eclipse.wst.json.bower.core 1.1.0-SNAPSHOT ..... SUCCESS [ 15.719 s]
04:38:49 [INFO] org.eclipse.wst.json.core 1.1.100-SNAPSHOT ......... SUCCESS [ 15.889 s]
04:38:49 [INFO] org.eclipse.wst.json.schemaprocessor 1.1.0-SNAPSHOT  SUCCESS [ 15.341 s]
04:38:49 [INFO] org.eclipse.wst.json.ui 1.1.0-SNAPSHOT ............. SUCCESS [ 18.330 s]
04:38:49 [INFO] org.eclipse.wst.json.bower.ui 1.1.0-SNAPSHOT ....... SUCCESS [ 18.231 s]
04:38:49 [INFO] org.eclipse.wst.json.eslint.core 1.1.0-SNAPSHOT .... SUCCESS [ 17.999 s]
04:38:49 [INFO] org.eclipse.wst.json.eslint.ui 1.1.0-SNAPSHOT ...... SUCCESS [ 16.568 s]
04:38:49 [INFO] org.eclipse.wst.json.jshint.core 1.1.0-SNAPSHOT .... SUCCESS [ 15.263 s]
04:38:49 [INFO] org.eclipse.wst.json.jshint.ui 1.1.0-SNAPSHOT ...... SUCCESS [ 15.250 s]
04:38:49 [INFO] org.eclipse.wst.json.npm.core 1.1.0-SNAPSHOT ....... SUCCESS [ 10.282 s]
04:38:49 [INFO] org.eclipse.wst.json.npm.ui 1.1.0-SNAPSHOT ......... SUCCESS [ 12.788 s]
04:38:49 [INFO] sourceediting.json.features 3.10.0-SNAPSHOT ........ SUCCESS [  0.010 s]
04:38:49 [INFO] org.eclipse.wst.json_core.feature 1.1.9-SNAPSHOT ... SUCCESS [ 10.534 s]
04:38:49 [INFO] org.eclipse.wst.json_ui.feature 1.1.11-SNAPSHOT .... SUCCESS [ 12.413 s]
04:38:49 [INFO] org.eclipse.wst.json_sdk.feature 1.1.9-SNAPSHOT .... SUCCESS [  9.890 s]
04:38:49 [INFO] sourceediting.json.tests 3.10.0-SNAPSHOT ........... SUCCESS [  0.005 s]
04:38:49 [INFO] org.eclipse.wst.json.core.tests 1.1.0-SNAPSHOT ..... SUCCESS [ 14.544 s]
04:38:49 [INFO] org.eclipse.wst.json_tests.feature 1.1.9-SNAPSHOT .. SUCCESS [  8.752 s]
04:38:49 [INFO] org.eclipse.wst.dtd.core 1.2.600-SNAPSHOT .......... SUCCESS [ 10.411 s]
04:38:49 [INFO] org.eclipse.wst.dtd.ui 1.1.700-SNAPSHOT ............ SUCCESS [ 11.428 s]
04:38:49 [INFO] org.eclipse.wst.standard.schemas 1.0.800-SNAPSHOT .. SUCCESS [  9.194 s]
04:38:49 [INFO] org.eclipse.wst.xsd.core 1.2.101-SNAPSHOT .......... SUCCESS [01:12 min]
04:38:49 [INFO] org.eclipse.wst.xsd.ui 1.3.601-SNAPSHOT ............ SUCCESS [02:28 min]
04:38:49 [INFO] org.eclipse.wtp.xml.capabilities 1.0.200-SNAPSHOT .. SUCCESS [ 11.756 s]
04:38:49 [INFO] sourceediting.xml.docs 3.10.0-SNAPSHOT ............. SUCCESS [  0.006 s]
04:38:49 [INFO] org.eclipse.wst.dtdeditor.doc.user 1.1.0-SNAPSHOT .. SUCCESS [  8.526 s]
04:38:49 [INFO] org.eclipse.wst.dtd.ui.infopop 1.0.400-SNAPSHOT .... SUCCESS [  6.812 s]
04:38:49 [INFO] org.eclipse.wst.xmleditor.doc.user 1.1.0-SNAPSHOT .. SUCCESS [  7.137 s]
04:38:49 [INFO] org.eclipse.wst.xml.ui.infopop 1.0.400-SNAPSHOT .... SUCCESS [  6.744 s]
04:38:49 [INFO] org.eclipse.wst.xsdeditor.doc.user 1.0.800-SNAPSHOT  SUCCESS [ 10.833 s]
04:38:49 [INFO] sourceediting.xml.features 3.10.0-SNAPSHOT ......... SUCCESS [  0.010 s]
04:38:49 [INFO] org.eclipse.wst.xml_core.feature 3.34.0-SNAPSHOT ... SUCCESS [  7.416 s]
04:38:49 [INFO] org.eclipse.wst.xml_userdoc.feature 3.18.0-SNAPSHOT  SUCCESS [  7.043 s]
04:38:49 [INFO] org.eclipse.wst.xml_ui.feature 3.34.0-SNAPSHOT ..... SUCCESS [ 15.164 s]
04:38:49 [INFO] org.eclipse.wst.xml_sdk.feature 3.34.0-SNAPSHOT .... SUCCESS [ 13.915 s]
04:38:49 [INFO] sourceediting.xml.tests 3.10.0-SNAPSHOT ............ SUCCESS [  0.005 s]
04:38:49 [INFO] org.eclipse.wst.xsd.validation.tests 1.1.0-SNAPSHOT  SUCCESS [ 17.567 s]
04:38:49 [INFO] org.eclipse.wst.xml.catalog.tests 1.1.0-SNAPSHOT ... SUCCESS [ 22.612 s]
04:38:49 [INFO] org.eclipse.wst.dtd.core.tests 1.1.0-SNAPSHOT ...... SUCCESS [ 18.114 s]
04:38:49 [INFO] sourceediting.web 3.10.0-SNAPSHOT .................. SUCCESS [  0.005 s]
04:38:49 [INFO] sourceediting.web.bundles 3.10.0-SNAPSHOT .......... SUCCESS [  0.004 s]
04:38:49 [INFO] org.eclipse.jst.standard.schemas 1.2.700-SNAPSHOT .. SUCCESS [ 11.056 s]
04:38:49 [INFO] org.eclipse.wst.xml.core.tests 1.2.0-SNAPSHOT ...... SUCCESS [ 21.947 s]
04:38:49 [INFO] org.eclipse.wst.xsd.core.tests 1.1.0-SNAPSHOT ...... SUCCESS [ 17.474 s]
04:38:49 [INFO] org.eclipse.wst.dtd.ui.tests 1.1.1-SNAPSHOT ........ SUCCESS [ 27.394 s]
04:38:49 [INFO] org.eclipse.wst.css.core 1.3.400-SNAPSHOT .......... SUCCESS [ 11.122 s]
04:38:49 [INFO] org.eclipse.wst.html.core 1.4.400-SNAPSHOT ......... SUCCESS [ 11.638 s]
04:38:49 [INFO] org.eclipse.jst.jsp.core 1.4.800-SNAPSHOT .......... SUCCESS [ 11.097 s]
04:38:49 [INFO] org.eclipse.wst.css.ui 1.2.200-SNAPSHOT ............ SUCCESS [ 13.810 s]
04:38:49 [INFO] org.eclipse.wst.html.ui 1.1.801-SNAPSHOT ........... SUCCESS [ 15.485 s]
04:38:49 [INFO] org.eclipse.jst.jsp.ui 1.3.600-SNAPSHOT ............ SUCCESS [ 14.296 s]
04:38:49 [INFO] org.eclipse.wst.xml.ui.tests 1.1.201-SNAPSHOT ...... SUCCESS [01:03 min]
04:38:49 [INFO] org.eclipse.wst.xsd.ui.tests 1.1.0-SNAPSHOT ........ SUCCESS [ 21.744 s]
04:38:49 [INFO] org.eclipse.wst.xml.validation.tests 1.1.100-SNAPSHOT SUCCESS [ 18.287 s]
04:38:49 [INFO] org.eclipse.wst.xml.tests.encoding 1.1.0-SNAPSHOT .. SUCCESS [ 20.843 s]
04:38:49 [INFO] org.eclipse.wst.xml_tests.feature 3.31.0-SNAPSHOT .. SUCCESS [ 13.468 s]
04:38:49 [INFO] sourceediting.xpath 3.10.0-SNAPSHOT ................ SUCCESS [  0.004 s]
04:38:49 [INFO] sourceediting.xpath.bundles 3.10.0-SNAPSHOT ........ SUCCESS [  0.008 s]
04:38:49 [INFO] PsychoPath XPath 2.0 Processor: Branding Plug-in 1.1.0-SNAPSHOT SUCCESS [ 10.184 s]
04:38:49 [INFO] PsychoPath XPath 2.0 Processor 2.2.0-SNAPSHOT ...... SUCCESS [ 11.209 s]
04:38:49 [INFO] PsychoPath XPath 2.0 Processor 2.1.0-SNAPSHOT ...... SUCCESS [  9.930 s]
04:38:49 [INFO] org.eclipse.wst.xml.xpath.core 1.4.0-SNAPSHOT ...... SUCCESS [ 10.213 s]
04:38:49 [INFO] org.eclipse.wst.xml.xpath.ui 1.2.100-SNAPSHOT ...... SUCCESS [ 14.695 s]
04:38:49 [INFO] sourceediting.xpath.docs 3.10.0-SNAPSHOT ........... SUCCESS [  0.005 s]
04:38:49 [INFO] PsychoPath XPath 2.0 Processor: User Documentation 2.1.100-SNAPSHOT SUCCESS [ 10.453 s]
04:38:49 [INFO] PsychoPath XPath 2.0 Processor: SDK Documentation 2.1.0-SNAPSHOT SUCCESS [ 10.529 s]
04:38:49 [INFO] sourceediting.xpath.features 3.10.0-SNAPSHOT ....... SUCCESS [  0.006 s]
04:38:49 [INFO] PsychoPath XPath 2.0 Processor Feature 2.1.0-SNAPSHOT SUCCESS [ 10.126 s]
04:38:49 [INFO] PsychoPath XPath 2.0 Processor: SDK Feature 2.1.0-SNAPSHOT SUCCESS [ 10.199 s]
04:38:49 [INFO] sourceediting.xpath.tests 3.10.0-SNAPSHOT .......... SUCCESS [  0.005 s]
04:38:49 [INFO] PsychoPath XPath 2.0 Processor: XQuery Test Suite 1.0.2-SNAPSHOT SUCCESS [01:13 min]
04:38:49 [INFO] PsychoPath XPath 2.0 Processor: Tests 2.2.100-SNAPSHOT SUCCESS [ 46.385 s]
04:38:49 [INFO] PsychoPath XPath 2.0 Processor: Tests for WTP type support 2.1.1-SNAPSHOT SUCCESS [ 20.628 s]
04:38:49 [INFO] org.eclipse.wst.xml.xpath.core.tests 1.1.0-SNAPSHOT  SUCCESS [ 17.612 s]
04:38:49 [INFO] org.eclipse.wst.xml.xpath.ui.tests 1.1.0-SNAPSHOT .. SUCCESS [ 18.718 s]
04:38:49 [INFO] sourceediting.xsl 3.10.0-SNAPSHOT .................. SUCCESS [  0.006 s]
04:38:49 [INFO] sourceediting.xsl.bundles 3.10.0-SNAPSHOT .......... SUCCESS [  0.004 s]
04:38:49 [INFO] XSL Tools Branding Plugin 1.2.0-SNAPSHOT ........... SUCCESS [ 10.304 s]
04:38:49 [INFO] XSLT Core Plugin 1.2.200-SNAPSHOT .................. SUCCESS [ 11.901 s]
04:38:49 [INFO] XSLT Launching Plugin 1.2.0-SNAPSHOT ............... SUCCESS [ 11.055 s]
04:38:49 [INFO] XSLT Debug UI Plugin 1.1.100-SNAPSHOT .............. SUCCESS [ 15.862 s]
04:38:49 [INFO] XSLT EXSLT Core Plugin 1.1.0-SNAPSHOT .............. SUCCESS [  8.107 s]
04:38:49 [INFO] XSLT UI Plugin 1.2.300-SNAPSHOT .................... SUCCESS [ 14.579 s]
04:38:49 [INFO] XSLT EXSLT UI Plugin 1.1.0-SNAPSHOT ................ SUCCESS [ 13.124 s]
04:38:49 [INFO] XSLT JAXP Debug Plugin 1.1.100-SNAPSHOT ............ SUCCESS [ 10.412 s]
04:38:49 [INFO] XSLT JAXP Launching UI Plugin 1.1.200-SNAPSHOT ..... SUCCESS [ 12.951 s]
04:38:49 [INFO] XSLT JAXP Debug UI Plugin 1.1.0-SNAPSHOT ........... SUCCESS [ 14.187 s]
04:38:49 [INFO] XSLT Saxon Plugin 1.1.0-SNAPSHOT ................... SUCCESS [ 10.144 s]
04:38:49 [INFO] XSLT Xalan Plugin 1.1.100-SNAPSHOT ................. SUCCESS [ 10.240 s]
04:38:49 [INFO] sourceediting.xsl.docs 3.10.0-SNAPSHOT ............. SUCCESS [  0.004 s]
04:38:49 [INFO] org.eclipse.wst.xsl.doc 1.1.0-SNAPSHOT ............. SUCCESS [ 14.096 s]
04:38:49 [INFO] org.eclipse.wst.xsl.sdk.documentation 1.1.0-SNAPSHOT SUCCESS [ 10.441 s]
04:38:49 [INFO] sourceediting.xsl.features 3.10.0-SNAPSHOT ......... SUCCESS [  0.008 s]
04:38:49 [INFO] XSLT FeaturePlugin 1.3.1600-SNAPSHOT ............... SUCCESS [ 16.130 s]
04:38:49 [INFO] org.eclipse.wst.xsl_sdk.feature 1.1.1500-SNAPSHOT .. SUCCESS [ 13.811 s]
04:38:49 [INFO] sourceediting.xsl.tests 3.10.0-SNAPSHOT ............ SUCCESS [  0.005 s]
04:38:49 [INFO] XSLT Core Tests 1.1.0-SNAPSHOT ..................... SUCCESS [ 10.383 s]
04:38:49 [INFO] EXSLT Core Tests 1.1.0-SNAPSHOT .................... SUCCESS [ 10.275 s]
04:38:49 [INFO] XSLT UI Tests 1.2.1-SNAPSHOT ....................... SUCCESS [ 14.941 s]
04:38:49 [INFO] JAXP Debug Tests 1.1.0-SNAPSHOT .................... SUCCESS [  7.574 s]
04:38:49 [INFO] EXSLT UI Tests 1.0.100-SNAPSHOT .................... SUCCESS [ 15.477 s]
04:38:49 [INFO] XSL Launching Tests 1.2.100-SNAPSHOT ............... SUCCESS [ 14.179 s]
04:38:49 [INFO] org.eclipse.wst.xsl.tests 1.3.0-SNAPSHOT ........... SUCCESS [ 13.642 s]
04:38:49 [INFO] org.eclipse.wst.xsl_tests.feature 1.1.1000-SNAPSHOT  SUCCESS [ 14.802 s]
04:38:49 [INFO] org.eclipse.wst.jsdt.web.core 1.1.300-SNAPSHOT ..... SUCCESS [ 14.172 s]
04:38:49 [INFO] org.eclipse.wst.jsdt.web.ui 1.3.0-SNAPSHOT ......... SUCCESS [ 15.475 s]
04:38:49 [INFO] org.eclipse.wst.jsdt.web.support.jsp 1.1.200-SNAPSHOT SUCCESS [ 13.585 s]
04:38:49 [INFO] org.eclipse.wst.web 1.3.200-SNAPSHOT ............... SUCCESS [ 14.255 s]
04:38:49 [INFO] org.eclipse.wst.web.ui 1.2.500-SNAPSHOT ............ SUCCESS [ 14.302 s]
04:38:49 [INFO] org.eclipse.wtp.javascript.capabilities 1.0.200-SNAPSHOT SUCCESS [ 11.166 s]
04:38:49 [INFO] org.eclipse.wtp.web.capabilities 1.0.200-SNAPSHOT .. SUCCESS [ 11.042 s]
04:38:49 [INFO] sourceediting.web.docs 3.10.0-SNAPSHOT ............. SUCCESS [  0.005 s]
04:38:49 [INFO] org.eclipse.jst.jsp.ui.infopop 1.0.200-SNAPSHOT .... SUCCESS [ 10.360 s]
04:38:49 [INFO] org.eclipse.wst.doc.user 1.2.0-SNAPSHOT ............ SUCCESS [ 10.635 s]
04:38:49 [INFO] org.eclipse.wst.html.ui.infopop 1.0.201-SNAPSHOT ... SUCCESS [ 10.094 s]
04:38:49 [INFO] org.eclipse.wst.webtools.doc.user 1.0.500-SNAPSHOT . SUCCESS [ 10.623 s]
04:38:49 [INFO] org.eclipse.wst.web.ui.infopop 1.0.300-SNAPSHOT .... SUCCESS [ 10.165 s]
04:38:49 [INFO] sourceediting.web.features 3.10.0-SNAPSHOT ......... SUCCESS [  0.006 s]
04:38:49 [INFO] org.eclipse.wst.web_core.feature 3.31.0-SNAPSHOT ... SUCCESS [ 13.963 s]
04:38:49 [INFO] org.eclipse.wst.web_userdoc.feature 3.18.0-SNAPSHOT  SUCCESS [ 10.017 s]
04:38:49 [INFO] org.eclipse.wst.web_js_support.feature 3.33.0-SNAPSHOT SUCCESS [ 14.024 s]
04:38:49 [INFO] org.eclipse.wst.web_ui.feature 3.31.0-SNAPSHOT ..... SUCCESS [ 17.190 s]
04:38:49 [INFO] org.eclipse.wst.web_js_support_sdk.feature 3.33.0-SNAPSHOT SUCCESS [ 13.932 s]
04:38:49 [INFO] org.eclipse.wst.web_sdk.feature 3.31.0-SNAPSHOT .... SUCCESS [ 17.051 s]
04:38:49 [INFO] sourceediting.web.tests 3.10.0-SNAPSHOT ............ SUCCESS [  0.004 s]
04:38:49 [INFO] org.eclipse.wst.html.core.tests 1.2.0-SNAPSHOT ..... SUCCESS [ 20.790 s]
04:38:49 [INFO] org.eclipse.wst.css.tests.encoding 1.1.0-SNAPSHOT .. SUCCESS [ 17.457 s]
04:38:49 [INFO] org.eclipse.wst.css.core.tests 1.1.100-SNAPSHOT .... SUCCESS [ 17.942 s]
04:38:49 [INFO] org.eclipse.wst.html.tests.encoding 1.1.100-SNAPSHOT SUCCESS [ 17.885 s]
04:38:49 [INFO] org.eclipse.wst.html.ui.tests 1.1.101-SNAPSHOT ..... SUCCESS [ 32.782 s]
04:38:49 [INFO] org.eclipse.wst.jsdt.web.core.tests 1.1.0-SNAPSHOT . SUCCESS [ 18.474 s]
04:38:49 [INFO] org.eclipse.wst.jsdt.web.ui.tests 1.1.1-SNAPSHOT ... SUCCESS [ 35.561 s]
04:38:49 [INFO] org.eclipse.wst.web_js_support_tests.feature 3.22.0-SNAPSHOT SUCCESS [ 16.385 s]
04:38:49 [INFO] org.eclipse.wst.css.ui.tests 1.1.101-SNAPSHOT ...... SUCCESS [ 34.981 s]
04:38:49 [INFO] org.eclipse.wst.web_tests.feature 3.31.0-SNAPSHOT .. SUCCESS [ 15.009 s]
04:38:49 [INFO] org.eclipse.jst.jsp.core.tests 1.1.300-SNAPSHOT .... SUCCESS [02:40 min]
04:38:49 [INFO] org.eclipse.jst.jsp.tests.encoding 1.1.0-SNAPSHOT .. SUCCESS [ 22.808 s]
04:38:49 [INFO] org.eclipse.jst.jsp.ui.tests 1.2.0-SNAPSHOT ........ SUCCESS [01:06 min]
04:38:49 [INFO] org.eclipse.webtools.sourceediting.site 3.6.0-SNAPSHOT SUCCESS [ 24.115 s]
04:38:49 [INFO] ------------------------------------------------------------------------
04:38:49 [INFO] BUILD SUCCESS
04:38:49 [INFO] ------------------------------------------------------------------------
04:38:49 [INFO] Total time:  42:31 min
04:38:49 [INFO] Finished at: 2024-06-20T08:38:49Z
04:38:49 [INFO] ------------------------------------------------------------------------
04:38:49 Exception in thread "Thread-5" java.lang.NoClassDefFoundError: org/eclipse/jgit/internal/JGitText
04:38:49 	at org.eclipse.jgit.internal.util.ShutdownHook.cleanup(ShutdownHook.java:85)
04:38:49 	at java.base/java.lang.Thread.run(Thread.java:1583)
04:38:49 Caused by: java.lang.ClassNotFoundException: org.eclipse.jgit.internal.JGitText
04:38:49 	... 2 more
04:38:50 Taking screenshot.
04:38:50 [webtools-sourceediting_master] $ echo $XAUTHORITY
04:38:50 /home/jenkins/agent/workspace/webtools-sourceediting_master/.Xauthority-1104061069591684475
04:38:50 [webtools-sourceediting_master] $ ls -l $XAUTHORITY
04:38:50 -rw-r--r--. 1 jenkins 1000750000 0 Jun 20 07:56 /home/jenkins/agent/workspace/webtools-sourceediting_master/.Xauthority-1104061069591684475
04:38:50 [webtools-sourceediting_master] $ import -window root -display :42 screenshot.jpg
04:38:50 Terminating xvnc.
04:38:55 
04:38:55 Thu Jun 20 08:38:55 2024
04:38:55  ComparingUpdateTracker: 0 pixels in / 0 pixels out
04:38:55  ComparingUpdateTracker: (1:-nan ratio)
04:38:56 $ ssh-agent -k
04:38:56 unset SSH_AUTH_SOCK;
04:38:56 unset SSH_AGENT_PID;
04:38:56 echo Agent pid 45 killed;
04:38:56 [ssh-agent] Stopped.
04:38:56 Not sending mail to unregistered user noreply@github.com
04:38:56 Not sending mail to unregistered user thatnitind@gmail.com
04:38:57 Sending e-mails to: wtp-releng@eclipse.org vrubezhn@redhat.com thatnitind@gmail.com loskutov@gmx.de exabrial+eclipse@gmail.com gzsombor@gmail.com erik.brangs@gmx.de walther@indel.ch
04:38:57 Recording test results
04:39:00 [Checks API] No suitable checks publisher found.
04:39:00 Build step 'Publish JUnit test result report' changed build result to UNSTABLE
04:39:00 Archiving artifacts
04:39:20 [description-setter] Could not determine description.
04:39:20 Finished: UNSTABLE