Skip to content

Console Output

Skipping 20,541 KB.. Full Log
 DEBUG org.eclipse.swtbot.swt.finder.matchers.AbstractMatcher - matched Button with text "OK", using matcher: (of type 'Button' and with mnemonic 'OK' and with style 'SWT.PUSH')
14:20:26 [2024-06-19T18:20:26.554Z] DEBUG org.eclipse.swtbot.swt.finder.widgets.SWTBotButton - Clicking on OK
14:20:26 [2024-06-19T18:20:26.554Z] DEBUG org.eclipse.swtbot.swt.finder.widgets.SWTBotButton - Sent event 6 to [MouseEnter [6]: MouseEvent{Button {OK} time=834308069 data=null button=0 stateMask=0x0 x=0 y=0 count=0}, (of type 'Button' and with mnemonic 'OK' and with style 'SWT.PUSH')]
14:20:26 [2024-06-19T18:20:26.554Z] DEBUG org.eclipse.swtbot.swt.finder.widgets.SWTBotButton - Sent event 5 to [MouseMove [5]: MouseEvent{Button {OK} time=834308069 data=null button=0 stateMask=0x0 x=0 y=0 count=0}, (of type 'Button' and with mnemonic 'OK' and with style 'SWT.PUSH')]
14:20:26 [2024-06-19T18:20:26.554Z] DEBUG org.eclipse.swtbot.swt.finder.widgets.SWTBotButton - Sent event 26 to [Activate [26]: ShellEvent{Button {OK} time=834308070 data=null doit=true}, (of type 'Button' and with mnemonic 'OK' and with style 'SWT.PUSH')]
14:20:26 [2024-06-19T18:20:26.554Z] DEBUG org.eclipse.swtbot.swt.finder.widgets.SWTBotButton - Sent event 15 to [FocusIn [15]: FocusEvent{Button {OK} time=834308070 data=null}, (of type 'Button' and with mnemonic 'OK' and with style 'SWT.PUSH')]
14:20:26 [2024-06-19T18:20:26.554Z] DEBUG org.eclipse.swtbot.swt.finder.widgets.SWTBotButton - Sent event 3 to [MouseDown [3]: MouseEvent{Button {OK} time=834308070 data=null button=0 stateMask=0x0 x=0 y=0 count=0}, (of type 'Button' and with mnemonic 'OK' and with style 'SWT.PUSH')]
14:20:26 [2024-06-19T18:20:26.554Z] DEBUG org.eclipse.swtbot.swt.finder.widgets.SWTBotButton - Sent event 4 to [MouseUp [4]: MouseEvent{Button {OK} time=834308070 data=null button=0 stateMask=0x0 x=0 y=0 count=0}, (of type 'Button' and with mnemonic 'OK' and with style 'SWT.PUSH')]
14:20:26 [2024-06-19T18:20:26.554Z] WARN org.eclipse.swtbot.swt.finder.widgets.SWTBotButton - Widget is not enabled: (of type 'Button' and with mnemonic 'OK' and with style 'SWT.PUSH')
14:20:26 [2024-06-19T18:20:26.554Z] WARN org.eclipse.swtbot.swt.finder.widgets.SWTBotButton - Widget is not enabled: (of type 'Button' and with mnemonic 'OK' and with style 'SWT.PUSH')
14:20:26 [2024-06-19T18:20:26.554Z] WARN org.eclipse.swtbot.swt.finder.widgets.SWTBotButton - Widget is not enabled: (of type 'Button' and with mnemonic 'OK' and with style 'SWT.PUSH')
14:20:26 [2024-06-19T18:20:26.554Z] WARN org.eclipse.swtbot.swt.finder.widgets.SWTBotButton - Widget is not enabled: (of type 'Button' and with mnemonic 'OK' and with style 'SWT.PUSH')
14:20:26 [2024-06-19T18:20:26.554Z] WARN org.eclipse.swtbot.swt.finder.widgets.SWTBotButton - Widget is not enabled: (of type 'Button' and with mnemonic 'OK' and with style 'SWT.PUSH')
14:20:26 [2024-06-19T18:20:26.554Z] DEBUG org.eclipse.swtbot.swt.finder.widgets.SWTBotButton - Clicked on OK
14:20:26 [2024-06-19T18:20:26.554Z] DEBUG org.eclipse.swtbot.swt.finder.widgets.SWTBotButton - Sent event 13 to [Selection [13]: SelectionEvent{Button {OK} time=834308070 data=null item=null detail=0 x=0 y=0 width=0 height=0 stateMask=0x0 text=null doit=true}, (of type 'Button' and with mnemonic 'OK' and with style 'SWT.PUSH')]
14:20:26 [2024-06-19T18:20:26.554Z] DEBUG org.eclipse.swtbot.swt.finder.widgets.SWTBotMenu - Sent event 13 to [Selection [13]: SelectionEvent{MenuItem {&Delete	Delete} time=834307421 data=null item=null detail=0 x=0 y=0 width=0 height=0 stateMask=0x0 text=null doit=true}, with mnemonic 'Delete']
14:20:27 [2024-06-19T18:20:27.115Z] DEBUG org.eclipse.swtbot.swt.finder.widgets.SWTBotShell - Sent event 26 to [Activate [26]: ShellEvent{Shell {data - Eclipse Platform} time=834308575 data=null doit=true}, Shell with text {data - Eclipse Platform}]
14:20:27 [2024-06-19T18:20:27.115Z] DEBUG org.eclipse.swtbot.swt.finder.matchers.AbstractMatcher - matched MenuItem with text "&Window", using matcher: with mnemonic 'Window'
14:20:27 [2024-06-19T18:20:27.115Z] DEBUG org.eclipse.swtbot.swt.finder.matchers.AbstractMatcher - matched MenuItem with text "&Preferences", using matcher: with mnemonic 'Preferences'
14:20:27 [2024-06-19T18:20:27.115Z] DEBUG org.eclipse.swtbot.swt.finder.widgets.SWTBotMenu - Clicking on with mnemonic 'Preferences'
14:20:27 [2024-06-19T18:20:27.370Z] DEBUG org.eclipse.swtbot.swt.finder.widgets.SWTBotMenu - Clicked on with mnemonic 'Preferences'
14:20:27 [2024-06-19T18:20:27.371Z] DEBUG org.eclipse.swtbot.swt.finder.matchers.AbstractMatcher - matched Shell with text "Preferences", using matcher: with text 'Preferences'
14:20:27 [2024-06-19T18:20:27.371Z] DEBUG org.eclipse.swtbot.swt.finder.widgets.SWTBotShell - Sent event 26 to [Activate [26]: ShellEvent{Shell {Preferences} time=834308835 data=null doit=true}, Shell with text {Preferences}]
14:20:27 [2024-06-19T18:20:27.371Z] DEBUG org.eclipse.swtbot.swt.finder.matchers.AbstractMatcher - matched Tree with text "", using matcher: of type 'Tree'
14:20:27 [2024-06-19T18:20:27.371Z] DEBUG org.eclipse.swtbot.swt.finder.matchers.AbstractMatcher - matched Tree with text "", using matcher: (of type 'Tree')
14:20:27 [2024-06-19T18:20:27.371Z] DEBUG org.eclipse.swtbot.swt.finder.matchers.AbstractMatcher - matched Tree with text "", using matcher: of type 'Tree'
14:20:27 [2024-06-19T18:20:27.371Z] DEBUG org.eclipse.swtbot.swt.finder.matchers.AbstractMatcher - matched Tree with text "", using matcher: (of type 'Tree')
14:20:27 [2024-06-19T18:20:27.371Z] DEBUG org.eclipse.swtbot.swt.finder.widgets.SWTBotTree - Attempting to set focus on Tree with text {}
14:20:27 [2024-06-19T18:20:27.371Z] DEBUG org.eclipse.swtbot.swt.finder.widgets.SWTBotTreeItem - Sent event 6 to [MouseEnter [6]: MouseEvent{TreeItem {Tracing} time=834308865 data=null button=0 stateMask=0x0 x=49 y=127 count=0}, TreeItem with text {Tracing}]
14:20:27 [2024-06-19T18:20:27.371Z] DEBUG org.eclipse.swtbot.swt.finder.widgets.SWTBotTreeItem - Sent event 26 to [Activate [26]: ShellEvent{TreeItem {Tracing} time=834308865 data=null doit=true}, TreeItem with text {Tracing}]
14:20:27 [2024-06-19T18:20:27.371Z] DEBUG org.eclipse.swtbot.swt.finder.widgets.SWTBotTreeItem - Sent event 15 to [FocusIn [15]: FocusEvent{TreeItem {Tracing} time=834308865 data=null}, TreeItem with text {Tracing}]
14:20:27 [2024-06-19T18:20:27.371Z] DEBUG org.eclipse.swtbot.swt.finder.widgets.SWTBotTreeItem - Sent event 3 to [MouseDown [3]: MouseEvent{TreeItem {Tracing} time=834308866 data=null button=1 stateMask=0x0 x=49 y=127 count=1}, TreeItem with text {Tracing}]
14:20:27 [2024-06-19T18:20:27.371Z] DEBUG org.eclipse.swtbot.swt.finder.widgets.SWTBotTreeItem - Sent event 13 to [Selection [13]: SelectionEvent{Tree {} time=834308888 data=null item=TreeItem {Tracing} detail=0 x=0 y=0 width=0 height=0 stateMask=0x80000 text=null doit=true}, TreeItem with text {Tracing}]
14:20:27 [2024-06-19T18:20:27.371Z] DEBUG org.eclipse.swtbot.swt.finder.widgets.SWTBotTreeItem - Sent event 4 to [MouseUp [4]: MouseEvent{TreeItem {Tracing} time=834308899 data=null button=1 stateMask=0x80000 x=49 y=127 count=1}, TreeItem with text {Tracing}]
14:20:27 [2024-06-19T18:20:27.371Z] WARN org.eclipse.swtbot.swt.finder.widgets.SWTBotTreeItem - Tree item TreeItem with text {Tracing} is already expanded. Won''t expand it again.
14:20:27 [2024-06-19T18:20:27.371Z] DEBUG org.eclipse.swtbot.swt.finder.widgets.SWTBotTree - Attempting to set focus on Tree with text {}
14:20:27 [2024-06-19T18:20:27.371Z] DEBUG org.eclipse.swtbot.swt.finder.widgets.SWTBotTreeItem - Sent event 6 to [MouseEnter [6]: MouseEvent{TreeItem {Remote Profiles} time=834308900 data=null button=0 stateMask=0x0 x=96 y=196 count=0}, Tree node with text: Remote Profiles]
14:20:27 [2024-06-19T18:20:27.371Z] DEBUG org.eclipse.swtbot.swt.finder.widgets.SWTBotTreeItem - Sent event 26 to [Activate [26]: ShellEvent{TreeItem {Remote Profiles} time=834308900 data=null doit=true}, Tree node with text: Remote Profiles]
14:20:27 [2024-06-19T18:20:27.371Z] DEBUG org.eclipse.swtbot.swt.finder.widgets.SWTBotTreeItem - Sent event 15 to [FocusIn [15]: FocusEvent{TreeItem {Remote Profiles} time=834308901 data=null}, Tree node with text: Remote Profiles]
14:20:27 [2024-06-19T18:20:27.371Z] DEBUG org.eclipse.swtbot.swt.finder.widgets.SWTBotTreeItem - Sent event 3 to [MouseDown [3]: MouseEvent{TreeItem {Remote Profiles} time=834308901 data=null button=1 stateMask=0x0 x=96 y=196 count=1}, Tree node with text: Remote Profiles]
14:20:27 [2024-06-19T18:20:27.371Z] DEBUG org.eclipse.swtbot.swt.finder.widgets.SWTBotTreeItem - Sent event 13 to [Selection [13]: SelectionEvent{Tree {} time=834308901 data=null item=TreeItem {Remote Profiles} detail=0 x=0 y=0 width=0 height=0 stateMask=0x80000 text=null doit=true}, Tree node with text: Remote Profiles]
14:20:27 [2024-06-19T18:20:27.371Z] DEBUG org.eclipse.swtbot.swt.finder.widgets.SWTBotTreeItem - Sent event 4 to [MouseUp [4]: MouseEvent{TreeItem {Remote Profiles} time=834308914 data=null button=1 stateMask=0x80000 x=96 y=196 count=1}, Tree node with text: Remote Profiles]
14:20:27 [2024-06-19T18:20:27.371Z] DEBUG org.eclipse.swtbot.swt.finder.matchers.AbstractMatcher - matched Tree with text "", using matcher: of type 'Tree'
14:20:27 [2024-06-19T18:20:27.371Z] DEBUG org.eclipse.swtbot.swt.finder.matchers.AbstractMatcher - matched Tree with text "", using matcher: (of type 'Tree')
14:20:27 [2024-06-19T18:20:27.371Z] DEBUG org.eclipse.swtbot.swt.finder.matchers.AbstractMatcher - matched Tree with text "", using matcher: of type 'Tree'
14:20:27 [2024-06-19T18:20:27.371Z] DEBUG org.eclipse.swtbot.swt.finder.matchers.AbstractMatcher - matched Tree with text "", using matcher: (of type 'Tree')
14:20:27 [2024-06-19T18:20:27.371Z] DEBUG org.eclipse.swtbot.swt.finder.widgets.SWTBotTree - Attempting to set focus on Tree with text {}
14:20:27 [2024-06-19T18:20:27.371Z] DEBUG org.eclipse.swtbot.swt.finder.widgets.SWTBotTreeItem - Sent event 6 to [MouseEnter [6]: MouseEvent{TreeItem {TestAllRecursive} time=834308917 data=null button=0 stateMask=0x0 x=96 y=12 count=0}, TreeItem with text {TestAllRecursive}]
14:20:27 [2024-06-19T18:20:27.371Z] DEBUG org.eclipse.swtbot.swt.finder.widgets.SWTBotTreeItem - Sent event 26 to [Activate [26]: ShellEvent{TreeItem {TestAllRecursive} time=834308918 data=null doit=true}, TreeItem with text {TestAllRecursive}]
14:20:27 [2024-06-19T18:20:27.371Z] DEBUG org.eclipse.swtbot.swt.finder.widgets.SWTBotTreeItem - Sent event 15 to [FocusIn [15]: FocusEvent{TreeItem {TestAllRecursive} time=834308918 data=null}, TreeItem with text {TestAllRecursive}]
14:20:27 [2024-06-19T18:20:27.371Z] DEBUG org.eclipse.swtbot.swt.finder.widgets.SWTBotTreeItem - Sent event 3 to [MouseDown [3]: MouseEvent{TreeItem {TestAllRecursive} time=834308918 data=null button=1 stateMask=0x0 x=96 y=12 count=1}, TreeItem with text {TestAllRecursive}]
14:20:27 [2024-06-19T18:20:27.371Z] DEBUG org.eclipse.swtbot.swt.finder.widgets.SWTBotTreeItem - Sent event 13 to [Selection [13]: SelectionEvent{Tree {} time=834308918 data=null item=TreeItem {TestAllRecursive} detail=0 x=0 y=0 width=0 height=0 stateMask=0x80000 text=null doit=true}, TreeItem with text {TestAllRecursive}]
14:20:27 [2024-06-19T18:20:27.371Z] DEBUG org.eclipse.swtbot.swt.finder.widgets.SWTBotTreeItem - Sent event 4 to [MouseUp [4]: MouseEvent{TreeItem {TestAllRecursive} time=834308932 data=null button=1 stateMask=0x80000 x=96 y=12 count=1}, TreeItem with text {TestAllRecursive}]
14:20:27 [2024-06-19T18:20:27.371Z] DEBUG org.eclipse.swtbot.swt.finder.matchers.AbstractMatcher - matched Button with text "Add", using matcher: of type 'Button'
14:20:27 [2024-06-19T18:20:27.371Z] DEBUG org.eclipse.swtbot.swt.finder.matchers.AbstractMatcher - matched Button with text "Remove", using matcher: of type 'Button'
14:20:27 [2024-06-19T18:20:27.371Z] DEBUG org.eclipse.swtbot.swt.finder.matchers.AbstractMatcher - matched Button with text "Remove", using matcher: with mnemonic 'Remove'
14:20:27 [2024-06-19T18:20:27.371Z] DEBUG org.eclipse.swtbot.swt.finder.matchers.AbstractMatcher - matched Button with text "Remove", using matcher: with style 'SWT.PUSH'
14:20:27 [2024-06-19T18:20:27.371Z] DEBUG org.eclipse.swtbot.swt.finder.matchers.AbstractMatcher - matched Button with text "Remove", using matcher: (of type 'Button' and with mnemonic 'Remove' and with style 'SWT.PUSH')
14:20:27 [2024-06-19T18:20:27.371Z] DEBUG org.eclipse.swtbot.swt.finder.matchers.AbstractMatcher - matched Button with text "Import", using matcher: of type 'Button'
14:20:27 [2024-06-19T18:20:27.371Z] DEBUG org.eclipse.swtbot.swt.finder.matchers.AbstractMatcher - matched Button with text "Export", using matcher: of type 'Button'
14:20:27 [2024-06-19T18:20:27.371Z] DEBUG org.eclipse.swtbot.swt.finder.matchers.AbstractMatcher - matched Button with text "Move Up", using matcher: of type 'Button'
14:20:27 [2024-06-19T18:20:27.371Z] DEBUG org.eclipse.swtbot.swt.finder.matchers.AbstractMatcher - matched Button with text "Move Down", using matcher: of type 'Button'
14:20:27 [2024-06-19T18:20:27.371Z] DEBUG org.eclipse.swtbot.swt.finder.matchers.AbstractMatcher - matched Button with text "Cancel", using matcher: of type 'Button'
14:20:27 [2024-06-19T18:20:27.371Z] DEBUG org.eclipse.swtbot.swt.finder.matchers.AbstractMatcher - matched Button with text "Apply and Close", using matcher: of type 'Button'
14:20:27 [2024-06-19T18:20:27.371Z] DEBUG org.eclipse.swtbot.swt.finder.widgets.SWTBotButton - Clicking on Remove
14:20:27 [2024-06-19T18:20:27.371Z] DEBUG org.eclipse.swtbot.swt.finder.widgets.SWTBotButton - Sent event 6 to [MouseEnter [6]: MouseEvent{Button {Remove} time=834308934 data=null button=0 stateMask=0x0 x=0 y=0 count=0}, (of type 'Button' and with mnemonic 'Remove' and with style 'SWT.PUSH')]
14:20:27 [2024-06-19T18:20:27.371Z] DEBUG org.eclipse.swtbot.swt.finder.widgets.SWTBotButton - Sent event 5 to [MouseMove [5]: MouseEvent{Button {Remove} time=834308934 data=null button=0 stateMask=0x0 x=0 y=0 count=0}, (of type 'Button' and with mnemonic 'Remove' and with style 'SWT.PUSH')]
14:20:27 [2024-06-19T18:20:27.371Z] DEBUG org.eclipse.swtbot.swt.finder.widgets.SWTBotButton - Sent event 26 to [Activate [26]: ShellEvent{Button {Remove} time=834308934 data=null doit=true}, (of type 'Button' and with mnemonic 'Remove' and with style 'SWT.PUSH')]
14:20:27 [2024-06-19T18:20:27.371Z] DEBUG org.eclipse.swtbot.swt.finder.widgets.SWTBotButton - Sent event 15 to [FocusIn [15]: FocusEvent{Button {Remove} time=834308934 data=null}, (of type 'Button' and with mnemonic 'Remove' and with style 'SWT.PUSH')]
14:20:27 [2024-06-19T18:20:27.371Z] DEBUG org.eclipse.swtbot.swt.finder.widgets.SWTBotButton - Sent event 3 to [MouseDown [3]: MouseEvent{Button {Remove} time=834308935 data=null button=0 stateMask=0x0 x=0 y=0 count=0}, (of type 'Button' and with mnemonic 'Remove' and with style 'SWT.PUSH')]
14:20:27 [2024-06-19T18:20:27.371Z] DEBUG org.eclipse.swtbot.swt.finder.widgets.SWTBotButton - Sent event 4 to [MouseUp [4]: MouseEvent{Button {Remove} time=834308935 data=null button=0 stateMask=0x0 x=0 y=0 count=0}, (of type 'Button' and with mnemonic 'Remove' and with style 'SWT.PUSH')]
14:20:27 [2024-06-19T18:20:27.371Z] DEBUG org.eclipse.swtbot.swt.finder.widgets.SWTBotButton - Sent event 13 to [Selection [13]: SelectionEvent{Button {Remove} time=834308935 data=null item=null detail=0 x=0 y=0 width=0 height=0 stateMask=0x0 text=null doit=true}, (of type 'Button' and with mnemonic 'Remove' and with style 'SWT.PUSH')]
14:20:27 [2024-06-19T18:20:27.371Z] WARN org.eclipse.swtbot.swt.finder.widgets.SWTBotButton - Widget is not enabled: (of type 'Button' and with mnemonic 'Remove' and with style 'SWT.PUSH')
14:20:27 [2024-06-19T18:20:27.372Z] WARN org.eclipse.swtbot.swt.finder.widgets.SWTBotButton - Widget is not enabled: (of type 'Button' and with mnemonic 'Remove' and with style 'SWT.PUSH')
14:20:27 [2024-06-19T18:20:27.372Z] WARN org.eclipse.swtbot.swt.finder.widgets.SWTBotButton - Widget is not enabled: (of type 'Button' and with mnemonic 'Remove' and with style 'SWT.PUSH')
14:20:27 [2024-06-19T18:20:27.372Z] WARN org.eclipse.swtbot.swt.finder.widgets.SWTBotButton - Widget is not enabled: (of type 'Button' and with mnemonic 'Remove' and with style 'SWT.PUSH')
14:20:27 [2024-06-19T18:20:27.372Z] WARN org.eclipse.swtbot.swt.finder.widgets.SWTBotButton - Widget is not enabled: (of type 'Button' and with mnemonic 'Remove' and with style 'SWT.PUSH')
14:20:27 [2024-06-19T18:20:27.372Z] DEBUG org.eclipse.swtbot.swt.finder.widgets.SWTBotButton - Clicked on Remove
14:20:27 [2024-06-19T18:20:27.372Z] DEBUG org.eclipse.swtbot.swt.finder.widgets.SWTBotTree - Attempting to set focus on Tree with text {}
14:20:27 [2024-06-19T18:20:27.372Z] DEBUG org.eclipse.swtbot.swt.finder.widgets.SWTBotTreeItem - Sent event 6 to [MouseEnter [6]: MouseEvent{TreeItem {TestAllNonRecursive} time=834308949 data=null button=0 stateMask=0x0 x=109 y=12 count=0}, TreeItem with text {TestAllNonRecursive}]
14:20:27 [2024-06-19T18:20:27.372Z] DEBUG org.eclipse.swtbot.swt.finder.widgets.SWTBotTreeItem - Sent event 26 to [Activate [26]: ShellEvent{TreeItem {TestAllNonRecursive} time=834308950 data=null doit=true}, TreeItem with text {TestAllNonRecursive}]
14:20:27 [2024-06-19T18:20:27.372Z] DEBUG org.eclipse.swtbot.swt.finder.widgets.SWTBotTreeItem - Sent event 15 to [FocusIn [15]: FocusEvent{TreeItem {TestAllNonRecursive} time=834308950 data=null}, TreeItem with text {TestAllNonRecursive}]
14:20:27 [2024-06-19T18:20:27.372Z] DEBUG org.eclipse.swtbot.swt.finder.widgets.SWTBotTreeItem - Sent event 3 to [MouseDown [3]: MouseEvent{TreeItem {TestAllNonRecursive} time=834308950 data=null button=1 stateMask=0x0 x=109 y=12 count=1}, TreeItem with text {TestAllNonRecursive}]
14:20:27 [2024-06-19T18:20:27.372Z] DEBUG org.eclipse.swtbot.swt.finder.widgets.SWTBotTreeItem - Sent event 13 to [Selection [13]: SelectionEvent{Tree {} time=834308950 data=null item=TreeItem {TestAllNonRecursive} detail=0 x=0 y=0 width=0 height=0 stateMask=0x80000 text=null doit=true}, TreeItem with text {TestAllNonRecursive}]
14:20:27 [2024-06-19T18:20:27.372Z] DEBUG org.eclipse.swtbot.swt.finder.widgets.SWTBotTreeItem - Sent event 4 to [MouseUp [4]: MouseEvent{TreeItem {TestAllNonRecursive} time=834308953 data=null button=1 stateMask=0x80000 x=109 y=12 count=1}, TreeItem with text {TestAllNonRecursive}]
14:20:27 [2024-06-19T18:20:27.372Z] DEBUG org.eclipse.swtbot.swt.finder.matchers.AbstractMatcher - matched Button with text "Add", using matcher: of type 'Button'
14:20:27 [2024-06-19T18:20:27.372Z] DEBUG org.eclipse.swtbot.swt.finder.matchers.AbstractMatcher - matched Button with text "Remove", using matcher: of type 'Button'
14:20:27 [2024-06-19T18:20:27.372Z] DEBUG org.eclipse.swtbot.swt.finder.matchers.AbstractMatcher - matched Button with text "Remove", using matcher: with mnemonic 'Remove'
14:20:27 [2024-06-19T18:20:27.372Z] DEBUG org.eclipse.swtbot.swt.finder.matchers.AbstractMatcher - matched Button with text "Remove", using matcher: with style 'SWT.PUSH'
14:20:27 [2024-06-19T18:20:27.372Z] DEBUG org.eclipse.swtbot.swt.finder.matchers.AbstractMatcher - matched Button with text "Remove", using matcher: (of type 'Button' and with mnemonic 'Remove' and with style 'SWT.PUSH')
14:20:27 [2024-06-19T18:20:27.372Z] DEBUG org.eclipse.swtbot.swt.finder.matchers.AbstractMatcher - matched Button with text "Import", using matcher: of type 'Button'
14:20:27 [2024-06-19T18:20:27.372Z] DEBUG org.eclipse.swtbot.swt.finder.matchers.AbstractMatcher - matched Button with text "Export", using matcher: of type 'Button'
14:20:27 [2024-06-19T18:20:27.372Z] DEBUG org.eclipse.swtbot.swt.finder.matchers.AbstractMatcher - matched Button with text "Move Up", using matcher: of type 'Button'
14:20:27 [2024-06-19T18:20:27.372Z] DEBUG org.eclipse.swtbot.swt.finder.matchers.AbstractMatcher - matched Button with text "Move Down", using matcher: of type 'Button'
14:20:27 [2024-06-19T18:20:27.372Z] DEBUG org.eclipse.swtbot.swt.finder.matchers.AbstractMatcher - matched Button with text "Cancel", using matcher: of type 'Button'
14:20:27 [2024-06-19T18:20:27.372Z] DEBUG org.eclipse.swtbot.swt.finder.matchers.AbstractMatcher - matched Button with text "Apply and Close", using matcher: of type 'Button'
14:20:27 [2024-06-19T18:20:27.372Z] DEBUG org.eclipse.swtbot.swt.finder.widgets.SWTBotButton - Clicking on Remove
14:20:27 [2024-06-19T18:20:27.372Z] DEBUG org.eclipse.swtbot.swt.finder.widgets.SWTBotButton - Sent event 6 to [MouseEnter [6]: MouseEvent{Button {Remove} time=834308959 data=null button=0 stateMask=0x0 x=0 y=0 count=0}, (of type 'Button' and with mnemonic 'Remove' and with style 'SWT.PUSH')]
14:20:27 [2024-06-19T18:20:27.372Z] DEBUG org.eclipse.swtbot.swt.finder.widgets.SWTBotButton - Sent event 5 to [MouseMove [5]: MouseEvent{Button {Remove} time=834308959 data=null button=0 stateMask=0x0 x=0 y=0 count=0}, (of type 'Button' and with mnemonic 'Remove' and with style 'SWT.PUSH')]
14:20:27 [2024-06-19T18:20:27.372Z] DEBUG org.eclipse.swtbot.swt.finder.widgets.SWTBotButton - Sent event 26 to [Activate [26]: ShellEvent{Button {Remove} time=834308960 data=null doit=true}, (of type 'Button' and with mnemonic 'Remove' and with style 'SWT.PUSH')]
14:20:27 [2024-06-19T18:20:27.372Z] DEBUG org.eclipse.swtbot.swt.finder.widgets.SWTBotButton - Sent event 15 to [FocusIn [15]: FocusEvent{Button {Remove} time=834308960 data=null}, (of type 'Button' and with mnemonic 'Remove' and with style 'SWT.PUSH')]
14:20:27 [2024-06-19T18:20:27.372Z] DEBUG org.eclipse.swtbot.swt.finder.widgets.SWTBotButton - Sent event 3 to [MouseDown [3]: MouseEvent{Button {Remove} time=834308960 data=null button=0 stateMask=0x0 x=0 y=0 count=0}, (of type 'Button' and with mnemonic 'Remove' and with style 'SWT.PUSH')]
14:20:27 [2024-06-19T18:20:27.372Z] DEBUG org.eclipse.swtbot.swt.finder.widgets.SWTBotButton - Sent event 4 to [MouseUp [4]: MouseEvent{Button {Remove} time=834308960 data=null button=0 stateMask=0x0 x=0 y=0 count=0}, (of type 'Button' and with mnemonic 'Remove' and with style 'SWT.PUSH')]
14:20:27 [2024-06-19T18:20:27.372Z] DEBUG org.eclipse.swtbot.swt.finder.widgets.SWTBotButton - Sent event 13 to [Selection [13]: SelectionEvent{Button {Remove} time=834308960 data=null item=null detail=0 x=0 y=0 width=0 height=0 stateMask=0x0 text=null doit=true}, (of type 'Button' and with mnemonic 'Remove' and with style 'SWT.PUSH')]
14:20:27 [2024-06-19T18:20:27.372Z] WARN org.eclipse.swtbot.swt.finder.widgets.SWTBotButton - Widget is not enabled: (of type 'Button' and with mnemonic 'Remove' and with style 'SWT.PUSH')
14:20:27 [2024-06-19T18:20:27.372Z] WARN org.eclipse.swtbot.swt.finder.widgets.SWTBotButton - Widget is not enabled: (of type 'Button' and with mnemonic 'Remove' and with style 'SWT.PUSH')
14:20:27 [2024-06-19T18:20:27.372Z] WARN org.eclipse.swtbot.swt.finder.widgets.SWTBotButton - Widget is not enabled: (of type 'Button' and with mnemonic 'Remove' and with style 'SWT.PUSH')
14:20:27 [2024-06-19T18:20:27.372Z] WARN org.eclipse.swtbot.swt.finder.widgets.SWTBotButton - Widget is not enabled: (of type 'Button' and with mnemonic 'Remove' and with style 'SWT.PUSH')
14:20:27 [2024-06-19T18:20:27.372Z] WARN org.eclipse.swtbot.swt.finder.widgets.SWTBotButton - Widget is not enabled: (of type 'Button' and with mnemonic 'Remove' and with style 'SWT.PUSH')
14:20:27 [2024-06-19T18:20:27.372Z] DEBUG org.eclipse.swtbot.swt.finder.widgets.SWTBotButton - Clicked on Remove
14:20:27 [2024-06-19T18:20:27.372Z] DEBUG org.eclipse.swtbot.swt.finder.widgets.SWTBotTree - Attempting to set focus on Tree with text {}
14:20:27 [2024-06-19T18:20:27.372Z] DEBUG org.eclipse.swtbot.swt.finder.widgets.SWTBotTreeItem - Sent event 6 to [MouseEnter [6]: MouseEvent{TreeItem {TestSpecificRecursive} time=834308967 data=null button=0 stateMask=0x0 x=112 y=12 count=0}, TreeItem with text {TestSpecificRecursive}]
14:20:27 [2024-06-19T18:20:27.372Z] DEBUG org.eclipse.swtbot.swt.finder.widgets.SWTBotTreeItem - Sent event 26 to [Activate [26]: ShellEvent{TreeItem {TestSpecificRecursive} time=834308967 data=null doit=true}, TreeItem with text {TestSpecificRecursive}]
14:20:27 [2024-06-19T18:20:27.372Z] DEBUG org.eclipse.swtbot.swt.finder.widgets.SWTBotTreeItem - Sent event 15 to [FocusIn [15]: FocusEvent{TreeItem {TestSpecificRecursive} time=834308967 data=null}, TreeItem with text {TestSpecificRecursive}]
14:20:27 [2024-06-19T18:20:27.372Z] DEBUG org.eclipse.swtbot.swt.finder.widgets.SWTBotTreeItem - Sent event 3 to [MouseDown [3]: MouseEvent{TreeItem {TestSpecificRecursive} time=834308968 data=null button=1 stateMask=0x0 x=112 y=12 count=1}, TreeItem with text {TestSpecificRecursive}]
14:20:27 [2024-06-19T18:20:27.628Z] DEBUG org.eclipse.swtbot.swt.finder.widgets.SWTBotTreeItem - Sent event 13 to [Selection [13]: SelectionEvent{Tree {} time=834308968 data=null item=TreeItem {TestSpecificRecursive} detail=0 x=0 y=0 width=0 height=0 stateMask=0x80000 text=null doit=true}, TreeItem with text {TestSpecificRecursive}]
14:20:27 [2024-06-19T18:20:27.628Z] DEBUG org.eclipse.swtbot.swt.finder.widgets.SWTBotTreeItem - Sent event 4 to [MouseUp [4]: MouseEvent{TreeItem {TestSpecificRecursive} time=834308970 data=null button=1 stateMask=0x80000 x=112 y=12 count=1}, TreeItem with text {TestSpecificRecursive}]
14:20:27 [2024-06-19T18:20:27.628Z] DEBUG org.eclipse.swtbot.swt.finder.matchers.AbstractMatcher - matched Button with text "Add", using matcher: of type 'Button'
14:20:27 [2024-06-19T18:20:27.628Z] DEBUG org.eclipse.swtbot.swt.finder.matchers.AbstractMatcher - matched Button with text "Remove", using matcher: of type 'Button'
14:20:27 [2024-06-19T18:20:27.628Z] DEBUG org.eclipse.swtbot.swt.finder.matchers.AbstractMatcher - matched Button with text "Remove", using matcher: with mnemonic 'Remove'
14:20:27 [2024-06-19T18:20:27.628Z] DEBUG org.eclipse.swtbot.swt.finder.matchers.AbstractMatcher - matched Button with text "Remove", using matcher: with style 'SWT.PUSH'
14:20:27 [2024-06-19T18:20:27.628Z] DEBUG org.eclipse.swtbot.swt.finder.matchers.AbstractMatcher - matched Button with text "Remove", using matcher: (of type 'Button' and with mnemonic 'Remove' and with style 'SWT.PUSH')
14:20:27 [2024-06-19T18:20:27.628Z] DEBUG org.eclipse.swtbot.swt.finder.matchers.AbstractMatcher - matched Button with text "Import", using matcher: of type 'Button'
14:20:27 [2024-06-19T18:20:27.628Z] DEBUG org.eclipse.swtbot.swt.finder.matchers.AbstractMatcher - matched Button with text "Export", using matcher: of type 'Button'
14:20:27 [2024-06-19T18:20:27.628Z] DEBUG org.eclipse.swtbot.swt.finder.matchers.AbstractMatcher - matched Button with text "Move Up", using matcher: of type 'Button'
14:20:27 [2024-06-19T18:20:27.628Z] DEBUG org.eclipse.swtbot.swt.finder.matchers.AbstractMatcher - matched Button with text "Move Down", using matcher: of type 'Button'
14:20:27 [2024-06-19T18:20:27.628Z] DEBUG org.eclipse.swtbot.swt.finder.matchers.AbstractMatcher - matched Button with text "Cancel", using matcher: of type 'Button'
14:20:27 [2024-06-19T18:20:27.628Z] DEBUG org.eclipse.swtbot.swt.finder.matchers.AbstractMatcher - matched Button with text "Apply and Close", using matcher: of type 'Button'
14:20:27 [2024-06-19T18:20:27.628Z] DEBUG org.eclipse.swtbot.swt.finder.widgets.SWTBotButton - Clicking on Remove
14:20:27 [2024-06-19T18:20:27.628Z] DEBUG org.eclipse.swtbot.swt.finder.widgets.SWTBotButton - Sent event 6 to [MouseEnter [6]: MouseEvent{Button {Remove} time=834308978 data=null button=0 stateMask=0x0 x=0 y=0 count=0}, (of type 'Button' and with mnemonic 'Remove' and with style 'SWT.PUSH')]
14:20:27 [2024-06-19T18:20:27.629Z] DEBUG org.eclipse.swtbot.swt.finder.widgets.SWTBotButton - Sent event 5 to [MouseMove [5]: MouseEvent{Button {Remove} time=834308979 data=null button=0 stateMask=0x0 x=0 y=0 count=0}, (of type 'Button' and with mnemonic 'Remove' and with style 'SWT.PUSH')]
14:20:27 [2024-06-19T18:20:27.629Z] DEBUG org.eclipse.swtbot.swt.finder.widgets.SWTBotButton - Sent event 26 to [Activate [26]: ShellEvent{Button {Remove} time=834308979 data=null doit=true}, (of type 'Button' and with mnemonic 'Remove' and with style 'SWT.PUSH')]
14:20:27 [2024-06-19T18:20:27.629Z] DEBUG org.eclipse.swtbot.swt.finder.widgets.SWTBotButton - Sent event 15 to [FocusIn [15]: FocusEvent{Button {Remove} time=834308979 data=null}, (of type 'Button' and with mnemonic 'Remove' and with style 'SWT.PUSH')]
14:20:27 [2024-06-19T18:20:27.629Z] DEBUG org.eclipse.swtbot.swt.finder.widgets.SWTBotButton - Sent event 3 to [MouseDown [3]: MouseEvent{Button {Remove} time=834308980 data=null button=0 stateMask=0x0 x=0 y=0 count=0}, (of type 'Button' and with mnemonic 'Remove' and with style 'SWT.PUSH')]
14:20:27 [2024-06-19T18:20:27.629Z] DEBUG org.eclipse.swtbot.swt.finder.widgets.SWTBotButton - Sent event 4 to [MouseUp [4]: MouseEvent{Button {Remove} time=834308980 data=null button=0 stateMask=0x0 x=0 y=0 count=0}, (of type 'Button' and with mnemonic 'Remove' and with style 'SWT.PUSH')]
14:20:27 [2024-06-19T18:20:27.629Z] DEBUG org.eclipse.swtbot.swt.finder.widgets.SWTBotButton - Sent event 13 to [Selection [13]: SelectionEvent{Button {Remove} time=834308980 data=null item=null detail=0 x=0 y=0 width=0 height=0 stateMask=0x0 text=null doit=true}, (of type 'Button' and with mnemonic 'Remove' and with style 'SWT.PUSH')]
14:20:27 [2024-06-19T18:20:27.629Z] WARN org.eclipse.swtbot.swt.finder.widgets.SWTBotButton - Widget is not enabled: (of type 'Button' and with mnemonic 'Remove' and with style 'SWT.PUSH')
14:20:27 [2024-06-19T18:20:27.629Z] WARN org.eclipse.swtbot.swt.finder.widgets.SWTBotButton - Widget is not enabled: (of type 'Button' and with mnemonic 'Remove' and with style 'SWT.PUSH')
14:20:27 [2024-06-19T18:20:27.629Z] WARN org.eclipse.swtbot.swt.finder.widgets.SWTBotButton - Widget is not enabled: (of type 'Button' and with mnemonic 'Remove' and with style 'SWT.PUSH')
14:20:27 [2024-06-19T18:20:27.629Z] WARN org.eclipse.swtbot.swt.finder.widgets.SWTBotButton - Widget is not enabled: (of type 'Button' and with mnemonic 'Remove' and with style 'SWT.PUSH')
14:20:27 [2024-06-19T18:20:27.629Z] WARN org.eclipse.swtbot.swt.finder.widgets.SWTBotButton - Widget is not enabled: (of type 'Button' and with mnemonic 'Remove' and with style 'SWT.PUSH')
14:20:27 [2024-06-19T18:20:27.629Z] DEBUG org.eclipse.swtbot.swt.finder.widgets.SWTBotButton - Clicked on Remove
14:20:27 [2024-06-19T18:20:27.629Z] DEBUG org.eclipse.swtbot.swt.finder.widgets.SWTBotTree - Attempting to set focus on Tree with text {}
14:20:27 [2024-06-19T18:20:27.629Z] DEBUG org.eclipse.swtbot.swt.finder.widgets.SWTBotTreeItem - Sent event 6 to [MouseEnter [6]: MouseEvent{TreeItem {TestSpecificNonRecursive} time=834308987 data=null button=0 stateMask=0x0 x=125 y=12 count=0}, TreeItem with text {TestSpecificNonRecursive}]
14:20:27 [2024-06-19T18:20:27.629Z] DEBUG org.eclipse.swtbot.swt.finder.widgets.SWTBotTreeItem - Sent event 26 to [Activate [26]: ShellEvent{TreeItem {TestSpecificNonRecursive} time=834308987 data=null doit=true}, TreeItem with text {TestSpecificNonRecursive}]
14:20:27 [2024-06-19T18:20:27.629Z] DEBUG org.eclipse.swtbot.swt.finder.widgets.SWTBotTreeItem - Sent event 15 to [FocusIn [15]: FocusEvent{TreeItem {TestSpecificNonRecursive} time=834308987 data=null}, TreeItem with text {TestSpecificNonRecursive}]
14:20:27 [2024-06-19T18:20:27.629Z] DEBUG org.eclipse.swtbot.swt.finder.widgets.SWTBotTreeItem - Sent event 3 to [MouseDown [3]: MouseEvent{TreeItem {TestSpecificNonRecursive} time=834308987 data=null button=1 stateMask=0x0 x=125 y=12 count=1}, TreeItem with text {TestSpecificNonRecursive}]
14:20:27 [2024-06-19T18:20:27.629Z] DEBUG org.eclipse.swtbot.swt.finder.widgets.SWTBotTreeItem - Sent event 13 to [Selection [13]: SelectionEvent{Tree {} time=834308988 data=null item=TreeItem {TestSpecificNonRecursive} detail=0 x=0 y=0 width=0 height=0 stateMask=0x80000 text=null doit=true}, TreeItem with text {TestSpecificNonRecursive}]
14:20:27 [2024-06-19T18:20:27.629Z] DEBUG org.eclipse.swtbot.swt.finder.widgets.SWTBotTreeItem - Sent event 4 to [MouseUp [4]: MouseEvent{TreeItem {TestSpecificNonRecursive} time=834308996 data=null button=1 stateMask=0x80000 x=125 y=12 count=1}, TreeItem with text {TestSpecificNonRecursive}]
14:20:27 [2024-06-19T18:20:27.629Z] DEBUG org.eclipse.swtbot.swt.finder.matchers.AbstractMatcher - matched Button with text "Add", using matcher: of type 'Button'
14:20:27 [2024-06-19T18:20:27.629Z] DEBUG org.eclipse.swtbot.swt.finder.matchers.AbstractMatcher - matched Button with text "Remove", using matcher: of type 'Button'
14:20:27 [2024-06-19T18:20:27.629Z] DEBUG org.eclipse.swtbot.swt.finder.matchers.AbstractMatcher - matched Button with text "Remove", using matcher: with mnemonic 'Remove'
14:20:27 [2024-06-19T18:20:27.629Z] DEBUG org.eclipse.swtbot.swt.finder.matchers.AbstractMatcher - matched Button with text "Remove", using matcher: with style 'SWT.PUSH'
14:20:27 [2024-06-19T18:20:27.629Z] DEBUG org.eclipse.swtbot.swt.finder.matchers.AbstractMatcher - matched Button with text "Remove", using matcher: (of type 'Button' and with mnemonic 'Remove' and with style 'SWT.PUSH')
14:20:27 [2024-06-19T18:20:27.629Z] DEBUG org.eclipse.swtbot.swt.finder.matchers.AbstractMatcher - matched Button with text "Import", using matcher: of type 'Button'
14:20:27 [2024-06-19T18:20:27.629Z] DEBUG org.eclipse.swtbot.swt.finder.matchers.AbstractMatcher - matched Button with text "Export", using matcher: of type 'Button'
14:20:27 [2024-06-19T18:20:27.629Z] DEBUG org.eclipse.swtbot.swt.finder.matchers.AbstractMatcher - matched Button with text "Move Up", using matcher: of type 'Button'
14:20:27 [2024-06-19T18:20:27.629Z] DEBUG org.eclipse.swtbot.swt.finder.matchers.AbstractMatcher - matched Button with text "Move Down", using matcher: of type 'Button'
14:20:27 [2024-06-19T18:20:27.629Z] DEBUG org.eclipse.swtbot.swt.finder.matchers.AbstractMatcher - matched Button with text "Cancel", using matcher: of type 'Button'
14:20:27 [2024-06-19T18:20:27.629Z] DEBUG org.eclipse.swtbot.swt.finder.matchers.AbstractMatcher - matched Button with text "Apply and Close", using matcher: of type 'Button'
14:20:27 [2024-06-19T18:20:27.629Z] DEBUG org.eclipse.swtbot.swt.finder.widgets.SWTBotButton - Clicking on Remove
14:20:27 [2024-06-19T18:20:27.629Z] DEBUG org.eclipse.swtbot.swt.finder.widgets.SWTBotButton - Sent event 6 to [MouseEnter [6]: MouseEvent{Button {Remove} time=834308998 data=null button=0 stateMask=0x0 x=0 y=0 count=0}, (of type 'Button' and with mnemonic 'Remove' and with style 'SWT.PUSH')]
14:20:27 [2024-06-19T18:20:27.629Z] DEBUG org.eclipse.swtbot.swt.finder.widgets.SWTBotButton - Sent event 5 to [MouseMove [5]: MouseEvent{Button {Remove} time=834308998 data=null button=0 stateMask=0x0 x=0 y=0 count=0}, (of type 'Button' and with mnemonic 'Remove' and with style 'SWT.PUSH')]
14:20:27 [2024-06-19T18:20:27.629Z] DEBUG org.eclipse.swtbot.swt.finder.widgets.SWTBotButton - Sent event 26 to [Activate [26]: ShellEvent{Button {Remove} time=834308998 data=null doit=true}, (of type 'Button' and with mnemonic 'Remove' and with style 'SWT.PUSH')]
14:20:27 [2024-06-19T18:20:27.629Z] DEBUG org.eclipse.swtbot.swt.finder.widgets.SWTBotButton - Sent event 15 to [FocusIn [15]: FocusEvent{Button {Remove} time=834308998 data=null}, (of type 'Button' and with mnemonic 'Remove' and with style 'SWT.PUSH')]
14:20:27 [2024-06-19T18:20:27.629Z] DEBUG org.eclipse.swtbot.swt.finder.widgets.SWTBotButton - Sent event 3 to [MouseDown [3]: MouseEvent{Button {Remove} time=834308999 data=null button=0 stateMask=0x0 x=0 y=0 count=0}, (of type 'Button' and with mnemonic 'Remove' and with style 'SWT.PUSH')]
14:20:27 [2024-06-19T18:20:27.629Z] DEBUG org.eclipse.swtbot.swt.finder.widgets.SWTBotButton - Sent event 4 to [MouseUp [4]: MouseEvent{Button {Remove} time=834308999 data=null button=0 stateMask=0x0 x=0 y=0 count=0}, (of type 'Button' and with mnemonic 'Remove' and with style 'SWT.PUSH')]
14:20:27 [2024-06-19T18:20:27.629Z] DEBUG org.eclipse.swtbot.swt.finder.widgets.SWTBotButton - Sent event 13 to [Selection [13]: SelectionEvent{Button {Remove} time=834308999 data=null item=null detail=0 x=0 y=0 width=0 height=0 stateMask=0x0 text=null doit=true}, (of type 'Button' and with mnemonic 'Remove' and with style 'SWT.PUSH')]
14:20:27 [2024-06-19T18:20:27.629Z] WARN org.eclipse.swtbot.swt.finder.widgets.SWTBotButton - Widget is not enabled: (of type 'Button' and with mnemonic 'Remove' and with style 'SWT.PUSH')
14:20:27 [2024-06-19T18:20:27.629Z] WARN org.eclipse.swtbot.swt.finder.widgets.SWTBotButton - Widget is not enabled: (of type 'Button' and with mnemonic 'Remove' and with style 'SWT.PUSH')
14:20:27 [2024-06-19T18:20:27.629Z] WARN org.eclipse.swtbot.swt.finder.widgets.SWTBotButton - Widget is not enabled: (of type 'Button' and with mnemonic 'Remove' and with style 'SWT.PUSH')
14:20:27 [2024-06-19T18:20:27.629Z] WARN org.eclipse.swtbot.swt.finder.widgets.SWTBotButton - Widget is not enabled: (of type 'Button' and with mnemonic 'Remove' and with style 'SWT.PUSH')
14:20:27 [2024-06-19T18:20:27.629Z] WARN org.eclipse.swtbot.swt.finder.widgets.SWTBotButton - Widget is not enabled: (of type 'Button' and with mnemonic 'Remove' and with style 'SWT.PUSH')
14:20:27 [2024-06-19T18:20:27.629Z] DEBUG org.eclipse.swtbot.swt.finder.widgets.SWTBotButton - Clicked on Remove
14:20:27 [2024-06-19T18:20:27.629Z] DEBUG org.eclipse.swtbot.swt.finder.widgets.SWTBotTree - Attempting to set focus on Tree with text {}
14:20:27 [2024-06-19T18:20:27.629Z] DEBUG org.eclipse.swtbot.swt.finder.widgets.SWTBotTreeItem - Sent event 6 to [MouseEnter [6]: MouseEvent{TreeItem {TestSpecificMultiGroupRecursive} time=834309015 data=null button=0 stateMask=0x0 x=148 y=12 count=0}, TreeItem with text {TestSpecificMultiGroupRecursive}]
14:20:27 [2024-06-19T18:20:27.629Z] DEBUG org.eclipse.swtbot.swt.finder.widgets.SWTBotTreeItem - Sent event 26 to [Activate [26]: ShellEvent{TreeItem {TestSpecificMultiGroupRecursive} time=834309015 data=null doit=true}, TreeItem with text {TestSpecificMultiGroupRecursive}]
14:20:27 [2024-06-19T18:20:27.629Z] DEBUG org.eclipse.swtbot.swt.finder.widgets.SWTBotTreeItem - Sent event 15 to [FocusIn [15]: FocusEvent{TreeItem {TestSpecificMultiGroupRecursive} time=834309015 data=null}, TreeItem with text {TestSpecificMultiGroupRecursive}]
14:20:27 [2024-06-19T18:20:27.629Z] DEBUG org.eclipse.swtbot.swt.finder.widgets.SWTBotTreeItem - Sent event 3 to [MouseDown [3]: MouseEvent{TreeItem {TestSpecificMultiGroupRecursive} time=834309016 data=null button=1 stateMask=0x0 x=148 y=12 count=1}, TreeItem with text {TestSpecificMultiGroupRecursive}]
14:20:27 [2024-06-19T18:20:27.630Z] DEBUG org.eclipse.swtbot.swt.finder.widgets.SWTBotTreeItem - Sent event 13 to [Selection [13]: SelectionEvent{Tree {} time=834309016 data=null item=TreeItem {TestSpecificMultiGroupRecursive} detail=0 x=0 y=0 width=0 height=0 stateMask=0x80000 text=null doit=true}, TreeItem with text {TestSpecificMultiGroupRecursive}]
14:20:27 [2024-06-19T18:20:27.630Z] DEBUG org.eclipse.swtbot.swt.finder.widgets.SWTBotTreeItem - Sent event 4 to [MouseUp [4]: MouseEvent{TreeItem {TestSpecificMultiGroupRecursive} time=834309018 data=null button=1 stateMask=0x80000 x=148 y=12 count=1}, TreeItem with text {TestSpecificMultiGroupRecursive}]
14:20:27 [2024-06-19T18:20:27.630Z] DEBUG org.eclipse.swtbot.swt.finder.matchers.AbstractMatcher - matched Button with text "Add", using matcher: of type 'Button'
14:20:27 [2024-06-19T18:20:27.630Z] DEBUG org.eclipse.swtbot.swt.finder.matchers.AbstractMatcher - matched Button with text "Remove", using matcher: of type 'Button'
14:20:27 [2024-06-19T18:20:27.630Z] DEBUG org.eclipse.swtbot.swt.finder.matchers.AbstractMatcher - matched Button with text "Remove", using matcher: with mnemonic 'Remove'
14:20:27 [2024-06-19T18:20:27.630Z] DEBUG org.eclipse.swtbot.swt.finder.matchers.AbstractMatcher - matched Button with text "Remove", using matcher: with style 'SWT.PUSH'
14:20:27 [2024-06-19T18:20:27.630Z] DEBUG org.eclipse.swtbot.swt.finder.matchers.AbstractMatcher - matched Button with text "Remove", using matcher: (of type 'Button' and with mnemonic 'Remove' and with style 'SWT.PUSH')
14:20:27 [2024-06-19T18:20:27.630Z] DEBUG org.eclipse.swtbot.swt.finder.matchers.AbstractMatcher - matched Button with text "Import", using matcher: of type 'Button'
14:20:27 [2024-06-19T18:20:27.630Z] DEBUG org.eclipse.swtbot.swt.finder.matchers.AbstractMatcher - matched Button with text "Export", using matcher: of type 'Button'
14:20:27 [2024-06-19T18:20:27.630Z] DEBUG org.eclipse.swtbot.swt.finder.matchers.AbstractMatcher - matched Button with text "Move Up", using matcher: of type 'Button'
14:20:27 [2024-06-19T18:20:27.630Z] DEBUG org.eclipse.swtbot.swt.finder.matchers.AbstractMatcher - matched Button with text "Move Down", using matcher: of type 'Button'
14:20:27 [2024-06-19T18:20:27.630Z] DEBUG org.eclipse.swtbot.swt.finder.matchers.AbstractMatcher - matched Button with text "Cancel", using matcher: of type 'Button'
14:20:27 [2024-06-19T18:20:27.630Z] DEBUG org.eclipse.swtbot.swt.finder.matchers.AbstractMatcher - matched Button with text "Apply and Close", using matcher: of type 'Button'
14:20:27 [2024-06-19T18:20:27.630Z] DEBUG org.eclipse.swtbot.swt.finder.widgets.SWTBotButton - Clicking on Remove
14:20:27 [2024-06-19T18:20:27.630Z] DEBUG org.eclipse.swtbot.swt.finder.widgets.SWTBotButton - Sent event 6 to [MouseEnter [6]: MouseEvent{Button {Remove} time=834309020 data=null button=0 stateMask=0x0 x=0 y=0 count=0}, (of type 'Button' and with mnemonic 'Remove' and with style 'SWT.PUSH')]
14:20:27 [2024-06-19T18:20:27.630Z] DEBUG org.eclipse.swtbot.swt.finder.widgets.SWTBotButton - Sent event 5 to [MouseMove [5]: MouseEvent{Button {Remove} time=834309020 data=null button=0 stateMask=0x0 x=0 y=0 count=0}, (of type 'Button' and with mnemonic 'Remove' and with style 'SWT.PUSH')]
14:20:27 [2024-06-19T18:20:27.630Z] DEBUG org.eclipse.swtbot.swt.finder.widgets.SWTBotButton - Sent event 26 to [Activate [26]: ShellEvent{Button {Remove} time=834309020 data=null doit=true}, (of type 'Button' and with mnemonic 'Remove' and with style 'SWT.PUSH')]
14:20:27 [2024-06-19T18:20:27.630Z] DEBUG org.eclipse.swtbot.swt.finder.widgets.SWTBotButton - Sent event 15 to [FocusIn [15]: FocusEvent{Button {Remove} time=834309020 data=null}, (of type 'Button' and with mnemonic 'Remove' and with style 'SWT.PUSH')]
14:20:27 [2024-06-19T18:20:27.630Z] DEBUG org.eclipse.swtbot.swt.finder.widgets.SWTBotButton - Sent event 3 to [MouseDown [3]: MouseEvent{Button {Remove} time=834309020 data=null button=0 stateMask=0x0 x=0 y=0 count=0}, (of type 'Button' and with mnemonic 'Remove' and with style 'SWT.PUSH')]
14:20:27 [2024-06-19T18:20:27.630Z] DEBUG org.eclipse.swtbot.swt.finder.widgets.SWTBotButton - Sent event 4 to [MouseUp [4]: MouseEvent{Button {Remove} time=834309021 data=null button=0 stateMask=0x0 x=0 y=0 count=0}, (of type 'Button' and with mnemonic 'Remove' and with style 'SWT.PUSH')]
14:20:27 [2024-06-19T18:20:27.630Z] DEBUG org.eclipse.swtbot.swt.finder.widgets.SWTBotButton - Sent event 13 to [Selection [13]: SelectionEvent{Button {Remove} time=834309021 data=null item=null detail=0 x=0 y=0 width=0 height=0 stateMask=0x0 text=null doit=true}, (of type 'Button' and with mnemonic 'Remove' and with style 'SWT.PUSH')]
14:20:27 [2024-06-19T18:20:27.630Z] WARN org.eclipse.swtbot.swt.finder.widgets.SWTBotButton - Widget is not enabled: (of type 'Button' and with mnemonic 'Remove' and with style 'SWT.PUSH')
14:20:27 [2024-06-19T18:20:27.630Z] WARN org.eclipse.swtbot.swt.finder.widgets.SWTBotButton - Widget is not enabled: (of type 'Button' and with mnemonic 'Remove' and with style 'SWT.PUSH')
14:20:27 [2024-06-19T18:20:27.630Z] WARN org.eclipse.swtbot.swt.finder.widgets.SWTBotButton - Widget is not enabled: (of type 'Button' and with mnemonic 'Remove' and with style 'SWT.PUSH')
14:20:27 [2024-06-19T18:20:27.630Z] WARN org.eclipse.swtbot.swt.finder.widgets.SWTBotButton - Widget is not enabled: (of type 'Button' and with mnemonic 'Remove' and with style 'SWT.PUSH')
14:20:27 [2024-06-19T18:20:27.630Z] WARN org.eclipse.swtbot.swt.finder.widgets.SWTBotButton - Widget is not enabled: (of type 'Button' and with mnemonic 'Remove' and with style 'SWT.PUSH')
14:20:27 [2024-06-19T18:20:27.630Z] DEBUG org.eclipse.swtbot.swt.finder.widgets.SWTBotButton - Clicked on Remove
14:20:27 [2024-06-19T18:20:27.630Z] DEBUG org.eclipse.swtbot.swt.finder.widgets.SWTBotTree - Attempting to set focus on Tree with text {}
14:20:27 [2024-06-19T18:20:27.630Z] DEBUG org.eclipse.swtbot.swt.finder.widgets.SWTBotTreeItem - Sent event 6 to [MouseEnter [6]: MouseEvent{TreeItem {TestMultiNode} time=834309031 data=null button=0 stateMask=0x0 x=89 y=12 count=0}, TreeItem with text {TestMultiNode}]
14:20:27 [2024-06-19T18:20:27.630Z] DEBUG org.eclipse.swtbot.swt.finder.widgets.SWTBotTreeItem - Sent event 26 to [Activate [26]: ShellEvent{TreeItem {TestMultiNode} time=834309031 data=null doit=true}, TreeItem with text {TestMultiNode}]
14:20:27 [2024-06-19T18:20:27.630Z] DEBUG org.eclipse.swtbot.swt.finder.widgets.SWTBotTreeItem - Sent event 15 to [FocusIn [15]: FocusEvent{TreeItem {TestMultiNode} time=834309031 data=null}, TreeItem with text {TestMultiNode}]
14:20:27 [2024-06-19T18:20:27.630Z] DEBUG org.eclipse.swtbot.swt.finder.widgets.SWTBotTreeItem - Sent event 3 to [MouseDown [3]: MouseEvent{TreeItem {TestMultiNode} time=834309031 data=null button=1 stateMask=0x0 x=89 y=12 count=1}, TreeItem with text {TestMultiNode}]
14:20:27 [2024-06-19T18:20:27.630Z] DEBUG org.eclipse.swtbot.swt.finder.widgets.SWTBotTreeItem - Sent event 13 to [Selection [13]: SelectionEvent{Tree {} time=834309032 data=null item=TreeItem {TestMultiNode} detail=0 x=0 y=0 width=0 height=0 stateMask=0x80000 text=null doit=true}, TreeItem with text {TestMultiNode}]
14:20:27 [2024-06-19T18:20:27.630Z] DEBUG org.eclipse.swtbot.swt.finder.widgets.SWTBotTreeItem - Sent event 4 to [MouseUp [4]: MouseEvent{TreeItem {TestMultiNode} time=834309034 data=null button=1 stateMask=0x80000 x=89 y=12 count=1}, TreeItem with text {TestMultiNode}]
14:20:27 [2024-06-19T18:20:27.630Z] DEBUG org.eclipse.swtbot.swt.finder.matchers.AbstractMatcher - matched Button with text "Add", using matcher: of type 'Button'
14:20:27 [2024-06-19T18:20:27.630Z] DEBUG org.eclipse.swtbot.swt.finder.matchers.AbstractMatcher - matched Button with text "Remove", using matcher: of type 'Button'
14:20:27 [2024-06-19T18:20:27.630Z] DEBUG org.eclipse.swtbot.swt.finder.matchers.AbstractMatcher - matched Button with text "Remove", using matcher: with mnemonic 'Remove'
14:20:27 [2024-06-19T18:20:27.630Z] DEBUG org.eclipse.swtbot.swt.finder.matchers.AbstractMatcher - matched Button with text "Remove", using matcher: with style 'SWT.PUSH'
14:20:27 [2024-06-19T18:20:27.630Z] DEBUG org.eclipse.swtbot.swt.finder.matchers.AbstractMatcher - matched Button with text "Remove", using matcher: (of type 'Button' and with mnemonic 'Remove' and with style 'SWT.PUSH')
14:20:27 [2024-06-19T18:20:27.630Z] DEBUG org.eclipse.swtbot.swt.finder.matchers.AbstractMatcher - matched Button with text "Import", using matcher: of type 'Button'
14:20:27 [2024-06-19T18:20:27.630Z] DEBUG org.eclipse.swtbot.swt.finder.matchers.AbstractMatcher - matched Button with text "Export", using matcher: of type 'Button'
14:20:27 [2024-06-19T18:20:27.630Z] DEBUG org.eclipse.swtbot.swt.finder.matchers.AbstractMatcher - matched Button with text "Move Up", using matcher: of type 'Button'
14:20:27 [2024-06-19T18:20:27.630Z] DEBUG org.eclipse.swtbot.swt.finder.matchers.AbstractMatcher - matched Button with text "Move Down", using matcher: of type 'Button'
14:20:27 [2024-06-19T18:20:27.630Z] DEBUG org.eclipse.swtbot.swt.finder.matchers.AbstractMatcher - matched Button with text "Cancel", using matcher: of type 'Button'
14:20:27 [2024-06-19T18:20:27.630Z] DEBUG org.eclipse.swtbot.swt.finder.matchers.AbstractMatcher - matched Button with text "Apply and Close", using matcher: of type 'Button'
14:20:27 [2024-06-19T18:20:27.630Z] DEBUG org.eclipse.swtbot.swt.finder.widgets.SWTBotButton - Clicking on Remove
14:20:27 [2024-06-19T18:20:27.630Z] DEBUG org.eclipse.swtbot.swt.finder.widgets.SWTBotButton - Sent event 6 to [MouseEnter [6]: MouseEvent{Button {Remove} time=834309036 data=null button=0 stateMask=0x0 x=0 y=0 count=0}, (of type 'Button' and with mnemonic 'Remove' and with style 'SWT.PUSH')]
14:20:27 [2024-06-19T18:20:27.630Z] DEBUG org.eclipse.swtbot.swt.finder.widgets.SWTBotButton - Sent event 5 to [MouseMove [5]: MouseEvent{Button {Remove} time=834309036 data=null button=0 stateMask=0x0 x=0 y=0 count=0}, (of type 'Button' and with mnemonic 'Remove' and with style 'SWT.PUSH')]
14:20:27 [2024-06-19T18:20:27.630Z] DEBUG org.eclipse.swtbot.swt.finder.widgets.SWTBotButton - Sent event 26 to [Activate [26]: ShellEvent{Button {Remove} time=834309036 data=null doit=true}, (of type 'Button' and with mnemonic 'Remove' and with style 'SWT.PUSH')]
14:20:27 [2024-06-19T18:20:27.630Z] DEBUG org.eclipse.swtbot.swt.finder.widgets.SWTBotButton - Sent event 15 to [FocusIn [15]: FocusEvent{Button {Remove} time=834309036 data=null}, (of type 'Button' and with mnemonic 'Remove' and with style 'SWT.PUSH')]
14:20:27 [2024-06-19T18:20:27.630Z] DEBUG org.eclipse.swtbot.swt.finder.widgets.SWTBotButton - Sent event 3 to [MouseDown [3]: MouseEvent{Button {Remove} time=834309037 data=null button=0 stateMask=0x0 x=0 y=0 count=0}, (of type 'Button' and with mnemonic 'Remove' and with style 'SWT.PUSH')]
14:20:27 [2024-06-19T18:20:27.630Z] DEBUG org.eclipse.swtbot.swt.finder.widgets.SWTBotButton - Sent event 4 to [MouseUp [4]: MouseEvent{Button {Remove} time=834309037 data=null button=0 stateMask=0x0 x=0 y=0 count=0}, (of type 'Button' and with mnemonic 'Remove' and with style 'SWT.PUSH')]
14:20:27 [2024-06-19T18:20:27.630Z] DEBUG org.eclipse.swtbot.swt.finder.widgets.SWTBotButton - Sent event 13 to [Selection [13]: SelectionEvent{Button {Remove} time=834309037 data=null item=null detail=0 x=0 y=0 width=0 height=0 stateMask=0x0 text=null doit=true}, (of type 'Button' and with mnemonic 'Remove' and with style 'SWT.PUSH')]
14:20:27 [2024-06-19T18:20:27.631Z] WARN org.eclipse.swtbot.swt.finder.widgets.SWTBotButton - Widget is not enabled: (of type 'Button' and with mnemonic 'Remove' and with style 'SWT.PUSH')
14:20:27 [2024-06-19T18:20:27.631Z] WARN org.eclipse.swtbot.swt.finder.widgets.SWTBotButton - Widget is not enabled: (of type 'Button' and with mnemonic 'Remove' and with style 'SWT.PUSH')
14:20:27 [2024-06-19T18:20:27.631Z] WARN org.eclipse.swtbot.swt.finder.widgets.SWTBotButton - Widget is not enabled: (of type 'Button' and with mnemonic 'Remove' and with style 'SWT.PUSH')
14:20:27 [2024-06-19T18:20:27.631Z] WARN org.eclipse.swtbot.swt.finder.widgets.SWTBotButton - Widget is not enabled: (of type 'Button' and with mnemonic 'Remove' and with style 'SWT.PUSH')
14:20:27 [2024-06-19T18:20:27.631Z] WARN org.eclipse.swtbot.swt.finder.widgets.SWTBotButton - Widget is not enabled: (of type 'Button' and with mnemonic 'Remove' and with style 'SWT.PUSH')
14:20:27 [2024-06-19T18:20:27.631Z] DEBUG org.eclipse.swtbot.swt.finder.widgets.SWTBotButton - Clicked on Remove
14:20:27 [2024-06-19T18:20:27.631Z] DEBUG org.eclipse.swtbot.swt.finder.widgets.SWTBotTree - Attempting to set focus on Tree with text {}
14:20:27 [2024-06-19T18:20:27.631Z] DEBUG org.eclipse.swtbot.swt.finder.widgets.SWTBotTreeItem - Sent event 6 to [MouseEnter [6]: MouseEvent{TreeItem {TestUnknown} time=834309040 data=null button=0 stateMask=0x0 x=86 y=12 count=0}, TreeItem with text {TestUnknown}]
14:20:27 [2024-06-19T18:20:27.631Z] DEBUG org.eclipse.swtbot.swt.finder.widgets.SWTBotTreeItem - Sent event 26 to [Activate [26]: ShellEvent{TreeItem {TestUnknown} time=834309045 data=null doit=true}, TreeItem with text {TestUnknown}]
14:20:27 [2024-06-19T18:20:27.631Z] DEBUG org.eclipse.swtbot.swt.finder.widgets.SWTBotTreeItem - Sent event 15 to [FocusIn [15]: FocusEvent{TreeItem {TestUnknown} time=834309045 data=null}, TreeItem with text {TestUnknown}]
14:20:27 [2024-06-19T18:20:27.631Z] DEBUG org.eclipse.swtbot.swt.finder.widgets.SWTBotTreeItem - Sent event 3 to [MouseDown [3]: MouseEvent{TreeItem {TestUnknown} time=834309047 data=null button=1 stateMask=0x0 x=86 y=12 count=1}, TreeItem with text {TestUnknown}]
14:20:27 [2024-06-19T18:20:27.631Z] DEBUG org.eclipse.swtbot.swt.finder.widgets.SWTBotTreeItem - Sent event 13 to [Selection [13]: SelectionEvent{Tree {} time=834309047 data=null item=TreeItem {TestUnknown} detail=0 x=0 y=0 width=0 height=0 stateMask=0x80000 text=null doit=true}, TreeItem with text {TestUnknown}]
14:20:27 [2024-06-19T18:20:27.631Z] DEBUG org.eclipse.swtbot.swt.finder.widgets.SWTBotTreeItem - Sent event 4 to [MouseUp [4]: MouseEvent{TreeItem {TestUnknown} time=834309049 data=null button=1 stateMask=0x80000 x=86 y=12 count=1}, TreeItem with text {TestUnknown}]
14:20:27 [2024-06-19T18:20:27.631Z] DEBUG org.eclipse.swtbot.swt.finder.matchers.AbstractMatcher - matched Button with text "Add", using matcher: of type 'Button'
14:20:27 [2024-06-19T18:20:27.631Z] DEBUG org.eclipse.swtbot.swt.finder.matchers.AbstractMatcher - matched Button with text "Remove", using matcher: of type 'Button'
14:20:27 [2024-06-19T18:20:27.631Z] DEBUG org.eclipse.swtbot.swt.finder.matchers.AbstractMatcher - matched Button with text "Remove", using matcher: with mnemonic 'Remove'
14:20:27 [2024-06-19T18:20:27.631Z] DEBUG org.eclipse.swtbot.swt.finder.matchers.AbstractMatcher - matched Button with text "Remove", using matcher: with style 'SWT.PUSH'
14:20:27 [2024-06-19T18:20:27.631Z] DEBUG org.eclipse.swtbot.swt.finder.matchers.AbstractMatcher - matched Button with text "Remove", using matcher: (of type 'Button' and with mnemonic 'Remove' and with style 'SWT.PUSH')
14:20:27 [2024-06-19T18:20:27.631Z] DEBUG org.eclipse.swtbot.swt.finder.matchers.AbstractMatcher - matched Button with text "Import", using matcher: of type 'Button'
14:20:27 [2024-06-19T18:20:27.631Z] DEBUG org.eclipse.swtbot.swt.finder.matchers.AbstractMatcher - matched Button with text "Export", using matcher: of type 'Button'
14:20:27 [2024-06-19T18:20:27.631Z] DEBUG org.eclipse.swtbot.swt.finder.matchers.AbstractMatcher - matched Button with text "Move Up", using matcher: of type 'Button'
14:20:27 [2024-06-19T18:20:27.631Z] DEBUG org.eclipse.swtbot.swt.finder.matchers.AbstractMatcher - matched Button with text "Move Down", using matcher: of type 'Button'
14:20:27 [2024-06-19T18:20:27.631Z] DEBUG org.eclipse.swtbot.swt.finder.matchers.AbstractMatcher - matched Button with text "Cancel", using matcher: of type 'Button'
14:20:27 [2024-06-19T18:20:27.631Z] DEBUG org.eclipse.swtbot.swt.finder.matchers.AbstractMatcher - matched Button with text "Apply and Close", using matcher: of type 'Button'
14:20:27 [2024-06-19T18:20:27.631Z] DEBUG org.eclipse.swtbot.swt.finder.widgets.SWTBotButton - Clicking on Remove
14:20:27 [2024-06-19T18:20:27.631Z] DEBUG org.eclipse.swtbot.swt.finder.widgets.SWTBotButton - Sent event 6 to [MouseEnter [6]: MouseEvent{Button {Remove} time=834309051 data=null button=0 stateMask=0x0 x=0 y=0 count=0}, (of type 'Button' and with mnemonic 'Remove' and with style 'SWT.PUSH')]
14:20:27 [2024-06-19T18:20:27.631Z] DEBUG org.eclipse.swtbot.swt.finder.widgets.SWTBotButton - Sent event 5 to [MouseMove [5]: MouseEvent{Button {Remove} time=834309051 data=null button=0 stateMask=0x0 x=0 y=0 count=0}, (of type 'Button' and with mnemonic 'Remove' and with style 'SWT.PUSH')]
14:20:27 [2024-06-19T18:20:27.631Z] DEBUG org.eclipse.swtbot.swt.finder.widgets.SWTBotButton - Sent event 26 to [Activate [26]: ShellEvent{Button {Remove} time=834309051 data=null doit=true}, (of type 'Button' and with mnemonic 'Remove' and with style 'SWT.PUSH')]
14:20:27 [2024-06-19T18:20:27.631Z] DEBUG org.eclipse.swtbot.swt.finder.widgets.SWTBotButton - Sent event 15 to [FocusIn [15]: FocusEvent{Button {Remove} time=834309051 data=null}, (of type 'Button' and with mnemonic 'Remove' and with style 'SWT.PUSH')]
14:20:27 [2024-06-19T18:20:27.631Z] DEBUG org.eclipse.swtbot.swt.finder.widgets.SWTBotButton - Sent event 3 to [MouseDown [3]: MouseEvent{Button {Remove} time=834309051 data=null button=0 stateMask=0x0 x=0 y=0 count=0}, (of type 'Button' and with mnemonic 'Remove' and with style 'SWT.PUSH')]
14:20:27 [2024-06-19T18:20:27.631Z] DEBUG org.eclipse.swtbot.swt.finder.widgets.SWTBotButton - Sent event 4 to [MouseUp [4]: MouseEvent{Button {Remove} time=834309051 data=null button=0 stateMask=0x0 x=0 y=0 count=0}, (of type 'Button' and with mnemonic 'Remove' and with style 'SWT.PUSH')]
14:20:27 [2024-06-19T18:20:27.631Z] DEBUG org.eclipse.swtbot.swt.finder.widgets.SWTBotButton - Sent event 13 to [Selection [13]: SelectionEvent{Button {Remove} time=834309051 data=null item=null detail=0 x=0 y=0 width=0 height=0 stateMask=0x0 text=null doit=true}, (of type 'Button' and with mnemonic 'Remove' and with style 'SWT.PUSH')]
14:20:27 [2024-06-19T18:20:27.631Z] WARN org.eclipse.swtbot.swt.finder.widgets.SWTBotButton - Widget is not enabled: (of type 'Button' and with mnemonic 'Remove' and with style 'SWT.PUSH')
14:20:27 [2024-06-19T18:20:27.631Z] WARN org.eclipse.swtbot.swt.finder.widgets.SWTBotButton - Widget is not enabled: (of type 'Button' and with mnemonic 'Remove' and with style 'SWT.PUSH')
14:20:27 [2024-06-19T18:20:27.631Z] WARN org.eclipse.swtbot.swt.finder.widgets.SWTBotButton - Widget is not enabled: (of type 'Button' and with mnemonic 'Remove' and with style 'SWT.PUSH')
14:20:27 [2024-06-19T18:20:27.631Z] WARN org.eclipse.swtbot.swt.finder.widgets.SWTBotButton - Widget is not enabled: (of type 'Button' and with mnemonic 'Remove' and with style 'SWT.PUSH')
14:20:27 [2024-06-19T18:20:27.631Z] WARN org.eclipse.swtbot.swt.finder.widgets.SWTBotButton - Widget is not enabled: (of type 'Button' and with mnemonic 'Remove' and with style 'SWT.PUSH')
14:20:27 [2024-06-19T18:20:27.631Z] DEBUG org.eclipse.swtbot.swt.finder.widgets.SWTBotButton - Clicked on Remove
14:20:27 [2024-06-19T18:20:27.631Z] DEBUG org.eclipse.swtbot.swt.finder.widgets.SWTBotTree - Attempting to set focus on Tree with text {}
14:20:27 [2024-06-19T18:20:27.631Z] DEBUG org.eclipse.swtbot.swt.finder.widgets.SWTBotTreeItem - Sent event 6 to [MouseEnter [6]: MouseEvent{TreeItem {TestLocal} time=834309055 data=null button=0 stateMask=0x0 x=72 y=12 count=0}, TreeItem with text {TestLocal}]
14:20:27 [2024-06-19T18:20:27.631Z] DEBUG org.eclipse.swtbot.swt.finder.widgets.SWTBotTreeItem - Sent event 26 to [Activate [26]: ShellEvent{TreeItem {TestLocal} time=834309055 data=null doit=true}, TreeItem with text {TestLocal}]
14:20:27 [2024-06-19T18:20:27.631Z] DEBUG org.eclipse.swtbot.swt.finder.widgets.SWTBotTreeItem - Sent event 15 to [FocusIn [15]: FocusEvent{TreeItem {TestLocal} time=834309055 data=null}, TreeItem with text {TestLocal}]
14:20:27 [2024-06-19T18:20:27.631Z] DEBUG org.eclipse.swtbot.swt.finder.widgets.SWTBotTreeItem - Sent event 3 to [MouseDown [3]: MouseEvent{TreeItem {TestLocal} time=834309055 data=null button=1 stateMask=0x0 x=72 y=12 count=1}, TreeItem with text {TestLocal}]
14:20:27 [2024-06-19T18:20:27.631Z] DEBUG org.eclipse.swtbot.swt.finder.widgets.SWTBotTreeItem - Sent event 13 to [Selection [13]: SelectionEvent{Tree {} time=834309055 data=null item=TreeItem {TestLocal} detail=0 x=0 y=0 width=0 height=0 stateMask=0x80000 text=null doit=true}, TreeItem with text {TestLocal}]
14:20:27 [2024-06-19T18:20:27.631Z] DEBUG org.eclipse.swtbot.swt.finder.widgets.SWTBotTreeItem - Sent event 4 to [MouseUp [4]: MouseEvent{TreeItem {TestLocal} time=834309061 data=null button=1 stateMask=0x80000 x=72 y=12 count=1}, TreeItem with text {TestLocal}]
14:20:27 [2024-06-19T18:20:27.631Z] DEBUG org.eclipse.swtbot.swt.finder.matchers.AbstractMatcher - matched Button with text "Add", using matcher: of type 'Button'
14:20:27 [2024-06-19T18:20:27.631Z] DEBUG org.eclipse.swtbot.swt.finder.matchers.AbstractMatcher - matched Button with text "Remove", using matcher: of type 'Button'
14:20:27 [2024-06-19T18:20:27.631Z] DEBUG org.eclipse.swtbot.swt.finder.matchers.AbstractMatcher - matched Button with text "Remove", using matcher: with mnemonic 'Remove'
14:20:27 [2024-06-19T18:20:27.631Z] DEBUG org.eclipse.swtbot.swt.finder.matchers.AbstractMatcher - matched Button with text "Remove", using matcher: with style 'SWT.PUSH'
14:20:27 [2024-06-19T18:20:27.631Z] DEBUG org.eclipse.swtbot.swt.finder.matchers.AbstractMatcher - matched Button with text "Remove", using matcher: (of type 'Button' and with mnemonic 'Remove' and with style 'SWT.PUSH')
14:20:27 [2024-06-19T18:20:27.631Z] DEBUG org.eclipse.swtbot.swt.finder.matchers.AbstractMatcher - matched Button with text "Import", using matcher: of type 'Button'
14:20:27 [2024-06-19T18:20:27.631Z] DEBUG org.eclipse.swtbot.swt.finder.matchers.AbstractMatcher - matched Button with text "Export", using matcher: of type 'Button'
14:20:27 [2024-06-19T18:20:27.631Z] DEBUG org.eclipse.swtbot.swt.finder.matchers.AbstractMatcher - matched Button with text "Move Up", using matcher: of type 'Button'
14:20:27 [2024-06-19T18:20:27.631Z] DEBUG org.eclipse.swtbot.swt.finder.matchers.AbstractMatcher - matched Button with text "Move Down", using matcher: of type 'Button'
14:20:27 [2024-06-19T18:20:27.631Z] DEBUG org.eclipse.swtbot.swt.finder.matchers.AbstractMatcher - matched Button with text "Cancel", using matcher: of type 'Button'
14:20:27 [2024-06-19T18:20:27.632Z] DEBUG org.eclipse.swtbot.swt.finder.matchers.AbstractMatcher - matched Button with text "Apply and Close", using matcher: of type 'Button'
14:20:27 [2024-06-19T18:20:27.632Z] DEBUG org.eclipse.swtbot.swt.finder.widgets.SWTBotButton - Clicking on Remove
14:20:27 [2024-06-19T18:20:27.632Z] DEBUG org.eclipse.swtbot.swt.finder.widgets.SWTBotButton - Sent event 6 to [MouseEnter [6]: MouseEvent{Button {Remove} time=834309063 data=null button=0 stateMask=0x0 x=0 y=0 count=0}, (of type 'Button' and with mnemonic 'Remove' and with style 'SWT.PUSH')]
14:20:27 [2024-06-19T18:20:27.632Z] DEBUG org.eclipse.swtbot.swt.finder.widgets.SWTBotButton - Sent event 5 to [MouseMove [5]: MouseEvent{Button {Remove} time=834309063 data=null button=0 stateMask=0x0 x=0 y=0 count=0}, (of type 'Button' and with mnemonic 'Remove' and with style 'SWT.PUSH')]
14:20:27 [2024-06-19T18:20:27.632Z] DEBUG org.eclipse.swtbot.swt.finder.widgets.SWTBotButton - Sent event 26 to [Activate [26]: ShellEvent{Button {Remove} time=834309063 data=null doit=true}, (of type 'Button' and with mnemonic 'Remove' and with style 'SWT.PUSH')]
14:20:27 [2024-06-19T18:20:27.632Z] DEBUG org.eclipse.swtbot.swt.finder.widgets.SWTBotButton - Sent event 15 to [FocusIn [15]: FocusEvent{Button {Remove} time=834309063 data=null}, (of type 'Button' and with mnemonic 'Remove' and with style 'SWT.PUSH')]
14:20:27 [2024-06-19T18:20:27.632Z] DEBUG org.eclipse.swtbot.swt.finder.widgets.SWTBotButton - Sent event 3 to [MouseDown [3]: MouseEvent{Button {Remove} time=834309063 data=null button=0 stateMask=0x0 x=0 y=0 count=0}, (of type 'Button' and with mnemonic 'Remove' and with style 'SWT.PUSH')]
14:20:27 [2024-06-19T18:20:27.632Z] DEBUG org.eclipse.swtbot.swt.finder.widgets.SWTBotButton - Sent event 4 to [MouseUp [4]: MouseEvent{Button {Remove} time=834309064 data=null button=0 stateMask=0x0 x=0 y=0 count=0}, (of type 'Button' and with mnemonic 'Remove' and with style 'SWT.PUSH')]
14:20:27 [2024-06-19T18:20:27.632Z] DEBUG org.eclipse.swtbot.swt.finder.widgets.SWTBotButton - Sent event 13 to [Selection [13]: SelectionEvent{Button {Remove} time=834309064 data=null item=null detail=0 x=0 y=0 width=0 height=0 stateMask=0x0 text=null doit=true}, (of type 'Button' and with mnemonic 'Remove' and with style 'SWT.PUSH')]
14:20:27 [2024-06-19T18:20:27.632Z] WARN org.eclipse.swtbot.swt.finder.widgets.SWTBotButton - Widget is not enabled: (of type 'Button' and with mnemonic 'Remove' and with style 'SWT.PUSH')
14:20:27 [2024-06-19T18:20:27.632Z] WARN org.eclipse.swtbot.swt.finder.widgets.SWTBotButton - Widget is not enabled: (of type 'Button' and with mnemonic 'Remove' and with style 'SWT.PUSH')
14:20:27 [2024-06-19T18:20:27.632Z] WARN org.eclipse.swtbot.swt.finder.widgets.SWTBotButton - Widget is not enabled: (of type 'Button' and with mnemonic 'Remove' and with style 'SWT.PUSH')
14:20:27 [2024-06-19T18:20:27.632Z] WARN org.eclipse.swtbot.swt.finder.widgets.SWTBotButton - Widget is not enabled: (of type 'Button' and with mnemonic 'Remove' and with style 'SWT.PUSH')
14:20:27 [2024-06-19T18:20:27.632Z] WARN org.eclipse.swtbot.swt.finder.widgets.SWTBotButton - Widget is not enabled: (of type 'Button' and with mnemonic 'Remove' and with style 'SWT.PUSH')
14:20:27 [2024-06-19T18:20:27.632Z] DEBUG org.eclipse.swtbot.swt.finder.widgets.SWTBotButton - Clicked on Remove
14:20:27 [2024-06-19T18:20:27.632Z] DEBUG org.eclipse.swtbot.swt.finder.matchers.AbstractMatcher - matched Button with text "Add", using matcher: of type 'Button'
14:20:27 [2024-06-19T18:20:27.632Z] DEBUG org.eclipse.swtbot.swt.finder.matchers.AbstractMatcher - matched Button with text "Remove", using matcher: of type 'Button'
14:20:27 [2024-06-19T18:20:27.632Z] DEBUG org.eclipse.swtbot.swt.finder.matchers.AbstractMatcher - matched Button with text "Import", using matcher: of type 'Button'
14:20:27 [2024-06-19T18:20:27.632Z] DEBUG org.eclipse.swtbot.swt.finder.matchers.AbstractMatcher - matched Button with text "Export", using matcher: of type 'Button'
14:20:27 [2024-06-19T18:20:27.632Z] DEBUG org.eclipse.swtbot.swt.finder.matchers.AbstractMatcher - matched Button with text "Move Up", using matcher: of type 'Button'
14:20:27 [2024-06-19T18:20:27.632Z] DEBUG org.eclipse.swtbot.swt.finder.matchers.AbstractMatcher - matched Button with text "Move Down", using matcher: of type 'Button'
14:20:27 [2024-06-19T18:20:27.632Z] DEBUG org.eclipse.swtbot.swt.finder.matchers.AbstractMatcher - matched Button with text "Cancel", using matcher: of type 'Button'
14:20:27 [2024-06-19T18:20:27.632Z] DEBUG org.eclipse.swtbot.swt.finder.matchers.AbstractMatcher - matched Button with text "Apply and Close", using matcher: of type 'Button'
14:20:27 [2024-06-19T18:20:27.632Z] DEBUG org.eclipse.swtbot.swt.finder.matchers.AbstractMatcher - matched Button with text "Apply and Close", using matcher: with mnemonic 'Apply and Close'
14:20:27 [2024-06-19T18:20:27.632Z] DEBUG org.eclipse.swtbot.swt.finder.matchers.AbstractMatcher - matched Button with text "Apply and Close", using matcher: (with mnemonic 'Apply and Close' or with mnemonic 'OK')
14:20:27 [2024-06-19T18:20:27.632Z] DEBUG org.eclipse.swtbot.swt.finder.matchers.AbstractMatcher - matched Button with text "Apply and Close", using matcher: with style 'SWT.PUSH'
14:20:27 [2024-06-19T18:20:27.632Z] DEBUG org.eclipse.swtbot.swt.finder.matchers.AbstractMatcher - matched Button with text "Apply and Close", using matcher: (of type 'Button' and (with mnemonic 'Apply and Close' or with mnemonic 'OK') and with style 'SWT.PUSH')
14:20:27 [2024-06-19T18:20:27.632Z] DEBUG org.eclipse.swtbot.swt.finder.widgets.SWTBotButton - Clicking on Apply and Close
14:20:27 [2024-06-19T18:20:27.632Z] DEBUG org.eclipse.swtbot.swt.finder.widgets.SWTBotButton - Sent event 6 to [MouseEnter [6]: MouseEvent{Button {Apply and Close} time=834309067 data=null button=0 stateMask=0x0 x=0 y=0 count=0}, (of type 'Button' and (with mnemonic 'Apply and Close' or with mnemonic 'OK') and with style 'SWT.PUSH')]
14:20:27 [2024-06-19T18:20:27.632Z] DEBUG org.eclipse.swtbot.swt.finder.widgets.SWTBotButton - Sent event 5 to [MouseMove [5]: MouseEvent{Button {Apply and Close} time=834309067 data=null button=0 stateMask=0x0 x=0 y=0 count=0}, (of type 'Button' and (with mnemonic 'Apply and Close' or with mnemonic 'OK') and with style 'SWT.PUSH')]
14:20:27 [2024-06-19T18:20:27.632Z] DEBUG org.eclipse.swtbot.swt.finder.widgets.SWTBotButton - Sent event 26 to [Activate [26]: ShellEvent{Button {Apply and Close} time=834309067 data=null doit=true}, (of type 'Button' and (with mnemonic 'Apply and Close' or with mnemonic 'OK') and with style 'SWT.PUSH')]
14:20:27 [2024-06-19T18:20:27.632Z] DEBUG org.eclipse.swtbot.swt.finder.widgets.SWTBotButton - Sent event 15 to [FocusIn [15]: FocusEvent{Button {Apply and Close} time=834309067 data=null}, (of type 'Button' and (with mnemonic 'Apply and Close' or with mnemonic 'OK') and with style 'SWT.PUSH')]
14:20:27 [2024-06-19T18:20:27.632Z] DEBUG org.eclipse.swtbot.swt.finder.widgets.SWTBotButton - Sent event 3 to [MouseDown [3]: MouseEvent{Button {Apply and Close} time=834309067 data=null button=0 stateMask=0x0 x=0 y=0 count=0}, (of type 'Button' and (with mnemonic 'Apply and Close' or with mnemonic 'OK') and with style 'SWT.PUSH')]
14:20:27 [2024-06-19T18:20:27.632Z] DEBUG org.eclipse.swtbot.swt.finder.widgets.SWTBotButton - Sent event 4 to [MouseUp [4]: MouseEvent{Button {Apply and Close} time=834309067 data=null button=0 stateMask=0x0 x=0 y=0 count=0}, (of type 'Button' and (with mnemonic 'Apply and Close' or with mnemonic 'OK') and with style 'SWT.PUSH')]
14:20:27 [2024-06-19T18:20:27.632Z] DEBUG org.eclipse.swtbot.swt.finder.widgets.SWTBotButton - Sent event 13 to [Selection [13]: SelectionEvent{Button {Apply and Close} time=834309067 data=null item=null detail=0 x=0 y=0 width=0 height=0 stateMask=0x0 text=null doit=true}, (of type 'Button' and (with mnemonic 'Apply and Close' or with mnemonic 'OK') and with style 'SWT.PUSH')]
14:20:27 [2024-06-19T18:20:27.632Z] DEBUG org.eclipse.swtbot.swt.finder.widgets.SWTBotMenu - Sent event 13 to [Selection [13]: SelectionEvent{MenuItem {&Preferences} time=834308582 data=null item=null detail=0 x=0 y=0 width=0 height=0 stateMask=0x0 text=null doit=true}, with mnemonic 'Preferences']
14:20:27 [2024-06-19T18:20:27.632Z] DEBUG org.eclipse.swtbot.swt.finder.widgets.SWTBotButton - Clicked on 
14:20:27 [2024-06-19T18:20:27.632Z] Tests run: 20, Failures: 0, Errors: 0, Skipped: 1, Time elapsed: 87.601 s - in org.eclipse.tracecompass.tmf.remote.ui.swtbot.tests.fetch.FetchRemoteTracesTest
14:20:27 [2024-06-19T18:20:27.632Z] testImportNothing  Time elapsed: 5.123 s
14:20:27 [2024-06-19T18:20:27.632Z] test_7_03  Time elapsed: 2.02 s
14:20:27 [2024-06-19T18:20:27.632Z] test_8_04  Time elapsed: 5.772 s
14:20:27 [2024-06-19T18:20:27.632Z] test_8_05  Time elapsed: 14.631 s
14:20:27 [2024-06-19T18:20:27.632Z] test_8_06  Time elapsed: 5.997 s
14:20:27 [2024-06-19T18:20:27.632Z] test_8_07  Time elapsed: 4.557 s
14:20:27 [2024-06-19T18:20:27.632Z] test_8_08  Time elapsed: 4.595 s
14:20:27 [2024-06-19T18:20:27.632Z] test_8_09  Time elapsed: 3.914 s
14:20:27 [2024-06-19T18:20:27.632Z] test_8_10  Time elapsed: 3.404 s
14:20:27 [2024-06-19T18:20:27.632Z] test_8_11  Time elapsed: 3.932 s
14:20:27 [2024-06-19T18:20:27.632Z] test_8_12  Time elapsed: 3.12 s
14:20:27 [2024-06-19T18:20:27.632Z] test_8_13  Time elapsed: 4.179 s
14:20:27 [2024-06-19T18:20:27.632Z] test_8_14  Time elapsed: 2.363 s
14:20:27 [2024-06-19T18:20:27.632Z] test_8_15  Time elapsed: 3.52 s
14:20:27 [2024-06-19T18:20:27.632Z] test_9_01  Time elapsed: 2.498 s
14:20:27 [2024-06-19T18:20:27.632Z] test_9_02 skipped
14:20:27 [2024-06-19T18:20:27.632Z] testImportOnlyOne  Time elapsed: 4.069 s
14:20:27 [2024-06-19T18:20:27.632Z] testEmptyFile  Time elapsed: 2.097 s
14:20:27 [2024-06-19T18:20:27.632Z] testImportAll  Time elapsed: 5.515 s
14:20:27 [2024-06-19T18:20:27.632Z] testEditProfile  Time elapsed: 2.931 s
14:20:27 [2024-06-19T18:20:27.632Z] 
14:20:27 [2024-06-19T18:20:27.632Z] Results:
14:20:27 [2024-06-19T18:20:27.632Z] 
14:20:27 [2024-06-19T18:20:27.632Z] Tests run: 20, Failures: 0, Errors: 0, Skipped: 1
14:20:27 [2024-06-19T18:20:27.632Z] 
14:20:28 [2024-06-19T18:20:28.194Z] 
14:20:28 [2024-06-19T18:20:28.194Z] !ENTRY org.eclipse.core.resources 2 10035 2024-06-19 18:20:28.045
14:20:28 [2024-06-19T18:20:28.194Z] !MESSAGE The workspace will exit with unsaved changes in this session.
14:20:28 [2024-06-19T18:20:28.755Z] [INFO] All tests passed!
14:20:28 [2024-06-19T18:20:28.755Z] [INFO] 
14:20:28 [2024-06-19T18:20:28.755Z] [INFO] --- maven-install-plugin:2.5.2:install (default-install) @ org.eclipse.tracecompass.tmf.remote.ui.swtbot.tests ---
14:20:28 [2024-06-19T18:20:28.755Z] [INFO] Installing /home/jenkins/agent/workspace/tracecompass-master-nightly-2021-06/tmf/org.eclipse.tracecompass.tmf.remote.ui.swtbot.tests/target/org.eclipse.tracecompass.tmf.remote.ui.swtbot.tests-1.0.11-SNAPSHOT.jar to /home/jenkins/.m2/repository/org/eclipse/tracecompass/org.eclipse.tracecompass.tmf.remote.ui.swtbot.tests/1.0.11-SNAPSHOT/org.eclipse.tracecompass.tmf.remote.ui.swtbot.tests-1.0.11-SNAPSHOT.jar
14:20:28 [2024-06-19T18:20:28.755Z] [INFO] Installing /home/jenkins/agent/workspace/tracecompass-master-nightly-2021-06/tmf/org.eclipse.tracecompass.tmf.remote.ui.swtbot.tests/.tycho-consumer-pom.xml to /home/jenkins/.m2/repository/org/eclipse/tracecompass/org.eclipse.tracecompass.tmf.remote.ui.swtbot.tests/1.0.11-SNAPSHOT/org.eclipse.tracecompass.tmf.remote.ui.swtbot.tests-1.0.11-SNAPSHOT.pom
14:20:28 [2024-06-19T18:20:28.755Z] [INFO] Installing /home/jenkins/agent/workspace/tracecompass-master-nightly-2021-06/tmf/org.eclipse.tracecompass.tmf.remote.ui.swtbot.tests/target/org.eclipse.tracecompass.tmf.remote.ui.swtbot.tests-1.0.11-SNAPSHOT-sources.jar to /home/jenkins/.m2/repository/org/eclipse/tracecompass/org.eclipse.tracecompass.tmf.remote.ui.swtbot.tests/1.0.11-SNAPSHOT/org.eclipse.tracecompass.tmf.remote.ui.swtbot.tests-1.0.11-SNAPSHOT-sources.jar
14:20:28 [2024-06-19T18:20:28.755Z] [INFO] Installing /home/jenkins/agent/workspace/tracecompass-master-nightly-2021-06/tmf/org.eclipse.tracecompass.tmf.remote.ui.swtbot.tests/target/p2content.xml to /home/jenkins/.m2/repository/org/eclipse/tracecompass/org.eclipse.tracecompass.tmf.remote.ui.swtbot.tests/1.0.11-SNAPSHOT/org.eclipse.tracecompass.tmf.remote.ui.swtbot.tests-1.0.11-SNAPSHOT-p2metadata.xml
14:20:28 [2024-06-19T18:20:28.755Z] [INFO] Installing /home/jenkins/agent/workspace/tracecompass-master-nightly-2021-06/tmf/org.eclipse.tracecompass.tmf.remote.ui.swtbot.tests/target/p2artifacts.xml to /home/jenkins/.m2/repository/org/eclipse/tracecompass/org.eclipse.tracecompass.tmf.remote.ui.swtbot.tests/1.0.11-SNAPSHOT/org.eclipse.tracecompass.tmf.remote.ui.swtbot.tests-1.0.11-SNAPSHOT-p2artifacts.xml
14:20:28 [2024-06-19T18:20:28.755Z] [INFO] 
14:20:28 [2024-06-19T18:20:28.755Z] [INFO] --- tycho-p2-plugin:2.7.5:update-local-index (default-update-local-index) @ org.eclipse.tracecompass.tmf.remote.ui.swtbot.tests ---
14:20:28 [2024-06-19T18:20:28.755Z] [INFO] 
14:20:28 [2024-06-19T18:20:28.755Z] [INFO] --< org.eclipse.tracecompass:org.eclipse.tracecompass.tmf.remote.ui.tests >--
14:20:28 [2024-06-19T18:20:28.755Z] [INFO] Building org.eclipse.tracecompass.tmf.remote.ui.tests 1.0.3-SNAPSHOT [135/141]
14:20:28 [2024-06-19T18:20:28.755Z] [INFO] ------------------------[ eclipse-test-plugin ]-------------------------
14:20:28 [2024-06-19T18:20:28.755Z] [INFO] 
14:20:28 [2024-06-19T18:20:28.755Z] [INFO] --- maven-clean-plugin:3.3.1:clean (default-clean) @ org.eclipse.tracecompass.tmf.remote.ui.tests ---
14:20:28 [2024-06-19T18:20:28.756Z] [INFO] 
14:20:28 [2024-06-19T18:20:28.756Z] [INFO] --- tycho-packaging-plugin:2.7.5:build-qualifier (default-build-qualifier) @ org.eclipse.tracecompass.tmf.remote.ui.tests ---
14:20:28 [2024-06-19T18:20:28.756Z] [INFO] The project's OSGi version is 1.0.3.202406191720
14:20:28 [2024-06-19T18:20:28.756Z] [INFO] 
14:20:28 [2024-06-19T18:20:28.756Z] [INFO] --- tycho-packaging-plugin:2.7.5:validate-id (default-validate-id) @ org.eclipse.tracecompass.tmf.remote.ui.tests ---
14:20:28 [2024-06-19T18:20:28.756Z] [INFO] 
14:20:28 [2024-06-19T18:20:28.756Z] [INFO] --- tycho-packaging-plugin:2.7.5:validate-version (default-validate-version) @ org.eclipse.tracecompass.tmf.remote.ui.tests ---
14:20:28 [2024-06-19T18:20:28.756Z] [INFO] 
14:20:28 [2024-06-19T18:20:28.756Z] [INFO] --- maven-enforcer-plugin:3.3.0:enforce (enforce-maven-version) @ org.eclipse.tracecompass.tmf.remote.ui.tests ---
14:20:28 [2024-06-19T18:20:28.756Z] [INFO] 
14:20:28 [2024-06-19T18:20:28.756Z] [INFO] --- target-platform-configuration:2.7.5:target-platform (default-target-platform) @ org.eclipse.tracecompass.tmf.remote.ui.tests ---
14:20:28 [2024-06-19T18:20:28.756Z] [INFO] 
14:20:28 [2024-06-19T18:20:28.756Z] [INFO] --- tycho-compiler-plugin:2.7.5:validate-classpath (default-validate-classpath) @ org.eclipse.tracecompass.tmf.remote.ui.tests ---
14:20:28 [2024-06-19T18:20:28.756Z] [INFO] Resolving class path of org.eclipse.tracecompass.tmf.remote.ui.tests...
14:20:29 [2024-06-19T18:20:29.011Z] [INFO] 
14:20:29 [2024-06-19T18:20:29.011Z] [INFO] --- maven-resources-plugin:3.3.1:resources (default-resources) @ org.eclipse.tracecompass.tmf.remote.ui.tests ---
14:20:29 [2024-06-19T18:20:29.011Z] [INFO] skip non existing resourceDirectory /home/jenkins/agent/workspace/tracecompass-master-nightly-2021-06/tmf/org.eclipse.tracecompass.tmf.remote.ui.tests/src/main/resources
14:20:29 [2024-06-19T18:20:29.011Z] [INFO] 
14:20:29 [2024-06-19T18:20:29.011Z] [INFO] --- tycho-compiler-plugin:2.7.5:compile (default-compile) @ org.eclipse.tracecompass.tmf.remote.ui.tests ---
14:20:29 [2024-06-19T18:20:29.011Z] [INFO] Compiling 4 source files to /home/jenkins/agent/workspace/tracecompass-master-nightly-2021-06/tmf/org.eclipse.tracecompass.tmf.remote.ui.tests/target/classes
14:20:29 [2024-06-19T18:20:29.267Z] [INFO] 
14:20:29 [2024-06-19T18:20:29.267Z] [INFO] --- maven-resources-plugin:3.3.1:testResources (default-testResources) @ org.eclipse.tracecompass.tmf.remote.ui.tests ---
14:20:29 [2024-06-19T18:20:29.267Z] [INFO] skip non existing resourceDirectory /home/jenkins/agent/workspace/tracecompass-master-nightly-2021-06/tmf/org.eclipse.tracecompass.tmf.remote.ui.tests/src/test/resources
14:20:29 [2024-06-19T18:20:29.267Z] [INFO] 
14:20:29 [2024-06-19T18:20:29.267Z] [INFO] --- tycho-packaging-plugin:2.7.5:update-consumer-pom (default-update-consumer-pom) @ org.eclipse.tracecompass.tmf.remote.ui.tests ---
14:20:29 [2024-06-19T18:20:29.267Z] [INFO] 
14:20:29 [2024-06-19T18:20:29.267Z] [INFO] --- tycho-source-plugin:2.7.5:plugin-source (plugin-source) @ org.eclipse.tracecompass.tmf.remote.ui.tests ---
14:20:29 [2024-06-19T18:20:29.267Z] [INFO] Building jar: /home/jenkins/agent/workspace/tracecompass-master-nightly-2021-06/tmf/org.eclipse.tracecompass.tmf.remote.ui.tests/target/org.eclipse.tracecompass.tmf.remote.ui.tests-1.0.3-SNAPSHOT-sources.jar
14:20:29 [2024-06-19T18:20:29.267Z] [INFO] 
14:20:29 [2024-06-19T18:20:29.267Z] [INFO] --- tycho-packaging-plugin:2.7.5:package-plugin (default-package-plugin) @ org.eclipse.tracecompass.tmf.remote.ui.tests ---
14:20:29 [2024-06-19T18:20:29.267Z] [INFO] Building jar: /home/jenkins/agent/workspace/tracecompass-master-nightly-2021-06/tmf/org.eclipse.tracecompass.tmf.remote.ui.tests/target/org.eclipse.tracecompass.tmf.remote.ui.tests-1.0.3-SNAPSHOT.jar
14:20:29 [2024-06-19T18:20:29.267Z] [INFO] 
14:20:29 [2024-06-19T18:20:29.267Z] [INFO] --- tycho-p2-plugin:2.7.5:p2-metadata-default (default-p2-metadata-default) @ org.eclipse.tracecompass.tmf.remote.ui.tests ---
14:20:29 [2024-06-19T18:20:29.267Z] [INFO] 
14:20:29 [2024-06-19T18:20:29.267Z] [INFO] --- tycho-source-plugin:2.7.5:feature-source (feature-source) @ org.eclipse.tracecompass.tmf.remote.ui.tests ---
14:20:29 [2024-06-19T18:20:29.267Z] [INFO] 
14:20:29 [2024-06-19T18:20:29.267Z] [INFO] --- tycho-p2-plugin:2.7.5:p2-metadata (p2-metadata) @ org.eclipse.tracecompass.tmf.remote.ui.tests ---
14:20:29 [2024-06-19T18:20:29.267Z] [INFO] 
14:20:29 [2024-06-19T18:20:29.267Z] [INFO] --- tycho-surefire-plugin:2.7.5:test (default-test) @ org.eclipse.tracecompass.tmf.remote.ui.tests ---
14:20:29 [2024-06-19T18:20:29.523Z] [INFO] Could not find a java toolchain of type jdk, using java from JAVA_HOME instead (/opt/tools/java/openjdk/jdk-17/latest/bin/java)
14:20:29 [2024-06-19T18:20:29.523Z] [INFO] Executing Test Runtime with timeout 0, logs (if any) will be placed at: /home/jenkins/agent/workspace/tracecompass-master-nightly-2021-06/tmf/org.eclipse.tracecompass.tmf.remote.ui.tests/target/work/data/.metadata/.log
14:20:29 [2024-06-19T18:20:29.523Z] [INFO] Command line:
14:20:29 [2024-06-19T18:20:29.523Z] 	[/opt/tools/java/openjdk/jdk-17/latest/bin/java, -Dosgi.noShutdown=false, -Dosgi.os=linux, -Dosgi.ws=gtk, -Dosgi.arch=x86_64, -Dorg.eclipse.swt.browser.DefaultType=mozilla, -Xms512m, -Xmx1024m, -Dosgi.clean=true, -jar, /home/jenkins/.m2/repository/p2/osgi/bundle/org.eclipse.equinox.launcher/1.6.200.v20210416-2027/org.eclipse.equinox.launcher-1.6.200.v20210416-2027.jar, -data, /home/jenkins/agent/workspace/tracecompass-master-nightly-2021-06/tmf/org.eclipse.tracecompass.tmf.remote.ui.tests/target/work/data, -install, /home/jenkins/agent/workspace/tracecompass-master-nightly-2021-06/tmf/org.eclipse.tracecompass.tmf.remote.ui.tests/target/work, -configuration, /home/jenkins/agent/workspace/tracecompass-master-nightly-2021-06/tmf/org.eclipse.tracecompass.tmf.remote.ui.tests/target/work/configuration, -application, org.eclipse.tycho.surefire.osgibooter.uitest, -testproperties, /home/jenkins/agent/workspace/tracecompass-master-nightly-2021-06/tmf/org.eclipse.tracecompass.tmf.remote.ui.tests/target/surefire.properties, -product, org.eclipse.platform.ide, -consoleLog]
14:20:29 [2024-06-19T18:20:29.523Z] Picked up _JAVA_OPTIONS: -Duser.home=/home/tracecompass
14:20:30 [2024-06-19T18:20:30.454Z] WARNING: A terminally deprecated method in java.lang.System has been called
14:20:30 [2024-06-19T18:20:30.454Z] WARNING: System::setSecurityManager has been called by org.eclipse.osgi.internal.framework.SystemBundleActivator (file:/home/jenkins/.m2/repository/p2/osgi/bundle/org.eclipse.osgi/3.16.300.v20210525-1715/org.eclipse.osgi-3.16.300.v20210525-1715.jar)
14:20:30 [2024-06-19T18:20:30.454Z] WARNING: Please consider reporting this to the maintainers of org.eclipse.osgi.internal.framework.SystemBundleActivator
14:20:30 [2024-06-19T18:20:30.454Z] WARNING: System::setSecurityManager will be removed in a future release
14:20:32 [2024-06-19T18:20:32.975Z] !SESSION 2024-06-19 18:20:29.647 -----------------------------------------------
14:20:32 [2024-06-19T18:20:32.975Z] eclipse.buildId=unknown
14:20:32 [2024-06-19T18:20:32.975Z] java.version=17.0.2
14:20:32 [2024-06-19T18:20:32.975Z] java.vendor=Oracle Corporation
14:20:32 [2024-06-19T18:20:32.975Z] BootLoader constants: OS=linux, ARCH=x86_64, WS=gtk, NL=en_US
14:20:32 [2024-06-19T18:20:32.975Z] Framework arguments:  -application org.eclipse.tycho.surefire.osgibooter.uitest -testproperties /home/jenkins/agent/workspace/tracecompass-master-nightly-2021-06/tmf/org.eclipse.tracecompass.tmf.remote.ui.tests/target/surefire.properties -product org.eclipse.platform.ide
14:20:32 [2024-06-19T18:20:32.975Z] Command-line arguments:  -data /home/jenkins/agent/workspace/tracecompass-master-nightly-2021-06/tmf/org.eclipse.tracecompass.tmf.remote.ui.tests/target/work/data -application org.eclipse.tycho.surefire.osgibooter.uitest -testproperties /home/jenkins/agent/workspace/tracecompass-master-nightly-2021-06/tmf/org.eclipse.tracecompass.tmf.remote.ui.tests/target/surefire.properties -product org.eclipse.platform.ide -consoleLog
14:20:32 [2024-06-19T18:20:32.975Z] 
14:20:32 [2024-06-19T18:20:32.975Z] !ENTRY org.eclipse.compare.win32 4 0 2024-06-19 18:20:32.424
14:20:32 [2024-06-19T18:20:32.975Z] !MESSAGE FrameworkEvent ERROR
14:20:32 [2024-06-19T18:20:32.975Z] !STACK 0
14:20:32 [2024-06-19T18:20:32.975Z] org.osgi.framework.BundleException: Could not resolve module: org.eclipse.compare.win32 [69]
14:20:32 [2024-06-19T18:20:32.975Z]   Unresolved requirement: Require-Capability: eclipse.platform; filter:="(osgi.os=win32)"
14:20:32 [2024-06-19T18:20:32.975Z] 
14:20:32 [2024-06-19T18:20:32.975Z] 	at org.eclipse.osgi.container.Module.start(Module.java:463)
14:20:32 [2024-06-19T18:20:32.975Z] 	at org.eclipse.osgi.container.ModuleContainer$ContainerStartLevel$2.run(ModuleContainer.java:1849)
14:20:32 [2024-06-19T18:20:32.976Z] 	at org.eclipse.osgi.internal.framework.EquinoxContainerAdaptor$1$1.execute(EquinoxContainerAdaptor.java:136)
14:20:32 [2024-06-19T18:20:32.976Z] 	at org.eclipse.osgi.container.ModuleContainer$ContainerStartLevel.incStartLevel(ModuleContainer.java:1842)
14:20:32 [2024-06-19T18:20:32.976Z] 	at org.eclipse.osgi.container.ModuleContainer$ContainerStartLevel.incStartLevel(ModuleContainer.java:1783)
14:20:32 [2024-06-19T18:20:32.976Z] 	at org.eclipse.osgi.container.ModuleContainer$ContainerStartLevel.doContainerStartLevel(ModuleContainer.java:1747)
14:20:32 [2024-06-19T18:20:32.976Z] 	at org.eclipse.osgi.container.ModuleContainer$ContainerStartLevel.dispatchEvent(ModuleContainer.java:1669)
14:20:32 [2024-06-19T18:20:32.976Z] 	at org.eclipse.osgi.container.ModuleContainer$ContainerStartLevel.dispatchEvent(ModuleContainer.java:1)
14:20:32 [2024-06-19T18:20:32.976Z] 	at org.eclipse.osgi.framework.eventmgr.EventManager.dispatchEvent(EventManager.java:234)
14:20:32 [2024-06-19T18:20:32.976Z] 	at org.eclipse.osgi.framework.eventmgr.EventManager$EventThread.run(EventManager.java:345)
14:20:32 [2024-06-19T18:20:32.976Z] 
14:20:32 [2024-06-19T18:20:32.976Z] !ENTRY org.eclipse.ecf.provider.filetransfer.httpclient45.win32 4 0 2024-06-19 18:20:32.636
14:20:32 [2024-06-19T18:20:32.976Z] !MESSAGE FrameworkEvent ERROR
14:20:32 [2024-06-19T18:20:32.976Z] !STACK 0
14:20:32 [2024-06-19T18:20:32.976Z] org.osgi.framework.BundleException: Could not resolve module: org.eclipse.ecf.provider.filetransfer.httpclient45.win32 [141]
14:20:32 [2024-06-19T18:20:32.976Z]   Unresolved requirement: Require-Capability: eclipse.platform; filter:="(osgi.os=win32)"
14:20:32 [2024-06-19T18:20:32.976Z]   Unresolved requirement: Import-Package: org.apache.http.impl.auth.win; version="[4.5.0,5.0.0)"
14:20:32 [2024-06-19T18:20:32.976Z]     -> Export-Package: org.apache.http.impl.auth.win; bundle-symbolic-name="org.apache.httpcomponents.httpclient.win"; bundle-version="4.5.13.v20210128-2225"; version="4.5.13"; x-internal:="true"; uses:="org.apache.http,org.apache.http.auth,org.apache.http.client,org.apache.http.impl.auth,org.apache.http.protocol,org.apache.http.util"
14:20:32 [2024-06-19T18:20:32.976Z]        org.apache.httpcomponents.httpclient.win [38]
14:20:32 [2024-06-19T18:20:32.976Z]          Unresolved requirement: Require-Capability: eclipse.platform; filter:="(osgi.os=win32)"
14:20:32 [2024-06-19T18:20:32.976Z] 
14:20:32 [2024-06-19T18:20:32.976Z] 	at org.eclipse.osgi.container.Module.start(Module.java:463)
14:20:32 [2024-06-19T18:20:32.976Z] 	at org.eclipse.osgi.container.ModuleContainer$ContainerStartLevel$2.run(ModuleContainer.java:1849)
14:20:32 [2024-06-19T18:20:32.976Z] 	at org.eclipse.osgi.internal.framework.EquinoxContainerAdaptor$1$1.execute(EquinoxContainerAdaptor.java:136)
14:20:32 [2024-06-19T18:20:32.976Z] 	at org.eclipse.osgi.container.ModuleContainer$ContainerStartLevel.incStartLevel(ModuleContainer.java:1842)
14:20:32 [2024-06-19T18:20:32.976Z] 	at org.eclipse.osgi.container.ModuleContainer$ContainerStartLevel.incStartLevel(ModuleContainer.java:1783)
14:20:32 [2024-06-19T18:20:32.976Z] 	at org.eclipse.osgi.container.ModuleContainer$ContainerStartLevel.doContainerStartLevel(ModuleContainer.java:1747)
14:20:32 [2024-06-19T18:20:32.976Z] 	at org.eclipse.osgi.container.ModuleContainer$ContainerStartLevel.dispatchEvent(ModuleContainer.java:1669)
14:20:32 [2024-06-19T18:20:32.976Z] 	at org.eclipse.osgi.container.ModuleContainer$ContainerStartLevel.dispatchEvent(ModuleContainer.java:1)
14:20:32 [2024-06-19T18:20:32.976Z] 	at org.eclipse.osgi.framework.eventmgr.EventManager.dispatchEvent(EventManager.java:234)
14:20:32 [2024-06-19T18:20:32.976Z] 	at org.eclipse.osgi.framework.eventmgr.EventManager$EventThread.run(EventManager.java:345)
14:20:33 [2024-06-19T18:20:33.231Z] SWT SessionManagerDBus: Failed to connect to org.gnome.SessionManager: Failed to execute child process “dbus-launch” (No such file or directory)
14:20:33 [2024-06-19T18:20:33.232Z] SWT SessionManagerDBus: Failed to connect to org.xfce.SessionManager: Failed to execute child process “dbus-launch” (No such file or directory)
14:20:38 [2024-06-19T18:20:38.479Z] Could not determine the accessibility bus address
14:20:38 [2024-06-19T18:20:38.479Z] 
14:20:38 [2024-06-19T18:20:38.479Z] !ENTRY org.eclipse.urischeme 4 0 2024-06-19 18:20:38.134
14:20:38 [2024-06-19T18:20:38.479Z] !MESSAGE Cannot run program "xdg-mime": error=2, No such file or directory
14:20:38 [2024-06-19T18:20:38.479Z] !STACK 0
14:20:38 [2024-06-19T18:20:38.479Z] java.io.IOException: Cannot run program "xdg-mime": error=2, No such file or directory
14:20:38 [2024-06-19T18:20:38.479Z] 	at java.base/java.lang.ProcessBuilder.start(ProcessBuilder.java:1143)
14:20:38 [2024-06-19T18:20:38.479Z] 	at java.base/java.lang.ProcessBuilder.start(ProcessBuilder.java:1073)
14:20:38 [2024-06-19T18:20:38.479Z] 	at org.eclipse.urischeme.internal.registration.ProcessExecutor.execute(ProcessExecutor.java:36)
14:20:38 [2024-06-19T18:20:38.479Z] 	at org.eclipse.urischeme.internal.registration.RegistrationLinux.getRegisteredDesktopFileForScheme(RegistrationLinux.java:145)
14:20:38 [2024-06-19T18:20:38.479Z] 	at org.eclipse.urischeme.internal.registration.RegistrationLinux.determineHandlerLocation(RegistrationLinux.java:87)
14:20:38 [2024-06-19T18:20:38.479Z] 	at org.eclipse.urischeme.internal.registration.RegistrationLinux.getSchemesInformation(RegistrationLinux.java:76)
14:20:38 [2024-06-19T18:20:38.479Z] 	at org.eclipse.urischeme.AutoRegisterSchemeHandlersJob.run(AutoRegisterSchemeHandlersJob.java:87)
14:20:38 [2024-06-19T18:20:38.479Z] 	at org.eclipse.core.internal.jobs.Worker.run(Worker.java:63)
14:20:38 [2024-06-19T18:20:38.479Z] Caused by: java.io.IOException: error=2, No such file or directory
14:20:38 [2024-06-19T18:20:38.479Z] 	at java.base/java.lang.ProcessImpl.forkAndExec(Native Method)
14:20:38 [2024-06-19T18:20:38.479Z] 	at java.base/java.lang.ProcessImpl.<init>(ProcessImpl.java:314)
14:20:38 [2024-06-19T18:20:38.479Z] 	at java.base/java.lang.ProcessImpl.start(ProcessImpl.java:244)
14:20:38 [2024-06-19T18:20:38.479Z] 	at java.base/java.lang.ProcessBuilder.start(ProcessBuilder.java:1110)
14:20:38 [2024-06-19T18:20:38.479Z] 	... 7 more
14:20:39 [2024-06-19T18:20:39.040Z] Running org.eclipse.tracecompass.tmf.remote.ui.tests.fetch.RemoteImportProfilesReaderTest
14:20:39 [2024-06-19T18:20:39.040Z] Tests run: 5, Failures: 0, Errors: 0, Skipped: 0, Time elapsed: 0.168 s - in org.eclipse.tracecompass.tmf.remote.ui.tests.fetch.RemoteImportProfilesReaderTest
14:20:39 [2024-06-19T18:20:39.040Z] testLoadElements  Time elapsed: 0.065 s
14:20:39 [2024-06-19T18:20:39.040Z] testValidateInvalidMissingFiles  Time elapsed: 0.087 s
14:20:39 [2024-06-19T18:20:39.040Z] testValidateInvalidEmptyProfile  Time elapsed: 0.003 s
14:20:39 [2024-06-19T18:20:39.040Z] testValidateInvalidMissingRoot  Time elapsed: 0.003 s
14:20:39 [2024-06-19T18:20:39.040Z] testValidateValid  Time elapsed: 0.003 s
14:20:39 [2024-06-19T18:20:39.040Z] Running org.eclipse.tracecompass.tmf.remote.ui.tests.fetch.RemoteImportProfilesWriterTest
14:20:39 [2024-06-19T18:20:39.297Z] Tests run: 1, Failures: 0, Errors: 0, Skipped: 0, Time elapsed: 0.089 s - in org.eclipse.tracecompass.tmf.remote.ui.tests.fetch.RemoteImportProfilesWriterTest
14:20:39 [2024-06-19T18:20:39.297Z] testValidateValid  Time elapsed: 0.088 s
14:20:39 [2024-06-19T18:20:39.297Z] 
14:20:39 [2024-06-19T18:20:39.297Z] Results:
14:20:39 [2024-06-19T18:20:39.297Z] 
14:20:39 [2024-06-19T18:20:39.297Z] Tests run: 6, Failures: 0, Errors: 0, Skipped: 0
14:20:39 [2024-06-19T18:20:39.297Z] 
14:20:40 [2024-06-19T18:20:40.225Z] [INFO] All tests passed!
14:20:40 [2024-06-19T18:20:40.225Z] [INFO] 
14:20:40 [2024-06-19T18:20:40.225Z] [INFO] --- maven-install-plugin:2.5.2:install (default-install) @ org.eclipse.tracecompass.tmf.remote.ui.tests ---
14:20:40 [2024-06-19T18:20:40.225Z] [INFO] Installing /home/jenkins/agent/workspace/tracecompass-master-nightly-2021-06/tmf/org.eclipse.tracecompass.tmf.remote.ui.tests/target/org.eclipse.tracecompass.tmf.remote.ui.tests-1.0.3-SNAPSHOT.jar to /home/jenkins/.m2/repository/org/eclipse/tracecompass/org.eclipse.tracecompass.tmf.remote.ui.tests/1.0.3-SNAPSHOT/org.eclipse.tracecompass.tmf.remote.ui.tests-1.0.3-SNAPSHOT.jar
14:20:40 [2024-06-19T18:20:40.225Z] [INFO] Installing /home/jenkins/agent/workspace/tracecompass-master-nightly-2021-06/tmf/org.eclipse.tracecompass.tmf.remote.ui.tests/.tycho-consumer-pom.xml to /home/jenkins/.m2/repository/org/eclipse/tracecompass/org.eclipse.tracecompass.tmf.remote.ui.tests/1.0.3-SNAPSHOT/org.eclipse.tracecompass.tmf.remote.ui.tests-1.0.3-SNAPSHOT.pom
14:20:40 [2024-06-19T18:20:40.225Z] [INFO] Installing /home/jenkins/agent/workspace/tracecompass-master-nightly-2021-06/tmf/org.eclipse.tracecompass.tmf.remote.ui.tests/target/org.eclipse.tracecompass.tmf.remote.ui.tests-1.0.3-SNAPSHOT-sources.jar to /home/jenkins/.m2/repository/org/eclipse/tracecompass/org.eclipse.tracecompass.tmf.remote.ui.tests/1.0.3-SNAPSHOT/org.eclipse.tracecompass.tmf.remote.ui.tests-1.0.3-SNAPSHOT-sources.jar
14:20:40 [2024-06-19T18:20:40.225Z] [INFO] Installing /home/jenkins/agent/workspace/tracecompass-master-nightly-2021-06/tmf/org.eclipse.tracecompass.tmf.remote.ui.tests/target/p2content.xml to /home/jenkins/.m2/repository/org/eclipse/tracecompass/org.eclipse.tracecompass.tmf.remote.ui.tests/1.0.3-SNAPSHOT/org.eclipse.tracecompass.tmf.remote.ui.tests-1.0.3-SNAPSHOT-p2metadata.xml
14:20:40 [2024-06-19T18:20:40.225Z] [INFO] Installing /home/jenkins/agent/workspace/tracecompass-master-nightly-2021-06/tmf/org.eclipse.tracecompass.tmf.remote.ui.tests/target/p2artifacts.xml to /home/jenkins/.m2/repository/org/eclipse/tracecompass/org.eclipse.tracecompass.tmf.remote.ui.tests/1.0.3-SNAPSHOT/org.eclipse.tracecompass.tmf.remote.ui.tests-1.0.3-SNAPSHOT-p2artifacts.xml
14:20:40 [2024-06-19T18:20:40.225Z] [INFO] 
14:20:40 [2024-06-19T18:20:40.226Z] [INFO] --- tycho-p2-plugin:2.7.5:update-local-index (default-update-local-index) @ org.eclipse.tracecompass.tmf.remote.ui.tests ---
14:20:40 [2024-06-19T18:20:40.226Z] [INFO] 
14:20:40 [2024-06-19T18:20:40.226Z] [INFO] -----< org.eclipse.tracecompass:org.eclipse.tracecompass.alltests >-----
14:20:40 [2024-06-19T18:20:40.226Z] [INFO] Building Trace Compass All Tests 1.0.13-SNAPSHOT               [136/141]
14:20:40 [2024-06-19T18:20:40.226Z] [INFO] ------------------------[ eclipse-test-plugin ]-------------------------
14:20:40 [2024-06-19T18:20:40.482Z] [INFO] 
14:20:40 [2024-06-19T18:20:40.482Z] [INFO] --- maven-clean-plugin:3.3.1:clean (default-clean) @ org.eclipse.tracecompass.alltests ---
14:20:40 [2024-06-19T18:20:40.482Z] [INFO] 
14:20:40 [2024-06-19T18:20:40.482Z] [INFO] --- tycho-packaging-plugin:2.7.5:build-qualifier (default-build-qualifier) @ org.eclipse.tracecompass.alltests ---
14:20:40 [2024-06-19T18:20:40.482Z] [INFO] The project's OSGi version is 1.0.13.202406191720
14:20:40 [2024-06-19T18:20:40.482Z] [INFO] 
14:20:40 [2024-06-19T18:20:40.482Z] [INFO] --- tycho-packaging-plugin:2.7.5:validate-id (default-validate-id) @ org.eclipse.tracecompass.alltests ---
14:20:40 [2024-06-19T18:20:40.482Z] [INFO] 
14:20:40 [2024-06-19T18:20:40.482Z] [INFO] --- tycho-packaging-plugin:2.7.5:validate-version (default-validate-version) @ org.eclipse.tracecompass.alltests ---
14:20:40 [2024-06-19T18:20:40.482Z] [INFO] 
14:20:40 [2024-06-19T18:20:40.482Z] [INFO] --- maven-enforcer-plugin:3.3.0:enforce (enforce-maven-version) @ org.eclipse.tracecompass.alltests ---
14:20:40 [2024-06-19T18:20:40.482Z] [INFO] 
14:20:40 [2024-06-19T18:20:40.482Z] [INFO] --- target-platform-configuration:2.7.5:target-platform (default-target-platform) @ org.eclipse.tracecompass.alltests ---
14:20:40 [2024-06-19T18:20:40.482Z] [INFO] 
14:20:40 [2024-06-19T18:20:40.482Z] [INFO] --- tycho-compiler-plugin:2.7.5:validate-classpath (default-validate-classpath) @ org.eclipse.tracecompass.alltests ---
14:20:40 [2024-06-19T18:20:40.482Z] [INFO] Resolving class path of Trace Compass All Tests...
14:20:41 [2024-06-19T18:20:41.053Z] [INFO] 
14:20:41 [2024-06-19T18:20:41.053Z] [INFO] --- maven-resources-plugin:3.3.1:resources (default-resources) @ org.eclipse.tracecompass.alltests ---
14:20:41 [2024-06-19T18:20:41.053Z] [INFO] skip non existing resourceDirectory /home/jenkins/agent/workspace/tracecompass-master-nightly-2021-06/releng/org.eclipse.tracecompass.alltests/src/main/resources
14:20:41 [2024-06-19T18:20:41.053Z] [INFO] 
14:20:41 [2024-06-19T18:20:41.053Z] [INFO] --- tycho-compiler-plugin:2.7.5:compile (default-compile) @ org.eclipse.tracecompass.alltests ---
14:20:41 [2024-06-19T18:20:41.053Z] [INFO] Compiling 8 source files to /home/jenkins/agent/workspace/tracecompass-master-nightly-2021-06/releng/org.eclipse.tracecompass.alltests/target/classes
14:20:41 [2024-06-19T18:20:41.615Z] [INFO] 
14:20:41 [2024-06-19T18:20:41.615Z] [INFO] --- maven-resources-plugin:3.3.1:testResources (default-testResources) @ org.eclipse.tracecompass.alltests ---
14:20:41 [2024-06-19T18:20:41.615Z] [INFO] skip non existing resourceDirectory /home/jenkins/agent/workspace/tracecompass-master-nightly-2021-06/releng/org.eclipse.tracecompass.alltests/src/test/resources
14:20:41 [2024-06-19T18:20:41.615Z] [INFO] 
14:20:41 [2024-06-19T18:20:41.615Z] [INFO] --- tycho-packaging-plugin:2.7.5:update-consumer-pom (default-update-consumer-pom) @ org.eclipse.tracecompass.alltests ---
14:20:41 [2024-06-19T18:20:41.615Z] [INFO] 
14:20:41 [2024-06-19T18:20:41.615Z] [INFO] --- tycho-source-plugin:2.7.5:plugin-source (plugin-source) @ org.eclipse.tracecompass.alltests ---
14:20:41 [2024-06-19T18:20:41.615Z] [INFO] Building jar: /home/jenkins/agent/workspace/tracecompass-master-nightly-2021-06/releng/org.eclipse.tracecompass.alltests/target/org.eclipse.tracecompass.alltests-1.0.13-SNAPSHOT-sources.jar
14:20:41 [2024-06-19T18:20:41.615Z] [INFO] 
14:20:41 [2024-06-19T18:20:41.615Z] [INFO] --- tycho-packaging-plugin:2.7.5:package-plugin (default-package-plugin) @ org.eclipse.tracecompass.alltests ---
14:20:41 [2024-06-19T18:20:41.615Z] [INFO] Building jar: /home/jenkins/agent/workspace/tracecompass-master-nightly-2021-06/releng/org.eclipse.tracecompass.alltests/target/org.eclipse.tracecompass.alltests-1.0.13-SNAPSHOT.jar
14:20:41 [2024-06-19T18:20:41.615Z] [INFO] 
14:20:41 [2024-06-19T18:20:41.615Z] [INFO] --- tycho-p2-plugin:2.7.5:p2-metadata-default (default-p2-metadata-default) @ org.eclipse.tracecompass.alltests ---
14:20:41 [2024-06-19T18:20:41.615Z] [INFO] 
14:20:41 [2024-06-19T18:20:41.615Z] [INFO] --- tycho-source-plugin:2.7.5:feature-source (feature-source) @ org.eclipse.tracecompass.alltests ---
14:20:41 [2024-06-19T18:20:41.615Z] [INFO] 
14:20:41 [2024-06-19T18:20:41.615Z] [INFO] --- tycho-p2-plugin:2.7.5:p2-metadata (p2-metadata) @ org.eclipse.tracecompass.alltests ---
14:20:41 [2024-06-19T18:20:41.615Z] [INFO] 
14:20:41 [2024-06-19T18:20:41.615Z] [INFO] --- tycho-surefire-plugin:2.7.5:test (default-test) @ org.eclipse.tracecompass.alltests ---
14:20:41 [2024-06-19T18:20:41.615Z] [WARNING] No tests found.
14:20:41 [2024-06-19T18:20:41.615Z] [INFO] 
14:20:41 [2024-06-19T18:20:41.615Z] [INFO] --- maven-install-plugin:2.5.2:install (default-install) @ org.eclipse.tracecompass.alltests ---
14:20:41 [2024-06-19T18:20:41.615Z] [INFO] Installing /home/jenkins/agent/workspace/tracecompass-master-nightly-2021-06/releng/org.eclipse.tracecompass.alltests/target/org.eclipse.tracecompass.alltests-1.0.13-SNAPSHOT.jar to /home/jenkins/.m2/repository/org/eclipse/tracecompass/org.eclipse.tracecompass.alltests/1.0.13-SNAPSHOT/org.eclipse.tracecompass.alltests-1.0.13-SNAPSHOT.jar
14:20:41 [2024-06-19T18:20:41.615Z] [INFO] Installing /home/jenkins/agent/workspace/tracecompass-master-nightly-2021-06/releng/org.eclipse.tracecompass.alltests/.tycho-consumer-pom.xml to /home/jenkins/.m2/repository/org/eclipse/tracecompass/org.eclipse.tracecompass.alltests/1.0.13-SNAPSHOT/org.eclipse.tracecompass.alltests-1.0.13-SNAPSHOT.pom
14:20:41 [2024-06-19T18:20:41.615Z] [INFO] Installing /home/jenkins/agent/workspace/tracecompass-master-nightly-2021-06/releng/org.eclipse.tracecompass.alltests/target/org.eclipse.tracecompass.alltests-1.0.13-SNAPSHOT-sources.jar to /home/jenkins/.m2/repository/org/eclipse/tracecompass/org.eclipse.tracecompass.alltests/1.0.13-SNAPSHOT/org.eclipse.tracecompass.alltests-1.0.13-SNAPSHOT-sources.jar
14:20:41 [2024-06-19T18:20:41.615Z] [INFO] Installing /home/jenkins/agent/workspace/tracecompass-master-nightly-2021-06/releng/org.eclipse.tracecompass.alltests/target/p2content.xml to /home/jenkins/.m2/repository/org/eclipse/tracecompass/org.eclipse.tracecompass.alltests/1.0.13-SNAPSHOT/org.eclipse.tracecompass.alltests-1.0.13-SNAPSHOT-p2metadata.xml
14:20:41 [2024-06-19T18:20:41.615Z] [INFO] Installing /home/jenkins/agent/workspace/tracecompass-master-nightly-2021-06/releng/org.eclipse.tracecompass.alltests/target/p2artifacts.xml to /home/jenkins/.m2/repository/org/eclipse/tracecompass/org.eclipse.tracecompass.alltests/1.0.13-SNAPSHOT/org.eclipse.tracecompass.alltests-1.0.13-SNAPSHOT-p2artifacts.xml
14:20:41 [2024-06-19T18:20:41.615Z] [INFO] 
14:20:41 [2024-06-19T18:20:41.615Z] [INFO] --- tycho-p2-plugin:2.7.5:update-local-index (default-update-local-index) @ org.eclipse.tracecompass.alltests ---
14:20:41 [2024-06-19T18:20:41.615Z] [INFO] 
14:20:41 [2024-06-19T18:20:41.615Z] [INFO] --< org.eclipse.tracecompass:org.eclipse.tracecompass.integration.core.tests >--
14:20:41 [2024-06-19T18:20:41.615Z] [INFO] Building org.eclipse.tracecompass.integration.core.tests 1.0.8-SNAPSHOT [137/141]
14:20:41 [2024-06-19T18:20:41.615Z] [INFO] ------------------------[ eclipse-test-plugin ]-------------------------
14:20:41 [2024-06-19T18:20:41.615Z] [INFO] 
14:20:41 [2024-06-19T18:20:41.615Z] [INFO] --- maven-clean-plugin:3.3.1:clean (default-clean) @ org.eclipse.tracecompass.integration.core.tests ---
14:20:41 [2024-06-19T18:20:41.615Z] [INFO] 
14:20:41 [2024-06-19T18:20:41.615Z] [INFO] --- tycho-packaging-plugin:2.7.5:build-qualifier (default-build-qualifier) @ org.eclipse.tracecompass.integration.core.tests ---
14:20:41 [2024-06-19T18:20:41.615Z] [INFO] The project's OSGi version is 1.0.8.202406191720
14:20:41 [2024-06-19T18:20:41.615Z] [INFO] 
14:20:41 [2024-06-19T18:20:41.615Z] [INFO] --- tycho-packaging-plugin:2.7.5:validate-id (default-validate-id) @ org.eclipse.tracecompass.integration.core.tests ---
14:20:41 [2024-06-19T18:20:41.615Z] [INFO] 
14:20:41 [2024-06-19T18:20:41.615Z] [INFO] --- tycho-packaging-plugin:2.7.5:validate-version (default-validate-version) @ org.eclipse.tracecompass.integration.core.tests ---
14:20:41 [2024-06-19T18:20:41.615Z] [INFO] 
14:20:41 [2024-06-19T18:20:41.615Z] [INFO] --- maven-enforcer-plugin:3.3.0:enforce (enforce-maven-version) @ org.eclipse.tracecompass.integration.core.tests ---
14:20:41 [2024-06-19T18:20:41.615Z] [INFO] 
14:20:41 [2024-06-19T18:20:41.615Z] [INFO] --- target-platform-configuration:2.7.5:target-platform (default-target-platform) @ org.eclipse.tracecompass.integration.core.tests ---
14:20:41 [2024-06-19T18:20:41.615Z] [INFO] 
14:20:41 [2024-06-19T18:20:41.615Z] [INFO] --- tycho-compiler-plugin:2.7.5:validate-classpath (default-validate-classpath) @ org.eclipse.tracecompass.integration.core.tests ---
14:20:41 [2024-06-19T18:20:41.615Z] [INFO] Resolving class path of org.eclipse.tracecompass.integration.core.tests...
14:20:41 [2024-06-19T18:20:41.615Z] [INFO] 
14:20:41 [2024-06-19T18:20:41.615Z] [INFO] --- maven-resources-plugin:3.3.1:resources (default-resources) @ org.eclipse.tracecompass.integration.core.tests ---
14:20:41 [2024-06-19T18:20:41.615Z] [INFO] skip non existing resourceDirectory /home/jenkins/agent/workspace/tracecompass-master-nightly-2021-06/releng/org.eclipse.tracecompass.integration.core.tests/src/main/resources
14:20:41 [2024-06-19T18:20:41.615Z] [INFO] 
14:20:41 [2024-06-19T18:20:41.616Z] [INFO] --- tycho-compiler-plugin:2.7.5:compile (default-compile) @ org.eclipse.tracecompass.integration.core.tests ---
14:20:41 [2024-06-19T18:20:41.616Z] [INFO] Compiling 1 source file to /home/jenkins/agent/workspace/tracecompass-master-nightly-2021-06/releng/org.eclipse.tracecompass.integration.core.tests/target/classes
14:20:41 [2024-06-19T18:20:41.871Z] [INFO] 
14:20:41 [2024-06-19T18:20:41.871Z] [INFO] --- maven-resources-plugin:3.3.1:testResources (default-testResources) @ org.eclipse.tracecompass.integration.core.tests ---
14:20:41 [2024-06-19T18:20:41.871Z] [INFO] skip non existing resourceDirectory /home/jenkins/agent/workspace/tracecompass-master-nightly-2021-06/releng/org.eclipse.tracecompass.integration.core.tests/src/test/resources
14:20:41 [2024-06-19T18:20:41.871Z] [INFO] 
14:20:41 [2024-06-19T18:20:41.871Z] [INFO] --- tycho-packaging-plugin:2.7.5:update-consumer-pom (default-update-consumer-pom) @ org.eclipse.tracecompass.integration.core.tests ---
14:20:41 [2024-06-19T18:20:41.871Z] [INFO] 
14:20:41 [2024-06-19T18:20:41.871Z] [INFO] --- tycho-source-plugin:2.7.5:plugin-source (plugin-source) @ org.eclipse.tracecompass.integration.core.tests ---
14:20:41 [2024-06-19T18:20:41.871Z] [INFO] Building jar: /home/jenkins/agent/workspace/tracecompass-master-nightly-2021-06/releng/org.eclipse.tracecompass.integration.core.tests/target/org.eclipse.tracecompass.integration.core.tests-1.0.8-SNAPSHOT-sources.jar
14:20:41 [2024-06-19T18:20:41.871Z] [INFO] 
14:20:41 [2024-06-19T18:20:41.871Z] [INFO] --- tycho-packaging-plugin:2.7.5:package-plugin (default-package-plugin) @ org.eclipse.tracecompass.integration.core.tests ---
14:20:42 [2024-06-19T18:20:42.800Z] [INFO] Building jar: /home/jenkins/agent/workspace/tracecompass-master-nightly-2021-06/releng/org.eclipse.tracecompass.integration.core.tests/target/org.eclipse.tracecompass.integration.core.tests-1.0.8-SNAPSHOT.jar
14:20:42 [2024-06-19T18:20:42.800Z] [INFO] 
14:20:42 [2024-06-19T18:20:42.800Z] [INFO] --- tycho-p2-plugin:2.7.5:p2-metadata-default (default-p2-metadata-default) @ org.eclipse.tracecompass.integration.core.tests ---
14:20:42 [2024-06-19T18:20:42.800Z] [INFO] 
14:20:42 [2024-06-19T18:20:42.800Z] [INFO] --- tycho-source-plugin:2.7.5:feature-source (feature-source) @ org.eclipse.tracecompass.integration.core.tests ---
14:20:42 [2024-06-19T18:20:42.800Z] [INFO] 
14:20:42 [2024-06-19T18:20:42.800Z] [INFO] --- tycho-p2-plugin:2.7.5:p2-metadata (p2-metadata) @ org.eclipse.tracecompass.integration.core.tests ---
14:20:42 [2024-06-19T18:20:42.800Z] [INFO] 
14:20:42 [2024-06-19T18:20:42.800Z] [INFO] --- tycho-surefire-plugin:2.7.5:test (default-test) @ org.eclipse.tracecompass.integration.core.tests ---
14:20:43 [2024-06-19T18:20:43.362Z] [INFO] Could not find a java toolchain of type jdk, using java from JAVA_HOME instead (/opt/tools/java/openjdk/jdk-17/latest/bin/java)
14:20:43 [2024-06-19T18:20:43.362Z] [INFO] Executing Test Runtime with timeout 0, logs (if any) will be placed at: /home/jenkins/agent/workspace/tracecompass-master-nightly-2021-06/releng/org.eclipse.tracecompass.integration.core.tests/target/work/data/.metadata/.log
14:20:43 [2024-06-19T18:20:43.362Z] [INFO] Command line:
14:20:43 [2024-06-19T18:20:43.362Z] 	[/opt/tools/java/openjdk/jdk-17/latest/bin/java, -Dosgi.noShutdown=false, -Dosgi.os=linux, -Dosgi.ws=gtk, -Dosgi.arch=x86_64, -Dorg.eclipse.swt.browser.DefaultType=mozilla, -Xms512m, -Xmx1024m, -Dosgi.clean=true, -jar, /home/jenkins/.m2/repository/p2/osgi/bundle/org.eclipse.equinox.launcher/1.6.200.v20210416-2027/org.eclipse.equinox.launcher-1.6.200.v20210416-2027.jar, -data, /home/jenkins/agent/workspace/tracecompass-master-nightly-2021-06/releng/org.eclipse.tracecompass.integration.core.tests/target/work/data, -install, /home/jenkins/agent/workspace/tracecompass-master-nightly-2021-06/releng/org.eclipse.tracecompass.integration.core.tests/target/work, -configuration, /home/jenkins/agent/workspace/tracecompass-master-nightly-2021-06/releng/org.eclipse.tracecompass.integration.core.tests/target/work/configuration, -application, org.eclipse.tycho.surefire.osgibooter.headlesstest, -testproperties, /home/jenkins/agent/workspace/tracecompass-master-nightly-2021-06/releng/org.eclipse.tracecompass.integration.core.tests/target/surefire.properties, -product, org.eclipse.platform.ide, -consoleLog]
14:20:43 [2024-06-19T18:20:43.362Z] Picked up _JAVA_OPTIONS: -Duser.home=/home/tracecompass
14:20:43 [2024-06-19T18:20:43.923Z] WARNING: A terminally deprecated method in java.lang.System has been called
14:20:43 [2024-06-19T18:20:43.923Z] WARNING: System::setSecurityManager has been called by org.eclipse.osgi.internal.framework.SystemBundleActivator (file:/home/jenkins/.m2/repository/p2/osgi/bundle/org.eclipse.osgi/3.16.300.v20210525-1715/org.eclipse.osgi-3.16.300.v20210525-1715.jar)
14:20:43 [2024-06-19T18:20:43.923Z] WARNING: Please consider reporting this to the maintainers of org.eclipse.osgi.internal.framework.SystemBundleActivator
14:20:43 [2024-06-19T18:20:43.923Z] WARNING: System::setSecurityManager will be removed in a future release
14:20:46 [2024-06-19T18:20:46.440Z] !SESSION 2024-06-19 18:20:43.331 -----------------------------------------------
14:20:46 [2024-06-19T18:20:46.440Z] eclipse.buildId=unknown
14:20:46 [2024-06-19T18:20:46.440Z] java.version=17.0.2
14:20:46 [2024-06-19T18:20:46.440Z] java.vendor=Oracle Corporation
14:20:46 [2024-06-19T18:20:46.440Z] BootLoader constants: OS=linux, ARCH=x86_64, WS=gtk, NL=en_US
14:20:46 [2024-06-19T18:20:46.440Z] Framework arguments:  -application org.eclipse.tycho.surefire.osgibooter.headlesstest -testproperties /home/jenkins/agent/workspace/tracecompass-master-nightly-2021-06/releng/org.eclipse.tracecompass.integration.core.tests/target/surefire.properties -product org.eclipse.platform.ide
14:20:46 [2024-06-19T18:20:46.440Z] Command-line arguments:  -data /home/jenkins/agent/workspace/tracecompass-master-nightly-2021-06/releng/org.eclipse.tracecompass.integration.core.tests/target/work/data -application org.eclipse.tycho.surefire.osgibooter.headlesstest -testproperties /home/jenkins/agent/workspace/tracecompass-master-nightly-2021-06/releng/org.eclipse.tracecompass.integration.core.tests/target/surefire.properties -product org.eclipse.platform.ide -consoleLog
14:20:46 [2024-06-19T18:20:46.440Z] 
14:20:46 [2024-06-19T18:20:46.440Z] !ENTRY org.eclipse.compare.win32 4 0 2024-06-19 18:20:46.219
14:20:46 [2024-06-19T18:20:46.440Z] !MESSAGE FrameworkEvent ERROR
14:20:46 [2024-06-19T18:20:46.440Z] !STACK 0
14:20:46 [2024-06-19T18:20:46.440Z] org.osgi.framework.BundleException: Could not resolve module: org.eclipse.compare.win32 [66]
14:20:46 [2024-06-19T18:20:46.440Z]   Unresolved requirement: Require-Capability: eclipse.platform; filter:="(osgi.os=win32)"
14:20:46 [2024-06-19T18:20:46.440Z] 
14:20:46 [2024-06-19T18:20:46.440Z] 	at org.eclipse.osgi.container.Module.start(Module.java:463)
14:20:46 [2024-06-19T18:20:46.440Z] 	at org.eclipse.osgi.container.ModuleContainer$ContainerStartLevel$2.run(ModuleContainer.java:1849)
14:20:46 [2024-06-19T18:20:46.440Z] 	at org.eclipse.osgi.internal.framework.EquinoxContainerAdaptor$1$1.execute(EquinoxContainerAdaptor.java:136)
14:20:46 [2024-06-19T18:20:46.440Z] 	at org.eclipse.osgi.container.ModuleContainer$ContainerStartLevel.incStartLevel(ModuleContainer.java:1842)
14:20:46 [2024-06-19T18:20:46.440Z] 	at org.eclipse.osgi.container.ModuleContainer$ContainerStartLevel.incStartLevel(ModuleContainer.java:1783)
14:20:46 [2024-06-19T18:20:46.440Z] 	at org.eclipse.osgi.container.ModuleContainer$ContainerStartLevel.doContainerStartLevel(ModuleContainer.java:1747)
14:20:46 [2024-06-19T18:20:46.440Z] 	at org.eclipse.osgi.container.ModuleContainer$ContainerStartLevel.dispatchEvent(ModuleContainer.java:1669)
14:20:46 [2024-06-19T18:20:46.440Z] 	at org.eclipse.osgi.container.ModuleContainer$ContainerStartLevel.dispatchEvent(ModuleContainer.java:1)
14:20:46 [2024-06-19T18:20:46.440Z] 	at org.eclipse.osgi.framework.eventmgr.EventManager.dispatchEvent(EventManager.java:234)
14:20:46 [2024-06-19T18:20:46.440Z] 	at org.eclipse.osgi.framework.eventmgr.EventManager$EventThread.run(EventManager.java:345)
14:20:46 [2024-06-19T18:20:46.440Z] 
14:20:46 [2024-06-19T18:20:46.440Z] !ENTRY org.eclipse.ecf.provider.filetransfer.httpclient45.win32 4 0 2024-06-19 18:20:46.429
14:20:46 [2024-06-19T18:20:46.440Z] !MESSAGE FrameworkEvent ERROR
14:20:46 [2024-06-19T18:20:46.697Z] !STACK 0
14:20:46 [2024-06-19T18:20:46.697Z] org.osgi.framework.BundleException: Could not resolve module: org.eclipse.ecf.provider.filetransfer.httpclient45.win32 [138]
14:20:46 [2024-06-19T18:20:46.697Z]   Unresolved requirement: Require-Capability: eclipse.platform; filter:="(osgi.os=win32)"
14:20:46 [2024-06-19T18:20:46.697Z]   Unresolved requirement: Import-Package: org.apache.http.impl.auth.win; version="[4.5.0,5.0.0)"
14:20:46 [2024-06-19T18:20:46.697Z]     -> Export-Package: org.apache.http.impl.auth.win; bundle-symbolic-name="org.apache.httpcomponents.httpclient.win"; bundle-version="4.5.13.v20210128-2225"; version="4.5.13"; x-internal:="true"; uses:="org.apache.http,org.apache.http.auth,org.apache.http.client,org.apache.http.impl.auth,org.apache.http.protocol,org.apache.http.util"
14:20:46 [2024-06-19T18:20:46.697Z]        org.apache.httpcomponents.httpclient.win [37]
14:20:46 [2024-06-19T18:20:46.697Z]          Unresolved requirement: Require-Capability: eclipse.platform; filter:="(osgi.os=win32)"
14:20:46 [2024-06-19T18:20:46.697Z] 
14:20:46 [2024-06-19T18:20:46.697Z] 	at org.eclipse.osgi.container.Module.start(Module.java:463)
14:20:46 [2024-06-19T18:20:46.697Z] 	at org.eclipse.osgi.container.ModuleContainer$ContainerStartLevel$2.run(ModuleContainer.java:1849)
14:20:46 [2024-06-19T18:20:46.697Z] 	at org.eclipse.osgi.internal.framework.EquinoxContainerAdaptor$1$1.execute(EquinoxContainerAdaptor.java:136)
14:20:46 [2024-06-19T18:20:46.697Z] 	at org.eclipse.osgi.container.ModuleContainer$ContainerStartLevel.incStartLevel(ModuleContainer.java:1842)
14:20:46 [2024-06-19T18:20:46.697Z] 	at org.eclipse.osgi.container.ModuleContainer$ContainerStartLevel.incStartLevel(ModuleContainer.java:1783)
14:20:46 [2024-06-19T18:20:46.697Z] 	at org.eclipse.osgi.container.ModuleContainer$ContainerStartLevel.doContainerStartLevel(ModuleContainer.java:1747)
14:20:46 [2024-06-19T18:20:46.697Z] 	at org.eclipse.osgi.container.ModuleContainer$ContainerStartLevel.dispatchEvent(ModuleContainer.java:1669)
14:20:46 [2024-06-19T18:20:46.697Z] 	at org.eclipse.osgi.container.ModuleContainer$ContainerStartLevel.dispatchEvent(ModuleContainer.java:1)
14:20:46 [2024-06-19T18:20:46.697Z] 	at org.eclipse.osgi.framework.eventmgr.EventManager.dispatchEvent(EventManager.java:234)
14:20:46 [2024-06-19T18:20:46.697Z] 	at org.eclipse.osgi.framework.eventmgr.EventManager$EventThread.run(EventManager.java:345)
14:20:48 [2024-06-19T18:20:48.064Z] Running org.eclipse.tracecompass.integration.core.tests.dataproviders.DataProviderManagerTest
14:21:09 [2024-06-19T18:21:09.952Z] Tests run: 2, Failures: 0, Errors: 0, Skipped: 0, Time elapsed: 18.968 s - in org.eclipse.tracecompass.integration.core.tests.dataproviders.DataProviderManagerTest
14:21:09 [2024-06-19T18:21:09.952Z] test  Time elapsed: 0.007 s
14:21:09 [2024-06-19T18:21:09.952Z] testGetter  Time elapsed: 0.005 s
14:21:09 [2024-06-19T18:21:09.952Z] 
14:21:09 [2024-06-19T18:21:09.952Z] Results:
14:21:09 [2024-06-19T18:21:09.952Z] 
14:21:09 [2024-06-19T18:21:09.952Z] Tests run: 2, Failures: 0, Errors: 0, Skipped: 0
14:21:09 [2024-06-19T18:21:09.952Z] 
14:21:09 [2024-06-19T18:21:09.952Z] [INFO] All tests passed!
14:21:09 [2024-06-19T18:21:09.952Z] [INFO] 
14:21:09 [2024-06-19T18:21:09.952Z] [INFO] --- maven-install-plugin:2.5.2:install (default-install) @ org.eclipse.tracecompass.integration.core.tests ---
14:21:09 [2024-06-19T18:21:09.952Z] [INFO] Installing /home/jenkins/agent/workspace/tracecompass-master-nightly-2021-06/releng/org.eclipse.tracecompass.integration.core.tests/target/org.eclipse.tracecompass.integration.core.tests-1.0.8-SNAPSHOT.jar to /home/jenkins/.m2/repository/org/eclipse/tracecompass/org.eclipse.tracecompass.integration.core.tests/1.0.8-SNAPSHOT/org.eclipse.tracecompass.integration.core.tests-1.0.8-SNAPSHOT.jar
14:21:09 [2024-06-19T18:21:09.952Z] [INFO] Installing /home/jenkins/agent/workspace/tracecompass-master-nightly-2021-06/releng/org.eclipse.tracecompass.integration.core.tests/.tycho-consumer-pom.xml to /home/jenkins/.m2/repository/org/eclipse/tracecompass/org.eclipse.tracecompass.integration.core.tests/1.0.8-SNAPSHOT/org.eclipse.tracecompass.integration.core.tests-1.0.8-SNAPSHOT.pom
14:21:09 [2024-06-19T18:21:09.953Z] [INFO] Installing /home/jenkins/agent/workspace/tracecompass-master-nightly-2021-06/releng/org.eclipse.tracecompass.integration.core.tests/target/org.eclipse.tracecompass.integration.core.tests-1.0.8-SNAPSHOT-sources.jar to /home/jenkins/.m2/repository/org/eclipse/tracecompass/org.eclipse.tracecompass.integration.core.tests/1.0.8-SNAPSHOT/org.eclipse.tracecompass.integration.core.tests-1.0.8-SNAPSHOT-sources.jar
14:21:09 [2024-06-19T18:21:09.953Z] [INFO] Installing /home/jenkins/agent/workspace/tracecompass-master-nightly-2021-06/releng/org.eclipse.tracecompass.integration.core.tests/target/p2content.xml to /home/jenkins/.m2/repository/org/eclipse/tracecompass/org.eclipse.tracecompass.integration.core.tests/1.0.8-SNAPSHOT/org.eclipse.tracecompass.integration.core.tests-1.0.8-SNAPSHOT-p2metadata.xml
14:21:09 [2024-06-19T18:21:09.953Z] [INFO] Installing /home/jenkins/agent/workspace/tracecompass-master-nightly-2021-06/releng/org.eclipse.tracecompass.integration.core.tests/target/p2artifacts.xml to /home/jenkins/.m2/repository/org/eclipse/tracecompass/org.eclipse.tracecompass.integration.core.tests/1.0.8-SNAPSHOT/org.eclipse.tracecompass.integration.core.tests-1.0.8-SNAPSHOT-p2artifacts.xml
14:21:09 [2024-06-19T18:21:09.953Z] [INFO] 
14:21:09 [2024-06-19T18:21:09.953Z] [INFO] --- tycho-p2-plugin:2.7.5:update-local-index (default-update-local-index) @ org.eclipse.tracecompass.integration.core.tests ---
14:21:09 [2024-06-19T18:21:09.953Z] [INFO] 
14:21:09 [2024-06-19T18:21:09.953Z] [INFO] -----< org.eclipse.tracecompass:org.eclipse.tracecompass.testing >------
14:21:09 [2024-06-19T18:21:09.953Z] [INFO] Building org.eclipse.tracecompass.testing 10.0.0-SNAPSHOT      [138/141]
14:21:09 [2024-06-19T18:21:09.953Z] [INFO] --------------------------[ eclipse-feature ]---------------------------
14:21:09 [2024-06-19T18:21:09.953Z] [INFO] 
14:21:09 [2024-06-19T18:21:09.953Z] [INFO] --- maven-clean-plugin:3.3.1:clean (default-clean) @ org.eclipse.tracecompass.testing ---
14:21:09 [2024-06-19T18:21:09.953Z] [INFO] Deleting /home/jenkins/agent/workspace/tracecompass-master-nightly-2021-06/releng/org.eclipse.tracecompass.testing/target
14:21:09 [2024-06-19T18:21:09.953Z] [INFO] 
14:21:09 [2024-06-19T18:21:09.953Z] [INFO] --- tycho-packaging-plugin:2.7.5:build-qualifier-aggregator (default-build-qualifier-aggregator) @ org.eclipse.tracecompass.testing ---
14:21:09 [2024-06-19T18:21:09.953Z] [INFO] The project's OSGi version is 10.0.0.202406191720
14:21:09 [2024-06-19T18:21:09.953Z] [INFO] 
14:21:09 [2024-06-19T18:21:09.953Z] [INFO] --- tycho-packaging-plugin:2.7.5:validate-id (default-validate-id) @ org.eclipse.tracecompass.testing ---
14:21:09 [2024-06-19T18:21:09.953Z] [INFO] 
14:21:09 [2024-06-19T18:21:09.953Z] [INFO] --- tycho-packaging-plugin:2.7.5:validate-version (default-validate-version) @ org.eclipse.tracecompass.testing ---
14:21:09 [2024-06-19T18:21:09.953Z] [INFO] 
14:21:09 [2024-06-19T18:21:09.953Z] [INFO] --- maven-enforcer-plugin:3.3.0:enforce (enforce-maven-version) @ org.eclipse.tracecompass.testing ---
14:21:09 [2024-06-19T18:21:09.953Z] [INFO] 
14:21:09 [2024-06-19T18:21:09.953Z] [INFO] --- target-platform-configuration:2.7.5:target-platform (default-target-platform) @ org.eclipse.tracecompass.testing ---
14:21:09 [2024-06-19T18:21:09.953Z] [INFO] 
14:21:09 [2024-06-19T18:21:09.953Z] [INFO] --- tycho-packaging-plugin:2.7.5:update-consumer-pom (default-update-consumer-pom) @ org.eclipse.tracecompass.testing ---
14:21:09 [2024-06-19T18:21:09.953Z] [INFO] 
14:21:09 [2024-06-19T18:21:09.953Z] [INFO] --- tycho-source-plugin:2.7.5:plugin-source (plugin-source) @ org.eclipse.tracecompass.testing ---
14:21:09 [2024-06-19T18:21:09.953Z] [INFO] 
14:21:09 [2024-06-19T18:21:09.953Z] [INFO] --- tycho-packaging-plugin:2.7.5:package-feature (default-package-feature) @ org.eclipse.tracecompass.testing ---
14:21:09 [2024-06-19T18:21:09.953Z] [INFO] Building jar: /home/jenkins/agent/workspace/tracecompass-master-nightly-2021-06/releng/org.eclipse.tracecompass.testing/target/org.eclipse.tracecompass.testing-10.0.0-SNAPSHOT.jar
14:21:09 [2024-06-19T18:21:09.953Z] [INFO] 
14:21:09 [2024-06-19T18:21:09.953Z] [INFO] --- tycho-p2-plugin:2.7.5:p2-metadata-default (default-p2-metadata-default) @ org.eclipse.tracecompass.testing ---
14:21:09 [2024-06-19T18:21:09.953Z] [INFO] 
14:21:09 [2024-06-19T18:21:09.953Z] [INFO] --- tycho-p2-plugin:2.7.5:feature-p2-metadata (default-feature-p2-metadata) @ org.eclipse.tracecompass.testing ---
14:21:09 [2024-06-19T18:21:09.953Z] [INFO] 
14:21:09 [2024-06-19T18:21:09.953Z] [INFO] --- tycho-source-plugin:2.7.5:feature-source (feature-source) @ org.eclipse.tracecompass.testing ---
14:21:09 [2024-06-19T18:21:09.953Z] [INFO] Building jar: /home/jenkins/agent/workspace/tracecompass-master-nightly-2021-06/releng/org.eclipse.tracecompass.testing/target/org.eclipse.tracecompass.testing-10.0.0-SNAPSHOT-sources-feature.jar
14:21:09 [2024-06-19T18:21:09.953Z] [INFO] 
14:21:09 [2024-06-19T18:21:09.953Z] [INFO] --- tycho-p2-plugin:2.7.5:p2-metadata (p2-metadata) @ org.eclipse.tracecompass.testing ---
14:21:09 [2024-06-19T18:21:09.953Z] [INFO] 
14:21:09 [2024-06-19T18:21:09.953Z] [INFO] --- maven-install-plugin:2.5.2:install (default-install) @ org.eclipse.tracecompass.testing ---
14:21:09 [2024-06-19T18:21:09.953Z] [INFO] Installing /home/jenkins/agent/workspace/tracecompass-master-nightly-2021-06/releng/org.eclipse.tracecompass.testing/target/org.eclipse.tracecompass.testing-10.0.0-SNAPSHOT.jar to /home/jenkins/.m2/repository/org/eclipse/tracecompass/org.eclipse.tracecompass.testing/10.0.0-SNAPSHOT/org.eclipse.tracecompass.testing-10.0.0-SNAPSHOT.jar
14:21:09 [2024-06-19T18:21:09.953Z] [INFO] Installing /home/jenkins/agent/workspace/tracecompass-master-nightly-2021-06/releng/org.eclipse.tracecompass.testing/.tycho-consumer-pom.xml to /home/jenkins/.m2/repository/org/eclipse/tracecompass/org.eclipse.tracecompass.testing/10.0.0-SNAPSHOT/org.eclipse.tracecompass.testing-10.0.0-SNAPSHOT.pom
14:21:09 [2024-06-19T18:21:09.953Z] [INFO] Installing /home/jenkins/agent/workspace/tracecompass-master-nightly-2021-06/releng/org.eclipse.tracecompass.testing/target/org.eclipse.tracecompass.testing-10.0.0-SNAPSHOT-sources-feature.jar to /home/jenkins/.m2/repository/org/eclipse/tracecompass/org.eclipse.tracecompass.testing/10.0.0-SNAPSHOT/org.eclipse.tracecompass.testing-10.0.0-SNAPSHOT-sources-feature.jar
14:21:09 [2024-06-19T18:21:09.953Z] [INFO] Installing /home/jenkins/agent/workspace/tracecompass-master-nightly-2021-06/releng/org.eclipse.tracecompass.testing/target/p2content.xml to /home/jenkins/.m2/repository/org/eclipse/tracecompass/org.eclipse.tracecompass.testing/10.0.0-SNAPSHOT/org.eclipse.tracecompass.testing-10.0.0-SNAPSHOT-p2metadata.xml
14:21:09 [2024-06-19T18:21:09.953Z] [INFO] Installing /home/jenkins/agent/workspace/tracecompass-master-nightly-2021-06/releng/org.eclipse.tracecompass.testing/target/p2artifacts.xml to /home/jenkins/.m2/repository/org/eclipse/tracecompass/org.eclipse.tracecompass.testing/10.0.0-SNAPSHOT/org.eclipse.tracecompass.testing-10.0.0-SNAPSHOT-p2artifacts.xml
14:21:09 [2024-06-19T18:21:09.953Z] [INFO] 
14:21:09 [2024-06-19T18:21:09.953Z] [INFO] --- tycho-p2-plugin:2.7.5:update-local-index (default-update-local-index) @ org.eclipse.tracecompass.testing ---
14:21:09 [2024-06-19T18:21:09.953Z] [INFO] 
14:21:09 [2024-06-19T18:21:09.953Z] [INFO] ----< org.eclipse.tracecompass:org.eclipse.tracecompass.tmf.remote >----
14:21:09 [2024-06-19T18:21:09.953Z] [INFO] Building org.eclipse.tracecompass.tmf.remote 10.0.0-SNAPSHOT   [139/141]
14:21:09 [2024-06-19T18:21:09.953Z] [INFO] --------------------------[ eclipse-feature ]---------------------------
14:21:09 [2024-06-19T18:21:09.953Z] [INFO] 
14:21:09 [2024-06-19T18:21:09.953Z] [INFO] --- maven-clean-plugin:3.3.1:clean (default-clean) @ org.eclipse.tracecompass.tmf.remote ---
14:21:09 [2024-06-19T18:21:09.953Z] [INFO] Deleting /home/jenkins/agent/workspace/tracecompass-master-nightly-2021-06/tmf/org.eclipse.tracecompass.tmf.remote/target
14:21:09 [2024-06-19T18:21:09.953Z] [INFO] 
14:21:09 [2024-06-19T18:21:09.953Z] [INFO] --- tycho-packaging-plugin:2.7.5:build-qualifier-aggregator (default-build-qualifier-aggregator) @ org.eclipse.tracecompass.tmf.remote ---
14:21:09 [2024-06-19T18:21:09.953Z] [INFO] The project's OSGi version is 10.0.0.202406191720
14:21:09 [2024-06-19T18:21:09.953Z] [INFO] 
14:21:09 [2024-06-19T18:21:09.953Z] [INFO] --- tycho-packaging-plugin:2.7.5:validate-id (default-validate-id) @ org.eclipse.tracecompass.tmf.remote ---
14:21:09 [2024-06-19T18:21:09.953Z] [INFO] 
14:21:09 [2024-06-19T18:21:09.953Z] [INFO] --- tycho-packaging-plugin:2.7.5:validate-version (default-validate-version) @ org.eclipse.tracecompass.tmf.remote ---
14:21:09 [2024-06-19T18:21:09.953Z] [INFO] 
14:21:09 [2024-06-19T18:21:09.953Z] [INFO] --- maven-enforcer-plugin:3.3.0:enforce (enforce-maven-version) @ org.eclipse.tracecompass.tmf.remote ---
14:21:09 [2024-06-19T18:21:09.953Z] [INFO] 
14:21:09 [2024-06-19T18:21:09.953Z] [INFO] --- target-platform-configuration:2.7.5:target-platform (default-target-platform) @ org.eclipse.tracecompass.tmf.remote ---
14:21:09 [2024-06-19T18:21:09.953Z] [INFO] 
14:21:09 [2024-06-19T18:21:09.953Z] [INFO] --- tycho-packaging-plugin:2.7.5:update-consumer-pom (default-update-consumer-pom) @ org.eclipse.tracecompass.tmf.remote ---
14:21:09 [2024-06-19T18:21:09.953Z] [INFO] 
14:21:09 [2024-06-19T18:21:09.953Z] [INFO] --- tycho-source-plugin:2.7.5:plugin-source (plugin-source) @ org.eclipse.tracecompass.tmf.remote ---
14:21:09 [2024-06-19T18:21:09.953Z] [INFO] 
14:21:09 [2024-06-19T18:21:09.953Z] [INFO] --- tycho-packaging-plugin:2.7.5:package-feature (default-package-feature) @ org.eclipse.tracecompass.tmf.remote ---
14:21:09 [2024-06-19T18:21:09.953Z] [INFO] Building jar: /home/jenkins/agent/workspace/tracecompass-master-nightly-2021-06/tmf/org.eclipse.tracecompass.tmf.remote/target/org.eclipse.tracecompass.tmf.remote-10.0.0-SNAPSHOT.jar
14:21:09 [2024-06-19T18:21:09.953Z] [INFO] 
14:21:09 [2024-06-19T18:21:09.953Z] [INFO] --- tycho-p2-plugin:2.7.5:p2-metadata-default (default-p2-metadata-default) @ org.eclipse.tracecompass.tmf.remote ---
14:21:09 [2024-06-19T18:21:09.953Z] [INFO] 
14:21:09 [2024-06-19T18:21:09.953Z] [INFO] --- tycho-p2-plugin:2.7.5:feature-p2-metadata (default-feature-p2-metadata) @ org.eclipse.tracecompass.tmf.remote ---
14:21:09 [2024-06-19T18:21:09.953Z] [INFO] 
14:21:09 [2024-06-19T18:21:09.953Z] [INFO] --- tycho-source-plugin:2.7.5:feature-source (feature-source) @ org.eclipse.tracecompass.tmf.remote ---
14:21:09 [2024-06-19T18:21:09.953Z] [INFO] Building jar: /home/jenkins/agent/workspace/tracecompass-master-nightly-2021-06/tmf/org.eclipse.tracecompass.tmf.remote/target/org.eclipse.tracecompass.tmf.remote-10.0.0-SNAPSHOT-sources-feature.jar
14:21:09 [2024-06-19T18:21:09.953Z] [INFO] 
14:21:09 [2024-06-19T18:21:09.953Z] [INFO] --- tycho-p2-plugin:2.7.5:p2-metadata (p2-metadata) @ org.eclipse.tracecompass.tmf.remote ---
14:21:09 [2024-06-19T18:21:09.953Z] [INFO] 
14:21:09 [2024-06-19T18:21:09.953Z] [INFO] --- maven-install-plugin:2.5.2:install (default-install) @ org.eclipse.tracecompass.tmf.remote ---
14:21:09 [2024-06-19T18:21:09.953Z] [INFO] Installing /home/jenkins/agent/workspace/tracecompass-master-nightly-2021-06/tmf/org.eclipse.tracecompass.tmf.remote/target/org.eclipse.tracecompass.tmf.remote-10.0.0-SNAPSHOT.jar to /home/jenkins/.m2/repository/org/eclipse/tracecompass/org.eclipse.tracecompass.tmf.remote/10.0.0-SNAPSHOT/org.eclipse.tracecompass.tmf.remote-10.0.0-SNAPSHOT.jar
14:21:09 [2024-06-19T18:21:09.954Z] [INFO] Installing /home/jenkins/agent/workspace/tracecompass-master-nightly-2021-06/tmf/org.eclipse.tracecompass.tmf.remote/.tycho-consumer-pom.xml to /home/jenkins/.m2/repository/org/eclipse/tracecompass/org.eclipse.tracecompass.tmf.remote/10.0.0-SNAPSHOT/org.eclipse.tracecompass.tmf.remote-10.0.0-SNAPSHOT.pom
14:21:09 [2024-06-19T18:21:09.954Z] [INFO] Installing /home/jenkins/agent/workspace/tracecompass-master-nightly-2021-06/tmf/org.eclipse.tracecompass.tmf.remote/target/org.eclipse.tracecompass.tmf.remote-10.0.0-SNAPSHOT-sources-feature.jar to /home/jenkins/.m2/repository/org/eclipse/tracecompass/org.eclipse.tracecompass.tmf.remote/10.0.0-SNAPSHOT/org.eclipse.tracecompass.tmf.remote-10.0.0-SNAPSHOT-sources-feature.jar
14:21:09 [2024-06-19T18:21:09.954Z] [INFO] Installing /home/jenkins/agent/workspace/tracecompass-master-nightly-2021-06/tmf/org.eclipse.tracecompass.tmf.remote/target/p2content.xml to /home/jenkins/.m2/repository/org/eclipse/tracecompass/org.eclipse.tracecompass.tmf.remote/10.0.0-SNAPSHOT/org.eclipse.tracecompass.tmf.remote-10.0.0-SNAPSHOT-p2metadata.xml
14:21:09 [2024-06-19T18:21:09.954Z] [INFO] Installing /home/jenkins/agent/workspace/tracecompass-master-nightly-2021-06/tmf/org.eclipse.tracecompass.tmf.remote/target/p2artifacts.xml to /home/jenkins/.m2/repository/org/eclipse/tracecompass/org.eclipse.tracecompass.tmf.remote/10.0.0-SNAPSHOT/org.eclipse.tracecompass.tmf.remote-10.0.0-SNAPSHOT-p2artifacts.xml
14:21:09 [2024-06-19T18:21:09.954Z] [INFO] 
14:21:09 [2024-06-19T18:21:09.954Z] [INFO] --- tycho-p2-plugin:2.7.5:update-local-index (default-update-local-index) @ org.eclipse.tracecompass.tmf.remote ---
14:21:09 [2024-06-19T18:21:09.954Z] [INFO] 
14:21:09 [2024-06-19T18:21:09.954Z] [INFO] ---< org.eclipse.tracecompass:org.eclipse.tracecompass.releng-site >----
14:21:09 [2024-06-19T18:21:09.954Z] [INFO] Building Trace Compass Repository 10.0.0-SNAPSHOT              [140/141]
14:21:09 [2024-06-19T18:21:09.954Z] [INFO] -------------------------[ eclipse-repository ]-------------------------
14:21:09 [2024-06-19T18:21:09.954Z] [INFO] 
14:21:09 [2024-06-19T18:21:09.954Z] [INFO] --- maven-clean-plugin:3.3.1:clean (default-clean) @ org.eclipse.tracecompass.releng-site ---
14:21:09 [2024-06-19T18:21:09.954Z] [INFO] 
14:21:09 [2024-06-19T18:21:09.954Z] [INFO] --- tycho-packaging-plugin:2.7.5:build-qualifier-aggregator (default-build-qualifier-aggregator) @ org.eclipse.tracecompass.releng-site ---
14:21:09 [2024-06-19T18:21:09.954Z] [INFO] The project's OSGi version is 10.0.0.202406191720
14:21:09 [2024-06-19T18:21:09.954Z] [INFO] 
14:21:09 [2024-06-19T18:21:09.954Z] [INFO] --- maven-enforcer-plugin:3.3.0:enforce (enforce-maven-version) @ org.eclipse.tracecompass.releng-site ---
14:21:09 [2024-06-19T18:21:09.954Z] [INFO] 
14:21:09 [2024-06-19T18:21:09.954Z] [INFO] --- maven-clean-plugin:3.3.1:clean (default-clean-1) @ org.eclipse.tracecompass.releng-site ---
14:21:09 [2024-06-19T18:21:09.954Z] [INFO] 
14:21:09 [2024-06-19T18:21:09.954Z] [INFO] --- target-platform-configuration:2.7.5:target-platform (default-target-platform) @ org.eclipse.tracecompass.releng-site ---
14:21:09 [2024-06-19T18:21:09.954Z] [INFO] 
14:21:09 [2024-06-19T18:21:09.954Z] [INFO] --- maven-resources-plugin:3.3.1:resources (default-resources) @ org.eclipse.tracecompass.releng-site ---
14:21:09 [2024-06-19T18:21:09.954Z] [INFO] skip non existing resourceDirectory /home/jenkins/agent/workspace/tracecompass-master-nightly-2021-06/releng/org.eclipse.tracecompass.releng-site/src/main/resources
14:21:09 [2024-06-19T18:21:09.954Z] [INFO] 
14:21:09 [2024-06-19T18:21:09.954Z] [INFO] --- tycho-p2-publisher-plugin:2.7.5:publish-osgi-ee (default-publish-osgi-ee) @ org.eclipse.tracecompass.releng-site ---
14:21:09 [2024-06-19T18:21:09.954Z] [INFO] Published profile IUs: [a.jre.javase 11.0.0]
14:21:09 [2024-06-19T18:21:09.954Z] [INFO] Published profile IUs: [a.jre.javase 17.0.0]
14:21:09 [2024-06-19T18:21:09.954Z] [INFO] Published profile IUs: [a.jre.javase 18.0.0]
14:21:09 [2024-06-19T18:21:09.954Z] [INFO] 
14:21:09 [2024-06-19T18:21:09.954Z] [INFO] --- tycho-p2-publisher-plugin:2.7.5:publish-products (default-publish-products) @ org.eclipse.tracecompass.releng-site ---
14:21:09 [2024-06-19T18:21:09.954Z] [INFO] 
14:21:09 [2024-06-19T18:21:09.954Z] [INFO] --- tycho-p2-publisher-plugin:2.7.5:publish-categories (default-publish-categories) @ org.eclipse.tracecompass.releng-site ---
14:21:09 [2024-06-19T18:21:09.954Z] [INFO] 
14:21:09 [2024-06-19T18:21:09.954Z] [INFO] --- tycho-p2-publisher-plugin:2.7.5:attach-artifacts (default-attach-artifacts) @ org.eclipse.tracecompass.releng-site ---
14:21:09 [2024-06-19T18:21:09.954Z] [INFO] 
14:21:09 [2024-06-19T18:21:09.954Z] [INFO] --- tycho-p2-repository-plugin:2.7.5:assemble-repository (default-assemble-repository) @ org.eclipse.tracecompass.releng-site ---
14:21:09 [2024-06-19T18:21:09.954Z] [INFO] Fetching org.eclipse.cdt.dsf.gdb.ui_2.7.200.202104042017.jar from https://archive.eclipse.org/tools/cdt/releases/10.3/cdt-10.3.0/plugins/ (909.84kB)
14:21:09 [2024-06-19T18:21:09.954Z] [INFO] Fetching org.eclipse.cdt.dsf.ui_2.6.200.202105230425.jar from https://archive.eclipse.org/tools/cdt/releases/10.3/cdt-10.3.0/plugins/ (1.43MB)
14:21:09 [2024-06-19T18:21:09.954Z] [INFO] Fetching org.eclipse.tm.terminal.control_5.2.0.202105240049.jar from https://archive.eclipse.org/tools/cdt/releases/10.3/cdt-10.3.0/plugins/ (211.1kB)
14:21:14 [2024-06-19T18:21:14.124Z] [INFO] 
14:21:14 [2024-06-19T18:21:14.124Z] [INFO] --- tycho-source-plugin:2.7.5:plugin-source (plugin-source) @ org.eclipse.tracecompass.releng-site ---
14:21:14 [2024-06-19T18:21:14.124Z] [INFO] 
14:21:14 [2024-06-19T18:21:14.124Z] [INFO] --- tycho-p2-repository-plugin:2.7.5:archive-repository (default-archive-repository) @ org.eclipse.tracecompass.releng-site ---
14:21:14 [2024-06-19T18:21:14.124Z] [INFO] 
14:21:14 [2024-06-19T18:21:14.124Z] [INFO] --- tycho-source-plugin:2.7.5:feature-source (feature-source) @ org.eclipse.tracecompass.releng-site ---
14:21:14 [2024-06-19T18:21:14.124Z] [INFO] 
14:21:14 [2024-06-19T18:21:14.124Z] [INFO] --- tycho-p2-plugin:2.7.5:p2-metadata (p2-metadata) @ org.eclipse.tracecompass.releng-site ---
14:21:14 [2024-06-19T18:21:14.124Z] [INFO] 
14:21:14 [2024-06-19T18:21:14.124Z] [INFO] --- maven-install-plugin:2.5.2:install (default-install) @ org.eclipse.tracecompass.releng-site ---
14:21:14 [2024-06-19T18:21:14.124Z] [INFO] No primary artifact to install, installing attached artifacts instead.
14:21:14 [2024-06-19T18:21:14.124Z] [INFO] Installing /home/jenkins/agent/workspace/tracecompass-master-nightly-2021-06/releng/org.eclipse.tracecompass.releng-site/pom.xml to /home/jenkins/.m2/repository/org/eclipse/tracecompass/org.eclipse.tracecompass.releng-site/10.0.0-SNAPSHOT/org.eclipse.tracecompass.releng-site-10.0.0-SNAPSHOT.pom
14:21:14 [2024-06-19T18:21:14.124Z] [INFO] Installing /home/jenkins/agent/workspace/tracecompass-master-nightly-2021-06/releng/org.eclipse.tracecompass.releng-site/target/p2content.xml to /home/jenkins/.m2/repository/org/eclipse/tracecompass/org.eclipse.tracecompass.releng-site/10.0.0-SNAPSHOT/org.eclipse.tracecompass.releng-site-10.0.0-SNAPSHOT-p2metadata.xml
14:21:14 [2024-06-19T18:21:14.124Z] [INFO] Installing /home/jenkins/agent/workspace/tracecompass-master-nightly-2021-06/releng/org.eclipse.tracecompass.releng-site/target/p2artifacts.xml to /home/jenkins/.m2/repository/org/eclipse/tracecompass/org.eclipse.tracecompass.releng-site/10.0.0-SNAPSHOT/org.eclipse.tracecompass.releng-site-10.0.0-SNAPSHOT-p2artifacts.xml
14:21:14 [2024-06-19T18:21:14.124Z] [INFO] 
14:21:14 [2024-06-19T18:21:14.124Z] [INFO] --- tycho-p2-plugin:2.7.5:update-local-index (default-update-local-index) @ org.eclipse.tracecompass.releng-site ---
14:21:14 [2024-06-19T18:21:14.124Z] [INFO] 
14:21:14 [2024-06-19T18:21:14.124Z] [INFO] --< org.eclipse.tracecompass:org.eclipse.tracecompass.jsontrace.core.tests >--
14:21:14 [2024-06-19T18:21:14.124Z] [INFO] Building org.eclipse.tracecompass.jsontrace.core.tests 1.0.4-SNAPSHOT [141/141]
14:21:14 [2024-06-19T18:21:14.124Z] [INFO] ---------------------------[ eclipse-plugin ]---------------------------
14:21:14 [2024-06-19T18:21:14.124Z] [INFO] 
14:21:14 [2024-06-19T18:21:14.124Z] [INFO] --- maven-clean-plugin:3.3.1:clean (default-clean) @ org.eclipse.tracecompass.jsontrace.core.tests ---
14:21:14 [2024-06-19T18:21:14.124Z] [INFO] 
14:21:14 [2024-06-19T18:21:14.124Z] [INFO] --- tycho-packaging-plugin:2.7.5:build-qualifier (default-build-qualifier) @ org.eclipse.tracecompass.jsontrace.core.tests ---
14:21:14 [2024-06-19T18:21:14.124Z] [INFO] The project's OSGi version is 1.0.4.202406191720
14:21:14 [2024-06-19T18:21:14.124Z] [INFO] 
14:21:14 [2024-06-19T18:21:14.124Z] [INFO] --- tycho-packaging-plugin:2.7.5:validate-id (default-validate-id) @ org.eclipse.tracecompass.jsontrace.core.tests ---
14:21:14 [2024-06-19T18:21:14.124Z] [INFO] 
14:21:14 [2024-06-19T18:21:14.124Z] [INFO] --- tycho-packaging-plugin:2.7.5:validate-version (default-validate-version) @ org.eclipse.tracecompass.jsontrace.core.tests ---
14:21:14 [2024-06-19T18:21:14.124Z] [INFO] 
14:21:14 [2024-06-19T18:21:14.124Z] [INFO] --- maven-enforcer-plugin:3.3.0:enforce (enforce-maven-version) @ org.eclipse.tracecompass.jsontrace.core.tests ---
14:21:14 [2024-06-19T18:21:14.124Z] [INFO] 
14:21:14 [2024-06-19T18:21:14.124Z] [INFO] --- target-platform-configuration:2.7.5:target-platform (default-target-platform) @ org.eclipse.tracecompass.jsontrace.core.tests ---
14:21:14 [2024-06-19T18:21:14.124Z] [INFO] 
14:21:14 [2024-06-19T18:21:14.124Z] [INFO] --- tycho-compiler-plugin:2.7.5:validate-classpath (default-validate-classpath) @ org.eclipse.tracecompass.jsontrace.core.tests ---
14:21:14 [2024-06-19T18:21:14.124Z] [INFO] Resolving class path of org.eclipse.tracecompass.jsontrace.core.tests...
14:21:14 [2024-06-19T18:21:14.124Z] [INFO] 
14:21:14 [2024-06-19T18:21:14.124Z] [INFO] --- maven-resources-plugin:3.3.1:resources (default-resources) @ org.eclipse.tracecompass.jsontrace.core.tests ---
14:21:14 [2024-06-19T18:21:14.124Z] [INFO] skip non existing resourceDirectory /home/jenkins/agent/workspace/tracecompass-master-nightly-2021-06/jsontrace/org.eclipse.tracecompass.jsontrace.core.tests/src/main/resources
14:21:14 [2024-06-19T18:21:14.124Z] [INFO] 
14:21:14 [2024-06-19T18:21:14.124Z] [INFO] --- tycho-compiler-plugin:2.7.5:compile (default-compile) @ org.eclipse.tracecompass.jsontrace.core.tests ---
14:21:14 [2024-06-19T18:21:14.124Z] [INFO] Compiling 3 source files to /home/jenkins/agent/workspace/tracecompass-master-nightly-2021-06/jsontrace/org.eclipse.tracecompass.jsontrace.core.tests/target/classes
14:21:14 [2024-06-19T18:21:14.124Z] [INFO] 
14:21:14 [2024-06-19T18:21:14.124Z] [INFO] --- tycho-ds-plugin:2.7.5:declarative-services (default-declarative-services) @ org.eclipse.tracecompass.jsontrace.core.tests ---
14:21:14 [2024-06-19T18:21:14.124Z] [INFO] 
14:21:14 [2024-06-19T18:21:14.124Z] [INFO] --- maven-resources-plugin:3.3.1:testResources (default-testResources) @ org.eclipse.tracecompass.jsontrace.core.tests ---
14:21:14 [2024-06-19T18:21:14.124Z] [INFO] skip non existing resourceDirectory /home/jenkins/agent/workspace/tracecompass-master-nightly-2021-06/jsontrace/org.eclipse.tracecompass.jsontrace.core.tests/src/test/resources
14:21:14 [2024-06-19T18:21:14.124Z] [INFO] 
14:21:14 [2024-06-19T18:21:14.124Z] [INFO] --- tycho-compiler-plugin:2.7.5:testCompile (default-testCompile) @ org.eclipse.tracecompass.jsontrace.core.tests ---
14:21:14 [2024-06-19T18:21:14.124Z] [INFO] 
14:21:14 [2024-06-19T18:21:14.124Z] [INFO] --- maven-surefire-plugin:2.22.2:test (default-test) @ org.eclipse.tracecompass.jsontrace.core.tests ---
14:21:14 [2024-06-19T18:21:14.124Z] [INFO] No tests to run.
14:21:14 [2024-06-19T18:21:14.124Z] [INFO] 
14:21:14 [2024-06-19T18:21:14.124Z] [INFO] --- tycho-packaging-plugin:2.7.5:update-consumer-pom (default-update-consumer-pom) @ org.eclipse.tracecompass.jsontrace.core.tests ---
14:21:14 [2024-06-19T18:21:14.124Z] [INFO] 
14:21:14 [2024-06-19T18:21:14.124Z] [INFO] --- tycho-source-plugin:2.7.5:plugin-source (plugin-source) @ org.eclipse.tracecompass.jsontrace.core.tests ---
14:21:14 [2024-06-19T18:21:14.124Z] [INFO] Building jar: /home/jenkins/agent/workspace/tracecompass-master-nightly-2021-06/jsontrace/org.eclipse.tracecompass.jsontrace.core.tests/target/org.eclipse.tracecompass.jsontrace.core.tests-1.0.4-SNAPSHOT-sources.jar
14:21:14 [2024-06-19T18:21:14.124Z] [INFO] 
14:21:14 [2024-06-19T18:21:14.124Z] [INFO] --- tycho-packaging-plugin:2.7.5:package-plugin (default-package-plugin) @ org.eclipse.tracecompass.jsontrace.core.tests ---
14:21:14 [2024-06-19T18:21:14.124Z] [INFO] Building jar: /home/jenkins/agent/workspace/tracecompass-master-nightly-2021-06/jsontrace/org.eclipse.tracecompass.jsontrace.core.tests/target/org.eclipse.tracecompass.jsontrace.core.tests-1.0.4-SNAPSHOT.jar
14:21:14 [2024-06-19T18:21:14.124Z] [INFO] 
14:21:14 [2024-06-19T18:21:14.124Z] [INFO] --- tycho-p2-plugin:2.7.5:p2-metadata-default (default-p2-metadata-default) @ org.eclipse.tracecompass.jsontrace.core.tests ---
14:21:14 [2024-06-19T18:21:14.124Z] [INFO] 
14:21:14 [2024-06-19T18:21:14.124Z] [INFO] --- tycho-source-plugin:2.7.5:feature-source (feature-source) @ org.eclipse.tracecompass.jsontrace.core.tests ---
14:21:14 [2024-06-19T18:21:14.124Z] [INFO] 
14:21:14 [2024-06-19T18:21:14.124Z] [INFO] --- tycho-p2-plugin:2.7.5:p2-metadata (p2-metadata) @ org.eclipse.tracecompass.jsontrace.core.tests ---
14:21:14 [2024-06-19T18:21:14.124Z] [INFO] 
14:21:14 [2024-06-19T18:21:14.124Z] [INFO] --- tycho-surefire-plugin:2.7.5:integration-test (default-integration-test) @ org.eclipse.tracecompass.jsontrace.core.tests ---
14:21:14 [2024-06-19T18:21:14.124Z] [INFO] 
14:21:14 [2024-06-19T18:21:14.124Z] [INFO] --- maven-failsafe-plugin:2.22.2:verify (default-verify) @ org.eclipse.tracecompass.jsontrace.core.tests ---
14:21:14 [2024-06-19T18:21:14.124Z] [INFO] No tests to run.
14:21:14 [2024-06-19T18:21:14.124Z] [INFO] 
14:21:14 [2024-06-19T18:21:14.124Z] [INFO] --- maven-install-plugin:2.5.2:install (default-install) @ org.eclipse.tracecompass.jsontrace.core.tests ---
14:21:14 [2024-06-19T18:21:14.124Z] [INFO] Installing /home/jenkins/agent/workspace/tracecompass-master-nightly-2021-06/jsontrace/org.eclipse.tracecompass.jsontrace.core.tests/target/org.eclipse.tracecompass.jsontrace.core.tests-1.0.4-SNAPSHOT.jar to /home/jenkins/.m2/repository/org/eclipse/tracecompass/org.eclipse.tracecompass.jsontrace.core.tests/1.0.4-SNAPSHOT/org.eclipse.tracecompass.jsontrace.core.tests-1.0.4-SNAPSHOT.jar
14:21:14 [2024-06-19T18:21:14.124Z] [INFO] Installing /home/jenkins/agent/workspace/tracecompass-master-nightly-2021-06/jsontrace/org.eclipse.tracecompass.jsontrace.core.tests/.tycho-consumer-pom.xml to /home/jenkins/.m2/repository/org/eclipse/tracecompass/org.eclipse.tracecompass.jsontrace.core.tests/1.0.4-SNAPSHOT/org.eclipse.tracecompass.jsontrace.core.tests-1.0.4-SNAPSHOT.pom
14:21:14 [2024-06-19T18:21:14.124Z] [INFO] Installing /home/jenkins/agent/workspace/tracecompass-master-nightly-2021-06/jsontrace/org.eclipse.tracecompass.jsontrace.core.tests/target/org.eclipse.tracecompass.jsontrace.core.tests-1.0.4-SNAPSHOT-sources.jar to /home/jenkins/.m2/repository/org/eclipse/tracecompass/org.eclipse.tracecompass.jsontrace.core.tests/1.0.4-SNAPSHOT/org.eclipse.tracecompass.jsontrace.core.tests-1.0.4-SNAPSHOT-sources.jar
14:21:14 [2024-06-19T18:21:14.124Z] [INFO] Installing /home/jenkins/agent/workspace/tracecompass-master-nightly-2021-06/jsontrace/org.eclipse.tracecompass.jsontrace.core.tests/target/p2content.xml to /home/jenkins/.m2/repository/org/eclipse/tracecompass/org.eclipse.tracecompass.jsontrace.core.tests/1.0.4-SNAPSHOT/org.eclipse.tracecompass.jsontrace.core.tests-1.0.4-SNAPSHOT-p2metadata.xml
14:21:14 [2024-06-19T18:21:14.124Z] [INFO] Installing /home/jenkins/agent/workspace/tracecompass-master-nightly-2021-06/jsontrace/org.eclipse.tracecompass.jsontrace.core.tests/target/p2artifacts.xml to /home/jenkins/.m2/repository/org/eclipse/tracecompass/org.eclipse.tracecompass.jsontrace.core.tests/1.0.4-SNAPSHOT/org.eclipse.tracecompass.jsontrace.core.tests-1.0.4-SNAPSHOT-p2artifacts.xml
14:21:14 [2024-06-19T18:21:14.124Z] [INFO] 
14:21:14 [2024-06-19T18:21:14.124Z] [INFO] --- tycho-p2-plugin:2.7.5:update-local-index (default-update-local-index) @ org.eclipse.tracecompass.jsontrace.core.tests ---
14:21:14 [2024-06-19T18:21:14.124Z] [INFO] ------------------------------------------------------------------------
14:21:14 [2024-06-19T18:21:14.124Z] [INFO] Reactor Summary:
14:21:14 [2024-06-19T18:21:14.124Z] [INFO] 
14:21:14 [2024-06-19T18:21:14.124Z] [INFO] Trace Compass Parent 10.0.0-SNAPSHOT ............... SUCCESS [  5.345 s]
14:21:14 [2024-06-19T18:21:14.124Z] [INFO] Trace Compass Tracetype-agnostic Analyses Parent 10.0.0-SNAPSHOT SUCCESS [  0.006 s]
14:21:14 [2024-06-19T18:21:14.124Z] [INFO] Trace Compass Common Utilities Parent 10.0.0-SNAPSHOT SUCCESS [  0.005 s]
14:21:14 [2024-06-19T18:21:14.124Z] [INFO] org.eclipse.tracecompass.common.core 5.2.0-SNAPSHOT  SUCCESS [ 18.398 s]
14:21:14 [2024-06-19T18:21:14.124Z] [INFO] Trace Compass State System Parent 10.0.0-SNAPSHOT .. SUCCESS [  0.006 s]
14:21:14 [2024-06-19T18:21:14.124Z] [INFO] org.eclipse.tracecompass.datastore.core 1.3.0-SNAPSHOT SUCCESS [  1.506 s]
14:21:14 [2024-06-19T18:21:14.125Z] [INFO] org.eclipse.tracecompass.segmentstore.core 3.1.0-SNAPSHOT SUCCESS [  1.097 s]
14:21:14 [2024-06-19T18:21:14.125Z] [INFO] org.eclipse.tracecompass.statesystem.core 5.3.1-SNAPSHOT SUCCESS [  1.825 s]
14:21:14 [2024-06-19T18:21:14.125Z] [INFO] Trace Compass TMF Parent 10.0.0-SNAPSHOT ........... SUCCESS [  0.006 s]
14:21:14 [2024-06-19T18:21:14.125Z] [INFO] Trace Compass Filter Parser 1.1.1-SNAPSHOT ......... SUCCESS [  0.559 s]
14:21:14 [2024-06-19T18:21:14.125Z] [INFO] org.eclipse.tracecompass.tmf.core 9.3.0-SNAPSHOT ... SUCCESS [  6.409 s]
14:21:14 [2024-06-19T18:21:14.125Z] [INFO] org.eclipse.tracecompass.analysis.counters.core 2.2.1-SNAPSHOT SUCCESS [  0.602 s]
14:21:14 [2024-06-19T18:21:14.125Z] [INFO] org.eclipse.tracecompass.common.core.tests 1.1.12-SNAPSHOT SUCCESS [ 10.435 s]
14:21:14 [2024-06-19T18:21:14.125Z] [INFO] Trace Compass CTF Support Parent 10.0.0-SNAPSHOT ... SUCCESS [  0.007 s]
14:21:14 [2024-06-19T18:21:14.125Z] [INFO] Trace Compass CTF Parser Plug-in 1.1.1-SNAPSHOT .... SUCCESS [  3.780 s]
14:21:14 [2024-06-19T18:21:14.125Z] [INFO] org.eclipse.tracecompass.ctf.core 4.5.0-SNAPSHOT ... SUCCESS [  1.786 s]
14:21:14 [2024-06-19T18:21:14.125Z] [INFO] Trace Compass CTF Core Tests Plug-in 1.0.16-SNAPSHOT SUCCESS [ 55.192 s]
14:21:14 [2024-06-19T18:21:14.125Z] [INFO] org.eclipse.tracecompass.statesystem.core.tests 1.0.16-SNAPSHOT SUCCESS [ 11.497 s]
14:21:14 [2024-06-19T18:21:14.125Z] [INFO] org.eclipse.tracecompass.tmf.core.tests 1.0.25-SNAPSHOT SUCCESS [05:35 min]
14:21:14 [2024-06-19T18:21:14.125Z] [INFO] org.eclipse.tracecompass.tmf.ctf.core 4.5.1-SNAPSHOT SUCCESS [  0.679 s]
14:21:14 [2024-06-19T18:21:14.125Z] [INFO] org.eclipse.tracecompass.tmf.ctf.core.tests 1.0.17-SNAPSHOT SUCCESS [04:32 min]
14:21:14 [2024-06-19T18:21:14.125Z] [INFO] org.eclipse.tracecompass.analysis.counters.core.tests 1.0.3-SNAPSHOT SUCCESS [  5.606 s]
14:21:14 [2024-06-19T18:21:14.125Z] [INFO] org.eclipse.tracecompass.tmf.ui 9.0.4-SNAPSHOT ..... SUCCESS [  9.313 s]
14:21:14 [2024-06-19T18:21:14.125Z] [INFO] org.eclipse.tracecompass.analysis.counters.ui 2.1.0-SNAPSHOT SUCCESS [  0.733 s]
14:21:14 [2024-06-19T18:21:14.125Z] [INFO] Trace Compass Release Engineering Parent 10.0.0-SNAPSHOT SUCCESS [  0.004 s]
14:21:14 [2024-06-19T18:21:14.125Z] [INFO] org.eclipse.tracecompass.slf4j.binding.simple.properties 1.0.1-SNAPSHOT SUCCESS [  0.118 s]
14:21:14 [2024-06-19T18:21:14.125Z] [INFO] org.eclipse.tracecompass.tmf.ui.tests 1.0.21-SNAPSHOT SUCCESS [03:06 min]
14:21:14 [2024-06-19T18:21:14.125Z] [INFO] org.eclipse.tracecompass.tmf.ui.swtbot.tests 1.0.22-SNAPSHOT SUCCESS [05:13 min]
14:21:14 [2024-06-19T18:21:14.125Z] [INFO] org.eclipse.tracecompass.analysis.graph.core 5.0.0-SNAPSHOT SUCCESS [  1.017 s]
14:21:14 [2024-06-19T18:21:14.125Z] [INFO] org.eclipse.tracecompass.tmf.chart.core 1.1.0-SNAPSHOT SUCCESS [  0.402 s]
14:21:14 [2024-06-19T18:21:14.125Z] [INFO] org.eclipse.tracecompass.analysis.lami.core 1.2.1-SNAPSHOT SUCCESS [  0.857 s]
14:21:14 [2024-06-19T18:21:14.125Z] [INFO] org.eclipse.tracecompass.analysis.timing.core 6.0.0-SNAPSHOT SUCCESS [  0.832 s]
14:21:14 [2024-06-19T18:21:14.125Z] [INFO] org.eclipse.tracecompass.analysis.os.linux.core 9.0.0-SNAPSHOT SUCCESS [  1.903 s]
14:21:14 [2024-06-19T18:21:14.125Z] [INFO] org.eclipse.tracecompass.analysis.profiling.core 2.5.0-SNAPSHOT SUCCESS [  1.603 s]
14:21:14 [2024-06-19T18:21:14.125Z] [INFO] Trace Compass LTTng Support Parent 10.0.0-SNAPSHOT . SUCCESS [  0.056 s]
14:21:14 [2024-06-19T18:21:14.125Z] [INFO] org.eclipse.tracecompass.lttng2.common.core 1.2.0-SNAPSHOT SUCCESS [  0.310 s]
14:21:14 [2024-06-19T18:21:14.125Z] [INFO] org.eclipse.tracecompass.tmf.analysis.xml.core 4.2.0-SNAPSHOT SUCCESS [  1.714 s]
14:21:14 [2024-06-19T18:21:14.125Z] [INFO] org.eclipse.tracecompass.lttng2.kernel.core 3.1.2-SNAPSHOT SUCCESS [  0.699 s]
14:21:14 [2024-06-19T18:21:14.125Z] [INFO] org.eclipse.tracecompass.analysis.counters.ui.swtbot.tests 1.0.3-SNAPSHOT SUCCESS [01:18 min]
14:21:14 [2024-06-19T18:21:14.125Z] [INFO] org.eclipse.tracecompass.analysis.graph.core.tests 1.0.9-SNAPSHOT SUCCESS [  7.998 s]
14:21:14 [2024-06-19T18:21:14.125Z] [INFO] org.eclipse.tracecompass.analysis.graph.ui 1.1.0-SNAPSHOT SUCCESS [  0.739 s]
14:21:14 [2024-06-19T18:21:14.125Z] [INFO] org.eclipse.tracecompass.analysis.lami.core.tests 1.0.5-SNAPSHOT SUCCESS [  5.654 s]
14:21:14 [2024-06-19T18:21:14.125Z] [INFO] org.eclipse.tracecompass.tmf.chart.ui 1.1.0-SNAPSHOT SUCCESS [  1.275 s]
14:21:14 [2024-06-19T18:21:14.125Z] [INFO] org.eclipse.tracecompass.analysis.lami.ui 1.2.0-SNAPSHOT SUCCESS [  0.888 s]
14:21:14 [2024-06-19T18:21:14.125Z] [INFO] org.eclipse.tracecompass.tmf.chart.core.tests 1.0.4-SNAPSHOT SUCCESS [  5.550 s]
14:21:14 [2024-06-19T18:21:14.125Z] [INFO] org.eclipse.tracecompass.tmf.chart.ui.swtbot.tests 1.0.7-SNAPSHOT SUCCESS [ 15.006 s]
14:21:14 [2024-06-19T18:21:14.125Z] [INFO] org.eclipse.tracecompass.analysis.lami.ui.swtbot.tests 1.0.7-SNAPSHOT SUCCESS [ 25.482 s]
14:21:14 [2024-06-19T18:21:14.125Z] [INFO] org.eclipse.tracecompass.analysis.os.linux.core.tests 1.0.18-SNAPSHOT SUCCESS [02:01 min]
14:21:14 [2024-06-19T18:21:14.125Z] [INFO] org.eclipse.tracecompass.analysis.timing.ui 6.1.1-SNAPSHOT SUCCESS [  0.965 s]
14:21:14 [2024-06-19T18:21:14.125Z] [INFO] org.eclipse.tracecompass.analysis.os.linux.ui 4.1.3-SNAPSHOT SUCCESS [  1.425 s]
14:21:14 [2024-06-19T18:21:14.125Z] [INFO] org.eclipse.tracecompass.analysis.os.linux.ui.tests 1.0.10-SNAPSHOT SUCCESS [ 12.067 s]
14:21:14 [2024-06-19T18:21:14.125Z] [INFO] org.eclipse.tracecompass.analysis.timing.core.tests 1.0.12-SNAPSHOT SUCCESS [ 15.413 s]
14:21:14 [2024-06-19T18:21:14.125Z] [INFO] org.eclipse.tracecompass.analysis.timing.ui.swtbot.tests 1.0.12-SNAPSHOT SUCCESS [ 26.161 s]
14:21:14 [2024-06-19T18:21:14.125Z] [INFO] org.eclipse.tracecompass.analysis.os.linux.ui.swtbot.tests 1.0.17-SNAPSHOT SUCCESS [ 58.144 s]
14:21:14 [2024-06-19T18:21:14.125Z] [INFO] org.eclipse.tracecompass.analysis.profiling.core.tests 1.0.11-SNAPSHOT SUCCESS [ 51.480 s]
14:21:14 [2024-06-19T18:21:14.125Z] [INFO] org.eclipse.tracecompass.analysis.profiling.ui 4.1.2-SNAPSHOT SUCCESS [  1.690 s]
14:21:14 [2024-06-19T18:21:14.125Z] [INFO] org.eclipse.tracecompass.analysis.profiling.ui.swtbot.tests 1.0.8-SNAPSHOT SUCCESS [ 16.148 s]
14:21:14 [2024-06-19T18:21:14.125Z] [INFO] Trace Compass BTF Support Parent 10.0.0-SNAPSHOT ... SUCCESS [  0.003 s]
14:21:14 [2024-06-19T18:21:14.125Z] [INFO] Trace Compass Documentation 10.0.0-SNAPSHOT ........ SUCCESS [  0.003 s]
14:21:14 [2024-06-19T18:21:14.125Z] [INFO] Trace Compass Profiling User Guide 10.0.0-SNAPSHOT . SUCCESS [  8.054 s]
14:21:14 [2024-06-19T18:21:14.125Z] [INFO] org.eclipse.tracecompass.btf.core 3.1.0-SNAPSHOT ... SUCCESS [  0.318 s]
14:21:14 [2024-06-19T18:21:14.125Z] [INFO] Trace Compass Developer Guide 10.0.0-SNAPSHOT ...... SUCCESS [  5.125 s]
14:21:14 [2024-06-19T18:21:14.125Z] [INFO] org.eclipse.tracecompass.tmf.analysis.xml.ui 2.2.0-SNAPSHOT SUCCESS [  0.954 s]
14:21:14 [2024-06-19T18:21:14.125Z] [INFO] org.eclipse.tracecompass.tmf 10.0.0-SNAPSHOT ....... SUCCESS [  0.345 s]
14:21:14 [2024-06-19T18:21:14.125Z] [INFO] org.eclipse.tracecompass.btf.ui 1.1.0-SNAPSHOT ..... SUCCESS [  0.661 s]
14:21:14 [2024-06-19T18:21:14.125Z] [INFO] org.eclipse.tracecompass.btf 10.0.0-SNAPSHOT ....... SUCCESS [  0.132 s]
14:21:14 [2024-06-19T18:21:14.125Z] [INFO] org.eclipse.tracecompass.btf.core.tests 1.0.4-SNAPSHOT SUCCESS [  5.321 s]
14:21:14 [2024-06-19T18:21:14.125Z] [INFO] org.eclipse.tracecompass.ctf 10.0.0-SNAPSHOT ....... SUCCESS [  0.065 s]
14:21:14 [2024-06-19T18:21:14.125Z] [INFO] org.eclipse.tracecompass.ctf.parser.tests 1.0.4-SNAPSHOT SUCCESS [  4.645 s]
14:21:14 [2024-06-19T18:21:14.125Z] [INFO] org.eclipse.tracecompass.tmf.ctf 10.0.0-SNAPSHOT ... SUCCESS [  0.138 s]
14:21:14 [2024-06-19T18:21:14.125Z] [INFO] org.eclipse.tracecompass.tmf.ctf.ui.swtbot.tests 1.0.13-SNAPSHOT SUCCESS [02:09 min]
14:21:14 [2024-06-19T18:21:14.125Z] [INFO] Trace Compass User Guide 10.0.0-SNAPSHOT ........... SUCCESS [  5.421 s]
14:21:14 [2024-06-19T18:21:14.125Z] [INFO] Trace Compass GDB Tracepoint Analysis User Guide 10.0.0-SNAPSHOT SUCCESS [  3.791 s]
14:21:14 [2024-06-19T18:21:14.125Z] [INFO] Trace Compass RCP User Guide 10.0.0-SNAPSHOT ....... SUCCESS [  3.659 s]
14:21:14 [2024-06-19T18:21:14.125Z] [INFO] Trace Compass Pcap User Guide 10.0.0-SNAPSHOT ...... SUCCESS [  3.378 s]
14:21:14 [2024-06-19T18:21:14.125Z] [INFO] org.eclipse.tracecompass.examples 1.0.11-SNAPSHOT .. SUCCESS [  0.695 s]
14:21:14 [2024-06-19T18:21:14.125Z] [INFO] Trace Compass GDB Tracepoint Analysis Parent 10.0.0-SNAPSHOT SUCCESS [  0.004 s]
14:21:14 [2024-06-19T18:21:14.125Z] [INFO] org.eclipse.tracecompass.gdbtrace.core 1.1.1-SNAPSHOT SUCCESS [  0.803 s]
14:21:14 [2024-06-19T18:21:14.125Z] [INFO] org.eclipse.tracecompass.gdbtrace.ui 1.2.0-SNAPSHOT  SUCCESS [  0.634 s]
14:21:14 [2024-06-19T18:21:14.125Z] [INFO] org.eclipse.tracecompass.gdbtrace 10.0.0-SNAPSHOT .. SUCCESS [  0.142 s]
14:21:14 [2024-06-19T18:21:14.125Z] [INFO] org.eclipse.tracecompass.gdbtrace.core.tests 1.0.3-SNAPSHOT SUCCESS [  5.089 s]
14:21:14 [2024-06-19T18:21:14.125Z] [INFO] org.eclipse.tracecompass.gdbtrace.ui.tests 1.0.3-SNAPSHOT SUCCESS [ 11.704 s]
14:21:14 [2024-06-19T18:21:14.125Z] [INFO] org.eclipse.tracecompass.lttng2.common.core.tests 1.0.3-SNAPSHOT SUCCESS [  4.443 s]
14:21:14 [2024-06-19T18:21:14.125Z] [INFO] org.eclipse.tracecompass.lttng2.control.core 1.3.0-SNAPSHOT SUCCESS [  0.500 s]
14:21:14 [2024-06-19T18:21:14.125Z] [INFO] org.eclipse.tracecompass.tmf.remote.core 2.1.0-SNAPSHOT SUCCESS [  0.321 s]
14:21:14 [2024-06-19T18:21:14.125Z] [INFO] org.eclipse.tracecompass.tmf.remote.ui 1.1.0-SNAPSHOT SUCCESS [  0.904 s]
14:21:14 [2024-06-19T18:21:14.125Z] [INFO] org.eclipse.tracecompass.lttng2.control.ui 1.3.0-SNAPSHOT SUCCESS [  1.963 s]
14:21:14 [2024-06-19T18:21:14.125Z] [INFO] org.eclipse.tracecompass.lttng2.control 10.0.0-SNAPSHOT SUCCESS [  0.195 s]
14:21:14 [2024-06-19T18:21:14.125Z] [INFO] org.eclipse.tracecompass.lttng2.control.core.tests 1.1.4-SNAPSHOT SUCCESS [  5.479 s]
14:21:14 [2024-06-19T18:21:14.125Z] [INFO] org.eclipse.tracecompass.tmf.remote.core.tests 1.0.3-SNAPSHOT SUCCESS [  5.259 s]
14:21:14 [2024-06-19T18:21:14.125Z] [INFO] org.eclipse.tracecompass.lttng2.control.ui.tests 2.0.6-SNAPSHOT SUCCESS [ 34.651 s]
14:21:14 [2024-06-19T18:21:14.125Z] [INFO] org.eclipse.tracecompass.lttng2.control.ui.swtbot.tests 1.0.9-SNAPSHOT SUCCESS [ 51.103 s]
14:21:14 [2024-06-19T18:21:14.125Z] [INFO] org.eclipse.tracecompass.lttng2.kernel.ui 2.1.1-SNAPSHOT SUCCESS [  0.516 s]
14:21:14 [2024-06-19T18:21:14.125Z] [INFO] org.eclipse.tracecompass.lttng2.kernel 10.0.0-SNAPSHOT SUCCESS [  0.180 s]
14:21:14 [2024-06-19T18:21:14.125Z] [INFO] org.eclipse.tracecompass.tmf.analysis.xml.core.tests 1.0.17-SNAPSHOT SUCCESS [ 44.310 s]
14:21:14 [2024-06-19T18:21:14.125Z] [INFO] org.eclipse.tracecompass.lttng2.kernel.core.tests 2.0.7-SNAPSHOT SUCCESS [03:05 min]
14:21:14 [2024-06-19T18:21:14.125Z] [INFO] org.eclipse.tracecompass.lttng2.kernel.ui.swtbot.tests 1.0.22-SNAPSHOT SUCCESS [04:51 min]
14:21:14 [2024-06-19T18:21:14.125Z] [INFO] org.eclipse.tracecompass.lttng2.ust.core 5.2.3-SNAPSHOT SUCCESS [  0.693 s]
14:21:14 [2024-06-19T18:21:14.125Z] [INFO] org.eclipse.tracecompass.lttng2.ust.ui 3.1.0-SNAPSHOT SUCCESS [  0.506 s]
14:21:14 [2024-06-19T18:21:14.125Z] [INFO] org.eclipse.tracecompass.lttng2.ust 10.0.0-SNAPSHOT  SUCCESS [  0.132 s]
14:21:14 [2024-06-19T18:21:14.125Z] [INFO] org.eclipse.tracecompass.lttng2.ust.core.tests 1.0.15-SNAPSHOT SUCCESS [ 32.756 s]
14:21:14 [2024-06-19T18:21:14.125Z] [INFO] org.eclipse.tracecompass.lttng2.ust.ui.tests 1.0.3-SNAPSHOT SUCCESS [ 11.483 s]
14:21:14 [2024-06-19T18:21:14.125Z] [INFO] org.eclipse.tracecompass.lttng2.ust.ui.swtbot.tests 1.0.16-SNAPSHOT SUCCESS [01:08 min]
14:21:14 [2024-06-19T18:21:14.125Z] [INFO] Trace Compass Pcap Format Support Parent 10.0.0-SNAPSHOT SUCCESS [  0.004 s]
14:21:14 [2024-06-19T18:21:14.125Z] [INFO] org.eclipse.tracecompass.pcap.core 1.2.1-SNAPSHOT .. SUCCESS [  0.528 s]
14:21:14 [2024-06-19T18:21:14.125Z] [INFO] Trace Compass Pcap Parser Core Tests Plug-in 1.0.7-SNAPSHOT SUCCESS [  7.351 s]
14:21:14 [2024-06-19T18:21:14.125Z] [INFO] org.eclipse.tracecompass.tmf.pcap.core 1.1.1-SNAPSHOT SUCCESS [  0.326 s]
14:21:14 [2024-06-19T18:21:14.125Z] [INFO] org.eclipse.tracecompass.tmf.pcap.ui 1.2.0-SNAPSHOT  SUCCESS [  0.442 s]
14:21:14 [2024-06-19T18:21:14.125Z] [INFO] org.eclipse.tracecompass.tmf.pcap 10.0.0-SNAPSHOT .. SUCCESS [  0.112 s]
14:21:14 [2024-06-19T18:21:14.125Z] [INFO] org.eclipse.tracecompass.tmf.pcap.core.tests 1.0.4-SNAPSHOT SUCCESS [  6.295 s]
14:21:14 [2024-06-19T18:21:14.125Z] [INFO] org.eclipse.tracecompass.tmf.pcap.ui.swtbot.tests 1.0.3-SNAPSHOT SUCCESS [ 28.850 s]
14:21:14 [2024-06-19T18:21:14.125Z] [INFO] Trace Compass RCP Parent 10.0.0-SNAPSHOT ........... SUCCESS [  0.003 s]
14:21:14 [2024-06-19T18:21:14.125Z] [INFO] Trace Compass RCP Branding plug-in 10.0.0-SNAPSHOT . SUCCESS [  0.138 s]
14:21:14 [2024-06-19T18:21:14.125Z] [INFO] Trace Compass RCP Branding Feature 10.0.0-SNAPSHOT . SUCCESS [  0.047 s]
14:21:14 [2024-06-19T18:21:14.125Z] [INFO] org.eclipse.tracecompass.tmf.cli.core 1.1.0-SNAPSHOT SUCCESS [  0.238 s]
14:21:14 [2024-06-19T18:21:14.125Z] [INFO] org.eclipse.tracecompass.rcp.ui 10.0.0-SNAPSHOT .... SUCCESS [  0.717 s]
14:21:14 [2024-06-19T18:21:14.125Z] [INFO] Trace Compass RCP Feature 10.0.0-SNAPSHOT .......... SUCCESS [  2.082 s]
14:21:14 [2024-06-19T18:21:14.126Z] [INFO] org.eclipse.tracecompass.tmf.cli.core.tests 1.0.3-SNAPSHOT SUCCESS [  4.522 s]
14:21:14 [2024-06-19T18:21:14.126Z] [INFO] org.eclipse.tracecompass.rcp.ui.tests 2.0.5-SNAPSHOT SUCCESS [ 11.011 s]
14:21:14 [2024-06-19T18:21:14.126Z] [INFO] org.eclipse.tracecompass.rcp.incubator.ui 1.0.5-SNAPSHOT SUCCESS [  0.268 s]
14:21:14 [2024-06-19T18:21:14.126Z] [INFO] org.eclipse.tracecompass.rcp.incubator 10.0.0-SNAPSHOT SUCCESS [  0.098 s]
14:21:14 [2024-06-19T18:21:14.126Z] [INFO] Trace Compass Json trace Parent 10.0.0-SNAPSHOT .... SUCCESS [  0.003 s]
14:21:14 [2024-06-19T18:21:14.126Z] [INFO] org.eclipse.tracecompass.jsontrace.core 1.1.0-SNAPSHOT SUCCESS [  0.306 s]
14:21:14 [2024-06-19T18:21:14.126Z] [INFO] org.eclipse.tracecompass.jsontrace 10.0.0-SNAPSHOT . SUCCESS [  0.088 s]
14:21:14 [2024-06-19T18:21:14.126Z] [INFO] org.eclipse.tracecompass.tmf.cli 10.0.0-SNAPSHOT ... SUCCESS [  0.041 s]
14:21:14 [2024-06-19T18:21:14.126Z] [INFO] Trace Compass RCP Product 10.0.0-SNAPSHOT .......... SUCCESS [02:08 min]
14:21:14 [2024-06-19T18:21:14.126Z] [INFO] Trace Compass Target Platform 10.0.0-SNAPSHOT ...... SUCCESS [  1.373 s]
14:21:14 [2024-06-19T18:21:14.126Z] [INFO] org.eclipse.tracecompass.integration.swtbot.tests 1.0.16-SNAPSHOT SUCCESS [08:03 min]
14:21:14 [2024-06-19T18:21:14.126Z] [INFO] org.eclipse.tracecompass.datastore.core.tests 1.0.9-SNAPSHOT SUCCESS [  6.209 s]
14:21:14 [2024-06-19T18:21:14.126Z] [INFO] org.eclipse.tracecompass.segmentstore.core.tests 1.0.8-SNAPSHOT SUCCESS [  5.229 s]
14:21:14 [2024-06-19T18:21:14.126Z] [INFO] org.eclipse.tracecompass.tmf.analysis.xml.ui.swtbot.tests 1.0.15-SNAPSHOT SUCCESS [01:01 min]
14:21:14 [2024-06-19T18:21:14.126Z] [INFO] org.eclipse.tracecompass.tmf.analysis.xml.ui.tests 1.0.5-SNAPSHOT SUCCESS [ 12.434 s]
14:21:14 [2024-06-19T18:21:14.126Z] [INFO] org.eclipse.tracecompass.tmf.chart.ui.tests 1.0.3-SNAPSHOT SUCCESS [ 11.391 s]
14:21:14 [2024-06-19T18:21:14.126Z] [INFO] org.eclipse.tracecompass.tmf.remote.ui.swtbot.tests 1.0.11-SNAPSHOT SUCCESS [01:39 min]
14:21:14 [2024-06-19T18:21:14.126Z] [INFO] org.eclipse.tracecompass.tmf.remote.ui.tests 1.0.3-SNAPSHOT SUCCESS [ 11.559 s]
14:21:14 [2024-06-19T18:21:14.126Z] [INFO] Trace Compass All Tests 1.0.13-SNAPSHOT ............ SUCCESS [  1.244 s]
14:21:14 [2024-06-19T18:21:14.126Z] [INFO] org.eclipse.tracecompass.integration.core.tests 1.0.8-SNAPSHOT SUCCESS [ 26.000 s]
14:21:14 [2024-06-19T18:21:14.126Z] [INFO] org.eclipse.tracecompass.testing 10.0.0-SNAPSHOT ... SUCCESS [  0.400 s]
14:21:14 [2024-06-19T18:21:14.126Z] [INFO] org.eclipse.tracecompass.tmf.remote 10.0.0-SNAPSHOT  SUCCESS [  0.075 s]
14:21:14 [2024-06-19T18:21:14.126Z] [INFO] Trace Compass Repository 10.0.0-SNAPSHOT ........... SUCCESS [  5.572 s]
14:21:14 [2024-06-19T18:21:14.126Z] [INFO] org.eclipse.tracecompass.jsontrace.core.tests 1.0.4-SNAPSHOT SUCCESS [  0.255 s]
14:21:14 [2024-06-19T18:21:14.126Z] [INFO] ------------------------------------------------------------------------
14:21:14 [2024-06-19T18:21:14.126Z] [INFO] BUILD SUCCESS
14:21:14 [2024-06-19T18:21:14.126Z] [INFO] ------------------------------------------------------------------------
14:21:14 [2024-06-19T18:21:14.126Z] [INFO] Total time:  01:00 h
14:21:14 [2024-06-19T18:21:14.126Z] [INFO] Finished at: 2024-06-19T18:21:13Z
14:21:14 [2024-06-19T18:21:14.126Z] [INFO] ------------------------------------------------------------------------