FailedConsole Output

07:34:15 Started by user Arthur.vanDorp@bsi-software.com
07:34:15 Building in workspace /home/hudson/genie.scout/.jenkins/jobs/org.eclipse.scout.sdk_deploy_from_tag/workspace
07:34:15 No credentials specified
07:34:15  > /usr/local/bin/git rev-parse --is-inside-work-tree # timeout=10
07:34:15 Fetching changes from the remote Git repository
07:34:15  > /usr/local/bin/git config remote.origin.url git://git.eclipse.org/gitroot/scout/org.eclipse.scout.sdk.git # timeout=10
07:34:15 Fetching upstream changes from git://git.eclipse.org/gitroot/scout/org.eclipse.scout.sdk.git
07:34:15  > /usr/local/bin/git --version # timeout=10
07:34:15  > /usr/local/bin/git fetch --tags --progress git://git.eclipse.org/gitroot/scout/org.eclipse.scout.sdk.git +refs/heads/*:refs/remotes/origin/*
07:34:15  > /usr/local/bin/git rev-parse origin/9.0.0.025_Simrel_2019_09^{commit} # timeout=10
07:34:15  > /usr/local/bin/git rev-parse 9.0.0.025_Simrel_2019_09^{commit} # timeout=10
07:34:15 Checking out Revision 7919e5eedbdf0b418849a469e5c8b60cf92f4243 (9.0.0.025_Simrel_2019_09)
07:34:15  > /usr/local/bin/git config core.sparsecheckout # timeout=10
07:34:15  > /usr/local/bin/git checkout -f 7919e5eedbdf0b418849a469e5c8b60cf92f4243
07:34:15 Commit message: "[release] version updated to 9.0.0.025_Simrel_2019_09"
07:34:15  > /usr/local/bin/git rev-list --no-walk 7919e5eedbdf0b418849a469e5c8b60cf92f4243 # timeout=10
07:34:15 [workspace] $ /shared/common/apache-maven-latest/bin/mvn -f org.eclipse.scout.sdk/pom.xml -DbuildId=025_Simrel_2019_09 -Dtag=9.0.0.025_Simrel_2019_09 -DstageTargetDir=releases/9.0/9.0.0/ -Dmaven.repo.local=/home/hudson/genie.scout/.jenkins/jobs/org.eclipse.scout.sdk_deploy_from_tag/workspace/.repository clean install
07:34:15 Picked up JAVA_TOOL_OPTIONS: -Xmx2G -Djava.io.tmpdir=/tmp/genie.scout -DforkCount=1
07:34:17 [INFO] Scanning for projects...
07:34:18 [INFO] ------------------------------------------------------------------------
07:34:18 [INFO] Reactor Build Order:
07:34:18 [INFO] 
07:34:18 [INFO] Scout Hello World Sample Application                   [maven-archetype]
07:34:18 [INFO] Scout JaxWs Module                                     [maven-archetype]
07:34:18 [INFO] ScoutJS Sample Application                             [maven-archetype]
07:34:18 [INFO] Eclipse Scout SDK                                                  [pom]
07:34:18 [INFO] org.eclipse.scout.sdk:org.eclipse.scout.sdk.core                   [jar]
07:34:18 [INFO] org.eclipse.scout.sdk:org.eclipse.scout.sdk.core.test              [jar]
07:34:18 [INFO] org.eclipse.scout.sdk:org.eclipse.scout.sdk.core.s                 [jar]
07:34:18 [INFO] org.eclipse.scout.sdk:org.eclipse.scout.sdk.core.s.test            [jar]
07:34:18 [INFO] org.eclipse.scout.sdk.s2e:org.eclipse.scout.sdk.s2e             [bundle]
07:34:18 [INFO] org.eclipse.scout.sdk.s2e:org.eclipse.scout.sdk.s2e.test           [jar]
07:34:18 [INFO] org.eclipse.scout.sdk.s2e:org.eclipse.scout.sdk.s2e.doc         [bundle]
07:34:18 [INFO] org.eclipse.scout.sdk.s2e:org.eclipse.scout.sdk.s2e.nls         [bundle]
07:34:18 [INFO] org.eclipse.scout.sdk.s2e:org.eclipse.scout.sdk.s2e.ui          [bundle]
07:34:18 [INFO] org.eclipse.scout.sdk-settings                                     [jar]
07:34:18 [INFO] 
07:34:18 [INFO] ---------< org.eclipse.scout.archetypes:scout-helloworld-app >----------
07:34:18 [INFO] Building Scout Hello World Sample Application 9.0.0.025_Simrel_2019_09 [1/14]
07:34:18 [INFO] --------------------------[ maven-archetype ]---------------------------
07:34:18 [INFO] 
07:34:18 [INFO] --- maven-clean-plugin:3.1.0:clean (default-clean) @ scout-helloworld-app ---
07:34:18 [INFO] Deleting /jobs/genie.scout/org.eclipse.scout.sdk_deploy_from_tag/workspace/scout-helloworld-app/target
07:34:18 [INFO] 
07:34:18 [INFO] --- flatten-maven-plugin:1.0.1:clean (flatten.clean) @ scout-helloworld-app ---
07:34:19 [INFO] Deleting /jobs/genie.scout/org.eclipse.scout.sdk_deploy_from_tag/workspace/scout-helloworld-app/.flattened-pom.xml
07:34:19 [INFO] 
07:34:19 [INFO] --- maven-enforcer-plugin:1.4.1:enforce (enforce-rules) @ scout-helloworld-app ---
07:34:19 [INFO] 
07:34:19 [INFO] --- git-commit-id-plugin:2.2.5:revision (default) @ scout-helloworld-app ---
07:34:20 [INFO] 
07:34:20 [INFO] --- jacoco-maven-plugin:0.8.2:prepare-agent (default) @ scout-helloworld-app ---
07:34:21 [INFO] master_test_jacocoArgLine set to -javaagent:/home/hudson/genie.scout/.jenkins/jobs/org.eclipse.scout.sdk_deploy_from_tag/workspace/.repository/org/jacoco/org.jacoco.agent/0.8.2/org.jacoco.agent-0.8.2-runtime.jar=destfile=/jobs/genie.scout/org.eclipse.scout.sdk_deploy_from_tag/workspace/scout-helloworld-app/../target/jacoco-all.exec
07:34:21 [INFO] 
07:34:21 [INFO] --- build-helper-maven-plugin:3.0.0:parse-version (initialize-parse-version) @ scout-helloworld-app ---
07:34:21 [INFO] 
07:34:21 [INFO] --- build-helper-maven-plugin:3.0.0:regex-property (initialize-regex) @ scout-helloworld-app ---
07:34:21 [INFO] No match to regex 'SNAPSHOT' found in '9.0.0.025_Simrel_2019_09'. The initial value '9.0.0.025_Simrel_2019_09' is left as-is...
07:34:21 [INFO] 
07:34:21 [INFO] --- maven-resources-plugin:3.1.0:resources (default-resources) @ scout-helloworld-app ---
07:34:21 [INFO] Using 'UTF-8' encoding to copy filtered resources.
07:34:21 [INFO] Copying 105 resources
07:34:21 [INFO] Copying 2 resources
07:34:21 [INFO] 
07:34:21 [INFO] --- flatten-maven-plugin:1.0.1:flatten (flatten) @ scout-helloworld-app ---
07:34:21 [INFO] Generating flattened POM of project org.eclipse.scout.archetypes:scout-helloworld-app:maven-archetype:9.0.0.025_Simrel_2019_09...
07:34:21 [INFO] 
07:34:21 [INFO] --- maven-resources-plugin:3.1.0:testResources (default-testResources) @ scout-helloworld-app ---
07:34:21 [INFO] Using 'UTF-8' encoding to copy filtered resources.
07:34:21 [INFO] Copying 2 resources
07:34:21 [INFO] 
07:34:21 [INFO] --- maven-archetype-plugin:3.0.1:jar (default-jar) @ scout-helloworld-app ---
07:34:21 [INFO] Building archetype jar: /jobs/genie.scout/org.eclipse.scout.sdk_deploy_from_tag/workspace/scout-helloworld-app/target/scout-helloworld-app-9.0.0.025_Simrel_2019_09
07:34:21 [INFO] 
07:34:21 [INFO] --- maven-site-plugin:3.7.1:attach-descriptor (attach-descriptor) @ scout-helloworld-app ---
07:34:22 [INFO] Skipping because packaging 'maven-archetype' is not pom.
07:34:22 [INFO] 
07:34:22 [INFO] --- maven-jar-plugin:3.1.1:test-jar (attach-tests) @ scout-helloworld-app ---
07:34:22 [INFO] Building jar: /jobs/genie.scout/org.eclipse.scout.sdk_deploy_from_tag/workspace/scout-helloworld-app/target/scout-helloworld-app-9.0.0.025_Simrel_2019_09-tests.jar
07:34:22 [INFO] 
07:34:22 [INFO] --- maven-source-plugin:3.0.1:test-jar-no-fork (attach-test-sources) @ scout-helloworld-app ---
07:34:22 [INFO] No sources in project. Archive not created.
07:34:22 [INFO] 
07:34:22 [INFO] --- maven-archetype-plugin:3.0.1:integration-test (default-integration-test) @ scout-helloworld-app ---
07:34:22 [INFO] Processing Archetype IT project: basic
07:34:22 [INFO] ----------------------------------------------------------------------------
07:34:22 [INFO] Using following parameters for creating project from Archetype: scout-helloworld-app:9.0.0.025_Simrel_2019_09
07:34:22 [INFO] ----------------------------------------------------------------------------
07:34:22 [INFO] Parameter: groupId, Value: org.eclipse.scout.apps
07:34:22 [INFO] Parameter: artifactId, Value: helloworld
07:34:22 [INFO] Parameter: version, Value: 1.0.0-SNAPSHOT
07:34:22 [INFO] Parameter: package, Value: org.eclipse.scout.apps.helloworld
07:34:22 [INFO] Parameter: packageInPathFormat, Value: org/eclipse/scout/apps/helloworld
07:34:22 [INFO] Parameter: scoutAuthPublicKeyDev, Value: TODO (use org.eclipse.scout.rt.platform.security.SecurityUtility.generateKeyPair())
07:34:22 [INFO] Parameter: groupId, Value: org.eclipse.scout.apps
07:34:22 [INFO] Parameter: scoutAuthPrivateKeyDev, Value: TODO (use org.eclipse.scout.rt.platform.security.SecurityUtility.generateKeyPair())
07:34:22 [INFO] Parameter: scoutAuthPublicKey, Value: TODO (use org.eclipse.scout.rt.platform.security.SecurityUtility.generateKeyPair())
07:34:22 [INFO] Parameter: version, Value: 1.0.0-SNAPSHOT
07:34:22 [INFO] Parameter: userName, Value: Scout Robot
07:34:22 [INFO] Parameter: displayName, Value: My Application
07:34:22 [INFO] Parameter: javaVersion, Value: 1.8
07:34:22 [INFO] Parameter: package, Value: org.eclipse.scout.apps.helloworld
07:34:22 [INFO] Parameter: artifactId, Value: helloworld
07:34:22 [INFO] Parameter: scoutAuthPrivateKey, Value: TODO (use org.eclipse.scout.rt.platform.security.SecurityUtility.generateKeyPair())
07:34:22 [INFO] Parent element not overwritten in /jobs/genie.scout/org.eclipse.scout.sdk_deploy_from_tag/workspace/scout-helloworld-app/target/test-classes/projects/basic/project/helloworld/helloworld/pom.xml
07:34:22 [WARNING] Don't override file /jobs/genie.scout/org.eclipse.scout.sdk_deploy_from_tag/workspace/scout-helloworld-app/target/test-classes/projects/basic/project/helloworld/helloworld/pom.xml
07:34:22 [INFO] Parent element not overwritten in /jobs/genie.scout/org.eclipse.scout.sdk_deploy_from_tag/workspace/scout-helloworld-app/target/test-classes/projects/basic/project/helloworld/helloworld.shared/pom.xml
07:34:22 [INFO] Parent element not overwritten in /jobs/genie.scout/org.eclipse.scout.sdk_deploy_from_tag/workspace/scout-helloworld-app/target/test-classes/projects/basic/project/helloworld/helloworld.server/pom.xml
07:34:22 [INFO] Parent element not overwritten in /jobs/genie.scout/org.eclipse.scout.sdk_deploy_from_tag/workspace/scout-helloworld-app/target/test-classes/projects/basic/project/helloworld/helloworld.client/pom.xml
07:34:22 [INFO] Parent element not overwritten in /jobs/genie.scout/org.eclipse.scout.sdk_deploy_from_tag/workspace/scout-helloworld-app/target/test-classes/projects/basic/project/helloworld/helloworld.server.app.war/pom.xml
07:34:22 [INFO] Parent element not overwritten in /jobs/genie.scout/org.eclipse.scout.sdk_deploy_from_tag/workspace/scout-helloworld-app/target/test-classes/projects/basic/project/helloworld/helloworld.server.app.dev/pom.xml
07:34:22 [INFO] Parent element not overwritten in /jobs/genie.scout/org.eclipse.scout.sdk_deploy_from_tag/workspace/scout-helloworld-app/target/test-classes/projects/basic/project/helloworld/helloworld.ui.html/pom.xml
07:34:22 [INFO] Parent element not overwritten in /jobs/genie.scout/org.eclipse.scout.sdk_deploy_from_tag/workspace/scout-helloworld-app/target/test-classes/projects/basic/project/helloworld/helloworld.ui.html.app.war/pom.xml
07:34:22 [INFO] Parent element not overwritten in /jobs/genie.scout/org.eclipse.scout.sdk_deploy_from_tag/workspace/scout-helloworld-app/target/test-classes/projects/basic/project/helloworld/helloworld.ui.html.app.dev/pom.xml
07:34:22 [INFO] Project created from Archetype in dir: /jobs/genie.scout/org.eclipse.scout.sdk_deploy_from_tag/workspace/scout-helloworld-app/target/test-classes/projects/basic/project/helloworld
07:34:22 [INFO] 
07:34:22 [INFO] --- duplicate-finder-maven-plugin:1.3.0:check (default) @ scout-helloworld-app ---
07:34:22 [INFO] Checking compile classpath
07:34:23 [INFO] Checking runtime classpath
07:34:23 [INFO] Checking test classpath
07:34:23 [INFO] 
07:34:23 [INFO] --- animal-sniffer-maven-plugin:1.17:check (enforce-java-api-compatibility) @ scout-helloworld-app ---
07:34:23 [INFO] Checking unresolved references to org.codehaus.mojo.signature:java18:1.0
07:34:23 [INFO] 
07:34:23 [INFO] --- maven-source-plugin:3.0.1:jar-no-fork (attach-sources) @ scout-helloworld-app ---
07:34:23 [INFO] No sources in project. Archive not created.
07:34:23 [INFO] 
07:34:23 [INFO] --- maven-install-plugin:2.5.2:install (default-install) @ scout-helloworld-app ---
07:34:23 [INFO] Installing /jobs/genie.scout/org.eclipse.scout.sdk_deploy_from_tag/workspace/scout-helloworld-app/target/scout-helloworld-app-9.0.0.025_Simrel_2019_09.jar to /home/hudson/genie.scout/.jenkins/jobs/org.eclipse.scout.sdk_deploy_from_tag/workspace/.repository/org/eclipse/scout/archetypes/scout-helloworld-app/9.0.0.025_Simrel_2019_09/scout-helloworld-app-9.0.0.025_Simrel_2019_09.jar
07:34:23 [INFO] Installing /jobs/genie.scout/org.eclipse.scout.sdk_deploy_from_tag/workspace/scout-helloworld-app/.flattened-pom.xml to /home/hudson/genie.scout/.jenkins/jobs/org.eclipse.scout.sdk_deploy_from_tag/workspace/.repository/org/eclipse/scout/archetypes/scout-helloworld-app/9.0.0.025_Simrel_2019_09/scout-helloworld-app-9.0.0.025_Simrel_2019_09.pom
07:34:23 [INFO] Installing /jobs/genie.scout/org.eclipse.scout.sdk_deploy_from_tag/workspace/scout-helloworld-app/target/scout-helloworld-app-9.0.0.025_Simrel_2019_09-tests.jar to /home/hudson/genie.scout/.jenkins/jobs/org.eclipse.scout.sdk_deploy_from_tag/workspace/.repository/org/eclipse/scout/archetypes/scout-helloworld-app/9.0.0.025_Simrel_2019_09/scout-helloworld-app-9.0.0.025_Simrel_2019_09-tests.jar
07:34:23 [INFO] 
07:34:23 [INFO] --- maven-archetype-plugin:3.0.1:update-local-catalog (default-update-local-catalog) @ scout-helloworld-app ---
07:34:23 [INFO] 
07:34:23 [INFO] ----------< org.eclipse.scout.archetypes:scout-jaxws-module >-----------
07:34:23 [INFO] Building Scout JaxWs Module 9.0.0.025_Simrel_2019_09              [2/14]
07:34:23 [INFO] --------------------------[ maven-archetype ]---------------------------
07:34:23 [INFO] 
07:34:23 [INFO] --- maven-clean-plugin:3.1.0:clean (default-clean) @ scout-jaxws-module ---
07:34:23 [INFO] Deleting /jobs/genie.scout/org.eclipse.scout.sdk_deploy_from_tag/workspace/scout-jaxws-module/target
07:34:23 [INFO] 
07:34:23 [INFO] --- flatten-maven-plugin:1.0.1:clean (flatten.clean) @ scout-jaxws-module ---
07:34:23 [INFO] Deleting /jobs/genie.scout/org.eclipse.scout.sdk_deploy_from_tag/workspace/scout-jaxws-module/.flattened-pom.xml
07:34:23 [INFO] 
07:34:23 [INFO] --- maven-enforcer-plugin:1.4.1:enforce (enforce-rules) @ scout-jaxws-module ---
07:34:23 [INFO] 
07:34:23 [INFO] --- git-commit-id-plugin:2.2.5:revision (default) @ scout-jaxws-module ---
07:34:24 [INFO] 
07:34:24 [INFO] --- jacoco-maven-plugin:0.8.2:prepare-agent (default) @ scout-jaxws-module ---
07:34:24 [INFO] master_test_jacocoArgLine set to -javaagent:/home/hudson/genie.scout/.jenkins/jobs/org.eclipse.scout.sdk_deploy_from_tag/workspace/.repository/org/jacoco/org.jacoco.agent/0.8.2/org.jacoco.agent-0.8.2-runtime.jar=destfile=/jobs/genie.scout/org.eclipse.scout.sdk_deploy_from_tag/workspace/scout-jaxws-module/../target/jacoco-all.exec
07:34:24 [INFO] 
07:34:24 [INFO] --- build-helper-maven-plugin:3.0.0:parse-version (initialize-parse-version) @ scout-jaxws-module ---
07:34:24 [INFO] 
07:34:24 [INFO] --- build-helper-maven-plugin:3.0.0:regex-property (initialize-regex) @ scout-jaxws-module ---
07:34:24 [INFO] No match to regex 'SNAPSHOT' found in '9.0.0.025_Simrel_2019_09'. The initial value '9.0.0.025_Simrel_2019_09' is left as-is...
07:34:24 [INFO] 
07:34:24 [INFO] --- maven-resources-plugin:3.1.0:resources (default-resources) @ scout-jaxws-module ---
07:34:24 [INFO] Using 'UTF-8' encoding to copy filtered resources.
07:34:24 [INFO] Copying 7 resources
07:34:24 [INFO] Copying 2 resources
07:34:24 [INFO] 
07:34:24 [INFO] --- flatten-maven-plugin:1.0.1:flatten (flatten) @ scout-jaxws-module ---
07:34:24 [INFO] Generating flattened POM of project org.eclipse.scout.archetypes:scout-jaxws-module:maven-archetype:9.0.0.025_Simrel_2019_09...
07:34:24 [INFO] 
07:34:24 [INFO] --- maven-resources-plugin:3.1.0:testResources (default-testResources) @ scout-jaxws-module ---
07:34:24 [INFO] Using 'UTF-8' encoding to copy filtered resources.
07:34:24 [INFO] Copying 2 resources
07:34:24 [INFO] 
07:34:24 [INFO] --- maven-archetype-plugin:3.0.1:jar (default-jar) @ scout-jaxws-module ---
07:34:24 [INFO] Building archetype jar: /jobs/genie.scout/org.eclipse.scout.sdk_deploy_from_tag/workspace/scout-jaxws-module/target/scout-jaxws-module-9.0.0.025_Simrel_2019_09
07:34:24 [INFO] 
07:34:24 [INFO] --- maven-site-plugin:3.7.1:attach-descriptor (attach-descriptor) @ scout-jaxws-module ---
07:34:24 [INFO] Skipping because packaging 'maven-archetype' is not pom.
07:34:24 [INFO] 
07:34:24 [INFO] --- maven-jar-plugin:3.1.1:test-jar (attach-tests) @ scout-jaxws-module ---
07:34:24 [INFO] Building jar: /jobs/genie.scout/org.eclipse.scout.sdk_deploy_from_tag/workspace/scout-jaxws-module/target/scout-jaxws-module-9.0.0.025_Simrel_2019_09-tests.jar
07:34:24 [INFO] 
07:34:24 [INFO] --- maven-source-plugin:3.0.1:test-jar-no-fork (attach-test-sources) @ scout-jaxws-module ---
07:34:24 [INFO] No sources in project. Archive not created.
07:34:24 [INFO] 
07:34:24 [INFO] --- maven-archetype-plugin:3.0.1:integration-test (default-integration-test) @ scout-jaxws-module ---
07:34:24 [INFO] Processing Archetype IT project: basic
07:34:24 [INFO] ----------------------------------------------------------------------------
07:34:24 [INFO] Using following parameters for creating project from Archetype: scout-jaxws-module:9.0.0.025_Simrel_2019_09
07:34:24 [INFO] ----------------------------------------------------------------------------
07:34:24 [INFO] Parameter: groupId, Value: org.eclipse.scout.apps
07:34:24 [INFO] Parameter: artifactId, Value: helloworld.server.jaxws
07:34:24 [INFO] Parameter: version, Value: 1.0.0-SNAPSHOT
07:34:24 [INFO] Parameter: package, Value: org.eclipse.scout.apps.helloworld
07:34:24 [INFO] Parameter: packageInPathFormat, Value: org/eclipse/scout/apps/helloworld
07:34:24 [INFO] Parameter: displayName, Value: My Application
07:34:24 [INFO] Parameter: version, Value: 1.0.0-SNAPSHOT
07:34:24 [INFO] Parameter: package, Value: org.eclipse.scout.apps.helloworld
07:34:24 [INFO] Parameter: groupId, Value: org.eclipse.scout.apps
07:34:24 [INFO] Parameter: parentArtifactId, Value: helloworld
07:34:24 [INFO] Parameter: artifactId, Value: helloworld.server.jaxws
07:34:24 [WARNING] CP Don't override file /jobs/genie.scout/org.eclipse.scout.sdk_deploy_from_tag/workspace/scout-jaxws-module/target/test-classes/projects/basic/project/helloworld.server.jaxws/src/main/resources/META-INF/scout.xml
07:34:24 [INFO] Project created from Archetype in dir: /jobs/genie.scout/org.eclipse.scout.sdk_deploy_from_tag/workspace/scout-jaxws-module/target/test-classes/projects/basic/project/helloworld.server.jaxws
07:34:24 [INFO] 
07:34:24 [INFO] --- duplicate-finder-maven-plugin:1.3.0:check (default) @ scout-jaxws-module ---
07:34:24 [INFO] Checking compile classpath
07:34:24 [INFO] Checking runtime classpath
07:34:24 [INFO] Checking test classpath
07:34:24 [INFO] 
07:34:24 [INFO] --- animal-sniffer-maven-plugin:1.17:check (enforce-java-api-compatibility) @ scout-jaxws-module ---
07:34:24 [INFO] Checking unresolved references to org.codehaus.mojo.signature:java18:1.0
07:34:25 [INFO] 
07:34:25 [INFO] --- maven-source-plugin:3.0.1:jar-no-fork (attach-sources) @ scout-jaxws-module ---
07:34:25 [INFO] No sources in project. Archive not created.
07:34:25 [INFO] 
07:34:25 [INFO] --- maven-install-plugin:2.5.2:install (default-install) @ scout-jaxws-module ---
07:34:25 [INFO] Installing /jobs/genie.scout/org.eclipse.scout.sdk_deploy_from_tag/workspace/scout-jaxws-module/target/scout-jaxws-module-9.0.0.025_Simrel_2019_09.jar to /home/hudson/genie.scout/.jenkins/jobs/org.eclipse.scout.sdk_deploy_from_tag/workspace/.repository/org/eclipse/scout/archetypes/scout-jaxws-module/9.0.0.025_Simrel_2019_09/scout-jaxws-module-9.0.0.025_Simrel_2019_09.jar
07:34:25 [INFO] Installing /jobs/genie.scout/org.eclipse.scout.sdk_deploy_from_tag/workspace/scout-jaxws-module/.flattened-pom.xml to /home/hudson/genie.scout/.jenkins/jobs/org.eclipse.scout.sdk_deploy_from_tag/workspace/.repository/org/eclipse/scout/archetypes/scout-jaxws-module/9.0.0.025_Simrel_2019_09/scout-jaxws-module-9.0.0.025_Simrel_2019_09.pom
07:34:25 [INFO] Installing /jobs/genie.scout/org.eclipse.scout.sdk_deploy_from_tag/workspace/scout-jaxws-module/target/scout-jaxws-module-9.0.0.025_Simrel_2019_09-tests.jar to /home/hudson/genie.scout/.jenkins/jobs/org.eclipse.scout.sdk_deploy_from_tag/workspace/.repository/org/eclipse/scout/archetypes/scout-jaxws-module/9.0.0.025_Simrel_2019_09/scout-jaxws-module-9.0.0.025_Simrel_2019_09-tests.jar
07:34:25 [INFO] 
07:34:25 [INFO] --- maven-archetype-plugin:3.0.1:update-local-catalog (default-update-local-catalog) @ scout-jaxws-module ---
07:34:25 [INFO] 
07:34:25 [INFO] -----------< org.eclipse.scout.archetypes:scout-hellojs-app >-----------
07:34:25 [INFO] Building ScoutJS Sample Application 9.0.0.025_Simrel_2019_09      [3/14]
07:34:25 [INFO] --------------------------[ maven-archetype ]---------------------------
07:34:25 [INFO] 
07:34:25 [INFO] --- maven-clean-plugin:3.1.0:clean (default-clean) @ scout-hellojs-app ---
07:34:25 [INFO] Deleting /jobs/genie.scout/org.eclipse.scout.sdk_deploy_from_tag/workspace/scout-hellojs-app/target
07:34:25 [INFO] 
07:34:25 [INFO] --- flatten-maven-plugin:1.0.1:clean (flatten.clean) @ scout-hellojs-app ---
07:34:25 [INFO] Deleting /jobs/genie.scout/org.eclipse.scout.sdk_deploy_from_tag/workspace/scout-hellojs-app/.flattened-pom.xml
07:34:25 [INFO] 
07:34:25 [INFO] --- maven-enforcer-plugin:1.4.1:enforce (enforce-rules) @ scout-hellojs-app ---
07:34:25 [INFO] 
07:34:25 [INFO] --- git-commit-id-plugin:2.2.5:revision (default) @ scout-hellojs-app ---
07:34:25 [INFO] 
07:34:25 [INFO] --- jacoco-maven-plugin:0.8.2:prepare-agent (default) @ scout-hellojs-app ---
07:34:25 [INFO] master_test_jacocoArgLine set to -javaagent:/home/hudson/genie.scout/.jenkins/jobs/org.eclipse.scout.sdk_deploy_from_tag/workspace/.repository/org/jacoco/org.jacoco.agent/0.8.2/org.jacoco.agent-0.8.2-runtime.jar=destfile=/jobs/genie.scout/org.eclipse.scout.sdk_deploy_from_tag/workspace/scout-hellojs-app/../target/jacoco-all.exec
07:34:25 [INFO] 
07:34:25 [INFO] --- build-helper-maven-plugin:3.0.0:parse-version (initialize-parse-version) @ scout-hellojs-app ---
07:34:25 [INFO] 
07:34:25 [INFO] --- build-helper-maven-plugin:3.0.0:regex-property (initialize-regex) @ scout-hellojs-app ---
07:34:25 [INFO] No match to regex 'SNAPSHOT' found in '9.0.0.025_Simrel_2019_09'. The initial value '9.0.0.025_Simrel_2019_09' is left as-is...
07:34:25 [INFO] 
07:34:25 [INFO] --- maven-resources-plugin:3.1.0:resources (default-resources) @ scout-hellojs-app ---
07:34:25 [INFO] Using 'UTF-8' encoding to copy filtered resources.
07:34:25 [INFO] Copying 146 resources
07:34:26 [INFO] Copying 2 resources
07:34:26 [INFO] 
07:34:26 [INFO] --- flatten-maven-plugin:1.0.1:flatten (flatten) @ scout-hellojs-app ---
07:34:26 [INFO] Generating flattened POM of project org.eclipse.scout.archetypes:scout-hellojs-app:maven-archetype:9.0.0.025_Simrel_2019_09...
07:34:26 [INFO] 
07:34:26 [INFO] --- maven-resources-plugin:3.1.0:testResources (default-testResources) @ scout-hellojs-app ---
07:34:26 [INFO] Using 'UTF-8' encoding to copy filtered resources.
07:34:26 [INFO] Copying 2 resources
07:34:26 [INFO] 
07:34:26 [INFO] --- maven-archetype-plugin:3.0.1:jar (default-jar) @ scout-hellojs-app ---
07:34:26 [INFO] Building archetype jar: /jobs/genie.scout/org.eclipse.scout.sdk_deploy_from_tag/workspace/scout-hellojs-app/target/scout-hellojs-app-9.0.0.025_Simrel_2019_09
07:34:26 [INFO] 
07:34:26 [INFO] --- maven-site-plugin:3.7.1:attach-descriptor (attach-descriptor) @ scout-hellojs-app ---
07:34:26 [INFO] Skipping because packaging 'maven-archetype' is not pom.
07:34:26 [INFO] 
07:34:26 [INFO] --- maven-jar-plugin:3.1.1:test-jar (attach-tests) @ scout-hellojs-app ---
07:34:26 [INFO] Building jar: /jobs/genie.scout/org.eclipse.scout.sdk_deploy_from_tag/workspace/scout-hellojs-app/target/scout-hellojs-app-9.0.0.025_Simrel_2019_09-tests.jar
07:34:26 [INFO] 
07:34:26 [INFO] --- maven-source-plugin:3.0.1:test-jar-no-fork (attach-test-sources) @ scout-hellojs-app ---
07:34:26 [INFO] No sources in project. Archive not created.
07:34:26 [INFO] 
07:34:26 [INFO] --- maven-archetype-plugin:3.0.1:integration-test (default-integration-test) @ scout-hellojs-app ---
07:34:26 [INFO] Processing Archetype IT project: basic
07:34:26 [INFO] ----------------------------------------------------------------------------
07:34:26 [INFO] Using following parameters for creating project from Archetype: scout-hellojs-app:9.0.0.025_Simrel_2019_09
07:34:26 [INFO] ----------------------------------------------------------------------------
07:34:26 [INFO] Parameter: groupId, Value: org.eclipse.scout.apps
07:34:26 [INFO] Parameter: artifactId, Value: hellojs
07:34:26 [INFO] Parameter: version, Value: 1.0.0-SNAPSHOT
07:34:26 [INFO] Parameter: package, Value: org.eclipse.scout.apps.hellojs
07:34:26 [INFO] Parameter: packageInPathFormat, Value: org/eclipse/scout/apps/hellojs
07:34:26 [INFO] Parameter: displayName, Value: My Application
07:34:26 [INFO] Parameter: version, Value: 1.0.0-SNAPSHOT
07:34:26 [INFO] Parameter: package, Value: org.eclipse.scout.apps.hellojs
07:34:26 [INFO] Parameter: simpleArtifactName, Value: hellojs
07:34:26 [INFO] Parameter: javaVersion, Value: 1.8
07:34:26 [INFO] Parameter: groupId, Value: org.eclipse.scout.apps
07:34:26 [INFO] Parameter: scoutAuthPublicKeyDev, Value: changeme_database_password
07:34:26 [INFO] Parameter: artifactId, Value: hellojs
07:34:26 [INFO] Parent element not overwritten in /jobs/genie.scout/org.eclipse.scout.sdk_deploy_from_tag/workspace/scout-hellojs-app/target/test-classes/projects/basic/project/hellojs/hellojs/pom.xml
07:34:26 [WARNING] Don't override file /jobs/genie.scout/org.eclipse.scout.sdk_deploy_from_tag/workspace/scout-hellojs-app/target/test-classes/projects/basic/project/hellojs/hellojs/pom.xml
07:34:26 [INFO] Parent element not overwritten in /jobs/genie.scout/org.eclipse.scout.sdk_deploy_from_tag/workspace/scout-hellojs-app/target/test-classes/projects/basic/project/hellojs/hellojs.api/pom.xml
07:34:26 [INFO] Parent element not overwritten in /jobs/genie.scout/org.eclipse.scout.sdk_deploy_from_tag/workspace/scout-hellojs-app/target/test-classes/projects/basic/project/hellojs/hellojs.app/pom.xml
07:34:26 [INFO] Parent element not overwritten in /jobs/genie.scout/org.eclipse.scout.sdk_deploy_from_tag/workspace/scout-hellojs-app/target/test-classes/projects/basic/project/hellojs/hellojs.app.dev/pom.xml
07:34:26 [INFO] Parent element not overwritten in /jobs/genie.scout/org.eclipse.scout.sdk_deploy_from_tag/workspace/scout-hellojs-app/target/test-classes/projects/basic/project/hellojs/hellojs.app.war/pom.xml
07:34:26 [INFO] Parent element not overwritten in /jobs/genie.scout/org.eclipse.scout.sdk_deploy_from_tag/workspace/scout-hellojs-app/target/test-classes/projects/basic/project/hellojs/hellojs.core/pom.xml
07:34:26 [INFO] Parent element not overwritten in /jobs/genie.scout/org.eclipse.scout.sdk_deploy_from_tag/workspace/scout-hellojs-app/target/test-classes/projects/basic/project/hellojs/hellojs.core.test/pom.xml
07:34:26 [INFO] Parent element not overwritten in /jobs/genie.scout/org.eclipse.scout.sdk_deploy_from_tag/workspace/scout-hellojs-app/target/test-classes/projects/basic/project/hellojs/hellojs.data/pom.xml
07:34:26 [INFO] Parent element not overwritten in /jobs/genie.scout/org.eclipse.scout.sdk_deploy_from_tag/workspace/scout-hellojs-app/target/test-classes/projects/basic/project/hellojs/hellojs.db/pom.xml
07:34:26 [INFO] Parent element not overwritten in /jobs/genie.scout/org.eclipse.scout.sdk_deploy_from_tag/workspace/scout-hellojs-app/target/test-classes/projects/basic/project/hellojs/hellojs.persistence/pom.xml
07:34:26 [INFO] Parent element not overwritten in /jobs/genie.scout/org.eclipse.scout.sdk_deploy_from_tag/workspace/scout-hellojs-app/target/test-classes/projects/basic/project/hellojs/hellojs.persistence.test/pom.xml
07:34:26 [INFO] Parent element not overwritten in /jobs/genie.scout/org.eclipse.scout.sdk_deploy_from_tag/workspace/scout-hellojs-app/target/test-classes/projects/basic/project/hellojs/hellojs.ui/pom.xml
07:34:26 [INFO] Project created from Archetype in dir: /jobs/genie.scout/org.eclipse.scout.sdk_deploy_from_tag/workspace/scout-hellojs-app/target/test-classes/projects/basic/project/hellojs
07:34:26 [INFO] 
07:34:26 [INFO] --- duplicate-finder-maven-plugin:1.3.0:check (default) @ scout-hellojs-app ---
07:34:26 [INFO] Checking compile classpath
07:34:26 [INFO] Checking runtime classpath
07:34:26 [INFO] Checking test classpath
07:34:26 [INFO] 
07:34:26 [INFO] --- animal-sniffer-maven-plugin:1.17:check (enforce-java-api-compatibility) @ scout-hellojs-app ---
07:34:26 [INFO] Checking unresolved references to org.codehaus.mojo.signature:java18:1.0
07:34:26 [INFO] 
07:34:26 [INFO] --- maven-source-plugin:3.0.1:jar-no-fork (attach-sources) @ scout-hellojs-app ---
07:34:26 [INFO] No sources in project. Archive not created.
07:34:26 [INFO] 
07:34:26 [INFO] --- maven-install-plugin:2.5.2:install (default-install) @ scout-hellojs-app ---
07:34:26 [INFO] Installing /jobs/genie.scout/org.eclipse.scout.sdk_deploy_from_tag/workspace/scout-hellojs-app/target/scout-hellojs-app-9.0.0.025_Simrel_2019_09.jar to /home/hudson/genie.scout/.jenkins/jobs/org.eclipse.scout.sdk_deploy_from_tag/workspace/.repository/org/eclipse/scout/archetypes/scout-hellojs-app/9.0.0.025_Simrel_2019_09/scout-hellojs-app-9.0.0.025_Simrel_2019_09.jar
07:34:26 [INFO] Installing /jobs/genie.scout/org.eclipse.scout.sdk_deploy_from_tag/workspace/scout-hellojs-app/.flattened-pom.xml to /home/hudson/genie.scout/.jenkins/jobs/org.eclipse.scout.sdk_deploy_from_tag/workspace/.repository/org/eclipse/scout/archetypes/scout-hellojs-app/9.0.0.025_Simrel_2019_09/scout-hellojs-app-9.0.0.025_Simrel_2019_09.pom
07:34:26 [INFO] Installing /jobs/genie.scout/org.eclipse.scout.sdk_deploy_from_tag/workspace/scout-hellojs-app/target/scout-hellojs-app-9.0.0.025_Simrel_2019_09-tests.jar to /home/hudson/genie.scout/.jenkins/jobs/org.eclipse.scout.sdk_deploy_from_tag/workspace/.repository/org/eclipse/scout/archetypes/scout-hellojs-app/9.0.0.025_Simrel_2019_09/scout-hellojs-app-9.0.0.025_Simrel_2019_09-tests.jar
07:34:26 [INFO] 
07:34:26 [INFO] --- maven-archetype-plugin:3.0.1:update-local-catalog (default-update-local-catalog) @ scout-hellojs-app ---
07:34:26 [INFO] 
07:34:26 [INFO] ------------< org.eclipse.scout.sdk:org.eclipse.scout.sdk >-------------
07:34:26 [INFO] Building Eclipse Scout SDK 9.0.0.025_Simrel_2019_09               [4/14]
07:34:26 [INFO] --------------------------------[ pom ]---------------------------------
07:34:26 [INFO] 
07:34:26 [INFO] --- maven-clean-plugin:3.1.0:clean (default-clean) @ org.eclipse.scout.sdk ---
07:34:26 [INFO] Deleting /jobs/genie.scout/org.eclipse.scout.sdk_deploy_from_tag/workspace/org.eclipse.scout.sdk/target
07:34:26 [INFO] 
07:34:26 [INFO] --- flatten-maven-plugin:1.0.1:clean (flatten.clean) @ org.eclipse.scout.sdk ---
07:34:26 [INFO] Deleting /jobs/genie.scout/org.eclipse.scout.sdk_deploy_from_tag/workspace/org.eclipse.scout.sdk/.flattened-pom.xml
07:34:26 [INFO] 
07:34:26 [INFO] --- maven-enforcer-plugin:1.4.1:enforce (enforce-rules) @ org.eclipse.scout.sdk ---
07:34:27 [INFO] 
07:34:27 [INFO] --- git-commit-id-plugin:2.2.5:revision (default) @ org.eclipse.scout.sdk ---
07:34:27 [INFO] 
07:34:27 [INFO] --- jacoco-maven-plugin:0.8.2:prepare-agent (default) @ org.eclipse.scout.sdk ---
07:34:27 [INFO] master_test_jacocoArgLine set to -javaagent:/home/hudson/genie.scout/.jenkins/jobs/org.eclipse.scout.sdk_deploy_from_tag/workspace/.repository/org/jacoco/org.jacoco.agent/0.8.2/org.jacoco.agent-0.8.2-runtime.jar=destfile=/jobs/genie.scout/org.eclipse.scout.sdk_deploy_from_tag/workspace/org.eclipse.scout.sdk/../org.eclipse.scout.sdk/target/jacoco-all.exec
07:34:27 [INFO] 
07:34:27 [INFO] --- build-helper-maven-plugin:3.0.0:parse-version (initialize-parse-version) @ org.eclipse.scout.sdk ---
07:34:27 [INFO] 
07:34:27 [INFO] --- build-helper-maven-plugin:3.0.0:regex-property (initialize-regex) @ org.eclipse.scout.sdk ---
07:34:27 [INFO] No match to regex 'SNAPSHOT' found in '9.0.0.025_Simrel_2019_09'. The initial value '9.0.0.025_Simrel_2019_09' is left as-is...
07:34:27 [INFO] 
07:34:27 [INFO] --- flatten-maven-plugin:1.0.1:flatten (flatten) @ org.eclipse.scout.sdk ---
07:34:27 [INFO] Generating flattened POM of project org.eclipse.scout.sdk:org.eclipse.scout.sdk:pom:9.0.0.025_Simrel_2019_09...
07:34:27 [INFO] 
07:34:27 [INFO] --- maven-site-plugin:3.7.1:attach-descriptor (attach-descriptor) @ org.eclipse.scout.sdk ---
07:34:27 [INFO] No site descriptor found: nothing to attach.
07:34:27 [INFO] 
07:34:27 [INFO] --- maven-jar-plugin:3.1.1:test-jar (attach-tests) @ org.eclipse.scout.sdk ---
07:34:27 [INFO] Skipping packaging of the test-jar
07:34:27 [INFO] 
07:34:27 [INFO] --- maven-source-plugin:3.0.1:test-jar-no-fork (attach-test-sources) @ org.eclipse.scout.sdk ---
07:34:27 [INFO] 
07:34:27 [INFO] --- duplicate-finder-maven-plugin:1.3.0:check (default) @ org.eclipse.scout.sdk ---
07:34:27 [INFO] Checking compile classpath
07:34:27 [INFO] Checking runtime classpath
07:34:27 [INFO] Checking test classpath
07:34:27 [INFO] 
07:34:27 [INFO] --- animal-sniffer-maven-plugin:1.17:check (enforce-java-api-compatibility) @ org.eclipse.scout.sdk ---
07:34:27 [INFO] Checking unresolved references to org.codehaus.mojo.signature:java18:1.0
07:34:28 [INFO] 
07:34:28 [INFO] --- maven-source-plugin:3.0.1:jar-no-fork (attach-sources) @ org.eclipse.scout.sdk ---
07:34:28 [INFO] 
07:34:28 [INFO] --- maven-install-plugin:2.5.2:install (default-install) @ org.eclipse.scout.sdk ---
07:34:28 [INFO] Installing /jobs/genie.scout/org.eclipse.scout.sdk_deploy_from_tag/workspace/org.eclipse.scout.sdk/.flattened-pom.xml to /home/hudson/genie.scout/.jenkins/jobs/org.eclipse.scout.sdk_deploy_from_tag/workspace/.repository/org/eclipse/scout/sdk/org.eclipse.scout.sdk/9.0.0.025_Simrel_2019_09/org.eclipse.scout.sdk-9.0.0.025_Simrel_2019_09.pom
07:34:28 [INFO] 
07:34:28 [INFO] ----------< org.eclipse.scout.sdk:org.eclipse.scout.sdk.core >----------
07:34:28 [INFO] Building org.eclipse.scout.sdk:org.eclipse.scout.sdk.core 9.0.0.025_Simrel_2019_09 [5/14]
07:34:28 [INFO] --------------------------------[ jar ]---------------------------------
07:34:28 [INFO] 
07:34:28 [INFO] --- maven-clean-plugin:3.1.0:clean (default-clean) @ org.eclipse.scout.sdk.core ---
07:34:28 [INFO] Deleting /jobs/genie.scout/org.eclipse.scout.sdk_deploy_from_tag/workspace/org.eclipse.scout.sdk.core/target
07:34:28 [INFO] 
07:34:28 [INFO] --- maven-enforcer-plugin:1.4.1:enforce (enforce-rules) @ org.eclipse.scout.sdk.core ---
07:34:28 [INFO] 
07:34:28 [INFO] --- git-commit-id-plugin:2.2.5:revision (default) @ org.eclipse.scout.sdk.core ---
07:34:29 [INFO] 
07:34:29 [INFO] --- jacoco-maven-plugin:0.8.2:prepare-agent (default) @ org.eclipse.scout.sdk.core ---
07:34:29 [INFO] master_test_jacocoArgLine set to -javaagent:/home/hudson/genie.scout/.jenkins/jobs/org.eclipse.scout.sdk_deploy_from_tag/workspace/.repository/org/jacoco/org.jacoco.agent/0.8.2/org.jacoco.agent-0.8.2-runtime.jar=destfile=/jobs/genie.scout/org.eclipse.scout.sdk_deploy_from_tag/workspace/org.eclipse.scout.sdk.core/../org.eclipse.scout.sdk/target/jacoco-all.exec
07:34:29 [INFO] 
07:34:29 [INFO] --- build-helper-maven-plugin:3.0.0:parse-version (initialize-parse-version) @ org.eclipse.scout.sdk.core ---
07:34:29 [INFO] 
07:34:29 [INFO] --- build-helper-maven-plugin:3.0.0:regex-property (initialize-regex) @ org.eclipse.scout.sdk.core ---
07:34:29 [INFO] No match to regex 'SNAPSHOT' found in '9.0.0.025_Simrel_2019_09'. The initial value '9.0.0.025_Simrel_2019_09' is left as-is...
07:34:29 [INFO] 
07:34:29 [INFO] --- maven-resources-plugin:3.1.0:resources (default-resources) @ org.eclipse.scout.sdk.core ---
07:34:29 [INFO] Using 'UTF-8' encoding to copy filtered resources.
07:34:29 [INFO] skip non existing resourceDirectory /jobs/genie.scout/org.eclipse.scout.sdk_deploy_from_tag/workspace/org.eclipse.scout.sdk.core/src/main/resources
07:34:29 [INFO] Copying 2 resources
07:34:29 [INFO] 
07:34:29 [INFO] --- maven-compiler-plugin:3.8.0:compile (default-compile) @ org.eclipse.scout.sdk.core ---
07:34:30 [INFO] Changes detected - recompiling the module!
07:34:30 [INFO] Compiling 165 source files to /jobs/genie.scout/org.eclipse.scout.sdk_deploy_from_tag/workspace/org.eclipse.scout.sdk.core/target/classes
07:34:32 [INFO] 
07:34:32 [INFO] --- maven-resources-plugin:3.1.0:testResources (default-testResources) @ org.eclipse.scout.sdk.core ---
07:34:32 [INFO] Using 'UTF-8' encoding to copy filtered resources.
07:34:32 [INFO] skip non existing resourceDirectory /jobs/genie.scout/org.eclipse.scout.sdk_deploy_from_tag/workspace/org.eclipse.scout.sdk.core/src/test/resources
07:34:32 [INFO] 
07:34:32 [INFO] --- maven-compiler-plugin:3.8.0:testCompile (default-testCompile) @ org.eclipse.scout.sdk.core ---
07:34:32 [INFO] No sources to compile
07:34:32 [INFO] 
07:34:32 [INFO] --- maven-surefire-plugin:2.22.1:test (default-test) @ org.eclipse.scout.sdk.core ---
07:34:32 [INFO] No tests to run.
07:34:32 [INFO] 
07:34:32 [INFO] --- maven-jar-plugin:3.1.1:jar (default-jar) @ org.eclipse.scout.sdk.core ---
07:34:32 [INFO] Building jar: /jobs/genie.scout/org.eclipse.scout.sdk_deploy_from_tag/workspace/org.eclipse.scout.sdk.core/target/org.eclipse.scout.sdk.core-9.0.0.025_Simrel_2019_09.jar
07:34:32 [INFO] 
07:34:32 [INFO] --- maven-site-plugin:3.7.1:attach-descriptor (attach-descriptor) @ org.eclipse.scout.sdk.core ---
07:34:32 [INFO] Skipping because packaging 'jar' is not pom.
07:34:32 [INFO] 
07:34:32 [INFO] --- maven-jar-plugin:3.1.1:test-jar (attach-tests) @ org.eclipse.scout.sdk.core ---
07:34:32 [INFO] Skipping packaging of the test-jar
07:34:32 [INFO] 
07:34:32 [INFO] --- maven-source-plugin:3.0.1:test-jar-no-fork (attach-test-sources) @ org.eclipse.scout.sdk.core ---
07:34:32 [INFO] No sources in project. Archive not created.
07:34:32 [INFO] 
07:34:32 [INFO] --- duplicate-finder-maven-plugin:1.3.0:check (default) @ org.eclipse.scout.sdk.core ---
07:34:32 [INFO] Checking compile classpath
07:34:32 [INFO] Checking runtime classpath
07:34:32 [INFO] Checking test classpath
07:34:32 [INFO] 
07:34:32 [INFO] --- animal-sniffer-maven-plugin:1.17:check (enforce-java-api-compatibility) @ org.eclipse.scout.sdk.core ---
07:34:32 [INFO] Checking unresolved references to org.codehaus.mojo.signature:java18:1.0
07:34:33 [INFO] 
07:34:33 [INFO] --- maven-source-plugin:3.0.1:jar-no-fork (attach-sources) @ org.eclipse.scout.sdk.core ---
07:34:33 [INFO] Building jar: /jobs/genie.scout/org.eclipse.scout.sdk_deploy_from_tag/workspace/org.eclipse.scout.sdk.core/target/org.eclipse.scout.sdk.core-9.0.0.025_Simrel_2019_09-sources.jar
07:34:33 [INFO] 
07:34:33 [INFO] --- maven-install-plugin:2.5.2:install (default-install) @ org.eclipse.scout.sdk.core ---
07:34:33 [INFO] Installing /jobs/genie.scout/org.eclipse.scout.sdk_deploy_from_tag/workspace/org.eclipse.scout.sdk.core/target/org.eclipse.scout.sdk.core-9.0.0.025_Simrel_2019_09.jar to /home/hudson/genie.scout/.jenkins/jobs/org.eclipse.scout.sdk_deploy_from_tag/workspace/.repository/org/eclipse/scout/sdk/org.eclipse.scout.sdk.core/9.0.0.025_Simrel_2019_09/org.eclipse.scout.sdk.core-9.0.0.025_Simrel_2019_09.jar
07:34:33 [INFO] Installing /jobs/genie.scout/org.eclipse.scout.sdk_deploy_from_tag/workspace/org.eclipse.scout.sdk.core/pom.xml to /home/hudson/genie.scout/.jenkins/jobs/org.eclipse.scout.sdk_deploy_from_tag/workspace/.repository/org/eclipse/scout/sdk/org.eclipse.scout.sdk.core/9.0.0.025_Simrel_2019_09/org.eclipse.scout.sdk.core-9.0.0.025_Simrel_2019_09.pom
07:34:33 [INFO] Installing /jobs/genie.scout/org.eclipse.scout.sdk_deploy_from_tag/workspace/org.eclipse.scout.sdk.core/target/org.eclipse.scout.sdk.core-9.0.0.025_Simrel_2019_09-sources.jar to /home/hudson/genie.scout/.jenkins/jobs/org.eclipse.scout.sdk_deploy_from_tag/workspace/.repository/org/eclipse/scout/sdk/org.eclipse.scout.sdk.core/9.0.0.025_Simrel_2019_09/org.eclipse.scout.sdk.core-9.0.0.025_Simrel_2019_09-sources.jar
07:34:33 [INFO] 
07:34:33 [INFO] -------< org.eclipse.scout.sdk:org.eclipse.scout.sdk.core.test >--------
07:34:33 [INFO] Building org.eclipse.scout.sdk:org.eclipse.scout.sdk.core.test 9.0.0.025_Simrel_2019_09 [6/14]
07:34:33 [INFO] --------------------------------[ jar ]---------------------------------
07:34:33 [INFO] 
07:34:33 [INFO] --- maven-clean-plugin:3.1.0:clean (default-clean) @ org.eclipse.scout.sdk.core.test ---
07:34:33 [INFO] Deleting /jobs/genie.scout/org.eclipse.scout.sdk_deploy_from_tag/workspace/org.eclipse.scout.sdk.core.test/target
07:34:33 [INFO] 
07:34:33 [INFO] --- maven-enforcer-plugin:1.4.1:enforce (enforce-rules) @ org.eclipse.scout.sdk.core.test ---
07:34:33 [INFO] 
07:34:33 [INFO] --- git-commit-id-plugin:2.2.5:revision (default) @ org.eclipse.scout.sdk.core.test ---
07:34:34 [INFO] 
07:34:34 [INFO] --- jacoco-maven-plugin:0.8.2:prepare-agent (default) @ org.eclipse.scout.sdk.core.test ---
07:34:34 [INFO] master_test_jacocoArgLine set to -javaagent:/home/hudson/genie.scout/.jenkins/jobs/org.eclipse.scout.sdk_deploy_from_tag/workspace/.repository/org/jacoco/org.jacoco.agent/0.8.2/org.jacoco.agent-0.8.2-runtime.jar=destfile=/jobs/genie.scout/org.eclipse.scout.sdk_deploy_from_tag/workspace/org.eclipse.scout.sdk.core.test/../org.eclipse.scout.sdk/target/jacoco-all.exec
07:34:34 [INFO] 
07:34:34 [INFO] --- build-helper-maven-plugin:3.0.0:parse-version (initialize-parse-version) @ org.eclipse.scout.sdk.core.test ---
07:34:34 [INFO] 
07:34:34 [INFO] --- build-helper-maven-plugin:3.0.0:regex-property (initialize-regex) @ org.eclipse.scout.sdk.core.test ---
07:34:34 [INFO] No match to regex 'SNAPSHOT' found in '9.0.0.025_Simrel_2019_09'. The initial value '9.0.0.025_Simrel_2019_09' is left as-is...
07:34:34 [INFO] 
07:34:34 [INFO] --- build-helper-maven-plugin:3.0.0:add-source (add-source) @ org.eclipse.scout.sdk.core.test ---
07:34:34 [INFO] Source directory: /jobs/genie.scout/org.eclipse.scout.sdk_deploy_from_tag/workspace/org.eclipse.scout.sdk.core.test/src/main/fixture added.
07:34:34 [INFO] 
07:34:34 [INFO] --- maven-resources-plugin:3.1.0:resources (default-resources) @ org.eclipse.scout.sdk.core.test ---
07:34:34 [INFO] Using 'UTF-8' encoding to copy filtered resources.
07:34:34 [INFO] Copying 2 resources
07:34:34 [INFO] Copying 2 resources
07:34:34 [INFO] 
07:34:34 [INFO] --- maven-compiler-plugin:3.8.0:compile (default-compile) @ org.eclipse.scout.sdk.core.test ---
07:34:34 [INFO] Changes detected - recompiling the module!
07:34:34 [INFO] Compiling 38 source files to /jobs/genie.scout/org.eclipse.scout.sdk_deploy_from_tag/workspace/org.eclipse.scout.sdk.core.test/target/classes
07:34:34 [INFO] 
07:34:34 [INFO] --- maven-resources-plugin:3.1.0:testResources (default-testResources) @ org.eclipse.scout.sdk.core.test ---
07:34:34 [INFO] Using 'UTF-8' encoding to copy filtered resources.
07:34:34 [INFO] skip non existing resourceDirectory /jobs/genie.scout/org.eclipse.scout.sdk_deploy_from_tag/workspace/org.eclipse.scout.sdk.core.test/src/test/resources
07:34:34 [INFO] 
07:34:34 [INFO] --- maven-compiler-plugin:3.8.0:testCompile (default-testCompile) @ org.eclipse.scout.sdk.core.test ---
07:34:34 [INFO] Changes detected - recompiling the module!
07:34:34 [INFO] Compiling 29 source files to /jobs/genie.scout/org.eclipse.scout.sdk_deploy_from_tag/workspace/org.eclipse.scout.sdk.core.test/target/test-classes
07:34:35 [INFO] 
07:34:35 [INFO] --- maven-surefire-plugin:2.22.1:test (default-test) @ org.eclipse.scout.sdk.core.test ---
07:34:35 [INFO] 
07:34:35 [INFO] -------------------------------------------------------
07:34:35 [INFO]  T E S T S
07:34:35 [INFO] -------------------------------------------------------
07:34:35 [INFO] Running org.eclipse.scout.sdk.core.util.SdkLogTest
07:34:36 Unable to parse log level 'aa'. Fallback to default: 'WARNING'.
07:34:36 java.lang.IllegalArgumentException: Bad level "aa"
07:34:36 	at java.util.logging.Level.parse(Level.java:488)
07:34:36 	at org.eclipse.scout.sdk.core.util.SdkLog.parseLevel(SdkLog.java:424)
07:34:36 	at org.eclipse.scout.sdk.core.util.SdkLogTest.testParseLevel(SdkLogTest.java:96)
07:34:36 	at sun.reflect.NativeMethodAccessorImpl.invoke0(Native Method)
07:34:36 	at sun.reflect.NativeMethodAccessorImpl.invoke(NativeMethodAccessorImpl.java:62)
07:34:36 	at sun.reflect.DelegatingMethodAccessorImpl.invoke(DelegatingMethodAccessorImpl.java:43)
07:34:36 	at java.lang.reflect.Method.invoke(Method.java:498)
07:34:36 	at org.junit.runners.model.FrameworkMethod$1.runReflectiveCall(FrameworkMethod.java:50)
07:34:36 	at org.junit.internal.runners.model.ReflectiveCallable.run(ReflectiveCallable.java:12)
07:34:36 	at org.junit.runners.model.FrameworkMethod.invokeExplosively(FrameworkMethod.java:47)
07:34:36 	at org.junit.internal.runners.statements.InvokeMethod.evaluate(InvokeMethod.java:17)
07:34:36 	at org.junit.runners.ParentRunner.runLeaf(ParentRunner.java:325)
07:34:36 	at org.junit.runners.BlockJUnit4ClassRunner.runChild(BlockJUnit4ClassRunner.java:78)
07:34:36 	at org.junit.runners.BlockJUnit4ClassRunner.runChild(BlockJUnit4ClassRunner.java:57)
07:34:36 	at org.junit.runners.ParentRunner$3.run(ParentRunner.java:290)
07:34:36 	at org.junit.runners.ParentRunner$1.schedule(ParentRunner.java:71)
07:34:36 	at org.junit.runners.ParentRunner.runChildren(ParentRunner.java:288)
07:34:36 	at org.junit.runners.ParentRunner.access$000(ParentRunner.java:58)
07:34:36 	at org.junit.runners.ParentRunner$2.evaluate(ParentRunner.java:268)
07:34:36 	at org.junit.runners.ParentRunner.run(ParentRunner.java:363)
07:34:36 	at org.apache.maven.surefire.junit4.JUnit4Provider.execute(JUnit4Provider.java:365)
07:34:36 	at org.apache.maven.surefire.junit4.JUnit4Provider.executeWithRerun(JUnit4Provider.java:273)
07:34:36 	at org.apache.maven.surefire.junit4.JUnit4Provider.executeTestSet(JUnit4Provider.java:238)
07:34:36 	at org.apache.maven.surefire.junit4.JUnit4Provider.invoke(JUnit4Provider.java:159)
07:34:36 	at org.apache.maven.surefire.booter.ForkedBooter.invokeProviderInSameClassLoader(ForkedBooter.java:384)
07:34:36 	at org.apache.maven.surefire.booter.ForkedBooter.runSuitesInProcess(ForkedBooter.java:345)
07:34:36 	at org.apache.maven.surefire.booter.ForkedBooter.execute(ForkedBooter.java:126)
07:34:36 	at org.apache.maven.surefire.booter.ForkedBooter.main(ForkedBooter.java:418)
07:34:36 Scout SdkLog: Failed toString() invocation on an object of type [org.eclipse.scout.sdk.core.util.SdkLogTest$ClassWithToStringThrowingNpeFixture]
07:34:36 java.lang.NullPointerException: NPE of test class org.eclipse.scout.sdk.core.util.SdkLogTest
07:34:36 	at org.eclipse.scout.sdk.core.util.SdkLogTest$ClassWithToStringThrowingNpeFixture.toString(SdkLogTest.java:156)
07:34:36 	at org.eclipse.scout.sdk.core.util.SdkLog.safeObjectToString(SdkLog.java:223)
07:34:36 	at org.eclipse.scout.sdk.core.util.SdkLog.toString(SdkLog.java:159)
07:34:36 	at org.eclipse.scout.sdk.core.util.SdkLog.handlePlaceholders(SdkLog.java:149)
07:34:36 	at org.eclipse.scout.sdk.core.util.SdkLog.log(SdkLog.java:93)
07:34:36 	at org.eclipse.scout.sdk.core.util.SdkLog.error(SdkLog.java:317)
07:34:36 	at org.eclipse.scout.sdk.core.util.SdkLogTest$1.run(SdkLogTest.java:104)
07:34:36 	at org.eclipse.scout.sdk.core.util.SdkLogTest.runWithPrivateLogger(SdkLogTest.java:193)
07:34:36 	at org.eclipse.scout.sdk.core.util.SdkLogTest.testLogOfObjectWithToStringThrowingException(SdkLogTest.java:101)
07:34:36 	at sun.reflect.NativeMethodAccessorImpl.invoke0(Native Method)
07:34:36 	at sun.reflect.NativeMethodAccessorImpl.invoke(NativeMethodAccessorImpl.java:62)
07:34:36 	at sun.reflect.DelegatingMethodAccessorImpl.invoke(DelegatingMethodAccessorImpl.java:43)
07:34:36 	at java.lang.reflect.Method.invoke(Method.java:498)
07:34:36 	at org.junit.runners.model.FrameworkMethod$1.runReflectiveCall(FrameworkMethod.java:50)
07:34:36 	at org.junit.internal.runners.model.ReflectiveCallable.run(ReflectiveCallable.java:12)
07:34:36 	at org.junit.runners.model.FrameworkMethod.invokeExplosively(FrameworkMethod.java:47)
07:34:36 	at org.junit.internal.runners.statements.InvokeMethod.evaluate(InvokeMethod.java:17)
07:34:36 	at org.junit.runners.ParentRunner.runLeaf(ParentRunner.java:325)
07:34:36 	at org.junit.runners.BlockJUnit4ClassRunner.runChild(BlockJUnit4ClassRunner.java:78)
07:34:36 	at org.junit.runners.BlockJUnit4ClassRunner.runChild(BlockJUnit4ClassRunner.java:57)
07:34:36 	at org.junit.runners.ParentRunner$3.run(ParentRunner.java:290)
07:34:36 	at org.junit.runners.ParentRunner$1.schedule(ParentRunner.java:71)
07:34:36 	at org.junit.runners.ParentRunner.runChildren(ParentRunner.java:288)
07:34:36 	at org.junit.runners.ParentRunner.access$000(ParentRunner.java:58)
07:34:36 	at org.junit.runners.ParentRunner$2.evaluate(ParentRunner.java:268)
07:34:36 	at org.junit.runners.ParentRunner.run(ParentRunner.java:363)
07:34:36 	at org.apache.maven.surefire.junit4.JUnit4Provider.execute(JUnit4Provider.java:365)
07:34:36 	at org.apache.maven.surefire.junit4.JUnit4Provider.executeWithRerun(JUnit4Provider.java:273)
07:34:36 	at org.apache.maven.surefire.junit4.JUnit4Provider.executeTestSet(JUnit4Provider.java:238)
07:34:36 	at org.apache.maven.surefire.junit4.JUnit4Provider.invoke(JUnit4Provider.java:159)
07:34:36 	at org.apache.maven.surefire.booter.ForkedBooter.invokeProviderInSameClassLoader(ForkedBooter.java:384)
07:34:36 	at org.apache.maven.surefire.booter.ForkedBooter.runSuitesInProcess(ForkedBooter.java:345)
07:34:36 	at org.apache.maven.surefire.booter.ForkedBooter.execute(ForkedBooter.java:126)
07:34:36 	at org.apache.maven.surefire.booter.ForkedBooter.main(ForkedBooter.java:418)
07:34:36 [INFO] Tests run: 5, Failures: 0, Errors: 0, Skipped: 0, Time elapsed: 0.136 s - in org.eclipse.scout.sdk.core.util.SdkLogTest
07:34:36 [INFO] Running org.eclipse.scout.sdk.core.util.JavaEnvironmentImportExportTest
07:34:36 [INFO] Tests run: 1, Failures: 0, Errors: 0, Skipped: 0, Time elapsed: 0.705 s - in org.eclipse.scout.sdk.core.util.JavaEnvironmentImportExportTest
07:34:36 [INFO] Running org.eclipse.scout.sdk.core.util.CoreUtilsTest
07:34:37 [INFO] Tests run: 39, Failures: 0, Errors: 0, Skipped: 0, Time elapsed: 0.973 s - in org.eclipse.scout.sdk.core.util.CoreUtilsTest
07:34:37 [INFO] Running org.eclipse.scout.sdk.core.sourcebuilder.SourceModelRoundtripTest
07:34:38 [INFO] Tests run: 2, Failures: 0, Errors: 0, Skipped: 0, Time elapsed: 0.353 s - in org.eclipse.scout.sdk.core.sourcebuilder.SourceModelRoundtripTest
07:34:38 [INFO] Running org.eclipse.scout.sdk.core.signature.SignatureUtilsTest
07:34:38 [INFO] Tests run: 12, Failures: 0, Errors: 0, Skipped: 0, Time elapsed: 0.04 s - in org.eclipse.scout.sdk.core.signature.SignatureUtilsTest
07:34:38 [INFO] Running org.eclipse.scout.sdk.core.signature.SignatureTest
07:34:38 [INFO] Tests run: 189, Failures: 0, Errors: 0, Skipped: 0, Time elapsed: 0.065 s - in org.eclipse.scout.sdk.core.signature.SignatureTest
07:34:38 [INFO] Running org.eclipse.scout.sdk.core.model.sugar.QueryTest
07:34:38 [INFO] Tests run: 7, Failures: 0, Errors: 0, Skipped: 0, Time elapsed: 0.467 s - in org.eclipse.scout.sdk.core.model.sugar.QueryTest
07:34:38 [INFO] Running org.eclipse.scout.sdk.core.model.spi.internal.metavalue.MetaValueFactoryTest
07:34:38 [INFO] Tests run: 17, Failures: 0, Errors: 0, Skipped: 0, Time elapsed: 0.065 s - in org.eclipse.scout.sdk.core.model.spi.internal.metavalue.MetaValueFactoryTest
07:34:38 [INFO] Running org.eclipse.scout.sdk.core.model.spi.internal.CompositeObjectTest
07:34:38 [INFO] Tests run: 2, Failures: 0, Errors: 0, Skipped: 0, Time elapsed: 0.001 s - in org.eclipse.scout.sdk.core.model.spi.internal.CompositeObjectTest
07:34:38 [INFO] Running org.eclipse.scout.sdk.core.model.spi.internal.ClasspathBuilderTest
07:34:38 [INFO] Tests run: 2, Failures: 0, Errors: 0, Skipped: 0, Time elapsed: 0.001 s - in org.eclipse.scout.sdk.core.model.spi.internal.ClasspathBuilderTest
07:34:38 [INFO] Running org.eclipse.scout.sdk.core.model.TypeTest
07:34:38 [INFO] Tests run: 6, Failures: 0, Errors: 0, Skipped: 0, Time elapsed: 0.21 s - in org.eclipse.scout.sdk.core.model.TypeTest
07:34:38 [INFO] Running org.eclipse.scout.sdk.core.model.TypeParameterTest
07:34:38 [INFO] Tests run: 3, Failures: 0, Errors: 0, Skipped: 0, Time elapsed: 0 s - in org.eclipse.scout.sdk.core.model.TypeParameterTest
07:34:38 [INFO] Running org.eclipse.scout.sdk.core.model.SourceRangeTest
07:34:38 [INFO] Tests run: 1, Failures: 0, Errors: 0, Skipped: 0, Time elapsed: 0 s - in org.eclipse.scout.sdk.core.model.SourceRangeTest
07:34:38 [INFO] Running org.eclipse.scout.sdk.core.model.PrimitiveTypeTest
07:34:39 [INFO] Tests run: 1, Failures: 0, Errors: 0, Skipped: 0, Time elapsed: 0.034 s - in org.eclipse.scout.sdk.core.model.PrimitiveTypeTest
07:34:39 [INFO] Running org.eclipse.scout.sdk.core.model.PackageTest
07:34:39 [INFO] Tests run: 4, Failures: 0, Errors: 0, Skipped: 0, Time elapsed: 0 s - in org.eclipse.scout.sdk.core.model.PackageTest
07:34:39 [INFO] Running org.eclipse.scout.sdk.core.model.MethodTest
07:34:39 [INFO] Tests run: 3, Failures: 0, Errors: 0, Skipped: 0, Time elapsed: 0 s - in org.eclipse.scout.sdk.core.model.MethodTest
07:34:39 [INFO] Running org.eclipse.scout.sdk.core.model.MethodParameterTest
07:34:39 [INFO] Tests run: 3, Failures: 0, Errors: 0, Skipped: 0, Time elapsed: 0 s - in org.eclipse.scout.sdk.core.model.MethodParameterTest
07:34:39 [INFO] Running org.eclipse.scout.sdk.core.model.ManagedAnnotationTest
07:34:39 [INFO] Tests run: 9, Failures: 0, Errors: 0, Skipped: 0, Time elapsed: 0.728 s - in org.eclipse.scout.sdk.core.model.ManagedAnnotationTest
07:34:39 [INFO] Running org.eclipse.scout.sdk.core.model.ImportDeclarationTest
07:34:39 [INFO] Tests run: 2, Failures: 0, Errors: 0, Skipped: 0, Time elapsed: 0 s - in org.eclipse.scout.sdk.core.model.ImportDeclarationTest
07:34:39 [INFO] Running org.eclipse.scout.sdk.core.model.GenericMethodTest
07:34:40 [INFO] Tests run: 7, Failures: 0, Errors: 0, Skipped: 0, Time elapsed: 0.334 s - in org.eclipse.scout.sdk.core.model.GenericMethodTest
07:34:40 [INFO] Running org.eclipse.scout.sdk.core.model.FieldTest
07:34:40 [INFO] Tests run: 8, Failures: 0, Errors: 0, Skipped: 0, Time elapsed: 0.075 s - in org.eclipse.scout.sdk.core.model.FieldTest
07:34:40 [INFO] Running org.eclipse.scout.sdk.core.model.CreateAndOverrideNewCompilationUnitTest
07:34:40 [INFO] Tests run: 4, Failures: 0, Errors: 0, Skipped: 0, Time elapsed: 0.368 s - in org.eclipse.scout.sdk.core.model.CreateAndOverrideNewCompilationUnitTest
07:34:40 [INFO] Running org.eclipse.scout.sdk.core.model.CompilationUnitTest
07:34:40 [INFO] Tests run: 3, Failures: 0, Errors: 0, Skipped: 0, Time elapsed: 0.104 s - in org.eclipse.scout.sdk.core.model.CompilationUnitTest
07:34:40 [INFO] Running org.eclipse.scout.sdk.core.model.ArrayTypeTest
07:34:40 [INFO] Tests run: 1, Failures: 0, Errors: 0, Skipped: 0, Time elapsed: 0.109 s - in org.eclipse.scout.sdk.core.model.ArrayTypeTest
07:34:40 [INFO] Running org.eclipse.scout.sdk.core.model.AnnotationTest
07:34:40 [INFO] Tests run: 5, Failures: 0, Errors: 0, Skipped: 0, Time elapsed: 0.122 s - in org.eclipse.scout.sdk.core.model.AnnotationTest
07:34:40 [INFO] Running org.eclipse.scout.sdk.core.model.AnnotationSourceTest
07:34:41 [INFO] Tests run: 6, Failures: 0, Errors: 0, Skipped: 0, Time elapsed: 0.442 s - in org.eclipse.scout.sdk.core.model.AnnotationSourceTest
07:34:41 [INFO] Running org.eclipse.scout.sdk.core.model.AnnotationQueryTest
07:34:41 [INFO] Tests run: 4, Failures: 0, Errors: 0, Skipped: 0, Time elapsed: 0.272 s - in org.eclipse.scout.sdk.core.model.AnnotationQueryTest
07:34:41 [INFO] Running org.eclipse.scout.sdk.core.model.AnnotationElementTest
07:34:41 [INFO] Tests run: 3, Failures: 0, Errors: 0, Skipped: 0, Time elapsed: 0.001 s - in org.eclipse.scout.sdk.core.model.AnnotationElementTest
07:34:41 [INFO] Running org.eclipse.scout.sdk.core.importvalidator.ImportValidatorTest
07:34:41 [INFO] Tests run: 15, Failures: 0, Errors: 0, Skipped: 0, Time elapsed: 0.071 s - in org.eclipse.scout.sdk.core.importvalidator.ImportValidatorTest
07:34:42 [INFO] 
07:34:42 [INFO] Results:
07:34:42 [INFO] 
07:34:42 [INFO] Tests run: 364, Failures: 0, Errors: 0, Skipped: 0
07:34:42 [INFO] 
07:34:42 [INFO] 
07:34:42 [INFO] --- maven-jar-plugin:3.1.1:jar (default-jar) @ org.eclipse.scout.sdk.core.test ---
07:34:42 [INFO] Building jar: /jobs/genie.scout/org.eclipse.scout.sdk_deploy_from_tag/workspace/org.eclipse.scout.sdk.core.test/target/org.eclipse.scout.sdk.core.test-9.0.0.025_Simrel_2019_09.jar
07:34:42 [INFO] 
07:34:42 [INFO] --- maven-site-plugin:3.7.1:attach-descriptor (attach-descriptor) @ org.eclipse.scout.sdk.core.test ---
07:34:42 [INFO] Skipping because packaging 'jar' is not pom.
07:34:42 [INFO] 
07:34:42 [INFO] --- maven-jar-plugin:3.1.1:test-jar (attach-tests) @ org.eclipse.scout.sdk.core.test ---
07:34:42 [INFO] Building jar: /jobs/genie.scout/org.eclipse.scout.sdk_deploy_from_tag/workspace/org.eclipse.scout.sdk.core.test/target/org.eclipse.scout.sdk.core.test-9.0.0.025_Simrel_2019_09-tests.jar
07:34:42 [INFO] 
07:34:42 [INFO] --- maven-source-plugin:3.0.1:test-jar-no-fork (attach-test-sources) @ org.eclipse.scout.sdk.core.test ---
07:34:42 [INFO] Building jar: /jobs/genie.scout/org.eclipse.scout.sdk_deploy_from_tag/workspace/org.eclipse.scout.sdk.core.test/target/org.eclipse.scout.sdk.core.test-9.0.0.025_Simrel_2019_09-test-sources.jar
07:34:42 [INFO] 
07:34:42 [INFO] --- duplicate-finder-maven-plugin:1.3.0:check (default) @ org.eclipse.scout.sdk.core.test ---
07:34:42 [INFO] Checking compile classpath
07:34:42 [INFO] Checking runtime classpath
07:34:42 [INFO] Checking test classpath
07:34:42 [INFO] 
07:34:42 [INFO] --- animal-sniffer-maven-plugin:1.17:check (enforce-java-api-compatibility) @ org.eclipse.scout.sdk.core.test ---
07:34:42 [INFO] Checking unresolved references to org.codehaus.mojo.signature:java18:1.0
07:34:42 [INFO] 
07:34:42 [INFO] --- maven-source-plugin:3.0.1:jar-no-fork (attach-sources) @ org.eclipse.scout.sdk.core.test ---
07:34:42 [INFO] Building jar: /jobs/genie.scout/org.eclipse.scout.sdk_deploy_from_tag/workspace/org.eclipse.scout.sdk.core.test/target/org.eclipse.scout.sdk.core.test-9.0.0.025_Simrel_2019_09-sources.jar
07:34:42 [INFO] 
07:34:42 [INFO] --- maven-install-plugin:2.5.2:install (default-install) @ org.eclipse.scout.sdk.core.test ---
07:34:42 [INFO] Installing /jobs/genie.scout/org.eclipse.scout.sdk_deploy_from_tag/workspace/org.eclipse.scout.sdk.core.test/target/org.eclipse.scout.sdk.core.test-9.0.0.025_Simrel_2019_09.jar to /home/hudson/genie.scout/.jenkins/jobs/org.eclipse.scout.sdk_deploy_from_tag/workspace/.repository/org/eclipse/scout/sdk/org.eclipse.scout.sdk.core.test/9.0.0.025_Simrel_2019_09/org.eclipse.scout.sdk.core.test-9.0.0.025_Simrel_2019_09.jar
07:34:42 [INFO] Installing /jobs/genie.scout/org.eclipse.scout.sdk_deploy_from_tag/workspace/org.eclipse.scout.sdk.core.test/pom.xml to /home/hudson/genie.scout/.jenkins/jobs/org.eclipse.scout.sdk_deploy_from_tag/workspace/.repository/org/eclipse/scout/sdk/org.eclipse.scout.sdk.core.test/9.0.0.025_Simrel_2019_09/org.eclipse.scout.sdk.core.test-9.0.0.025_Simrel_2019_09.pom
07:34:42 [INFO] Installing /jobs/genie.scout/org.eclipse.scout.sdk_deploy_from_tag/workspace/org.eclipse.scout.sdk.core.test/target/org.eclipse.scout.sdk.core.test-9.0.0.025_Simrel_2019_09-tests.jar to /home/hudson/genie.scout/.jenkins/jobs/org.eclipse.scout.sdk_deploy_from_tag/workspace/.repository/org/eclipse/scout/sdk/org.eclipse.scout.sdk.core.test/9.0.0.025_Simrel_2019_09/org.eclipse.scout.sdk.core.test-9.0.0.025_Simrel_2019_09-tests.jar
07:34:42 [INFO] Installing /jobs/genie.scout/org.eclipse.scout.sdk_deploy_from_tag/workspace/org.eclipse.scout.sdk.core.test/target/org.eclipse.scout.sdk.core.test-9.0.0.025_Simrel_2019_09-test-sources.jar to /home/hudson/genie.scout/.jenkins/jobs/org.eclipse.scout.sdk_deploy_from_tag/workspace/.repository/org/eclipse/scout/sdk/org.eclipse.scout.sdk.core.test/9.0.0.025_Simrel_2019_09/org.eclipse.scout.sdk.core.test-9.0.0.025_Simrel_2019_09-test-sources.jar
07:34:42 [INFO] Installing /jobs/genie.scout/org.eclipse.scout.sdk_deploy_from_tag/workspace/org.eclipse.scout.sdk.core.test/target/org.eclipse.scout.sdk.core.test-9.0.0.025_Simrel_2019_09-sources.jar to /home/hudson/genie.scout/.jenkins/jobs/org.eclipse.scout.sdk_deploy_from_tag/workspace/.repository/org/eclipse/scout/sdk/org.eclipse.scout.sdk.core.test/9.0.0.025_Simrel_2019_09/org.eclipse.scout.sdk.core.test-9.0.0.025_Simrel_2019_09-sources.jar
07:34:42 [INFO] 
07:34:42 [INFO] ---------< org.eclipse.scout.sdk:org.eclipse.scout.sdk.core.s >---------
07:34:42 [INFO] Building org.eclipse.scout.sdk:org.eclipse.scout.sdk.core.s 9.0.0.025_Simrel_2019_09 [7/14]
07:34:42 [INFO] --------------------------------[ jar ]---------------------------------
07:34:43 [INFO] 
07:34:43 [INFO] --- maven-clean-plugin:3.1.0:clean (default-clean) @ org.eclipse.scout.sdk.core.s ---
07:34:43 [INFO] Deleting /jobs/genie.scout/org.eclipse.scout.sdk_deploy_from_tag/workspace/org.eclipse.scout.sdk.core.s/target
07:34:43 [INFO] 
07:34:43 [INFO] --- maven-enforcer-plugin:1.4.1:enforce (enforce-rules) @ org.eclipse.scout.sdk.core.s ---
07:34:43 [INFO] 
07:34:43 [INFO] --- git-commit-id-plugin:2.2.5:revision (default) @ org.eclipse.scout.sdk.core.s ---
07:34:43 [INFO] 
07:34:43 [INFO] --- jacoco-maven-plugin:0.8.2:prepare-agent (default) @ org.eclipse.scout.sdk.core.s ---
07:34:43 [INFO] master_test_jacocoArgLine set to -javaagent:/home/hudson/genie.scout/.jenkins/jobs/org.eclipse.scout.sdk_deploy_from_tag/workspace/.repository/org/jacoco/org.jacoco.agent/0.8.2/org.jacoco.agent-0.8.2-runtime.jar=destfile=/jobs/genie.scout/org.eclipse.scout.sdk_deploy_from_tag/workspace/org.eclipse.scout.sdk.core.s/../org.eclipse.scout.sdk/target/jacoco-all.exec
07:34:43 [INFO] 
07:34:43 [INFO] --- build-helper-maven-plugin:3.0.0:parse-version (initialize-parse-version) @ org.eclipse.scout.sdk.core.s ---
07:34:43 [INFO] 
07:34:43 [INFO] --- build-helper-maven-plugin:3.0.0:regex-property (initialize-regex) @ org.eclipse.scout.sdk.core.s ---
07:34:43 [INFO] No match to regex 'SNAPSHOT' found in '9.0.0.025_Simrel_2019_09'. The initial value '9.0.0.025_Simrel_2019_09' is left as-is...
07:34:43 [INFO] 
07:34:43 [INFO] --- maven-resources-plugin:3.1.0:resources (default-resources) @ org.eclipse.scout.sdk.core.s ---
07:34:43 [INFO] Using 'UTF-8' encoding to copy filtered resources.
07:34:43 [INFO] skip non existing resourceDirectory /jobs/genie.scout/org.eclipse.scout.sdk_deploy_from_tag/workspace/org.eclipse.scout.sdk.core.s/src/main/resources
07:34:43 [INFO] Copying 2 resources
07:34:43 [INFO] 
07:34:43 [INFO] --- maven-compiler-plugin:3.8.0:compile (default-compile) @ org.eclipse.scout.sdk.core.s ---
07:34:43 [INFO] Changes detected - recompiling the module!
07:34:43 [INFO] Compiling 50 source files to /jobs/genie.scout/org.eclipse.scout.sdk_deploy_from_tag/workspace/org.eclipse.scout.sdk.core.s/target/classes
07:34:44 [INFO] 
07:34:44 [INFO] --- maven-resources-plugin:3.1.0:testResources (default-testResources) @ org.eclipse.scout.sdk.core.s ---
07:34:44 [INFO] Using 'UTF-8' encoding to copy filtered resources.
07:34:44 [INFO] skip non existing resourceDirectory /jobs/genie.scout/org.eclipse.scout.sdk_deploy_from_tag/workspace/org.eclipse.scout.sdk.core.s/src/test/resources
07:34:44 [INFO] 
07:34:44 [INFO] --- maven-compiler-plugin:3.8.0:testCompile (default-testCompile) @ org.eclipse.scout.sdk.core.s ---
07:34:44 [INFO] No sources to compile
07:34:44 [INFO] 
07:34:44 [INFO] --- maven-surefire-plugin:2.22.1:test (default-test) @ org.eclipse.scout.sdk.core.s ---
07:34:44 [INFO] No tests to run.
07:34:44 [INFO] 
07:34:44 [INFO] --- maven-jar-plugin:3.1.1:jar (default-jar) @ org.eclipse.scout.sdk.core.s ---
07:34:44 [INFO] Building jar: /jobs/genie.scout/org.eclipse.scout.sdk_deploy_from_tag/workspace/org.eclipse.scout.sdk.core.s/target/org.eclipse.scout.sdk.core.s-9.0.0.025_Simrel_2019_09.jar
07:34:44 [INFO] 
07:34:44 [INFO] --- maven-site-plugin:3.7.1:attach-descriptor (attach-descriptor) @ org.eclipse.scout.sdk.core.s ---
07:34:44 [INFO] Skipping because packaging 'jar' is not pom.
07:34:44 [INFO] 
07:34:44 [INFO] --- maven-jar-plugin:3.1.1:test-jar (attach-tests) @ org.eclipse.scout.sdk.core.s ---
07:34:44 [INFO] Skipping packaging of the test-jar
07:34:44 [INFO] 
07:34:44 [INFO] --- maven-source-plugin:3.0.1:test-jar-no-fork (attach-test-sources) @ org.eclipse.scout.sdk.core.s ---
07:34:44 [INFO] No sources in project. Archive not created.
07:34:44 [INFO] 
07:34:44 [INFO] --- duplicate-finder-maven-plugin:1.3.0:check (default) @ org.eclipse.scout.sdk.core.s ---
07:34:44 [INFO] Checking compile classpath
07:34:44 [INFO] Checking runtime classpath
07:34:44 [INFO] Checking test classpath
07:34:44 [INFO] 
07:34:44 [INFO] --- animal-sniffer-maven-plugin:1.17:check (enforce-java-api-compatibility) @ org.eclipse.scout.sdk.core.s ---
07:34:44 [INFO] Checking unresolved references to org.codehaus.mojo.signature:java18:1.0
07:34:45 [INFO] 
07:34:45 [INFO] --- maven-source-plugin:3.0.1:jar-no-fork (attach-sources) @ org.eclipse.scout.sdk.core.s ---
07:34:45 [INFO] Building jar: /jobs/genie.scout/org.eclipse.scout.sdk_deploy_from_tag/workspace/org.eclipse.scout.sdk.core.s/target/org.eclipse.scout.sdk.core.s-9.0.0.025_Simrel_2019_09-sources.jar
07:34:45 [INFO] 
07:34:45 [INFO] --- maven-install-plugin:2.5.2:install (default-install) @ org.eclipse.scout.sdk.core.s ---
07:34:45 [INFO] Installing /jobs/genie.scout/org.eclipse.scout.sdk_deploy_from_tag/workspace/org.eclipse.scout.sdk.core.s/target/org.eclipse.scout.sdk.core.s-9.0.0.025_Simrel_2019_09.jar to /home/hudson/genie.scout/.jenkins/jobs/org.eclipse.scout.sdk_deploy_from_tag/workspace/.repository/org/eclipse/scout/sdk/org.eclipse.scout.sdk.core.s/9.0.0.025_Simrel_2019_09/org.eclipse.scout.sdk.core.s-9.0.0.025_Simrel_2019_09.jar
07:34:45 [INFO] Installing /jobs/genie.scout/org.eclipse.scout.sdk_deploy_from_tag/workspace/org.eclipse.scout.sdk.core.s/pom.xml to /home/hudson/genie.scout/.jenkins/jobs/org.eclipse.scout.sdk_deploy_from_tag/workspace/.repository/org/eclipse/scout/sdk/org.eclipse.scout.sdk.core.s/9.0.0.025_Simrel_2019_09/org.eclipse.scout.sdk.core.s-9.0.0.025_Simrel_2019_09.pom
07:34:45 [INFO] Installing /jobs/genie.scout/org.eclipse.scout.sdk_deploy_from_tag/workspace/org.eclipse.scout.sdk.core.s/target/org.eclipse.scout.sdk.core.s-9.0.0.025_Simrel_2019_09-sources.jar to /home/hudson/genie.scout/.jenkins/jobs/org.eclipse.scout.sdk_deploy_from_tag/workspace/.repository/org/eclipse/scout/sdk/org.eclipse.scout.sdk.core.s/9.0.0.025_Simrel_2019_09/org.eclipse.scout.sdk.core.s-9.0.0.025_Simrel_2019_09-sources.jar
07:34:45 [INFO] 
07:34:45 [INFO] ------< org.eclipse.scout.sdk:org.eclipse.scout.sdk.core.s.test >-------
07:34:45 [INFO] Building org.eclipse.scout.sdk:org.eclipse.scout.sdk.core.s.test 9.0.0.025_Simrel_2019_09 [8/14]
07:34:45 [INFO] --------------------------------[ jar ]---------------------------------
07:34:45 [WARNING] The POM for org.eclipse.scout.rt:org.eclipse.scout.rt.ui.html.test:jar:9.0.0.025_Simrel_2019_09 is missing, no dependency information available
07:34:45 [WARNING] The POM for org.eclipse.scout.rt:org.eclipse.scout.rt.server.test:jar:9.0.0.025_Simrel_2019_09 is missing, no dependency information available
07:34:45 [WARNING] The POM for org.eclipse.scout.rt:org.eclipse.scout.rt.shared:jar:9.0.0.025_Simrel_2019_09 is missing, no dependency information available
07:34:45 [INFO] ------------------------------------------------------------------------
07:34:45 [INFO] Reactor Summary for Eclipse Scout SDK 9.0.0.025_Simrel_2019_09:
07:34:45 [INFO] 
07:34:45 [INFO] Scout Hello World Sample Application ............... SUCCESS [  5.187 s]
07:34:45 [INFO] Scout JaxWs Module ................................. SUCCESS [  1.377 s]
07:34:45 [INFO] ScoutJS Sample Application ......................... SUCCESS [  1.547 s]
07:34:45 [INFO] Eclipse Scout SDK .................................. SUCCESS [  1.785 s]
07:34:45 [INFO] org.eclipse.scout.sdk:org.eclipse.scout.sdk.core ... SUCCESS [  5.189 s]
07:34:45 [INFO] org.eclipse.scout.sdk:org.eclipse.scout.sdk.core.test SUCCESS [  9.163 s]
07:34:45 [INFO] org.eclipse.scout.sdk:org.eclipse.scout.sdk.core.s . SUCCESS [  2.672 s]
07:34:45 [INFO] org.eclipse.scout.sdk:org.eclipse.scout.sdk.core.s.test FAILURE [  0.056 s]
07:34:45 [INFO] org.eclipse.scout.sdk.s2e:org.eclipse.scout.sdk.s2e  SKIPPED
07:34:45 [INFO] org.eclipse.scout.sdk.s2e:org.eclipse.scout.sdk.s2e.test SKIPPED
07:34:45 [INFO] org.eclipse.scout.sdk.s2e:org.eclipse.scout.sdk.s2e.doc SKIPPED
07:34:45 [INFO] org.eclipse.scout.sdk.s2e:org.eclipse.scout.sdk.s2e.nls SKIPPED
07:34:45 [INFO] org.eclipse.scout.sdk.s2e:org.eclipse.scout.sdk.s2e.ui SKIPPED
07:34:45 [INFO] org.eclipse.scout.sdk-settings ..................... SKIPPED
07:34:45 [INFO] ------------------------------------------------------------------------
07:34:45 [INFO] BUILD FAILURE
07:34:45 [INFO] ------------------------------------------------------------------------
07:34:45 [INFO] Total time:  28.699 s
07:34:45 [INFO] Finished at: 2019-09-10T07:34:45-04:00
07:34:45 [INFO] ------------------------------------------------------------------------
07:34:45 [ERROR] Failed to execute goal on project org.eclipse.scout.sdk.core.s.test: Could not resolve dependencies for project org.eclipse.scout.sdk:org.eclipse.scout.sdk.core.s.test:jar:9.0.0.025_Simrel_2019_09: The following artifacts could not be resolved: org.eclipse.scout.rt:org.eclipse.scout.rt.ui.html.test:jar:9.0.0.025_Simrel_2019_09, org.eclipse.scout.rt:org.eclipse.scout.rt.shared:jar:9.0.0.025_Simrel_2019_09: Failure to find org.eclipse.scout.rt:org.eclipse.scout.rt.ui.html.test:jar:9.0.0.025_Simrel_2019_09 in https://repo.eclipse.org/content/groups/releases/ was cached in the local repository, resolution will not be reattempted until the update interval of eclipse.release has elapsed or updates are forced -> [Help 1]
07:34:45 [ERROR] 
07:34:45 [ERROR] To see the full stack trace of the errors, re-run Maven with the -e switch.
07:34:45 [ERROR] Re-run Maven using the -X switch to enable full debug logging.
07:34:45 [ERROR] 
07:34:45 [ERROR] For more information about the errors and possible solutions, please read the following articles:
07:34:45 [ERROR] [Help 1] http://cwiki.apache.org/confluence/display/MAVEN/DependencyResolutionException
07:34:45 [ERROR] 
07:34:45 [ERROR] After correcting the problems, you can resume the build with the command
07:34:45 [ERROR]   mvn <goals> -rf :org.eclipse.scout.sdk.core.s.test
07:34:45 Build step 'Invoke top-level Maven targets' marked build as failure
07:34:45 Sending e-mails to: patrick.baenziger@bsi-software.com arthur.vandorp@bsi-software.com
07:34:46 Recording test results
07:34:46 Started calculate disk usage of build
07:34:46 Finished Calculation of disk usage of build in 0 seconds
07:34:50 Started calculate disk usage of workspace
07:34:50 Finished Calculation of disk usage of workspace in 0 seconds
07:34:51 Triggering a new build of publish_staged_builds
07:34:51 Finished: FAILURE