UnstableConsole Output

Skipping 2,822 KB.. Full Log
nners.ParentRunner.access$100(ParentRunner.java:66)
01:13:48 	at org.junit.runners.ParentRunner$2.evaluate(ParentRunner.java:293)
01:13:48 	at org.junit.runners.ParentRunner$3.evaluate(ParentRunner.java:306)
01:13:48 	at org.junit.runners.ParentRunner.run(ParentRunner.java:413)
01:13:48 	at org.eclipse.papyrus.junit.framework.classification.ClassificationSuite.run(ClassificationSuite.java:130)
01:13:48 	at org.junit.runners.Suite.runChild(Suite.java:128)
01:13:48 	at org.junit.runners.Suite.runChild(Suite.java:27)
01:13:48 	at org.junit.runners.ParentRunner$4.run(ParentRunner.java:331)
01:13:48 	at org.junit.runners.ParentRunner$1.schedule(ParentRunner.java:79)
01:13:48 	at org.junit.runners.ParentRunner.runChildren(ParentRunner.java:329)
01:13:48 	at org.junit.runners.ParentRunner.access$100(ParentRunner.java:66)
01:13:48 	at org.junit.runners.ParentRunner$2.evaluate(ParentRunner.java:293)
01:13:48 	at org.junit.runners.ParentRunner$3.evaluate(ParentRunner.java:306)
01:13:48 	at org.junit.runners.ParentRunner.run(ParentRunner.java:413)
01:13:48 	at org.apache.maven.surefire.junit4.JUnit4Provider.execute(JUnit4Provider.java:365)
01:13:48 	at org.apache.maven.surefire.junit4.JUnit4Provider.executeWithRerun(JUnit4Provider.java:273)
01:13:48 	at org.apache.maven.surefire.junit4.JUnit4Provider.executeTestSet(JUnit4Provider.java:238)
01:13:48 	at org.apache.maven.surefire.junit4.JUnit4Provider.invoke(JUnit4Provider.java:159)
01:13:48 	at sun.reflect.NativeMethodAccessorImpl.invoke0(Native Method)
01:13:48 	at sun.reflect.NativeMethodAccessorImpl.invoke(NativeMethodAccessorImpl.java:62)
01:13:48 	at sun.reflect.DelegatingMethodAccessorImpl.invoke(DelegatingMethodAccessorImpl.java:43)
01:13:48 	at java.lang.reflect.Method.invoke(Method.java:498)
01:13:48 	at org.apache.maven.surefire.util.ReflectionUtils.invokeMethodWithArray2(ReflectionUtils.java:206)
01:13:48 	at org.apache.maven.surefire.booter.ProviderFactory$ProviderProxy.invoke(ProviderFactory.java:161)
01:13:48 	at org.apache.maven.surefire.booter.ProviderFactory.invokeProvider(ProviderFactory.java:84)
01:13:48 	at org.eclipse.tycho.surefire.osgibooter.OsgiSurefireBooter.run(OsgiSurefireBooter.java:110)
01:13:48 	at org.eclipse.tycho.surefire.osgibooter.AbstractUITestApplication$1.run(AbstractUITestApplication.java:35)
01:13:48 	at org.eclipse.swt.widgets.RunnableLock.run(RunnableLock.java:40)
01:13:48 	at org.eclipse.swt.widgets.Synchronizer.runAsyncMessages(Synchronizer.java:185)
01:13:48 	at org.eclipse.swt.widgets.Display.runAsyncMessages(Display.java:4928)
01:13:48 	at org.eclipse.swt.widgets.Display.readAndDispatch(Display.java:4449)
01:13:48 	at org.eclipse.e4.ui.internal.workbench.swt.PartRenderingEngine$5.run(PartRenderingEngine.java:1158)
01:13:48 	at org.eclipse.core.databinding.observable.Realm.runWithDefault(Realm.java:338)
01:13:48 	at org.eclipse.e4.ui.internal.workbench.swt.PartRenderingEngine.run(PartRenderingEngine.java:1047)
01:13:48 	at org.eclipse.e4.ui.internal.workbench.E4Workbench.createAndRunUI(E4Workbench.java:155)
01:13:48 	at org.eclipse.ui.internal.Workbench.lambda$3(Workbench.java:658)
01:13:48 	at org.eclipse.core.databinding.observable.Realm.runWithDefault(Realm.java:338)
01:13:48 	at org.eclipse.ui.internal.Workbench.createAndRunWorkbench(Workbench.java:557)
01:13:48 	at org.eclipse.ui.PlatformUI.createAndRunWorkbench(PlatformUI.java:154)
01:13:48 	at org.eclipse.ui.internal.ide.application.IDEApplication.start(IDEApplication.java:150)
01:13:48 	at org.eclipse.tycho.surefire.osgibooter.UITestApplication.runApplication(UITestApplication.java:31)
01:13:48 	at org.eclipse.tycho.surefire.osgibooter.AbstractUITestApplication.run(AbstractUITestApplication.java:120)
01:13:48 	at org.eclipse.tycho.surefire.osgibooter.UITestApplication.start(UITestApplication.java:37)
01:13:48 	at org.eclipse.equinox.internal.app.EclipseAppHandle.run(EclipseAppHandle.java:203)
01:13:48 	at org.eclipse.core.runtime.internal.adaptor.EclipseAppLauncher.runApplication(EclipseAppLauncher.java:137)
01:13:48 	at org.eclipse.core.runtime.internal.adaptor.EclipseAppLauncher.start(EclipseAppLauncher.java:107)
01:13:48 	at org.eclipse.core.runtime.adaptor.EclipseStarter.run(EclipseStarter.java:401)
01:13:48 	at org.eclipse.core.runtime.adaptor.EclipseStarter.run(EclipseStarter.java:255)
01:13:48 	at sun.reflect.NativeMethodAccessorImpl.invoke0(Native Method)
01:13:48 	at sun.reflect.NativeMethodAccessorImpl.invoke(NativeMethodAccessorImpl.java:62)
01:13:48 	at sun.reflect.DelegatingMethodAccessorImpl.invoke(DelegatingMethodAccessorImpl.java:43)
01:13:48 	at java.lang.reflect.Method.invoke(Method.java:498)
01:13:48 	at org.eclipse.equinox.launcher.Main.invokeFramework(Main.java:657)
01:13:48 	at org.eclipse.equinox.launcher.Main.basicRun(Main.java:594)
01:13:48 	at org.eclipse.equinox.launcher.Main.run(Main.java:1447)
01:13:48 	at org.eclipse.equinox.launcher.Main.main(Main.java:1420)
01:15:54 log4j:WARN No appenders could be found for logger (org.eclipse.ocl.pivot.internal.resource.StandaloneProjectMap).
01:15:54 log4j:WARN Please initialize the log4j system properly.
01:17:09 Tests run: 658, Failures: 1, Errors: 2, Skipped: 38, Time elapsed: 282.208 s <<< FAILURE! - in org.eclipse.papyrus.uml.suite.tests.AllTests
01:17:09 testUML(org.eclipse.papyrus.uml.service.types.tests.creation.CreatePureUMLElementTest)  Time elapsed: 0.104 s
01:17:09 test(org.eclipse.papyrus.uml.service.types.tests.creation.CreatePureUMLElementTest)  Time elapsed: 0.285 s
01:17:09 testDeleteOneAddVariableValueAction(org.eclipse.papyrus.uml.service.types.tests.deletion.DeletePureUMLElementTest)  Time elapsed: 0.078 s
01:17:09 testDeleteOneCentralBufferNode(org.eclipse.papyrus.uml.service.types.tests.deletion.DeletePureUMLElementTest)  Time elapsed: 0.019 s
01:17:09 stereotypeApplicationsDeleted:command(org.eclipse.papyrus.uml.service.types.tests.deletion.DeleteDependentWithStereotypeApplications458685)  Time elapsed: 1.593 s
01:17:09 stereotypeApplicationsDeleted:elements(org.eclipse.papyrus.uml.service.types.tests.deletion.DeleteDependentWithStereotypeApplications458685)  Time elapsed: 0 s
01:17:09 stereotypeApplicationsDeleted:stereotypes(org.eclipse.papyrus.uml.service.types.tests.deletion.DeleteDependentWithStereotypeApplications458685)  Time elapsed: 0 s
01:17:09 stereotypeApplicationsDeleted:undo(org.eclipse.papyrus.uml.service.types.tests.deletion.DeleteDependentWithStereotypeApplications458685)  Time elapsed: 0.001 s
01:17:09 stereotypeApplicationsDeleted:redo(org.eclipse.papyrus.uml.service.types.tests.deletion.DeleteDependentWithStereotypeApplications458685)  Time elapsed: 0 s
01:17:09 deleteInitialState(org.eclipse.papyrus.uml.service.types.tests.deletion.DeleteTransitionsWithVertexTest)  Time elapsed: 0.502 s
01:17:09 deleteS1(org.eclipse.papyrus.uml.service.types.tests.deletion.DeleteTransitionsWithVertexTest)  Time elapsed: 0.244 s
01:17:09 deleteS2(org.eclipse.papyrus.uml.service.types.tests.deletion.DeleteTransitionsWithVertexTest)  Time elapsed: 0.181 s
01:17:09 deleteFinalState(org.eclipse.papyrus.uml.service.types.tests.deletion.DeleteTransitionsWithVertexTest)  Time elapsed: 0.243 s
01:17:09 deleteFromContainmentSubset(org.eclipse.papyrus.uml.service.types.tests.deletion.DeleteContainmentSubsetTest)  Time elapsed: 0.129 s
01:17:09 deleteFromTwoContainmentSupersetsAtOnce(org.eclipse.papyrus.uml.service.types.tests.deletion.DeleteContainmentSubsetTest)  Time elapsed: 0.1 s
01:17:09 createAssociationWritable(org.eclipse.papyrus.uml.service.types.tests.creation.ConnectorReadOnlyTestBug465899)  Time elapsed: 0.251 s
01:17:09 createAssociationReadOnly_usecase(org.eclipse.papyrus.uml.service.types.tests.creation.ConnectorReadOnlyTestBug465899)  Time elapsed: 0.044 s
01:17:09 createAssociationReadOnly(org.eclipse.papyrus.uml.service.types.tests.creation.ConnectorReadOnlyTestBug465899)  Time elapsed: 0.031 s
01:17:09 createConnectorTargetReadOnly(org.eclipse.papyrus.uml.service.types.tests.creation.ConnectorReadOnlyTestBug465899)  Time elapsed: 0.032 s
01:17:09 createConnectorSourceReadOnly(org.eclipse.papyrus.uml.service.types.tests.creation.ConnectorReadOnlyTestBug465899)  Time elapsed: 0.03 s
01:17:09 testDeletion(org.eclipse.papyrus.uml.service.types.tests.deletion.DeleteAssociationPropertyTypeTest)  Time elapsed: 0.05 s
01:17:09 testDeletionInCompositeDiagram(org.eclipse.papyrus.uml.service.types.tests.deletion.DeleteCommentLinkTest)  Time elapsed: 6.533 s
01:17:09 testDeletionWithSetRequest(org.eclipse.papyrus.uml.service.types.tests.deletion.DeleteCommentLinkTest) skipped
01:17:09 testDeletionInClassDiagram(org.eclipse.papyrus.uml.service.types.tests.deletion.DeleteCommentLinkTest)  Time elapsed: 1.525 s
01:17:09 testDeletionInComponentDiagram(org.eclipse.papyrus.uml.service.types.tests.deletion.DeleteCommentLinkTest)  Time elapsed: 1.476 s
01:17:09 testCreation(org.eclipse.papyrus.uml.service.types.tests.creation.CreateAssociationTest)  Time elapsed: 0.016 s
01:17:09 testCreation(org.eclipse.papyrus.uml.service.types.tests.creation.CreateAssociationDirectedTest)  Time elapsed: 0.018 s
01:17:09 testCreation(org.eclipse.papyrus.uml.service.types.tests.creation.CreateAssociationCompositeTest)  Time elapsed: 0.008 s
01:17:09 testCreation(org.eclipse.papyrus.uml.service.types.tests.creation.CreateAssociationCompositeDirectedTest)  Time elapsed: 0.006 s
01:17:09 testCreation(org.eclipse.papyrus.uml.service.types.tests.creation.CreateAssociationSharedTest)  Time elapsed: 0.005 s
01:17:09 testCreation(org.eclipse.papyrus.uml.service.types.tests.creation.CreateAssociationSharedDirectedTest)  Time elapsed: 0.006 s
01:17:09 deleteInteractionFragmentInOperand(org.eclipse.papyrus.uml.service.types.tests.deletion.InteractionDeletionTest)  Time elapsed: 0.591 s
01:17:09 deleteAllOperandsOfCombinedFragment(org.eclipse.papyrus.uml.service.types.tests.deletion.InteractionDeletionTest)  Time elapsed: 0.597 s
01:17:09 deleteCombinedFragment(org.eclipse.papyrus.uml.service.types.tests.deletion.InteractionDeletionTest)  Time elapsed: 0.611 s
01:17:09 deleteCombinedFragmentNested(org.eclipse.papyrus.uml.service.types.tests.deletion.InteractionDeletionTest)  Time elapsed: 0.56 s
01:17:09 deleteOperandsOfCombinedFragment(org.eclipse.papyrus.uml.service.types.tests.deletion.InteractionDeletionTest)  Time elapsed: 0.618 s
01:17:09 deleteCombinedFragmentDeeplyNested(org.eclipse.papyrus.uml.service.types.tests.deletion.InteractionDeletionTest)  Time elapsed: 0.626 s
01:17:09 deleteInteractionWithNesting(org.eclipse.papyrus.uml.service.types.tests.deletion.InteractionDeletionTest)  Time elapsed: 0.55 s
01:17:09 deleteInteraction(org.eclipse.papyrus.uml.service.types.tests.deletion.InteractionDeletionTest)  Time elapsed: 0.466 s
01:17:09 testCreateClassInModel(org.eclipse.papyrus.uml.service.types.ui.tests.creation.CreateElementTest)  Time elapsed: 0.012 s
01:17:09 testCreateCentralBufferNodeInActivity(org.eclipse.papyrus.uml.service.types.ui.tests.creation.CreateElementTest)  Time elapsed: 0.014 s
01:17:09 testCreateCentralBufferNodeInActivityWithNode(org.eclipse.papyrus.uml.service.types.ui.tests.creation.CreateElementTest)  Time elapsed: 0.008 s
01:17:09 testCannotCreateOperationRedefinableTemplateSignature_bug468071(org.eclipse.papyrus.uml.service.types.ui.tests.creation.CreateElementTest)  Time elapsed: 0.001 s
01:17:09 testCreateOperationTemplateSignature_bug468071(org.eclipse.papyrus.uml.service.types.ui.tests.creation.CreateElementTest)  Time elapsed: 0.01 s
01:17:09 testCreateModelInClass(org.eclipse.papyrus.uml.service.types.ui.tests.creation.CreateElementTest)  Time elapsed: 0 s
01:17:09 testCreateDeploymentBetweenNodeAndArtifactInNode(org.eclipse.papyrus.uml.service.types.ui.tests.creation.CreateRelationshipTest)  Time elapsed: 0.009 s
01:17:09 testCreatePackageMergeBetweenPackageAndPackageInPackage2(org.eclipse.papyrus.uml.service.types.ui.tests.creation.CreateRelationshipTest)  Time elapsed: 0.016 s
01:17:09 testCreateTraceBetweenClassAndNullInPackage(org.eclipse.papyrus.uml.service.types.ui.tests.creation.CreateRelationshipTest)  Time elapsed: 0.005 s
01:17:09 testCreateDependencyBetweenClassesInPackage(org.eclipse.papyrus.uml.service.types.ui.tests.creation.CreateRelationshipTest)  Time elapsed: 0.009 s
01:17:09 testCreateProtocolConformanceBetweenPackageAndPackageInPackage(org.eclipse.papyrus.uml.service.types.ui.tests.creation.CreateRelationshipTest)  Time elapsed: 0.008 s
01:17:09 testCreateInformationfloweBetweenClasses2InPackage(org.eclipse.papyrus.uml.service.types.ui.tests.creation.CreateRelationshipTest)  Time elapsed: 0.017 s
01:17:09 testCreateUsageBetweenClassAndNullInPackage(org.eclipse.papyrus.uml.service.types.ui.tests.creation.CreateRelationshipTest)  Time elapsed: 0.003 s
01:17:09 testCreateAbstractionBetweenPackageAndClassesInModel(org.eclipse.papyrus.uml.service.types.ui.tests.creation.CreateRelationshipTest)  Time elapsed: 0.016 s
01:17:09 testCreateComponentRealizationBetweenClassAndComponentInComponent(org.eclipse.papyrus.uml.service.types.ui.tests.creation.CreateRelationshipTest)  Time elapsed: 0.017 s
01:17:09 testCreateAbstractionBetweenClassesInPackage(org.eclipse.papyrus.uml.service.types.ui.tests.creation.CreateRelationshipTest)  Time elapsed: 0.006 s
01:17:09 testCreateUsageBetweenClassesInPackage(org.eclipse.papyrus.uml.service.types.ui.tests.creation.CreateRelationshipTest)  Time elapsed: 0.007 s
01:17:09 testCreatePackageImportBetweenPackageAndPackageInPackage(org.eclipse.papyrus.uml.service.types.ui.tests.creation.CreateRelationshipTest)  Time elapsed: 0.009 s
01:17:09 testCreateComponentRealizationBetweenComponentAndClassInComponent(org.eclipse.papyrus.uml.service.types.ui.tests.creation.CreateRelationshipTest)  Time elapsed: 0.019 s
01:17:09 testCreateElementImportBetweenPackageAndPackageInPackage(org.eclipse.papyrus.uml.service.types.ui.tests.creation.CreateRelationshipTest)  Time elapsed: 0.009 s
01:17:09 testCreateDeploymentBetweenNodeAndArtifactInArtifact(org.eclipse.papyrus.uml.service.types.ui.tests.creation.CreateRelationshipTest)  Time elapsed: 0.001 s
01:17:09 testCreateGeneralizationBetweenClassesInPackage(org.eclipse.papyrus.uml.service.types.ui.tests.creation.CreateRelationshipTest)  Time elapsed: 0.006 s
01:17:09 testCreateGeneralizationBetweenClassAndNullInClass(org.eclipse.papyrus.uml.service.types.ui.tests.creation.CreateRelationshipTest)  Time elapsed: 0.001 s
01:17:09 testCreateDeploymentBetweenArtifactAndNodeInArtifact(org.eclipse.papyrus.uml.service.types.ui.tests.creation.CreateRelationshipTest)  Time elapsed: 0.01 s
01:17:09 testCreateExtendBetweenClasses2InPackage(org.eclipse.papyrus.uml.service.types.ui.tests.creation.CreateRelationshipTest)  Time elapsed: 0 s
01:17:09 testCreateProtocolConformanceBetweenPackageAndPackageInPackage2(org.eclipse.papyrus.uml.service.types.ui.tests.creation.CreateRelationshipTest)  Time elapsed: 0.001 s
01:17:09 testCreateTransitionBetweenInitialAndState(org.eclipse.papyrus.uml.service.types.ui.tests.creation.CreateRelationshipTest) skipped
01:17:09 testCreateInformationfloweBetweenUseCases2InUseCase(org.eclipse.papyrus.uml.service.types.ui.tests.creation.CreateRelationshipTest)  Time elapsed: 0.003 s
01:17:09 testCreateRefineBetweenClassesInPackage(org.eclipse.papyrus.uml.service.types.ui.tests.creation.CreateRelationshipTest)  Time elapsed: 0.237 s
01:17:09 testCreateComponentRealizationBetweenClassAndComponentInClass(org.eclipse.papyrus.uml.service.types.ui.tests.creation.CreateRelationshipTest)  Time elapsed: 0.014 s
01:17:09 testCreateRealizationBetweenClassAndNullInPackage(org.eclipse.papyrus.uml.service.types.ui.tests.creation.CreateRelationshipTest)  Time elapsed: 0.003 s
01:17:09 testCreateExtensionBetweenClassAndNullInNull(org.eclipse.papyrus.uml.service.types.ui.tests.creation.CreateRelationshipTest)  Time elapsed: 0.001 s
01:17:09 testCreateExtendBetweenUseCases2InUseCase(org.eclipse.papyrus.uml.service.types.ui.tests.creation.CreateRelationshipTest)  Time elapsed: 0.016 s
01:17:09 testCreateElementImportBetweenPackageAndPackageInPackage2(org.eclipse.papyrus.uml.service.types.ui.tests.creation.CreateRelationshipTest)  Time elapsed: 0.005 s
01:17:09 testCreateAssociationBetweenClassesInPackage(org.eclipse.papyrus.uml.service.types.ui.tests.creation.CreateRelationshipTest)  Time elapsed: 0.005 s
01:17:09 testCreateTraceBetweenClassesInClass(org.eclipse.papyrus.uml.service.types.ui.tests.creation.CreateRelationshipTest)  Time elapsed: 0.02 s
01:17:09 testCreateManifestationBetweenArtifactAndPackage2InArtifact(org.eclipse.papyrus.uml.service.types.ui.tests.creation.CreateRelationshipTest)  Time elapsed: 0.012 s
01:17:09 testCreateSubstitutionBetweenClassesInPackage(org.eclipse.papyrus.uml.service.types.ui.tests.creation.CreateRelationshipTest)  Time elapsed: 0.008 s
01:17:09 testCreateAbstractionBetweenClassAndNullInPackage(org.eclipse.papyrus.uml.service.types.ui.tests.creation.CreateRelationshipTest)  Time elapsed: 0.002 s
01:17:09 testCreateAbstractionBetweenClassAndClassInClass(org.eclipse.papyrus.uml.service.types.ui.tests.creation.CreateRelationshipTest)  Time elapsed: 0.005 s
01:17:09 testCreatePackageMergeBetweenPackageAndPackageInPackage(org.eclipse.papyrus.uml.service.types.ui.tests.creation.CreateRelationshipTest)  Time elapsed: 0.003 s
01:17:09 testCreateRealizationBetweenClassesInPackage(org.eclipse.papyrus.uml.service.types.ui.tests.creation.CreateRelationshipTest)  Time elapsed: 0.004 s
01:17:09 testCreateTransitionBetweenStateAndInitial(org.eclipse.papyrus.uml.service.types.ui.tests.creation.CreateRelationshipTest) skipped
01:17:09 testCreateAssociationBetweenClassAndNullInPackage(org.eclipse.papyrus.uml.service.types.ui.tests.creation.CreateRelationshipTest)  Time elapsed: 0.001 s
01:17:09 testCreateRefineBetweenClassAndNullInPackage(org.eclipse.papyrus.uml.service.types.ui.tests.creation.CreateRelationshipTest)  Time elapsed: 0.002 s
01:17:09 testCreateDeploymentBetweenArtifactAndNodeInNode(org.eclipse.papyrus.uml.service.types.ui.tests.creation.CreateRelationshipTest)  Time elapsed: 0.006 s
01:17:09 testCreateIncludeBetweenUseCases2InUseCase(org.eclipse.papyrus.uml.service.types.ui.tests.creation.CreateRelationshipTest)  Time elapsed: 0.006 s
01:17:09 testCreateGeneralizationBetweenClassesInClass(org.eclipse.papyrus.uml.service.types.ui.tests.creation.CreateRelationshipTest)  Time elapsed: 0.003 s
01:17:09 testCreateExtensionBetweenClassAndNullInClass(org.eclipse.papyrus.uml.service.types.ui.tests.creation.CreateRelationshipTest)  Time elapsed: 0 s
01:17:09 testCreateDependencyBetweenClassAndNullInPackage(org.eclipse.papyrus.uml.service.types.ui.tests.creation.CreateRelationshipTest)  Time elapsed: 0.002 s
01:17:09 testCreatePackageImportBetweenPackageAndPackageInPackage2(org.eclipse.papyrus.uml.service.types.ui.tests.creation.CreateRelationshipTest)  Time elapsed: 0.004 s
01:17:09 testCreateComponentRealizationBetweenComponentAndClass(org.eclipse.papyrus.uml.service.types.ui.tests.creation.CreateRelationshipTest)  Time elapsed: 0.002 s
01:17:09 testCreateSubstitutionBetweenClassAndNullInPackage(org.eclipse.papyrus.uml.service.types.ui.tests.creation.CreateRelationshipTest)  Time elapsed: 0.002 s
01:17:09 testCreateInterfaceRealizationBetweenClassAndInterfaceInClass(org.eclipse.papyrus.uml.service.types.ui.tests.creation.CreateRelationshipTest)  Time elapsed: 0.008 s
01:17:09 testCreateTraceBetweenClassesInPackage(org.eclipse.papyrus.uml.service.types.ui.tests.creation.CreateRelationshipTest)  Time elapsed: 0.009 s
01:17:09 testCreateTransitionBetweenStateAndFinal(org.eclipse.papyrus.uml.service.types.ui.tests.creation.CreateRelationshipTest) skipped
01:17:09 testCreateAbstractionBetweenClassAndPackageInModel(org.eclipse.papyrus.uml.service.types.ui.tests.creation.CreateRelationshipTest)  Time elapsed: 0.003 s
01:17:09 testCreateRefineBetweenClassesInClass(org.eclipse.papyrus.uml.service.types.ui.tests.creation.CreateRelationshipTest)  Time elapsed: 0.009 s
01:17:09 testCreateTransitionBetweenFinalAndState(org.eclipse.papyrus.uml.service.types.ui.tests.creation.CreateRelationshipTest) skipped
01:17:09 testCreateManifestationBetweenClassAndPackage2InArtifact(org.eclipse.papyrus.uml.service.types.ui.tests.creation.CreateRelationshipTest)  Time elapsed: 0.005 s
01:17:09 testCreateInterfaceRealizationBetweenUseCases2InUseCase(org.eclipse.papyrus.uml.service.types.ui.tests.creation.CreateRelationshipTest)  Time elapsed: 0.002 s
01:17:09 testCreateIncludeBetweenClasses2InPackage(org.eclipse.papyrus.uml.service.types.ui.tests.creation.CreateRelationshipTest)  Time elapsed: 0 s
01:17:09 testCreateExtensionBetweenStereotypeAndMetaClassInPackage(org.eclipse.papyrus.uml.service.types.ui.tests.creation.CreateProfileRelationshipTest)  Time elapsed: 0.034 s
01:17:09 testMoveTemplateSignatureToOperation_bug468071(org.eclipse.papyrus.uml.service.types.ui.tests.creation.MoveElementTest)  Time elapsed: 0.331 s
01:17:09 testMoveRedefinableTemplateSignatureToClass_bug468071(org.eclipse.papyrus.uml.service.types.ui.tests.creation.MoveElementTest)  Time elapsed: 0.003 s
01:17:09 testCannotMoveRedefinableTemplateSignatureToOperation_bug468071(org.eclipse.papyrus.uml.service.types.ui.tests.creation.MoveElementTest)  Time elapsed: 0 s
01:17:09 testSetTemplateSignatureOfOperation_bug468071(org.eclipse.papyrus.uml.service.types.ui.tests.creation.SetFeatureTest)  Time elapsed: 0.004 s
01:17:09 testSetRedefinableTemplateSignatureOfClass_bug468071(org.eclipse.papyrus.uml.service.types.ui.tests.creation.SetFeatureTest)  Time elapsed: 0.002 s
01:17:09 testCannotSetRedefinableTemplateSignatureOfOperation_bug468071(org.eclipse.papyrus.uml.service.types.ui.tests.creation.SetFeatureTest)  Time elapsed: 0 s
01:17:09 deleteAssociation(org.eclipse.papyrus.uml.service.types.ui.tests.deletion.DeleteAssociationTest)  Time elapsed: 0.245 s
01:17:09 deleteAssociationTarget(org.eclipse.papyrus.uml.service.types.ui.tests.deletion.DeleteAssociationTest)  Time elapsed: 0.201 s
01:17:09 deleteReadOnlyElement(org.eclipse.papyrus.uml.modelexplorer.tests.DeleteModelExplorerTest)  Time elapsed: 1.231 s
01:17:09 deleteClassInTheModel(org.eclipse.papyrus.uml.modelexplorer.tests.DeleteModelExplorerTest)  Time elapsed: 0.835 s
01:17:09 deleteRootOfTheModel(org.eclipse.papyrus.uml.modelexplorer.tests.DeleteModelExplorerTest)  Time elapsed: 0.487 s
01:17:09 renameUMLUnnamedElementTest(org.eclipse.papyrus.uml.modelexplorer.tests.RenameHandlerTest) skipped
01:17:09 renameUMLNamedElementTest(org.eclipse.papyrus.uml.modelexplorer.tests.RenameHandlerTest) skipped
01:17:09 revealSemanticElement_selectRootTest(org.eclipse.papyrus.uml.modelexplorer.tests.ModelExplorerViewTests)  Time elapsed: 0.84 s
01:17:09 revealSemanticElement_selectChildrenTest(org.eclipse.papyrus.uml.modelexplorer.tests.ModelExplorerViewTests)  Time elapsed: 1.115 s
01:17:09 revealSemanticElement_selectImportedPackage(org.eclipse.papyrus.uml.modelexplorer.tests.ModelExplorerViewTests)  Time elapsed: 1 s
01:17:09 revealSemanticElement_selectImportedPackageList(org.eclipse.papyrus.uml.modelexplorer.tests.ModelExplorerViewTests)  Time elapsed: 0.918 s
01:17:09 revealSemanticElement_selectChildrenTestList(org.eclipse.papyrus.uml.modelexplorer.tests.ModelExplorerViewTests)  Time elapsed: 1.113 s
01:17:09 cutReadOnlyElement(org.eclipse.papyrus.uml.modelexplorer.tests.paste.CutPasteModelExplorerTest)  Time elapsed: 0.58 s
01:17:09 cutClassTest(org.eclipse.papyrus.uml.modelexplorer.tests.paste.CutPasteModelExplorerTest)  Time elapsed: 0.993 s
01:17:09 cutRootOfTheModel(org.eclipse.papyrus.uml.modelexplorer.tests.paste.CutPasteModelExplorerTest)  Time elapsed: 0.406 s
01:17:09 copyPasteofClass1Test(org.eclipse.papyrus.uml.modelexplorer.tests.paste.CopyPasteModelExplorerTest)  Time elapsed: 0.494 s
01:17:09 pasteOnReadOnlyElement(org.eclipse.papyrus.uml.modelexplorer.tests.paste.CopyPasteModelExplorerTest)  Time elapsed: 0.464 s
01:17:09 copyPasteofClass1And2Test(org.eclipse.papyrus.uml.modelexplorer.tests.paste.CopyPasteModelExplorerTest)  Time elapsed: 0.45 s
01:17:09 copyPasteDiagramTest(org.eclipse.papyrus.uml.modelexplorer.tests.paste.DiagramCopyPasteModelExplorerTest)  Time elapsed: 0.382 s
01:17:09 copyPasteTableTest(org.eclipse.papyrus.uml.modelexplorer.tests.paste.TableCopyPasteModelExplorerTest)  Time elapsed: 0.444 s
01:17:09 copyPasteofClass1Test(org.eclipse.papyrus.uml.modelexplorer.tests.paste.StereotypeCopyPasteModelExplorerTest)  Time elapsed: 1.149 s
01:17:09 advancedModeDoesNotCollapseItself(org.eclipse.papyrus.uml.modelexplorer.tests.AdvancedModeTest)  Time elapsed: 1.024 s  <<< ERROR!
01:17:09 org.eclipse.emf.common.util.BasicEList$BasicIndexOutOfBoundsException: index=0, size=0
01:17:09 
01:17:09 advancedModeDoesNotCollapseItself(org.eclipse.papyrus.uml.modelexplorer.tests.AdvancedModeTest)  Time elapsed: 1.024 s  <<< ERROR!
01:17:09 java.lang.NullPointerException
01:17:09 	at org.eclipse.papyrus.uml.modelexplorer.tests.AdvancedModeTest.advancedModeDoesNotCollapseItself(AdvancedModeTest.java:69)
01:17:09 
01:17:09 validateModel[0](org.eclipse.papyrus.uml.modelexplorer.tests.resources.ModelValidationTest)  Time elapsed: 0.028 s
01:17:09 validateModel[1](org.eclipse.papyrus.uml.modelexplorer.tests.resources.ModelValidationTest)  Time elapsed: 0.014 s
01:17:09 org.eclipse.papyrus.uml.diagram.dnd.tests.tests.InstanceSpecificationTest  Time elapsed: 0.796 s  <<< FAILURE!
01:17:09 java.lang.AssertionError: Cannot load the test diagram
01:17:09 	at org.eclipse.papyrus.uml.diagram.dnd.tests.tests.InstanceSpecificationTest.initModel(InstanceSpecificationTest.java:131)
01:17:09 	at org.eclipse.papyrus.uml.diagram.dnd.tests.tests.InstanceSpecificationTest.init(InstanceSpecificationTest.java:91)
01:17:09 
01:17:09 singleValuePropertyGraphicalTest(org.eclipse.papyrus.uml.tools.tests.tests.ContentProviderTest)  Time elapsed: 0.1 s
01:17:09 singleValuePropertyTest(org.eclipse.papyrus.uml.tools.tests.tests.ContentProviderTest)  Time elapsed: 0.022 s
01:17:09 multipleValuePropertyTest(org.eclipse.papyrus.uml.tools.tests.tests.ContentProviderTest) skipped
01:17:09 enumPropertyTest(org.eclipse.papyrus.uml.tools.tests.tests.ContentProviderTest)  Time elapsed: 0.009 s
01:17:09 testProfileContentWithBaseClassPropertyWithoutInheritedProperties(org.eclipse.papyrus.uml.tools.tests.tests.UMLStereotypePropertyContentProviderTest)  Time elapsed: 0.225 s
01:17:09 testProfileContentWithoutBaseClassPropertyWithoutInheritedProperties(org.eclipse.papyrus.uml.tools.tests.tests.UMLStereotypePropertyContentProviderTest)  Time elapsed: 0.173 s
01:17:09 testProfileContentWithBaseClassPropertyWithInheritedProperties(org.eclipse.papyrus.uml.tools.tests.tests.UMLStereotypePropertyContentProviderTest)  Time elapsed: 0.136 s
01:17:09 testProfileContentWithoutBaseClassPropertyWithInheritedProperties(org.eclipse.papyrus.uml.tools.tests.tests.UMLStereotypePropertyContentProviderTest)  Time elapsed: 0.135 s
01:17:09 testSwitchToProxy(org.eclipse.papyrus.uml.tools.tests.tests.DependencyManagementTest) skipped
01:17:09 testSwitchProfilesWithStereotypes(org.eclipse.papyrus.uml.tools.tests.tests.DependencyManagementTest)  Time elapsed: 1.455 s
01:17:09 testSwitchFromRegistererdToLocal(org.eclipse.papyrus.uml.tools.tests.tests.DependencyManagementTest)  Time elapsed: 1.281 s
01:17:09 testSwitchProfilesWithStereotypeProperties(org.eclipse.papyrus.uml.tools.tests.tests.DependencyManagementTest)  Time elapsed: 1.27 s
01:17:09 testSwitchProfilesWithMissingDefinitions(org.eclipse.papyrus.uml.tools.tests.tests.DependencyManagementTest)  Time elapsed: 1.379 s
01:17:09 testSwitchFromLocalToRegistered(org.eclipse.papyrus.uml.tools.tests.tests.DependencyManagementTest)  Time elapsed: 1.236 s
01:17:09 testSwitchToDifferentVersion(org.eclipse.papyrus.uml.tools.tests.tests.DependencyManagementTest) skipped
01:17:09 testSimpleSwitch(org.eclipse.papyrus.uml.tools.tests.tests.DependencyManagementTest)  Time elapsed: 1.569 s
01:17:09 testSwitchFromProxy(org.eclipse.papyrus.uml.tools.tests.tests.DependencyManagementTest) skipped
01:17:09 testSwitchProfilesStereotypeIdentities(org.eclipse.papyrus.uml.tools.tests.tests.DependencyManagementTest)  Time elapsed: 1.478 s
01:17:09 testSwitchProfilesWithRequiredStereotypes(org.eclipse.papyrus.uml.tools.tests.tests.DependencyManagementTest)  Time elapsed: 1.146 s
01:17:09 testOverloadDoesNotClash(org.eclipse.papyrus.uml.tools.tests.tests.NamedElementValidatorTest)  Time elapsed: 0.047 s
01:17:09 testNameClash(org.eclipse.papyrus.uml.tools.tests.tests.NamedElementValidatorTest)  Time elapsed: 0.039 s
01:17:09 testElementOfDifferentKindDoesNotClash(org.eclipse.papyrus.uml.tools.tests.tests.NamedElementValidatorTest)  Time elapsed: 0.033 s
01:17:09 testModifiedSysMLStereotype(org.eclipse.papyrus.uml.tools.tests.tests.StereotypeElementListenerTest) skipped
01:17:09 testUndoUnapplyProfile(org.eclipse.papyrus.uml.tools.tests.tests.StereotypeElementListenerTest)  Time elapsed: 0.337 s
01:17:09 testAddStereotype(org.eclipse.papyrus.uml.tools.tests.tests.StereotypeElementListenerTest)  Time elapsed: 0.368 s
01:17:09 testStereotypeUnsetAttributeChange(org.eclipse.papyrus.uml.tools.tests.tests.StereotypeElementListenerTest)  Time elapsed: 0.325 s
01:17:09 testUndoAddStereotype(org.eclipse.papyrus.uml.tools.tests.tests.StereotypeElementListenerTest)  Time elapsed: 0.324 s
01:17:09 testAddStereotypes(org.eclipse.papyrus.uml.tools.tests.tests.StereotypeElementListenerTest)  Time elapsed: 0.284 s
01:17:09 testUndoRemoveStereotype(org.eclipse.papyrus.uml.tools.tests.tests.StereotypeElementListenerTest)  Time elapsed: 0.296 s
01:17:09 testAddSysMLStereotype(org.eclipse.papyrus.uml.tools.tests.tests.StereotypeElementListenerTest)  Time elapsed: 0.44 s
01:17:09 testModifiedStereotype(org.eclipse.papyrus.uml.tools.tests.tests.StereotypeElementListenerTest)  Time elapsed: 0.517 s
01:17:09 testAddStereotypeOnSeveralElements(org.eclipse.papyrus.uml.tools.tests.tests.StereotypeElementListenerTest)  Time elapsed: 0.371 s
01:17:09 testUndoAddStereotypes(org.eclipse.papyrus.uml.tools.tests.tests.StereotypeElementListenerTest)  Time elapsed: 0.28 s
01:17:09 testFakeBasedProperty(org.eclipse.papyrus.uml.tools.tests.tests.StereotypeElementListenerTest)  Time elapsed: 0.408 s
01:17:09 testRemoveStereotype(org.eclipse.papyrus.uml.tools.tests.tests.StereotypeElementListenerTest)  Time elapsed: 0.422 s
01:17:09 testRemoveSysMLStereotype(org.eclipse.papyrus.uml.tools.tests.tests.StereotypeElementListenerTest)  Time elapsed: 0.319 s
01:17:09 testUndoAddSysMLStereotype(org.eclipse.papyrus.uml.tools.tests.tests.StereotypeElementListenerTest)  Time elapsed: 0.423 s
01:17:09 testUndoModifiedStereotype(org.eclipse.papyrus.uml.tools.tests.tests.StereotypeElementListenerTest)  Time elapsed: 0.57 s
01:17:09 testUndoAddStereotypeOnSeveralElements(org.eclipse.papyrus.uml.tools.tests.tests.StereotypeElementListenerTest)  Time elapsed: 0.278 s
01:17:09 testUndoRedoAddStereotypeTiming(org.eclipse.papyrus.uml.tools.tests.tests.StereotypeElementListenerTest)  Time elapsed: 0.334 s
01:17:09 testUnapplyProfile(org.eclipse.papyrus.uml.tools.tests.tests.StereotypeElementListenerTest)  Time elapsed: 0.426 s
01:17:09 testUndoRemoveSysMLStereotype(org.eclipse.papyrus.uml.tools.tests.tests.StereotypeElementListenerTest)  Time elapsed: 0.47 s
01:17:09 testUndoModifiedSysMLStereotype(org.eclipse.papyrus.uml.tools.tests.tests.StereotypeElementListenerTest) skipped
01:17:09 testStereotypeListAttributeChange(org.eclipse.papyrus.uml.tools.tests.tests.StereotypeElementListenerTest)  Time elapsed: 0.395 s
01:17:09 twoProfilesUnapplied(org.eclipse.papyrus.uml.tools.tests.tests.ProfileApplicationListenerTest)  Time elapsed: 0.112 s
01:17:09 moveProfileApplication(org.eclipse.papyrus.uml.tools.tests.tests.ProfileApplicationListenerTest)  Time elapsed: 0.107 s
01:17:09 applyProfileThenMoveApplication(org.eclipse.papyrus.uml.tools.tests.tests.ProfileApplicationListenerTest)  Time elapsed: 0.173 s
01:17:09 twoProfilesApplied(org.eclipse.papyrus.uml.tools.tests.tests.ProfileApplicationListenerTest)  Time elapsed: 0.148 s
01:17:09 profileReplacedInAnApplication(org.eclipse.papyrus.uml.tools.tests.tests.ProfileApplicationListenerTest)  Time elapsed: 0.177 s
01:17:09 simpleNewProfileApplication(org.eclipse.papyrus.uml.tools.tests.tests.ProfileApplicationListenerTest)  Time elapsed: 0.274 s
01:17:09 simpleProfileUnapplication(org.eclipse.papyrus.uml.tools.tests.tests.ProfileApplicationListenerTest)  Time elapsed: 0.211 s
01:17:09 profileAppliedThenReplacedInSameApplication(org.eclipse.papyrus.uml.tools.tests.tests.ProfileApplicationListenerTest)  Time elapsed: 0.182 s
01:17:09 testEditToDisplaySingleString_1(org.eclipse.papyrus.uml.tools.tests.tests.UMLReferenceConverterTest)  Time elapsed: 0.064 s
01:17:09 testList(org.eclipse.papyrus.uml.tools.tests.tests.UMLReferenceConverterTest)  Time elapsed: 0.059 s
01:17:09 testNull(org.eclipse.papyrus.uml.tools.tests.tests.UMLReferenceConverterTest)  Time elapsed: 0.066 s
01:17:09 testDisplayToEditString_1(org.eclipse.papyrus.uml.tools.tests.tests.UMLReferenceConverterTest)  Time elapsed: 0.049 s
01:17:09 testEmptyString(org.eclipse.papyrus.uml.tools.tests.tests.UMLReferenceConverterTest)  Time elapsed: 0.051 s
01:17:09 testClass2(org.eclipse.papyrus.uml.tools.tests.tests.UMLReferenceConverterTest)  Time elapsed: 0.054 s
01:17:09 testClass3(org.eclipse.papyrus.uml.tools.tests.tests.UMLReferenceConverterTest)  Time elapsed: 0.033 s
01:17:09 testMatchingElementstSingleValue1(org.eclipse.papyrus.uml.tools.tests.tests.UMLReferenceConverterTest)  Time elapsed: 0.034 s
01:17:09 testMatchingElementstSingleValue2(org.eclipse.papyrus.uml.tools.tests.tests.UMLReferenceConverterTest)  Time elapsed: 0.034 s
01:17:09 testCompletionToFindClass_1(org.eclipse.papyrus.uml.tools.tests.tests.UMLReferenceConverterCompletionTest)  Time elapsed: 0.183 s
01:17:09 testCompletionToFindClass_3(org.eclipse.papyrus.uml.tools.tests.tests.UMLReferenceConverterCompletionTest)  Time elapsed: 0.073 s
01:17:09 testCompletionToFindClass_4(org.eclipse.papyrus.uml.tools.tests.tests.UMLReferenceConverterCompletionTest)  Time elapsed: 0.049 s
01:17:09 testCompletionToFindClass_5(org.eclipse.papyrus.uml.tools.tests.tests.UMLReferenceConverterCompletionTest)  Time elapsed: 0.045 s
01:17:09 testCompletionToFindClass_6(org.eclipse.papyrus.uml.tools.tests.tests.UMLReferenceConverterCompletionTest)  Time elapsed: 0.082 s
01:17:09 testCompletionToFindClass_7(org.eclipse.papyrus.uml.tools.tests.tests.UMLReferenceConverterCompletionTest)  Time elapsed: 0.233 s
01:17:09 testCompletionToFindClass_8(org.eclipse.papyrus.uml.tools.tests.tests.UMLReferenceConverterCompletionTest)  Time elapsed: 0.036 s
01:17:09 testSplitString_1(org.eclipse.papyrus.uml.tools.tests.tests.UMLReferenceConverterCompletionTest)  Time elapsed: 0.04 s
01:17:09 testSplitString_2(org.eclipse.papyrus.uml.tools.tests.tests.UMLReferenceConverterCompletionTest)  Time elapsed: 0.042 s
01:17:09 testCompletionToFindConstraint_1(org.eclipse.papyrus.uml.tools.tests.tests.UMLReferenceConverterCompletionTest)  Time elapsed: 0.041 s
01:17:09 testCompletionToFindConstraint_2(org.eclipse.papyrus.uml.tools.tests.tests.UMLReferenceConverterCompletionTest)  Time elapsed: 0.037 s
01:17:09 testCompletionMultiValueConverterEmptyString(org.eclipse.papyrus.uml.tools.tests.tests.UMLReferenceConverterCompletionTest)  Time elapsed: 0.042 s
01:17:09 testCompletionToFindPackage_1(org.eclipse.papyrus.uml.tools.tests.tests.UMLReferenceConverterCompletionTest)  Time elapsed: 0.039 s
01:17:09 testCompletionToFindPackage_2(org.eclipse.papyrus.uml.tools.tests.tests.UMLReferenceConverterCompletionTest)  Time elapsed: 0.036 s
01:17:09 testCompletionSingleValueConverterEmptyString(org.eclipse.papyrus.uml.tools.tests.tests.UMLReferenceConverterCompletionTest)  Time elapsed: 0.038 s
01:17:09 profileLanguage(org.eclipse.papyrus.uml.tools.tests.tests.UMLLanguageProvidersTest)  Time elapsed: 0.003 s
01:17:09 umlLanguage(org.eclipse.papyrus.uml.tools.tests.tests.UMLLanguageProvidersTest)  Time elapsed: 0.002 s
01:17:09 ValidationStereotypesListClass1Test(org.eclipse.papyrus.uml.tools.tests.tests.IconsStereotypesTest)  Time elapsed: 0.757 s
01:17:09 ValidationStereotypesListClass2Test(org.eclipse.papyrus.uml.tools.tests.tests.IconsStereotypesTest)  Time elapsed: 0.809 s
01:17:09 ValidationStereotypesListClass3Test(org.eclipse.papyrus.uml.tools.tests.tests.IconsStereotypesTest)  Time elapsed: 0.648 s
01:17:09 ValidationStereotypesListClass4Test(org.eclipse.papyrus.uml.tools.tests.tests.IconsStereotypesTest)  Time elapsed: 0.643 s
01:17:09 ValidationImageClass1Test(org.eclipse.papyrus.uml.tools.tests.tests.IconsStereotypesTest)  Time elapsed: 0.838 s
01:17:09 ValidationImageClass2Test(org.eclipse.papyrus.uml.tools.tests.tests.IconsStereotypesTest)  Time elapsed: 0.802 s
01:17:09 ValidationImageClass3Test(org.eclipse.papyrus.uml.tools.tests.tests.IconsStereotypesTest)  Time elapsed: 0.717 s
01:17:09 ValidationImageClass4Test(org.eclipse.papyrus.uml.tools.tests.tests.IconsStereotypesTest)  Time elapsed: 0.739 s
01:17:09 returnedTextTest(org.eclipse.papyrus.uml.tools.tests.tests.CustomizableDelegatingItemLabelProviderTest)  Time elapsed: 0.849 s
01:17:09 returnedStyledTextTest(org.eclipse.papyrus.uml.tools.tests.tests.CustomizableDelegatingItemLabelProviderTest)  Time elapsed: 0.776 s
01:17:09 notifyChange(org.eclipse.papyrus.uml.tools.tests.tests.DelegatingItemLabelProviderTest)  Time elapsed: 0.057 s
01:17:09 copyingInterfaceRealizationDoesNotCorruptTheModel(org.eclipse.papyrus.uml.tools.tests.tests.UMLCopyTest)  Time elapsed: 0.004 s
01:17:09 copyingInterfaceRealizationDoesNotCorruptTheModel(org.eclipse.papyrus.uml.tools.tests.tests.UMLCopyTestME)  Time elapsed: 0.619 s
01:17:09 duplicateStereotypeWithMultivaluedDataTypeContainmentFeatureTest(org.eclipse.papyrus.uml.tools.tests.tests.DuplicateStereotypeCommandTest)  Time elapsed: 1.231 s
01:17:09 duplicateStereotypeWithMultivaluedContainmentFeatureTest(org.eclipse.papyrus.uml.tools.tests.tests.DuplicateStereotypeCommandTest)  Time elapsed: 0.985 s
01:17:09 duplicateStereotypeWithSingleContainmentFeatureTest(org.eclipse.papyrus.uml.tools.tests.tests.DuplicateStereotypeCommandTest)  Time elapsed: 0.992 s
01:17:09 recursiveImportPackage(org.eclipse.papyrus.uml.tools.utils.tests.tests.NameResolutionHelperTest)  Time elapsed: 0.062 s
01:17:09 testIsAutoNamed(org.eclipse.papyrus.uml.tools.utils.tests.tests.NamedElementUtilTest)  Time elapsed: 0.033 s
01:17:09 testGetDefaultNameWithIncrement(org.eclipse.papyrus.uml.tools.utils.tests.tests.NamedElementUtilTest)  Time elapsed: 0.001 s
01:17:09 testAutoNameIncrement(org.eclipse.papyrus.uml.tools.utils.tests.tests.NamedElementUtilTest)  Time elapsed: 0.001 s
01:17:09 testExistingElementHavingNameNotRenamed(org.eclipse.papyrus.uml.tools.utils.tests.tests.NamedElementUtilTest)  Time elapsed: 0.001 s
01:17:09 testGetAppliedSuperstereotype(org.eclipse.papyrus.uml.tools.utils.tests.tests.UMLUtilTest)  Time elapsed: 0.067 s
01:17:09 testGetApplicableStereotype_notStrict_notApplicable(org.eclipse.papyrus.uml.tools.utils.tests.tests.UMLUtilTest)  Time elapsed: 0.241 s
01:17:09 testGetApplicableStereotype_notStrict_applicable(org.eclipse.papyrus.uml.tools.utils.tests.tests.UMLUtilTest)  Time elapsed: 0.228 s
01:17:09 testGetApplicableStereotype_strict_applicable(org.eclipse.papyrus.uml.tools.utils.tests.tests.UMLUtilTest)  Time elapsed: 0.208 s
01:17:09 testGetAppliedSubstereotype_notApplied(org.eclipse.papyrus.uml.tools.utils.tests.tests.UMLUtilTest)  Time elapsed: 0.056 s
01:17:09 testGetApplicableStereotype_strict_notApplicable(org.eclipse.papyrus.uml.tools.utils.tests.tests.UMLUtilTest)  Time elapsed: 0.201 s
01:17:09 testGetAppliedSubstereotype_applied(org.eclipse.papyrus.uml.tools.utils.tests.tests.UMLUtilTest)  Time elapsed: 0.071 s
01:17:09 testUnApplyStereotypeApplication(org.eclipse.papyrus.uml.diagram.stereotypeproperty.TestBadUnapplyProfile2ClosedDiagComment)  Time elapsed: 1.389 s
01:17:09 testStereotypeApplicationOnClass(org.eclipse.papyrus.uml.diagram.stereotypeproperty.TestDropStereotypedClass)  Time elapsed: 0.878 s
01:17:09 testProfileApplicationOnModel(org.eclipse.papyrus.uml.diagram.stereotypeproperty.TestProfileApplication)  Time elapsed: 0.553 s
01:17:09 testBrace(org.eclipse.papyrus.uml.diagram.stereotypeproperty.tests.asbrace.TestDisplayAsBrace)  Time elapsed: 0.913 s
01:17:09 testReopenStereotypeAsComment(org.eclipse.papyrus.uml.diagram.stereotypeproperty.tests.asbrace.TestReopenAsBrace)  Time elapsed: 2.024 s
01:17:09 testStereotypeApplicationOnClass(org.eclipse.papyrus.uml.diagram.stereotypeproperty.tests.ascomment.TestDisplayAsComment)  Time elapsed: 0.634 s
01:17:09 testReopenStereotypeAsComment(org.eclipse.papyrus.uml.diagram.stereotypeproperty.tests.ascomment.TestReopenAsComment)  Time elapsed: 1.778 s
01:17:09 testStereotypeApplicationOnClass(org.eclipse.papyrus.uml.diagram.stereotypeproperty.tests.ascompartment.TestDisplayAsCompartment)  Time elapsed: 0.939 s
01:17:09 testReopenStereotypeAsComment(org.eclipse.papyrus.uml.diagram.stereotypeproperty.tests.ascompartment.TestReopenAsCompartment)  Time elapsed: 1.92 s
01:17:09 test2StereotypeApplicationsOnClass(org.eclipse.papyrus.uml.diagram.stereotypeproperty.tests.displayname.Test2StereotypeApplications)  Time elapsed: 0.815 s
01:17:09 testStereotypeApplicationOnPackage(org.eclipse.papyrus.uml.diagram.stereotypeproperty.tests.displayname.TestStereotypeApplication)  Time elapsed: 0.813 s
01:17:09 testStereotypeApplicationOnClass(org.eclipse.papyrus.uml.diagram.stereotypeproperty.tests.displayname.TestStereotypeApplication)  Time elapsed: 0.074 s
01:17:09 testQNStereotypeApplicationOnClass(org.eclipse.papyrus.uml.diagram.stereotypeproperty.tests.displayname.TestStereotypeApplicationQualifiedName)  Time elapsed: 0.541 s
01:17:09 testLayoutStereotypeApplicationOnClass(org.eclipse.papyrus.uml.diagram.stereotypeproperty.tests.layout.TestLayoutWithStereotype) skipped
01:17:09 testLayoutOnClass(org.eclipse.papyrus.uml.diagram.stereotypeproperty.tests.layout.TestLayoutWithStereotype) skipped
01:17:09 testLayoutStereotypeApplicationOnClass(org.eclipse.papyrus.uml.diagram.stereotypeproperty.tests.layout.TestLayoutWithStereotypeOnEclipseHIPPInstance) skipped
01:17:09 testLayoutOnClass(org.eclipse.papyrus.uml.diagram.stereotypeproperty.tests.layout.TestLayoutWithStereotypeOnEclipseHIPPInstance) skipped
01:17:09 testDiagramFileExtentionLabel(org.eclipse.papyrus.uml.diagram.wizards.TestCreateModelWizard)  Time elapsed: 0.242 s
01:17:09 testDiagramFileExtenstionForUML(org.eclipse.papyrus.uml.diagram.wizards.TestCreateModelWizard)  Time elapsed: 0.065 s
01:17:09 testOrderOfPages(org.eclipse.papyrus.uml.diagram.wizards.TestCreateModelWizard)  Time elapsed: 0.06 s
01:17:09 testDiagramFileExtentionLabel(org.eclipse.papyrus.uml.diagram.wizards.TestInitModelWizard)  Time elapsed: 0.098 s
01:17:09 testDiagramFileExtenstionForUML(org.eclipse.papyrus.uml.diagram.wizards.TestInitModelWizard)  Time elapsed: 0.075 s
01:17:09 testOrderOfPages(org.eclipse.papyrus.uml.diagram.wizards.TestInitModelWizard)  Time elapsed: 0.07 s
01:17:09 testOrderOfPages(org.eclipse.papyrus.uml.diagram.wizards.TestNewProjectWizard)  Time elapsed: 0.086 s
01:17:09 testForSimpleModel(org.eclipse.papyrus.uml.diagram.wizards.TestCreateModelFromExistingModelWizard)  Time elapsed: 0.109 s
01:17:09 testOrderOfPages(org.eclipse.papyrus.uml.diagram.wizards.TestCreateModelFromExistingModelWizard)  Time elapsed: 0.083 s
01:17:09 testForModelWithDot(org.eclipse.papyrus.uml.diagram.wizards.TestCreateModelFromExistingModelWizard)  Time elapsed: 0.078 s
01:17:09 missingSchema(org.eclipse.papyrus.uml.modelrepair.internal.stereotypes.StereotypeApplicationRepairSnippetTest)  Time elapsed: 0.318 s
01:17:09 noCorruptionControlCase(org.eclipse.papyrus.uml.modelrepair.internal.stereotypes.StereotypeApplicationRepairSnippetTest)  Time elapsed: 0.05 s
01:17:09 wrongProfileVersion(org.eclipse.papyrus.uml.modelrepair.internal.stereotypes.StereotypeApplicationRepairSnippetTest)  Time elapsed: 0.222 s
01:17:09 missingProfileApplication(org.eclipse.papyrus.uml.modelrepair.internal.stereotypes.StereotypeApplicationRepairSnippetTest)  Time elapsed: 0.209 s
01:17:09 deleteStereotypes(org.eclipse.papyrus.uml.modelrepair.internal.stereotypes.StereotypeApplicationRepairSnippetTest)  Time elapsed: 0.058 s
01:17:09 nestedProfileApplicationsMissingNamespace_bug434302(org.eclipse.papyrus.uml.modelrepair.internal.stereotypes.StereotypeRepairRegressionTest)  Time elapsed: 0.349 s
01:17:09 orphansOfWrongProfileVersion_bug436666(org.eclipse.papyrus.uml.modelrepair.internal.stereotypes.StereotypeRepairRegressionTest)  Time elapsed: 0.06 s
01:17:09 badSchemaLocationInNonPackageFragment_bug459488(org.eclipse.papyrus.uml.modelrepair.internal.stereotypes.StereotypeRepairRegressionTest)  Time elapsed: 0.71 s
01:17:09 nestedProfilesAndNestedApplicationsWellFormed_bug434302(org.eclipse.papyrus.uml.modelrepair.internal.stereotypes.StereotypeRepairRegressionTest)  Time elapsed: 0.274 s
01:17:09 registeredDynamicProfie_bug455329(org.eclipse.papyrus.uml.modelrepair.internal.stereotypes.StereotypeRepairRegressionTest)  Time elapsed: 0.042 s
01:17:09 nestedPackageSchemaMissing_bug436666(org.eclipse.papyrus.uml.modelrepair.internal.stereotypes.StereotypeRepairRegressionTest)  Time elapsed: 0.275 s
01:17:09 incorrectZombieGroupingWithoutProfileNamespaceURIPattern_bug496307(org.eclipse.papyrus.uml.modelrepair.internal.stereotypes.StereotypeRepairRegressionTest)  Time elapsed: 0.1 s
01:17:09 nonStereotypeApplicationsAreOK_bug436666(org.eclipse.papyrus.uml.modelrepair.internal.stereotypes.StereotypeRepairRegressionTest)  Time elapsed: 0.025 s
01:17:09 nestedProfileApplications2Pkgs1Profile_bug434302(org.eclipse.papyrus.uml.modelrepair.internal.stereotypes.StereotypeRepairRegressionTest)  Time elapsed: 0.273 s
01:17:09 crossReferencedPackageUnitWithoutOwnProfileApplication_bug458736(org.eclipse.papyrus.uml.modelrepair.internal.stereotypes.StereotypeRepairRegressionTest)  Time elapsed: 0.434 s
01:17:09 correctZombieGroupingWithProfileNamespaceURIPattern_bug496307(org.eclipse.papyrus.uml.modelrepair.internal.stereotypes.StereotypeRepairRegressionTest)  Time elapsed: 0.03 s
01:17:09 orphansOfValidSchema_bug436666(org.eclipse.papyrus.uml.modelrepair.internal.stereotypes.StereotypeRepairRegressionTest)  Time elapsed: 0.14 s
01:17:09 packageUnitWithoutOwnProfileApplication_bug455248(org.eclipse.papyrus.uml.modelrepair.internal.stereotypes.StereotypeRepairRegressionTest)  Time elapsed: 0.063 s
01:17:09 nestedPackageInProfileIsOK_bug436666(org.eclipse.papyrus.uml.modelrepair.internal.stereotypes.StereotypeRepairRegressionTest)  Time elapsed: 0.293 s
01:17:09 compareMultiVersionSameURISameVersion(org.eclipse.papyrus.uml.modelrepair.internal.uripattern.ProfileNamespaceURIPatternTest)  Time elapsed: 0 s
01:17:09 compareMultiVersionDifferentURIDifferentVersion(org.eclipse.papyrus.uml.modelrepair.internal.uripattern.ProfileNamespaceURIPatternTest)  Time elapsed: 0 s
01:17:09 compareSingleVersionDifferentURISameVersion(org.eclipse.papyrus.uml.modelrepair.internal.uripattern.ProfileNamespaceURIPatternTest)  Time elapsed: 0.001 s
01:17:09 compareMultiVersionDifferentURISameVersion(org.eclipse.papyrus.uml.modelrepair.internal.uripattern.ProfileNamespaceURIPatternTest)  Time elapsed: 0 s
01:17:09 compareCorrectInvalidComparisonConstantBehavior(org.eclipse.papyrus.uml.modelrepair.internal.uripattern.ProfileNamespaceURIPatternTest)  Time elapsed: 0 s
01:17:09 compareNoVersionSameURI(org.eclipse.papyrus.uml.modelrepair.internal.uripattern.ProfileNamespaceURIPatternTest)  Time elapsed: 0.001 s
01:17:09 compareSingleVersionDifferentURIDifferentVersion(org.eclipse.papyrus.uml.modelrepair.internal.uripattern.ProfileNamespaceURIPatternTest)  Time elapsed: 0 s
01:17:09 matchCorrectNoMatchConstantBehavior(org.eclipse.papyrus.uml.modelrepair.internal.uripattern.ProfileNamespaceURIPatternTest)  Time elapsed: 0 s
01:17:09 matchSingleVersionCorrectURIGivenVersion(org.eclipse.papyrus.uml.modelrepair.internal.uripattern.ProfileNamespaceURIPatternTest)  Time elapsed: 0 s
01:17:09 matchNoVersionCorrectURIDefaultVersion(org.eclipse.papyrus.uml.modelrepair.internal.uripattern.ProfileNamespaceURIPatternTest)  Time elapsed: 0 s
01:17:09 matchMultipleVersionCorrectURIGivenVersion(org.eclipse.papyrus.uml.modelrepair.internal.uripattern.ProfileNamespaceURIPatternTest)  Time elapsed: 0 s
01:17:09 matchMultipleVersionCorrectURIDefaultVersion(org.eclipse.papyrus.uml.modelrepair.internal.uripattern.ProfileNamespaceURIPatternTest)  Time elapsed: 0.001 s
01:17:09 compareCorrectInvalidComparisonBehaviorWrongLHS(org.eclipse.papyrus.uml.modelrepair.internal.uripattern.ProfileNamespaceURIPatternTest)  Time elapsed: 0 s
01:17:09 compareCorrectInvalidComparisonBehaviorWrongRHS(org.eclipse.papyrus.uml.modelrepair.internal.uripattern.ProfileNamespaceURIPatternTest)  Time elapsed: 0 s
01:17:09 registryExtensionPointCorrectMatch(org.eclipse.papyrus.uml.modelrepair.internal.uripattern.ProfileNamespaceURIPatternTest)  Time elapsed: 0.001 s
01:17:09 compareSingleVersionSameURIDifferentVersion(org.eclipse.papyrus.uml.modelrepair.internal.uripattern.ProfileNamespaceURIPatternTest)  Time elapsed: 0.001 s
01:17:09 compareSingleVersionSameURISameVersion(org.eclipse.papyrus.uml.modelrepair.internal.uripattern.ProfileNamespaceURIPatternTest)  Time elapsed: 0 s
01:17:09 compareMultiVersionSameURIDifferentVersion(org.eclipse.papyrus.uml.modelrepair.internal.uripattern.ProfileNamespaceURIPatternTest)  Time elapsed: 0 s
01:17:09 registryCorrectUnregisterAndRegister(org.eclipse.papyrus.uml.modelrepair.internal.uripattern.ProfileNamespaceURIPatternTest)  Time elapsed: 0 s
01:17:09 registryExtensionPointRegistered(org.eclipse.papyrus.uml.modelrepair.internal.uripattern.ProfileNamespaceURIPatternTest)  Time elapsed: 0 s
01:17:09 compareCorrectInvalidComparisonBehaviorWrongPattern(org.eclipse.papyrus.uml.modelrepair.internal.uripattern.ProfileNamespaceURIPatternTest)  Time elapsed: 0 s
01:17:09 matchNoVersionCorrectURIGivenVersion(org.eclipse.papyrus.uml.modelrepair.internal.uripattern.ProfileNamespaceURIPatternTest)  Time elapsed: 0 s
01:17:09 compareNoVersionDifferentURI(org.eclipse.papyrus.uml.modelrepair.internal.uripattern.ProfileNamespaceURIPatternTest)  Time elapsed: 0.001 s
01:17:09 matchSingleVersionCorrectURIDefaultVersion(org.eclipse.papyrus.uml.modelrepair.internal.uripattern.ProfileNamespaceURIPatternTest)  Time elapsed: 0 s
01:17:09 matchCorrectNoMatchBehavior(org.eclipse.papyrus.uml.modelrepair.internal.uripattern.ProfileNamespaceURIPatternTest)  Time elapsed: 0 s
01:17:09 interactionOperand_contentProvider(org.eclipse.papyrus.uml.properties.modelelement.tests.UMLModelElementTest)  Time elapsed: 0.084 s
01:17:09 combinedFragment_contentProvider(org.eclipse.papyrus.uml.properties.modelelement.tests.UMLModelElementTest)  Time elapsed: 0.148 s
01:17:09 testObservableValue(org.eclipse.papyrus.uml.properties.databinding.tests.MultiplicityObservableValueTest)  Time elapsed: 0.637 s
01:17:09 testObservableValue(org.eclipse.papyrus.uml.properties.databinding.tests.ExtensionEndMultiplicityObservableValueTest)  Time elapsed: 0.607 s
01:17:09 testObservableValue(org.eclipse.papyrus.uml.properties.databinding.tests.NavigationObservableValueTest)  Time elapsed: 0.602 s
01:17:09 testObservableValue(org.eclipse.papyrus.uml.properties.databinding.tests.OwnerObservableValueTest)  Time elapsed: 0.665 s
01:17:09 testObservableValue(org.eclipse.papyrus.uml.properties.databinding.tests.KeywordObservableValueTest)  Time elapsed: 0.855 s
01:17:09 testObservableValue(org.eclipse.papyrus.uml.properties.databinding.tests.UMLLabelObservableValueTest)  Time elapsed: 0.609 s
01:17:09 testObservableValue(org.eclipse.papyrus.uml.properties.databinding.tests.ImageExpressionObservableValueTest)  Time elapsed: 0.749 s
01:17:09 testObservableValue(org.eclipse.papyrus.uml.properties.databinding.tests.ImageKindObservableValueTest)  Time elapsed: 0.676 s
01:17:09 testObservableValue(org.eclipse.papyrus.uml.properties.databinding.tests.ImageNameObservableValueTest)  Time elapsed: 0.881 s
01:17:09 testObservableValue(org.eclipse.papyrus.uml.properties.databinding.tests.ElementCustomizationElementIconObservableValueTest)  Time elapsed: 1.477 s
01:17:09 testObservableValue(org.eclipse.papyrus.uml.properties.databinding.tests.ElementCustomizationQualifiedNameObservableValueTest)  Time elapsed: 1.224 s
01:17:09 testObservableValue(org.eclipse.papyrus.uml.properties.databinding.tests.ElementCustomizationShadowObservableValueTest)  Time elapsed: 0.961 s
01:17:09 testObservableValue(org.eclipse.papyrus.uml.properties.databinding.tests.ExtensionRequiredObservableValueTest)  Time elapsed: 0.776 s
01:17:09 testObservableValue(org.eclipse.papyrus.uml.properties.databinding.tests.ImportedPackageLocationObservableValueTest)  Time elapsed: 1.005 s
01:17:09 testObservableValue(org.eclipse.papyrus.uml.properties.databinding.tests.UnsettableStringObservableValueTest)  Time elapsed: 1.111 s
01:17:09 testObservableValue(org.eclipse.papyrus.uml.properties.databinding.tests.BasicObservableValueTest)  Time elapsed: 1.154 s
01:17:09 testObservableValue(org.eclipse.papyrus.uml.properties.databinding.tests.AnnotationObservableValueTest)  Time elapsed: 0.965 s
01:17:09 testObservableList(org.eclipse.papyrus.uml.properties.databinding.tests.MaskValueObservableListTest)  Time elapsed: 1.041 s
01:17:09 testObservableList(org.eclipse.papyrus.uml.properties.databinding.tests.AppliedCommentsObservableListTest)  Time elapsed: 1.068 s
01:17:09 testObservableList(org.eclipse.papyrus.uml.properties.databinding.tests.OwnedCommentsObservableListTest)  Time elapsed: 1.208 s
01:17:09 testObservableList(org.eclipse.papyrus.uml.properties.databinding.tests.ProvidedInterfaceObservableListTest)  Time elapsed: 0.818 s
01:17:09 testObservableList(org.eclipse.papyrus.uml.properties.databinding.tests.RequiredInterfaceObservableListTest)  Time elapsed: 0.754 s
01:17:09 testObservableList(org.eclipse.papyrus.uml.properties.databinding.tests.ProfileApplicationObservableListTest)  Time elapsed: 0.797 s
01:17:09 testObservableList(org.eclipse.papyrus.uml.properties.databinding.tests.StereotypeApplicationObservableListTest)  Time elapsed: 0.648 s
01:17:09 testObservableList(org.eclipse.papyrus.uml.properties.databinding.tests.BasicObservableListTest)  Time elapsed: 0.627 s
01:17:09 testObservableValue(org.eclipse.papyrus.uml.diagram.properties.databinding.tests.CanonicalObservableValueTest)  Time elapsed: 0.961 s
01:17:09 testObservableValue(org.eclipse.papyrus.uml.diagram.properties.databinding.tests.ConnectionDecorationStyleObservableValueTest)  Time elapsed: 1.131 s
01:17:09 testObservableValue(org.eclipse.papyrus.uml.diagram.properties.databinding.tests.CustomStringStyleCompartmentObservableValueTest)  Time elapsed: 0.756 s
01:17:09 testObservableValue(org.eclipse.papyrus.uml.diagram.properties.databinding.tests.CustomIntStyleCompartmentObservableValueTest)  Time elapsed: 0.808 s
01:17:09 testObservableValue(org.eclipse.papyrus.uml.diagram.properties.databinding.tests.DiagramLabelObservableValueTest)  Time elapsed: 0.54 s
01:17:09 testObservableValue(org.eclipse.papyrus.uml.diagram.properties.databinding.tests.CustomBooleanStyleWithStoreObservableValueTest)  Time elapsed: 0.502 s
01:17:09 testObservableValue(org.eclipse.papyrus.uml.diagram.properties.databinding.tests.CustomDoubleStyleWithStoreObservableValueTest)  Time elapsed: 0.567 s
01:17:09 testObservableValue(org.eclipse.papyrus.uml.diagram.properties.databinding.tests.CustomIntStyleWithStoreObservableValueTest)  Time elapsed: 0.571 s
01:17:09 testObservableValue(org.eclipse.papyrus.uml.diagram.properties.databinding.tests.RulersUnitStyleObservableValueTest)  Time elapsed: 0.833 s
01:17:09 testObservableValue(org.eclipse.papyrus.uml.diagram.properties.databinding.tests.SwitchOrientationObservableValueTest)  Time elapsed: 1.783 s
01:17:09 outOfDateModelSkipMigration_papyrus(org.eclipse.papyrus.uml.profile.service.ReapplyProfilesServiceTest)  Time elapsed: 1.077 s
01:17:09 upToDateModelDoesNotPromptForMigration_papyrus(org.eclipse.papyrus.uml.profile.service.ReapplyProfilesServiceTest)  Time elapsed: 0.787 s
01:17:09 outOfDateModelDoMigration_dynamic(org.eclipse.papyrus.uml.profile.service.ReapplyProfilesServiceTest)  Time elapsed: 1.251 s
01:17:09 outOfDateModelSkipMigration_uml2(org.eclipse.papyrus.uml.profile.service.ReapplyProfilesServiceTest)  Time elapsed: 1.096 s
01:17:09 outOfDateModelDoMigration_papyrus(org.eclipse.papyrus.uml.profile.service.ReapplyProfilesServiceTest)  Time elapsed: 1.134 s
01:17:09 outOfDateModelSkipMigration_dynamic(org.eclipse.papyrus.uml.profile.service.ReapplyProfilesServiceTest)  Time elapsed: 0.735 s
01:17:09 outOfDateModelDoMigration_uml2(org.eclipse.papyrus.uml.profile.service.ReapplyProfilesServiceTest)  Time elapsed: 1.464 s
01:17:09 upToDateModelDoesNotPromptForMigration_uml2(org.eclipse.papyrus.uml.profile.service.ReapplyProfilesServiceTest)  Time elapsed: 0.879 s
01:17:09 upToDateModelDoesNotPromptForMigration_dynamic(org.eclipse.papyrus.uml.profile.service.ReapplyProfilesServiceTest)  Time elapsed: 0.66 s
01:17:09 loadDecoratorAsMainModel(org.eclipse.papyrus.uml.decoratormodel.tests.ExternalizeProfileApplicationTest)  Time elapsed: 0.523 s
01:17:09 externalizeApplication(org.eclipse.papyrus.uml.decoratormodel.tests.ExternalizeProfileApplicationTest)  Time elapsed: 0.538 s
01:17:09 unloadApplication(org.eclipse.papyrus.uml.decoratormodel.tests.ExternalizeProfileApplicationTest)  Time elapsed: 0.64 s
01:17:09 externalizeApplication_undo(org.eclipse.papyrus.uml.decoratormodel.tests.ExternalizeProfileApplicationTest)  Time elapsed: 0.741 s
01:17:09 unloadedApplicationNotAvailable(org.eclipse.papyrus.uml.decoratormodel.tests.ExternalizeProfileApplicationTest)  Time elapsed: 0.609 s
01:17:09 loadApplication(org.eclipse.papyrus.uml.decoratormodel.tests.ExternalizeProfileApplicationTest)  Time elapsed: 0.554 s
01:17:09 externalizeApplication_undo_redo(org.eclipse.papyrus.uml.decoratormodel.tests.ExternalizeProfileApplicationTest)  Time elapsed: 0.461 s
01:17:09 nestedPackageApplicationOfSameProfile_bug459613(org.eclipse.papyrus.uml.decoratormodel.tests.ExternalizeProfileApplicationTest)  Time elapsed: 0.578 s
01:17:09 externalizeApplication_forNestedPackage(org.eclipse.papyrus.uml.decoratormodel.tests.ExternalizeProfileApplicationTest)  Time elapsed: 0.526 s
01:17:09 internalizeApplication_undo(org.eclipse.papyrus.uml.decoratormodel.tests.InternalizeProfileApplicationTest)  Time elapsed: 0.505 s
01:17:09 internalizeApplication_undo_redo(org.eclipse.papyrus.uml.decoratormodel.tests.InternalizeProfileApplicationTest)  Time elapsed: 0.624 s
01:17:09 internalizeApplication(org.eclipse.papyrus.uml.decoratormodel.tests.InternalizeProfileApplicationTest)  Time elapsed: 0.399 s
01:17:09 migrateProfile(org.eclipse.papyrus.uml.decoratormodel.tests.ProfileMigrationTest)  Time elapsed: 0.533 s
01:17:09 missingSchema(org.eclipse.papyrus.uml.decoratormodel.tests.StereotypeApplicationRepairTest)  Time elapsed: 0.538 s
01:17:09 wrongProfileVersion(org.eclipse.papyrus.uml.decoratormodel.tests.StereotypeApplicationRepairTest)  Time elapsed: 0.417 s
01:17:09 missingProfileApplication(org.eclipse.papyrus.uml.decoratormodel.tests.StereotypeApplicationRepairTest)  Time elapsed: 0.446 s
01:17:09 decoratorModelsForPackageAsync(org.eclipse.papyrus.uml.decoratormodel.internal.resource.tests.DecoratorModelIndexTest)  Time elapsed: 0.639 s
01:17:09 decoratorModelsForPackage_none(org.eclipse.papyrus.uml.decoratormodel.internal.resource.tests.DecoratorModelIndexTest)  Time elapsed: 0.588 s
01:17:09 removeResource(org.eclipse.papyrus.uml.decoratormodel.internal.resource.tests.DecoratorModelIndexTest)  Time elapsed: 0.85 s
01:17:09 decoratorModelsAsync_uri(org.eclipse.papyrus.uml.decoratormodel.internal.resource.tests.DecoratorModelIndexTest)  Time elapsed: 0.588 s
01:17:09 decoratorModelName(org.eclipse.papyrus.uml.decoratormodel.internal.resource.tests.DecoratorModelIndexTest)  Time elapsed: 0.55 s
01:17:09 baseline(org.eclipse.papyrus.uml.decoratormodel.internal.resource.tests.DecoratorModelIndexTest)  Time elapsed: 0.558 s
01:17:09 decoratorModelsForPackage(org.eclipse.papyrus.uml.decoratormodel.internal.resource.tests.DecoratorModelIndexTest)  Time elapsed: 0.551 s
01:17:09 decoratorModelNameAsync(org.eclipse.papyrus.uml.decoratormodel.internal.resource.tests.DecoratorModelIndexTest)  Time elapsed: 0.53 s
01:17:09 appliedProfilesByResourceIndex(org.eclipse.papyrus.uml.decoratormodel.internal.resource.tests.DecoratorModelIndexTest)  Time elapsed: 0.606 s
01:17:09 decoratorModels(org.eclipse.papyrus.uml.decoratormodel.internal.resource.tests.DecoratorModelIndexTest)  Time elapsed: 0.634 s
01:17:09 decoratorModelsAsync(org.eclipse.papyrus.uml.decoratormodel.internal.resource.tests.DecoratorModelIndexTest)  Time elapsed: 0.803 s
01:17:09 allAppliedProfiles(org.eclipse.papyrus.uml.decoratormodel.internal.resource.tests.DecoratorModelIndexTest)  Time elapsed: 0.581 s
01:17:09 decoratorModelNames(org.eclipse.papyrus.uml.decoratormodel.internal.resource.tests.DecoratorModelIndexTest)  Time elapsed: 0.568 s
01:17:09 decoratorModels_uri(org.eclipse.papyrus.uml.decoratormodel.internal.resource.tests.DecoratorModelIndexTest)  Time elapsed: 0.515 s
01:17:09 decoratorModelNamesAsync(org.eclipse.papyrus.uml.decoratormodel.internal.resource.tests.DecoratorModelIndexTest)  Time elapsed: 0.581 s
01:17:09 listener(org.eclipse.papyrus.uml.decoratormodel.internal.resource.tests.DecoratorModelIndexTest)  Time elapsed: 0.713 s
01:17:09 allAppliedProfilesAsync(org.eclipse.papyrus.uml.decoratormodel.internal.resource.tests.DecoratorModelIndexTest)  Time elapsed: 0.549 s
01:17:09 addNewResource(org.eclipse.papyrus.uml.decoratormodel.internal.resource.tests.DecoratorModelIndexTest)  Time elapsed: 0.946 s
01:17:09 decoratorModelsForPackageAsync_none(org.eclipse.papyrus.uml.decoratormodel.internal.resource.tests.DecoratorModelIndexTest)  Time elapsed: 0.542 s
01:17:09 copy_subsetOfProfiles(org.eclipse.papyrus.uml.decoratormodel.internal.resource.tests.DecoratorModelCopierTest)  Time elapsed: 0.831 s
01:17:09 copy_allProfiles(org.eclipse.papyrus.uml.decoratormodel.internal.resource.tests.DecoratorModelCopierTest)  Time elapsed: 0.76 s
01:17:09 testHasUnloadedDecoratorModelsAsync_recursive(org.eclipse.papyrus.uml.decoratormodel.helper.tests.DecoratorModelUtilsTest)  Time elapsed: 0.727 s
01:17:09 testIsDecoratorModelFor(org.eclipse.papyrus.uml.decoratormodel.helper.tests.DecoratorModelUtilsTest)  Time elapsed: 0.397 s
01:17:09 testIsDecoratorModelURI(org.eclipse.papyrus.uml.decoratormodel.helper.tests.DecoratorModelUtilsTest)  Time elapsed: 0.48 s
01:17:09 testInternalizeProfileApplications(org.eclipse.papyrus.uml.decoratormodel.helper.tests.DecoratorModelUtilsTest)  Time elapsed: 0.479 s
01:17:09 testHasUnloadedDecoratorModelsAsync(org.eclipse.papyrus.uml.decoratormodel.helper.tests.DecoratorModelUtilsTest)  Time elapsed: 0.629 s
01:17:09 testExternalizeProfileApplication(org.eclipse.papyrus.uml.decoratormodel.helper.tests.DecoratorModelUtilsTest)  Time elapsed: 0.463 s
01:17:09 testGetDecoratorPackages(org.eclipse.papyrus.uml.decoratormodel.helper.tests.DecoratorModelUtilsTest)  Time elapsed: 0.361 s
01:17:09 testGetDecoratorModelAppliedProfiles(org.eclipse.papyrus.uml.decoratormodel.helper.tests.DecoratorModelUtilsTest)  Time elapsed: 0.407 s
01:17:09 testGetUnloadedDecoratorModelsAsyncResource(org.eclipse.papyrus.uml.decoratormodel.helper.tests.DecoratorModelUtilsTest)  Time elapsed: 0.634 s
01:17:09 testGetExternalizationProfile(org.eclipse.papyrus.uml.decoratormodel.helper.tests.DecoratorModelUtilsTest)  Time elapsed: 0.375 s
01:17:09 testIsDecoratorModelResource(org.eclipse.papyrus.uml.decoratormodel.helper.tests.DecoratorModelUtilsTest)  Time elapsed: 0.458 s
01:17:09 testGetDecoratorModelProfileApplications(org.eclipse.papyrus.uml.decoratormodel.helper.tests.DecoratorModelUtilsTest)  Time elapsed: 0.376 s
01:17:09 testGetUnloadedDecoratorModelsAsyncPackage(org.eclipse.papyrus.uml.decoratormodel.helper.tests.DecoratorModelUtilsTest)  Time elapsed: 0.627 s
01:17:09 testGetLoadedDecoratorModels(org.eclipse.papyrus.uml.decoratormodel.helper.tests.DecoratorModelUtilsTest)  Time elapsed: 0.453 s
01:17:09 testGetLoadedSubUnitPackages(org.eclipse.papyrus.uml.decoratormodel.helper.tests.DecoratorModelUtilsTest)  Time elapsed: 0.444 s
01:17:09 testGetUnloadedDecoratorModels(org.eclipse.papyrus.uml.decoratormodel.helper.tests.DecoratorModelUtilsTest)  Time elapsed: 0.621 s
01:17:09 testHasExternalizationProfile(org.eclipse.papyrus.uml.decoratormodel.helper.tests.DecoratorModelUtilsTest)  Time elapsed: 0.448 s
01:17:09 testGetUnloadedDecoratorModelsAsyncIterableOfResource(org.eclipse.papyrus.uml.decoratormodel.helper.tests.DecoratorModelUtilsTest)  Time elapsed: 0.978 s
01:17:09 testGetUserModelResources(org.eclipse.papyrus.uml.decoratormodel.helper.tests.DecoratorModelUtilsTest)  Time elapsed: 0.664 s
01:17:09 testGetDecoratorProfileApplications(org.eclipse.papyrus.uml.decoratormodel.helper.tests.DecoratorModelUtilsTest)  Time elapsed: 0.457 s
01:17:09 stereotypeApplication_inNestedPackage(org.eclipse.papyrus.uml.decoratormodel.helper.tests.PapyrusStereotypeApplicationHelperTest)  Time elapsed: 0.171 s
01:17:09 stereotypeApplication_inNonPackageSubmodelUnit_bug459613(org.eclipse.papyrus.uml.decoratormodel.helper.tests.PapyrusStereotypeApplicationHelperTest)  Time elapsed: 0.166 s
01:17:09 applyStereotype_resourceSet(org.eclipse.papyrus.uml.decoratormodel.helper.tests.PapyrusStereotypeApplicationHelperTest)  Time elapsed: 0.14 s
01:17:09 applyStereotype_freeFloating(org.eclipse.papyrus.uml.decoratormodel.helper.tests.PapyrusStereotypeApplicationHelperTest)  Time elapsed: 0.141 s
01:17:09 isDecoratorModel_decoratorModelUML(org.eclipse.papyrus.uml.decoratormodel.internal.expressions.tests.FilePropertyTesterTest)  Time elapsed: 0.29 s
01:17:09 isDecoratorModel_decoratorModelNotation(org.eclipse.papyrus.uml.decoratormodel.internal.expressions.tests.FilePropertyTesterTest)  Time elapsed: 0.375 s
01:17:09 isDecoratorModel_userModelUML(org.eclipse.papyrus.uml.decoratormodel.internal.expressions.tests.FilePropertyTesterTest)  Time elapsed: 0.294 s
01:17:09 decoratorIndexing(org.eclipse.papyrus.uml.decoratormodel.internal.resource.index.tests.ProfileIndexTest)  Time elapsed: 0.503 s
01:17:09 userModelIndexing(org.eclipse.papyrus.uml.decoratormodel.internal.resource.index.tests.ProfileIndexTest)  Time elapsed: 0 s
01:17:09 decoratorAsUserModelIndexing(org.eclipse.papyrus.uml.decoratormodel.internal.resource.index.tests.ProfileIndexTest)  Time elapsed: 0 s
01:17:09 migrateProfileExtendingDynamic_bug481302(org.eclipse.papyrus.uml.decoratormodel.tests.RegressionTest)  Time elapsed: 0.413 s
01:17:09 basicUMLMigrateProfileExtendingStatic_bug481302(org.eclipse.papyrus.uml.decoratormodel.tests.RegressionTest) skipped
01:17:09 migrateProfileExtendingStatic_bug481302(org.eclipse.papyrus.uml.decoratormodel.tests.RegressionTest)  Time elapsed: 0.354 s
01:17:09 control_undo_redo_allDecoratorsLoaded(org.eclipse.papyrus.uml.decoratormodel.controlmode.tests.ControlModeWithDecoratorModelsTest)  Time elapsed: 0.943 s
01:17:09 uncontrol_undo_redo_allDecoratorsUnloaded(org.eclipse.papyrus.uml.decoratormodel.controlmode.tests.ControlModeWithDecoratorModelsTest)  Time elapsed: 3.124 s
01:17:09 control_someDecoratorsLoaded(org.eclipse.papyrus.uml.decoratormodel.controlmode.tests.ControlModeWithDecoratorModelsTest)  Time elapsed: 1.148 s
01:17:09 uncontrol_someDecoratorsLoaded(org.eclipse.papyrus.uml.decoratormodel.controlmode.tests.ControlModeWithDecoratorModelsTest)  Time elapsed: 1.485 s
01:17:09 uncontrol_allDecoratorsUnloaded(org.eclipse.papyrus.uml.decoratormodel.controlmode.tests.ControlModeWithDecoratorModelsTest)  Time elapsed: 2.048 s
01:17:09 control_undo_redo_someDecoratorsLoaded(org.eclipse.papyrus.uml.decoratormodel.controlmode.tests.ControlModeWithDecoratorModelsTest)  Time elapsed: 2.226 s
01:17:09 control_allDecoratorsLoaded(org.eclipse.papyrus.uml.decoratormodel.controlmode.tests.ControlModeWithDecoratorModelsTest)  Time elapsed: 0.874 s
01:17:09 control_undo_redo_allDecoratorsUnloaded(org.eclipse.papyrus.uml.decoratormodel.controlmode.tests.ControlModeWithDecoratorModelsTest)  Time elapsed: 3.144 s
01:17:09 control_allDecoratorsUnloaded(org.eclipse.papyrus.uml.decoratormodel.controlmode.tests.ControlModeWithDecoratorModelsTest)  Time elapsed: 1.812 s
01:17:09 uncontrol_undo_redo_someDecoratorsLoaded(org.eclipse.papyrus.uml.decoratormodel.controlmode.tests.ControlModeWithDecoratorModelsTest)  Time elapsed: 2.653 s
01:17:09 uncontrol_undo_redo_allDecoratorsLoaded(org.eclipse.papyrus.uml.decoratormodel.controlmode.tests.ControlModeWithDecoratorModelsTest)  Time elapsed: 0.668 s
01:17:09 uncontrol_allDecoratorsLoaded(org.eclipse.papyrus.uml.decoratormodel.controlmode.tests.ControlModeWithDecoratorModelsTest)  Time elapsed: 0.771 s
01:17:09 nonBaseElementStereotypeCrossReferences(org.eclipse.papyrus.uml.decoratormodel.controlmode.tests.AdditionalModelStructuresTest)  Time elapsed: 1.085 s
01:17:09 classUnitExternalizeParentUnitProfileApplication_bug459613(org.eclipse.papyrus.uml.decoratormodel.controlmode.tests.AdditionalModelStructuresTest)  Time elapsed: 0.358 s
01:17:09 nestedPackagesInheritingExternalProfileApplications(org.eclipse.papyrus.uml.decoratormodel.controlmode.tests.AdditionalModelStructuresTest)  Time elapsed: 2.004 s
01:17:09 validateOCLOnInstanceSpec(org.eclipse.papyrus.uml.validation.tests.rules.TestOCLConstraintOnInstanceSpec)  Time elapsed: 4.615 s
01:17:09 validateCamelCaseRule(org.eclipse.papyrus.uml.validation.tests.rules.TestOCLValidationRuleFromFile)  Time elapsed: 0.986 s
01:17:09 validateIsActiveOCLRule_inactiveClass(org.eclipse.papyrus.uml.validation.tests.rules.TestValidationRulesInPluginXML)  Time elapsed: 1.782 s
01:17:09 validateIsPassiveJavaRule_inactiveClass(org.eclipse.papyrus.uml.validation.tests.rules.TestValidationRulesInPluginXML)  Time elapsed: 1.504 s
01:17:09 validateIsPassiveJavaRule_activeClass(org.eclipse.papyrus.uml.validation.tests.rules.TestValidationRulesInPluginXML)  Time elapsed: 1.21 s
01:17:09 validateMalformedActiveRule_notActiveCapsule(org.eclipse.papyrus.uml.validation.tests.rules.TestValidationRulesInProfile)  Time elapsed: 1.64 s
01:17:09 validateIsActiveRule_notActiveCapsule(org.eclipse.papyrus.uml.validation.tests.rules.TestValidationRulesInProfile)  Time elapsed: 1.318 s
01:17:09 validateIsActiveRule_ActiveCapsule(org.eclipse.papyrus.uml.validation.tests.rules.TestValidationRulesInProfile)  Time elapsed: 1.303 s
01:17:09 validateNameClashDetection(org.eclipse.papyrus.uml.validation.tests.rules.TestUMLValidationRules)  Time elapsed: 0.799 s
01:17:09 validateNonStandardMultiplicity(org.eclipse.papyrus.uml.validation.tests.rules.TestUMLValidationRules)  Time elapsed: 0.744 s
01:17:09 validateUnsetStereotypeAttribute(org.eclipse.papyrus.uml.validation.tests.rules.TestStereotypeValidation)  Time elapsed: 1.109 s
01:17:09 testResolveProfile__Object(org.eclipse.papyrus.uml.filters.tests.ProfileAppliedTest)  Time elapsed: 0.033 s
01:17:09 testMatches__Object(org.eclipse.papyrus.uml.filters.tests.ProfileAppliedTest)  Time elapsed: 0.014 s
01:17:09 profileAppliedFilterResourceURI_bug480221(org.eclipse.papyrus.uml.filters.tests.ProfileAppliedRegressionTest)  Time elapsed: 0.026 s
01:17:09 profileAppliedFilterDoesNotLoadProfiles_miss_bug480221(org.eclipse.papyrus.uml.filters.tests.ProfileAppliedRegressionTest)  Time elapsed: 0.021 s
01:17:09 profileAppliedFilterDoesNotLoadProfiles_hit_bug480221(org.eclipse.papyrus.uml.filters.tests.ProfileAppliedRegressionTest)  Time elapsed: 0.02 s
01:17:09 popupsGenerated(org.eclipse.papyrus.uml.profile.assistants.generator.tests.BasicAssistantsGenerationTest)  Time elapsed: 0.01 s
01:17:09 connectionTargetFilters(org.eclipse.papyrus.uml.profile.assistants.generator.tests.BasicAssistantsGenerationTest)  Time elapsed: 0.003 s
01:17:09 popupFilters(org.eclipse.papyrus.uml.profile.assistants.generator.tests.BasicAssistantsGenerationTest)  Time elapsed: 0 s
01:17:09 connectionSourceFilters(org.eclipse.papyrus.uml.profile.assistants.generator.tests.BasicAssistantsGenerationTest)  Time elapsed: 0.001 s
01:17:09 connectionsGenerated(org.eclipse.papyrus.uml.profile.assistants.generator.tests.BasicAssistantsGenerationTest)  Time elapsed: 0 s
01:17:09 popupsGenerated(org.eclipse.papyrus.uml.profile.assistants.generator.tests.DiagramSpecificAssistantsGenerationTest)  Time elapsed: 0.023 s
01:17:09 connectionTargetFilters(org.eclipse.papyrus.uml.profile.assistants.generator.tests.DiagramSpecificAssistantsGenerationTest)  Time elapsed: 0.004 s
01:17:09 distinctConnectionHintsGenerated(org.eclipse.papyrus.uml.profile.assistants.generator.tests.DiagramSpecificAssistantsGenerationTest)  Time elapsed: 0.002 s
01:17:09 popupFilters(org.eclipse.papyrus.uml.profile.assistants.generator.tests.DiagramSpecificAssistantsGenerationTest)  Time elapsed: 0.001 s
01:17:09 connectionSourceFilters(org.eclipse.papyrus.uml.profile.assistants.generator.tests.DiagramSpecificAssistantsGenerationTest)  Time elapsed: 0.001 s
01:17:09 distinctPopupHintsGenerated(org.eclipse.papyrus.uml.profile.assistants.generator.tests.DiagramSpecificAssistantsGenerationTest)  Time elapsed: 0 s
01:17:09 connectionsGenerated(org.eclipse.papyrus.uml.profile.assistants.generator.tests.DiagramSpecificAssistantsGenerationTest)  Time elapsed: 0 s
01:17:09 popupsGenerated(org.eclipse.papyrus.uml.profile.assistants.generator.tests.ProfilesWithPackageNestingTest)  Time elapsed: 0.003 s
01:17:09 connectionTargetFilters(org.eclipse.papyrus.uml.profile.assistants.generator.tests.ProfilesWithPackageNestingTest)  Time elapsed: 0.002 s
01:17:09 popupFilters(org.eclipse.papyrus.uml.profile.assistants.generator.tests.ProfilesWithPackageNestingTest)  Time elapsed: 0 s
01:17:09 connectionSourceFilters(org.eclipse.papyrus.uml.profile.assistants.generator.tests.ProfilesWithPackageNestingTest)  Time elapsed: 0.001 s
01:17:09 connectionsGenerated(org.eclipse.papyrus.uml.profile.assistants.generator.tests.ProfilesWithPackageNestingTest)  Time elapsed: 0 s
01:17:09 connectionsGenerated[<<Indirect>> Generalization](org.eclipse.papyrus.uml.profile.assistants.generator.tests.ConnectionTypesTest)  Time elapsed: 0.006 s
01:17:09 connectionsGenerated[<<Indirect>> GeneralizationSet](org.eclipse.papyrus.uml.profile.assistants.generator.tests.ConnectionTypesTest)  Time elapsed: 0.001 s
01:17:09 connectionsGenerated[<<Virtual>> ControlFlow](org.eclipse.papyrus.uml.profile.assistants.generator.tests.ConnectionTypesTest)  Time elapsed: 0.001 s
01:17:09 connectionsGenerated[<<Virtual>> ObjectFlow](org.eclipse.papyrus.uml.profile.assistants.generator.tests.ConnectionTypesTest)  Time elapsed: 0 s
01:17:09 connectionsGenerated[<<Virtual>> Transition](org.eclipse.papyrus.uml.profile.assistants.generator.tests.ConnectionTypesTest)  Time elapsed: 0.001 s
01:17:09 connectionsGenerated[<<Virtual>> Message](org.eclipse.papyrus.uml.profile.assistants.generator.tests.ConnectionTypesTest)  Time elapsed: 0 s
01:17:09 connectionsGenerated[<<Indirect>> Connector](org.eclipse.papyrus.uml.profile.assistants.generator.tests.ConnectionTypesTest)  Time elapsed: 0 s
01:17:09 iconGenerated(org.eclipse.papyrus.uml.profile.types.generator.tests.BasicElementTypesGenerationTest)  Time elapsed: 0.02 s
01:17:09 elementTypeSpecializedTypes_bug461717(org.eclipse.papyrus.uml.profile.types.generator.tests.BasicElementTypesGenerationTest)  Time elapsed: 0.017 s
01:17:09 multipleElementTypesForOneStereotypeGenerated(org.eclipse.papyrus.uml.profile.types.generator.tests.BasicElementTypesGenerationTest)  Time elapsed: 0.001 s
01:17:09 stereotypeAdviceGenerated(org.eclipse.papyrus.uml.profile.types.generator.tests.BasicElementTypesGenerationTest)  Time elapsed: 0.002 s
01:17:09 elementTypesGenerated(org.eclipse.papyrus.uml.profile.types.generator.tests.BasicElementTypesGenerationTest)  Time elapsed: 0 s
01:17:09 stereotypeMatcherGenerated(org.eclipse.papyrus.uml.profile.types.generator.tests.BasicElementTypesGenerationTest)  Time elapsed: 0.001 s
01:17:09 stereotypeAdviceNotGenerated(org.eclipse.papyrus.uml.profile.types.generator.tests.DiagramSpecificElementTypesGenerationTest)  Time elapsed: 0.003 s
01:17:09 distinctHintsGenerated(org.eclipse.papyrus.uml.profile.types.generator.tests.DiagramSpecificElementTypesGenerationTest)  Time elapsed: 0.003 s
01:17:09 stereotypeMatcherNotGenerated(org.eclipse.papyrus.uml.profile.types.generator.tests.DiagramSpecificElementTypesGenerationTest)  Time elapsed: 0.001 s
01:17:09 iconGenerated(org.eclipse.papyrus.uml.profile.types.generator.tests.DiagramSpecificElementTypesGenerationTest)  Time elapsed: 0.001 s
01:17:09 elementTypeSpecializedTypes_bug461717(org.eclipse.papyrus.uml.profile.types.generator.tests.DiagramSpecificElementTypesGenerationTest)  Time elapsed: 0.031 s
01:17:09 elementTypesGenerated(org.eclipse.papyrus.uml.profile.types.generator.tests.DiagramSpecificElementTypesGenerationTest)  Time elapsed: 0 s
01:17:09 iconGenerated(org.eclipse.papyrus.uml.profile.types.generator.tests.ProfilesWithPackageNestingTest)  Time elapsed: 0.003 s
01:17:09 stereotypeAdviceGenerated(org.eclipse.papyrus.uml.profile.types.generator.tests.ProfilesWithPackageNestingTest)  Time elapsed: 0 s
01:17:09 elementTypesGenerated(org.eclipse.papyrus.uml.profile.types.generator.tests.ProfilesWithPackageNestingTest)  Time elapsed: 0 s
01:17:09 stereotypeMatcherGenerated(org.eclipse.papyrus.uml.profile.types.generator.tests.ProfilesWithPackageNestingTest)  Time elapsed: 0.001 s
01:17:09 elementTypeSpecializedTypes(org.eclipse.papyrus.uml.profile.types.generator.tests.DiagramSpecificElementTypesGenerationBug461717Test)  Time elapsed: 0.019 s
01:17:09 stereotypeAdviceGenerated(org.eclipse.papyrus.uml.profile.types.generator.tests.DiagramSpecificElementTypesGenerationBug461717Test)  Time elapsed: 0.001 s
01:17:09 stereotypeMatcherGenerated(org.eclipse.papyrus.uml.profile.types.generator.tests.DiagramSpecificElementTypesGenerationBug461717Test)  Time elapsed: 0 s
01:17:09 testGetStereotypeNames(org.eclipse.papyrus.uml.profile.drafter.tests.ProfileCatalogTest)  Time elapsed: 0.026 s
01:17:09 testGetStereotypes(org.eclipse.papyrus.uml.profile.drafter.tests.ProfileCatalogTest)  Time elapsed: 0.023 s
01:17:09 testGetAllStereotypeNames(org.eclipse.papyrus.uml.profile.drafter.tests.ProfileCatalogTest) skipped
01:17:09 testGetProfileNames(org.eclipse.papyrus.uml.profile.drafter.tests.ProfileCatalogTest)  Time elapsed: 0.031 s
01:17:09 testProfileCatalog(org.eclipse.papyrus.uml.profile.drafter.tests.ProfileCatalogTest)  Time elapsed: 0.025 s
01:17:09 testLookupStereotype(org.eclipse.papyrus.uml.profile.drafter.tests.ProfileCatalogTest)  Time elapsed: 0.025 s
01:17:09 testLookupStereotypeInAppliedProfile(org.eclipse.papyrus.uml.profile.drafter.tests.ProfileCatalogTest)  Time elapsed: 0.025 s
01:17:09 testProfileCopy(org.eclipse.papyrus.uml.profile.drafter.tests.ProfileCatalogTest)  Time elapsed: 0.018 s
01:17:09 testGetProfiles(org.eclipse.papyrus.uml.profile.drafter.tests.ProfileCatalogTest)  Time elapsed: 0.031 s
01:17:09 testGetNamedElement(org.eclipse.papyrus.uml.profile.drafter.tests.ProfileCatalogTest)  Time elapsed: 0.022 s
01:17:09 testIsModelsExist(org.eclipse.papyrus.uml.profile.drafter.tests.ProfileCatalogTest)  Time elapsed: 0.027 s
01:17:09 testGetStereotypeQualifiedNames(org.eclipse.papyrus.uml.profile.drafter.tests.ProfileCatalogTest)  Time elapsed: 0.027 s
01:17:09 testGetProfileQualifiedNames(org.eclipse.papyrus.uml.profile.drafter.tests.ProfileCatalogTest)  Time elapsed: 0.033 s
01:17:09 testCopyResources(org.eclipse.papyrus.uml.profile.drafter.tests.EclipseProjectTest)  Time elapsed: 0.004 s
01:17:09 testCopyResource(org.eclipse.papyrus.uml.profile.drafter.tests.EclipseProjectTest)  Time elapsed: 0.001 s
01:17:09 testGetProject(org.eclipse.papyrus.uml.profile.drafter.tests.EclipseProjectTest)  Time elapsed: 0 s
01:17:09 testEclipseProject(org.eclipse.papyrus.uml.profile.drafter.tests.EclipseProjectTest)  Time elapsed: 0 s
01:17:09 testGetUmlModelWithIFile(org.eclipse.papyrus.uml.profile.drafter.tests.ModelSetManagerTest)  Time elapsed: 0.071 s
01:17:09 testModelSetManagerString(org.eclipse.papyrus.uml.profile.drafter.tests.ModelSetManagerTest)  Time elapsed: 0.003 s
01:17:09 testModelSetManagerURI(org.eclipse.papyrus.uml.profile.drafter.tests.ModelSetManagerTest)  Time elapsed: 0.006 s
01:17:09 testGetNamedElementByNameString(org.eclipse.papyrus.uml.profile.drafter.tests.ModelSetManagerTest)  Time elapsed: 0.007 s
01:17:09 testGetUmlModel(org.eclipse.papyrus.uml.profile.drafter.tests.ModelSetManagerTest)  Time elapsed: 0.128 s
01:17:09 testModelSetManagerStringModels(org.eclipse.papyrus.uml.profile.drafter.tests.ModelSetManagerTest)  Time elapsed: 0.002 s
01:17:09 testGetNamedElementByNameWithSterotype(org.eclipse.papyrus.uml.profile.drafter.tests.ModelSetManagerTest)  Time elapsed: 0.027 s
01:17:09 testCreation(org.eclipse.papyrus.uml.profile.drafter.tests.utils.UMLModelCreatorTest)  Time elapsed: 0.003 s
01:17:09 testCreateClass(org.eclipse.papyrus.uml.profile.drafter.tests.utils.UMLModelCreatorTest)  Time elapsed: 0 s
01:17:09 testCreateModel(org.eclipse.papyrus.uml.profile.drafter.tests.utils.UMLModelCreatorTest)  Time elapsed: 0 s
01:17:09 testCreatePackage(org.eclipse.papyrus.uml.profile.drafter.tests.utils.UMLModelCreatorTest)  Time elapsed: 0 s
01:17:09 testCd(org.eclipse.papyrus.uml.profile.drafter.tests.utils.UMLModelCreatorTest)  Time elapsed: 0 s
01:17:09 testUMLModelCreatorResourceFailing(org.eclipse.papyrus.uml.profile.drafter.tests.utils.UMLModelCreatorTest)  Time elapsed: 0 s
01:17:09 testUMLModelCreatorStringString(org.eclipse.papyrus.uml.profile.drafter.tests.utils.UMLModelCreatorTest)  Time elapsed: 0 s
01:17:09 testUMLModelCreatorResource(org.eclipse.papyrus.uml.profile.drafter.tests.utils.UMLModelCreatorTest)  Time elapsed: 0 s
01:17:09 testCreateDatatype(org.eclipse.papyrus.uml.profile.drafter.tests.utils.UMLModelCreatorTest)  Time elapsed: 0 s
01:17:09 testCompoundTypeProvider(org.eclipse.papyrus.uml.profile.drafter.ui.model.CompoundTypeProviderTest)  Time elapsed: 0.001 s
01:17:09 testGetTypes(org.eclipse.papyrus.uml.profile.drafter.ui.model.CompoundTypeProviderTest)  Time elapsed: 0 s
01:17:09 testAddITypeProvider(org.eclipse.papyrus.uml.profile.drafter.ui.model.CompoundTypeProviderTest)  Time elapsed: 0 s
01:17:09 testIterator(org.eclipse.papyrus.uml.profile.drafter.ui.model.CompoundTypeProviderTest)  Time elapsed: 0 s
01:17:09 testVisitMetaclassesModel(org.eclipse.papyrus.uml.profile.drafter.ui.model.SimpleModelVisitorTest) skipped
01:17:09 testVisitPropertyModel(org.eclipse.papyrus.uml.profile.drafter.ui.model.SimpleModelVisitorTest) skipped
01:17:09 testSimpleModelVisitor(org.eclipse.papyrus.uml.profile.drafter.ui.model.SimpleModelVisitorTest)  Time elapsed: 0.001 s
01:17:09 testDoVisitStereoptypeModel(org.eclipse.papyrus.uml.profile.drafter.ui.model.SimpleModelVisitorTest) skipped
01:17:09 testDoVisitPropertyModel(org.eclipse.papyrus.uml.profile.drafter.ui.model.SimpleModelVisitorTest) skipped
01:17:09 testVisitStereoptypeModel(org.eclipse.papyrus.uml.profile.drafter.ui.model.SimpleModelVisitorTest) skipped
01:17:09 testDoVisitMetaclassesModel(org.eclipse.papyrus.uml.profile.drafter.ui.model.SimpleModelVisitorTest) skipped
01:17:09 testSetStereotypeName(org.eclipse.papyrus.uml.profile.drafter.ui.model.StereotypeURLTest)  Time elapsed: 0.015 s
01:17:09 testGetProfileName(org.eclipse.papyrus.uml.profile.drafter.ui.model.StereotypeURLTest)  Time elapsed: 0 s
01:17:09 testAddPropertyChangeListenerPropertyChangeListener(org.eclipse.papyrus.uml.profile.drafter.ui.model.StereotypeURLTest)  Time elapsed: 0.001 s
01:17:09 testSetQualifiedNameComplex(org.eclipse.papyrus.uml.profile.drafter.ui.model.StereotypeURLTest)  Time elapsed: 0 s
01:17:09 testClear(org.eclipse.papyrus.uml.profile.drafter.ui.model.StereotypeURLTest)  Time elapsed: 0 s
01:17:09 testStereotypeURLString(org.eclipse.papyrus.uml.profile.drafter.ui.model.StereotypeURLTest)  Time elapsed: 0 s
01:17:09 testToString(org.eclipse.papyrus.uml.profile.drafter.ui.model.StereotypeURLTest)  Time elapsed: 0 s
01:17:09 testGetStereotypeName(org.eclipse.papyrus.uml.profile.drafter.ui.model.StereotypeURLTest)  Time elapsed: 0 s
01:17:09 testAddPropertyChangeListenerStringPropertyChangeListener(org.eclipse.papyrus.uml.profile.drafter.ui.model.StereotypeURLTest)  Time elapsed: 0 s
01:17:09 testStereotypeURL(org.eclipse.papyrus.uml.profile.drafter.ui.model.StereotypeURLTest)  Time elapsed: 0 s
01:17:09 testRemovePropertyChangeListenerPropertyChangeListener(org.eclipse.papyrus.uml.profile.drafter.ui.model.StereotypeURLTest)  Time elapsed: 0 s
01:17:09 testSetQualifiedNameSimple(org.eclipse.papyrus.uml.profile.drafter.ui.model.StereotypeURLTest)  Time elapsed: 0 s
01:17:09 testSetProfileName(org.eclipse.papyrus.uml.profile.drafter.ui.model.StereotypeURLTest)  Time elapsed: 0 s
01:17:09 testRemovePropertyChangeListenerStringPropertyChangeListener(org.eclipse.papyrus.uml.profile.drafter.ui.model.StereotypeURLTest)  Time elapsed: 0 s
01:17:09 testComputeQualifiedName(org.eclipse.papyrus.uml.profile.drafter.ui.model.StereotypeURLTest)  Time elapsed: 0 s
01:17:09 testGetQualifiedName(org.eclipse.papyrus.uml.profile.drafter.ui.model.StereotypeURLTest)  Time elapsed: 0.002 s
01:17:09 testStereotypeURLStringString(org.eclipse.papyrus.uml.profile.drafter.ui.model.StereotypeURLTest)  Time elapsed: 0 s
01:17:09 testGetTypes(org.eclipse.papyrus.uml.profile.drafter.ui.model.TypeProviderTest)  Time elapsed: 0.001 s
01:17:09 testTypeProvider(org.eclipse.papyrus.uml.profile.drafter.ui.model.TypeProviderTest)  Time elapsed: 0 s
01:17:09 testIterator(org.eclipse.papyrus.uml.profile.drafter.ui.model.TypeProviderTest)  Time elapsed: 0.001 s
01:17:09 testGetTypes(org.eclipse.papyrus.uml.profile.drafter.ui.model.TypeProviderTest2)  Time elapsed: 0 s
01:17:09 testAddType(org.eclipse.papyrus.uml.profile.drafter.ui.model.TypeProviderTest2)  Time elapsed: 0 s
01:17:09 testAddTypeFromConstructor(org.eclipse.papyrus.uml.profile.drafter.ui.model.TypeProviderTest2)  Time elapsed: 0 s
01:17:09 testTypeProvider(org.eclipse.papyrus.uml.profile.drafter.ui.model.TypeProviderTest2)  Time elapsed: 0 s
01:17:09 testTypeProviderTypeArray(org.eclipse.papyrus.uml.profile.drafter.ui.model.TypeProviderTest2)  Time elapsed: 0 s
01:17:09 testIterator(org.eclipse.papyrus.uml.profile.drafter.ui.model.TypeProviderTest2)  Time elapsed: 0 s
01:17:09 testUMLPrimitiveTypesModel(org.eclipse.papyrus.uml.profile.drafter.utils.UMLPrimitiveTypesModelTest)  Time elapsed: 0.018 s
01:17:09 testGetLibraryPackage(org.eclipse.papyrus.uml.profile.drafter.utils.UMLPrimitiveTypesModelTest)  Time elapsed: 0.012 s
01:17:09 testUseInternationalizationModification(org.eclipse.papyrus.uml.internationalization.tests.tests.UMLInternationalizationChangePreferencesTest)  Time elapsed: 0.702 s
01:17:09 testLanguageModification(org.eclipse.papyrus.uml.internationalization.tests.tests.UMLInternationalizationChangeLanguageTest)  Time elapsed: 0.783 s
01:17:09 rebuildAdapters(org.eclipse.papyrus.uml.internationalization.tests.tests.InternationalizationUMLItemProviderAdapterFactoryTest)  Time elapsed: 0.706 s
01:17:09 normalAdapters(org.eclipse.papyrus.uml.internationalization.tests.tests.InternationalizationUMLItemProviderAdapterFactoryTest)  Time elapsed: 0.648 s
01:17:09 testLabelProviderAdapter(org.eclipse.papyrus.uml.internationalization.tests.tests.InternationalizationAdapterTest)  Time elapsed: 0.004 s
01:17:09 testMapping(org.eclipse.papyrus.uml.alf.tests.mapper.MappingTest) skipped
01:17:09 org.eclipse.papyrus.uml.alf.tests.mapper.MappingTest skipped
01:17:09 testMerging(org.eclipse.papyrus.uml.alf.tests.mapper.MergeTest) skipped
01:17:09 org.eclipse.papyrus.uml.alf.tests.mapper.MergeTest skipped
01:17:09 testStaticSemantics(org.eclipse.papyrus.uml.alf.tests.SemanticTest) skipped
01:17:09 org.eclipse.papyrus.uml.alf.tests.SemanticTest skipped
01:17:09 testOneFile(org.eclipse.papyrus.uml.alf.tests.SingleTest) skipped
01:17:09 org.eclipse.papyrus.uml.alf.tests.SingleTest skipped
01:17:09 testSyntax(org.eclipse.papyrus.uml.alf.tests.SyntacticTest) skipped
01:17:09 org.eclipse.papyrus.uml.alf.tests.SyntacticTest skipped
01:17:09 testGeneration(org.eclipse.papyrus.uml.alf.tests.generator.GenerationTest) skipped
01:17:09 org.eclipse.papyrus.uml.alf.tests.generator.GenerationTest skipped
01:17:09 org.eclipse.papyrus.uml.alf.tests.AllTests skipped
01:17:09 IsStereotypedWithExpression_Test10(org.eclipse.papyrus.uml.expressions.tests.IsStereotypedWithExpressionTests)  Time elapsed: 1.088 s
01:17:09 IsStereotypedWithExpression_Test11(org.eclipse.papyrus.uml.expressions.tests.IsStereotypedWithExpressionTests)  Time elapsed: 0.925 s
01:17:09 IsStereotypedWithExpression_Test12(org.eclipse.papyrus.uml.expressions.tests.IsStereotypedWithExpressionTests)  Time elapsed: 0.908 s
01:17:09 IsStereotypedWithExpression_Test13(org.eclipse.papyrus.uml.expressions.tests.IsStereotypedWithExpressionTests)  Time elapsed: 1.001 s
01:17:09 IsStereotypedWithExpression_Test1(org.eclipse.papyrus.uml.expressions.tests.IsStereotypedWithExpressionTests)  Time elapsed: 1.538 s
01:17:09 IsStereotypedWithExpression_Test2(org.eclipse.papyrus.uml.expressions.tests.IsStereotypedWithExpressionTests)  Time elapsed: 0.771 s
01:17:09 IsStereotypedWithExpression_Test3(org.eclipse.papyrus.uml.expressions.tests.IsStereotypedWithExpressionTests)  Time elapsed: 1.043 s
01:17:09 IsStereotypedWithExpression_Test4(org.eclipse.papyrus.uml.expressions.tests.IsStereotypedWithExpressionTests)  Time elapsed: 1.036 s
01:17:09 IsStereotypedWithExpression_Test5(org.eclipse.papyrus.uml.expressions.tests.IsStereotypedWithExpressionTests)  Time elapsed: 0.802 s
01:17:09 IsStereotypedWithExpression_Test6(org.eclipse.papyrus.uml.expressions.tests.IsStereotypedWithExpressionTests)  Time elapsed: 0.735 s
01:17:09 IsStereotypedWithExpression_Test7(org.eclipse.papyrus.uml.expressions.tests.IsStereotypedWithExpressionTests)  Time elapsed: 1.084 s
01:17:09 IsStereotypedWithExpression_Test8(org.eclipse.papyrus.uml.expressions.tests.IsStereotypedWithExpressionTests)  Time elapsed: 1.015 s
01:17:09 IsStereotypedWithExpression_Test9(org.eclipse.papyrus.uml.expressions.tests.IsStereotypedWithExpressionTests)  Time elapsed: 0.758 s
01:17:09 HasStereotypeExpressionTests_Test1(org.eclipse.papyrus.uml.expressions.tests.HasAppliedStereotypeExpressionTests)  Time elapsed: 0.883 s
01:17:09 HasStereotypeExpressionTests_Test2(org.eclipse.papyrus.uml.expressions.tests.HasAppliedStereotypeExpressionTests)  Time elapsed: 0.82 s
01:17:09 HasStereotypeExpressionTests_Test3(org.eclipse.papyrus.uml.expressions.tests.HasAppliedStereotypeExpressionTests)  Time elapsed: 0.896 s
01:17:09 HasStereotypeExpressionTests_Test4(org.eclipse.papyrus.uml.expressions.tests.HasAppliedStereotypeExpressionTests)  Time elapsed: 0.908 s
01:17:09 metaclassAndNoContext(org.eclipse.papyrus.uml.expressions.tests.IsKindOfExpressionTest)  Time elapsed: 0.008 s
01:17:09 noMetaclassAndNoContextTest(org.eclipse.papyrus.uml.expressions.tests.IsKindOfExpressionTest)  Time elapsed: 0 s
01:17:09 metaclassAndValidContext_1(org.eclipse.papyrus.uml.expressions.tests.IsKindOfExpressionTest)  Time elapsed: 0 s
01:17:09 metaclassAndValidContext_2(org.eclipse.papyrus.uml.expressions.tests.IsKindOfExpressionTest)  Time elapsed: 0 s
01:17:09 metaclassAndInvalidContext(org.eclipse.papyrus.uml.expressions.tests.IsKindOfExpressionTest)  Time elapsed: 0 s
01:17:09 metaclassAndNoContext(org.eclipse.papyrus.uml.expressions.tests.IsTypeOfExpressionTests)  Time elapsed: 0.003 s
01:17:09 noMetaclassAndNoContextTest(org.eclipse.papyrus.uml.expressions.tests.IsTypeOfExpressionTests)  Time elapsed: 0 s
01:17:09 metaclassAndValidContext_2(org.eclipse.papyrus.uml.expressions.tests.IsTypeOfExpressionTests)  Time elapsed: 0 s
01:17:09 metaclassAndInValidContext_1(org.eclipse.papyrus.uml.expressions.tests.IsTypeOfExpressionTests)  Time elapsed: 0 s
01:17:09 IsKindOfStereotypeExpression_Test10(org.eclipse.papyrus.uml.expressions.tests.IsKindOfStereotypeExpressionTests)  Time elapsed: 1.329 s
01:17:09 IsKindOfStereotypeExpression_Test11(org.eclipse.papyrus.uml.expressions.tests.IsKindOfStereotypeExpressionTests)  Time elapsed: 1.084 s
01:17:09 IsKindOfStereotypeExpression_Test12(org.eclipse.papyrus.uml.expressions.tests.IsKindOfStereotypeExpressionTests)  Time elapsed: 0.964 s
01:17:09 IsKindOfStereotypeExpression_Test13(org.eclipse.papyrus.uml.expressions.tests.IsKindOfStereotypeExpressionTests)  Time elapsed: 0.805 s
01:17:09 IsKindOfStereotypeExpression_Test14(org.eclipse.papyrus.uml.expressions.tests.IsKindOfStereotypeExpressionTests)  Time elapsed: 0.868 s
01:17:09 IsKindOfStereotypeExpression_Test1(org.eclipse.papyrus.uml.expressions.tests.IsKindOfStereotypeExpressionTests)  Time elapsed: 0.784 s
01:17:09 IsKindOfStereotypeExpression_Test2(org.eclipse.papyrus.uml.expressions.tests.IsKindOfStereotypeExpressionTests)  Time elapsed: 0.741 s
01:17:09 IsKindOfStereotypeExpression_Test3(org.eclipse.papyrus.uml.expressions.tests.IsKindOfStereotypeExpressionTests)  Time elapsed: 0.784 s
01:17:09 IsKindOfStereotypeExpression_Test4(org.eclipse.papyrus.uml.expressions.tests.IsKindOfStereotypeExpressionTests)  Time elapsed: 0.69 s
01:17:09 IsKindOfStereotypeExpression_Test5(org.eclipse.papyrus.uml.expressions.tests.IsKindOfStereotypeExpressionTests)  Time elapsed: 0.771 s
01:17:09 IsKindOfStereotypeExpression_Test6(org.eclipse.papyrus.uml.expressions.tests.IsKindOfStereotypeExpressionTests)  Time elapsed: 0.818 s
01:17:09 IsKindOfStereotypeExpression_Test7(org.eclipse.papyrus.uml.expressions.tests.IsKindOfStereotypeExpressionTests)  Time elapsed: 0.791 s
01:17:09 IsKindOfStereotypeExpression_Test8(org.eclipse.papyrus.uml.expressions.tests.IsKindOfStereotypeExpressionTests)  Time elapsed: 0.814 s
01:17:09 IsKindOfStereotypeExpression_Test9(org.eclipse.papyrus.uml.expressions.tests.IsKindOfStereotypeExpressionTests)  Time elapsed: 0.784 s
01:17:09 IsTypeOfStereotypeExpression_Test1(org.eclipse.papyrus.uml.expressions.tests.IsTypeOfStereotypeExpressionTests)  Time elapsed: 0.767 s
01:17:09 IsTypeOfStereotypeExpression_Test2(org.eclipse.papyrus.uml.expressions.tests.IsTypeOfStereotypeExpressionTests)  Time elapsed: 0.81 s
01:17:09 IsTypeOfStereotypeExpression_Test3(org.eclipse.papyrus.uml.expressions.tests.IsTypeOfStereotypeExpressionTests)  Time elapsed: 0.808 s
01:17:09 IsTypeOfStereotypeExpression_Test4(org.eclipse.papyrus.uml.expressions.tests.IsTypeOfStereotypeExpressionTests)  Time elapsed: 0.878 s
01:17:09 IsTypeOfStereotypeExpression_Test5(org.eclipse.papyrus.uml.expressions.tests.IsTypeOfStereotypeExpressionTests)  Time elapsed: 0.928 s
01:17:09 IsTypeOfStereotypeExpression_Test6(org.eclipse.papyrus.uml.expressions.tests.IsTypeOfStereotypeExpressionTests)  Time elapsed: 0.804 s
01:17:09 IsTypeOfStereotypeExpression_Test7(org.eclipse.papyrus.uml.expressions.tests.IsTypeOfStereotypeExpressionTests)  Time elapsed: 1.009 s
01:17:09 IsTypeOfStereotypeExpression_Test8(org.eclipse.papyrus.uml.expressions.tests.IsTypeOfStereotypeExpressionTests)  Time elapsed: 1.063 s
01:17:09 IsTypeOfStereotypeExpression_Test9(org.eclipse.papyrus.uml.expressions.tests.IsTypeOfStereotypeExpressionTests)  Time elapsed: 0.801 s
01:17:09 IsTypeOfStereotypeExpression_Test10(org.eclipse.papyrus.uml.expressions.tests.IsTypeOfStereotypeExpressionTests)  Time elapsed: 0.875 s
01:17:09 IsTypeOfStereotypeExpression_Test11(org.eclipse.papyrus.uml.expressions.tests.IsTypeOfStereotypeExpressionTests)  Time elapsed: 0.907 s
01:17:09 IsTypeOfStereotypeExpression_Test12(org.eclipse.papyrus.uml.expressions.tests.IsTypeOfStereotypeExpressionTests)  Time elapsed: 0.835 s
01:17:09 IsTypeOfStereotypeExpression_Test13(org.eclipse.papyrus.uml.expressions.tests.IsTypeOfStereotypeExpressionTests)  Time elapsed: 0.764 s
01:17:09 SingleStereotypeAttributeEqualityExpressionTests_Test10(org.eclipse.papyrus.uml.expressions.tests.SingleStereotypeAttributeEqualityExpressionTests)  Time elapsed: 0.844 s
01:17:09 SingleStereotypeAttributeEqualityExpressionTests_Test11(org.eclipse.papyrus.uml.expressions.tests.SingleStereotypeAttributeEqualityExpressionTests)  Time elapsed: 0.74 s
01:17:09 SingleStereotypeAttributeEqualityExpressionTests_Test12(org.eclipse.papyrus.uml.expressions.tests.SingleStereotypeAttributeEqualityExpressionTests)  Time elapsed: 0.734 s
01:17:09 SingleStereotypeAttributeEqualityExpressionTests_Test13(org.eclipse.papyrus.uml.expressions.tests.SingleStereotypeAttributeEqualityExpressionTests)  Time elapsed: 0.831 s
01:17:09 SingleStereotypeAttributeEqualityExpressionTests_Test1(org.eclipse.papyrus.uml.expressions.tests.SingleStereotypeAttributeEqualityExpressionTests)  Time elapsed: 0.793 s
01:17:09 SingleStereotypeAttributeEqualityExpressionTests_Test2(org.eclipse.papyrus.uml.expressions.tests.SingleStereotypeAttributeEqualityExpressionTests)  Time elapsed: 0.742 s
01:17:09 SingleStereotypeAttributeEqualityExpressionTests_Test3(org.eclipse.papyrus.uml.expressions.tests.SingleStereotypeAttributeEqualityExpressionTests)  Time elapsed: 0.782 s
01:17:09 SingleStereotypeAttributeEqualityExpressionTests_Test4(org.eclipse.papyrus.uml.expressions.tests.SingleStereotypeAttributeEqualityExpressionTests)  Time elapsed: 0.801 s
01:17:09 SingleStereotypeAttributeEqualityExpressionTests_Test5(org.eclipse.papyrus.uml.expressions.tests.SingleStereotypeAttributeEqualityExpressionTests)  Time elapsed: 0.897 s
01:17:09 SingleStereotypeAttributeEqualityExpressionTests_Test6(org.eclipse.papyrus.uml.expressions.tests.SingleStereotypeAttributeEqualityExpressionTests)  Time elapsed: 0.79 s
01:17:09 SingleStereotypeAttributeEqualityExpressionTests_Test7(org.eclipse.papyrus.uml.expressions.tests.SingleStereotypeAttributeEqualityExpressionTests)  Time elapsed: 0.766 s
01:17:09 SingleStereotypeAttributeEqualityExpressionTests_Test8(org.eclipse.papyrus.uml.expressions.tests.SingleStereotypeAttributeEqualityExpressionTests)  Time elapsed: 0.806 s
01:17:09 SingleStereotypeAttributeEqualityExpressionTests_Test9(org.eclipse.papyrus.uml.expressions.tests.SingleStereotypeAttributeEqualityExpressionTests)  Time elapsed: 0.718 s
01:17:09 validateModel[0](org.eclipse.papyrus.uml.architecture.tests.resources.ModelValidationTest)  Time elapsed: 0.113 s
01:17:09 
01:17:09 Results:
01:17:09 
01:17:09 Failures: 
01:17:09   InstanceSpecificationTest.init:91->initModel:131 Cannot load the test diagram
01:17:09 Errors: 
01:17:09 org.eclipse.papyrus.uml.modelexplorer.tests.AdvancedModeTest.advancedModeDoesNotCollapseItself(org.eclipse.papyrus.uml.modelexplorer.tests.AdvancedModeTest)
01:17:09   Run 1: AdvancedModeTest.advancedModeDoesNotCollapseItself » BasicIndexOutOfBounds ind...
01:17:09   Run 2: AdvancedModeTest.advancedModeDoesNotCollapseItself:69 » NullPointer
01:17:09 
01:17:09 
01:17:09 Tests run: 657, Failures: 1, Errors: 1, Skipped: 38
01:17:09 
01:17:11 [ERROR] There are test failures.
01:17:11 
01:17:11 Please refer to /jobs/genie.papyrus/Papyrus-Master-Tests/workspace/source/tests/junit/plugins/uml/org.eclipse.papyrus.uml.suite.tests/target/surefire-reports for the individual test results.
01:17:11 [INFO] 
01:17:11 [INFO] --- jacoco-maven-plugin:0.8.2:report (default-report) @ org.eclipse.papyrus.uml.suite.tests ---
01:17:11 [INFO] Loading execution data file /jobs/genie.papyrus/Papyrus-Master-Tests/workspace/source/tests/junit/plugins/uml/org.eclipse.papyrus.uml.suite.tests/target/jacoco.exec
01:17:11 [INFO] Analyzed bundle 'org.eclipse.papyrus.uml.suite.tests' with 0 classes
01:17:11 [INFO] 
01:17:11 [INFO] --< org.eclipse.papyrus.tests:org.eclipse.papyrus.uml.alf.tests.releng >--
01:17:11 [INFO] Building org.eclipse.papyrus.uml.alf.tests.releng 0.0.1-SNAPSHOT [159/167]
01:17:11 [INFO] --------------------------------[ pom ]---------------------------------
01:17:11 [INFO] 
01:17:11 [INFO] --- maven-clean-plugin:3.1.0:clean (default-clean) @ org.eclipse.papyrus.uml.alf.tests.releng ---
01:17:11 [INFO] 
01:17:11 [INFO] --- jacoco-maven-plugin:0.8.2:prepare-agent (default-prepare-agent) @ org.eclipse.papyrus.uml.alf.tests.releng ---
01:17:11 [INFO] argLine set to -javaagent:/home/hudson/genie.papyrus/.jenkins/jobs/Papyrus-Master-Tests/workspace/.repository/org/jacoco/org.jacoco.agent/0.8.2/org.jacoco.agent-0.8.2-runtime.jar=destfile=/jobs/genie.papyrus/Papyrus-Master-Tests/workspace/source/tests/junit/plugins/uml/alf/target/jacoco.exec,includes=org.eclipse.papyrus.*,excludes=org.eclipse.uml2
01:17:11 [INFO] 
01:17:11 [INFO] --- jacoco-maven-plugin:0.8.2:report (default-report) @ org.eclipse.papyrus.uml.alf.tests.releng ---
01:17:11 [INFO] Skipping JaCoCo execution due to missing execution data file.
01:17:11 [INFO] 
01:17:11 [INFO] --< org.eclipse.papyrus.tests:org.eclipse.papyrus.uml.alf.backend.tests >--
01:17:11 [INFO] Building org.eclipse.papyrus.uml.alf.backend.tests 1.1.100-SNAPSHOT [160/167]
01:17:11 [INFO] ------------------------[ eclipse-test-plugin ]-------------------------
01:17:11 [INFO] 
01:17:11 [INFO] --- maven-clean-plugin:3.1.0:clean (default-clean) @ org.eclipse.papyrus.uml.alf.backend.tests ---
01:17:11 [INFO] 
01:17:11 [INFO] --- tycho-packaging-plugin:1.3.0:build-qualifier (default-build-qualifier) @ org.eclipse.papyrus.uml.alf.backend.tests ---
01:17:11 [INFO] The project's OSGi version is 1.1.100.202008060424
01:17:11 [INFO] 
01:17:11 [INFO] --- tycho-packaging-plugin:1.3.0:validate-id (default-validate-id) @ org.eclipse.papyrus.uml.alf.backend.tests ---
01:17:11 [INFO] 
01:17:11 [INFO] --- tycho-packaging-plugin:1.3.0:validate-version (default-validate-version) @ org.eclipse.papyrus.uml.alf.backend.tests ---
01:17:11 [INFO] 
01:17:11 [INFO] --- jacoco-maven-plugin:0.8.2:prepare-agent (default-prepare-agent) @ org.eclipse.papyrus.uml.alf.backend.tests ---
01:17:11 [INFO] tycho.testArgLine set to -javaagent:/home/hudson/genie.papyrus/.jenkins/jobs/Papyrus-Master-Tests/workspace/.repository/org/jacoco/org.jacoco.agent/0.8.2/org.jacoco.agent-0.8.2-runtime.jar=destfile=/jobs/genie.papyrus/Papyrus-Master-Tests/workspace/source/tests/junit/plugins/uml/alf/org.eclipse.papyrus.uml.alf.backend.tests/target/jacoco.exec,includes=org.eclipse.papyrus.*,excludes=org.eclipse.uml2
01:17:11 [INFO] 
01:17:11 [INFO] --- xtend-maven-plugin:2.16.0:compile (default) @ org.eclipse.papyrus.uml.alf.backend.tests ---
01:17:12 [INFO] 
01:17:12 [INFO] --- maven-resources-plugin:3.1.0:resources (default-resources) @ org.eclipse.papyrus.uml.alf.backend.tests ---
01:17:12 [INFO] Using 'UTF-8' encoding to copy filtered resources.
01:17:12 [INFO] skip non existing resourceDirectory /jobs/genie.papyrus/Papyrus-Master-Tests/workspace/source/tests/junit/plugins/uml/alf/org.eclipse.papyrus.uml.alf.backend.tests/src/main/resources
01:17:12 [INFO] 
01:17:12 [INFO] --- tycho-compiler-plugin:1.3.0:compile (default-compile) @ org.eclipse.papyrus.uml.alf.backend.tests ---
01:17:12 [WARNING] The effective compiler target level 1.8 is incompatible with the following OSGi execution environments: [JavaSE-1.7 (assumes 1.7)] @ MavenProject: org.eclipse.papyrus.tests:org.eclipse.papyrus.uml.alf.backend.tests:1.1.100-SNAPSHOT @ /jobs/genie.papyrus/Papyrus-Master-Tests/workspace/source/tests/junit/plugins/uml/alf/org.eclipse.papyrus.uml.alf.backend.tests/pom.xml
01:17:12 [INFO] Compiling 4 source files to /jobs/genie.papyrus/Papyrus-Master-Tests/workspace/source/tests/junit/plugins/uml/alf/org.eclipse.papyrus.uml.alf.backend.tests/bin
01:17:12 [INFO] 
01:17:12 [INFO] --- maven-resources-plugin:3.1.0:testResources (default-testResources) @ org.eclipse.papyrus.uml.alf.backend.tests ---
01:17:12 [INFO] Using 'UTF-8' encoding to copy filtered resources.
01:17:12 [INFO] skip non existing resourceDirectory /jobs/genie.papyrus/Papyrus-Master-Tests/workspace/source/tests/junit/plugins/uml/alf/org.eclipse.papyrus.uml.alf.backend.tests/src/test/resources
01:17:12 [INFO] 
01:17:12 [INFO] --- target-platform-configuration:1.3.0:target-platform (default-target-platform) @ org.eclipse.papyrus.uml.alf.backend.tests ---
01:17:12 [INFO] 
01:17:12 [INFO] --- tycho-packaging-plugin:1.3.0:package-plugin (default-package-plugin) @ org.eclipse.papyrus.uml.alf.backend.tests ---
01:17:12 [INFO] Building jar: /jobs/genie.papyrus/Papyrus-Master-Tests/workspace/source/tests/junit/plugins/uml/alf/org.eclipse.papyrus.uml.alf.backend.tests/target/org.eclipse.papyrus.uml.alf.backend.tests-1.1.100-SNAPSHOT.jar
01:17:12 [INFO] 
01:17:12 [INFO] --- tycho-p2-plugin:1.3.0:p2-metadata-default (default-p2-metadata-default) @ org.eclipse.papyrus.uml.alf.backend.tests ---
01:17:12 [INFO] 
01:17:12 [INFO] --- tycho-surefire-plugin:1.3.0:test (default-test) @ org.eclipse.papyrus.uml.alf.backend.tests ---
01:17:12 [INFO] Skipping tests
01:17:12 [INFO] 
01:17:12 [INFO] --- jacoco-maven-plugin:0.8.2:report (default-report) @ org.eclipse.papyrus.uml.alf.backend.tests ---
01:17:12 [INFO] Skipping JaCoCo execution due to missing execution data file.
01:17:12 [INFO] 
01:17:12 [INFO] --< org.eclipse.papyrus.tests:org.eclipse.papyrus.views.properties.toolsmiths.tests >--
01:17:12 [INFO] Building org.eclipse.papyrus.views.properties.toolsmiths.tests 1.2.100-SNAPSHOT [161/167]
01:17:12 [INFO] ------------------------[ eclipse-test-plugin ]-------------------------
01:17:12 [INFO] 
01:17:12 [INFO] --- maven-clean-plugin:3.1.0:clean (default-clean) @ org.eclipse.papyrus.views.properties.toolsmiths.tests ---
01:17:12 [INFO] 
01:17:12 [INFO] --- tycho-packaging-plugin:1.3.0:build-qualifier (default-build-qualifier) @ org.eclipse.papyrus.views.properties.toolsmiths.tests ---
01:17:12 [INFO] The project's OSGi version is 1.2.100.202008060424
01:17:12 [INFO] 
01:17:12 [INFO] --- tycho-packaging-plugin:1.3.0:validate-id (default-validate-id) @ org.eclipse.papyrus.views.properties.toolsmiths.tests ---
01:17:12 [INFO] 
01:17:12 [INFO] --- tycho-packaging-plugin:1.3.0:validate-version (default-validate-version) @ org.eclipse.papyrus.views.properties.toolsmiths.tests ---
01:17:12 [INFO] 
01:17:12 [INFO] --- jacoco-maven-plugin:0.8.2:prepare-agent (default-prepare-agent) @ org.eclipse.papyrus.views.properties.toolsmiths.tests ---
01:17:12 [INFO] tycho.testArgLine set to -javaagent:/home/hudson/genie.papyrus/.jenkins/jobs/Papyrus-Master-Tests/workspace/.repository/org/jacoco/org.jacoco.agent/0.8.2/org.jacoco.agent-0.8.2-runtime.jar=destfile=/jobs/genie.papyrus/Papyrus-Master-Tests/workspace/source/tests/junit/plugins/views/org.eclipse.papyrus.views.properties.toolsmiths.tests/target/jacoco.exec,includes=org.eclipse.papyrus.*,excludes=org.eclipse.uml2
01:17:12 [INFO] 
01:17:12 [INFO] --- maven-resources-plugin:3.1.0:resources (default-resources) @ org.eclipse.papyrus.views.properties.toolsmiths.tests ---
01:17:12 [INFO] Using 'UTF-8' encoding to copy filtered resources.
01:17:12 [INFO] skip non existing resourceDirectory /jobs/genie.papyrus/Papyrus-Master-Tests/workspace/source/tests/junit/plugins/views/org.eclipse.papyrus.views.properties.toolsmiths.tests/src/main/resources
01:17:12 [INFO] 
01:17:12 [INFO] --- tycho-compiler-plugin:1.3.0:compile (default-compile) @ org.eclipse.papyrus.views.properties.toolsmiths.tests ---
01:17:12 [WARNING] The effective compiler target level 1.8 is incompatible with the following OSGi execution environments: [J2SE-1.5 (assumes 1.5)] @ MavenProject: org.eclipse.papyrus.tests:org.eclipse.papyrus.views.properties.toolsmiths.tests:1.2.100-SNAPSHOT @ /jobs/genie.papyrus/Papyrus-Master-Tests/workspace/source/tests/junit/plugins/views/org.eclipse.papyrus.views.properties.toolsmiths.tests/pom.xml
01:17:12 [INFO] Compiling 3 source files to /jobs/genie.papyrus/Papyrus-Master-Tests/workspace/source/tests/junit/plugins/views/org.eclipse.papyrus.views.properties.toolsmiths.tests/bin
01:17:13 [WARNING] /jobs/genie.papyrus/Papyrus-Master-Tests/workspace/source/tests/junit/plugins/views/org.eclipse.papyrus.views.properties.toolsmiths.tests/src/org/eclipse/papyrus/views/properties/toolsmiths/tests/qvt/TransformationsTests.java:[274] 
01:17:13 	DataContextElement st3Element = findContextElement(context, "Stereotype3");
01:17:13 	                   ^^^^^^^^^^
01:17:13 The value of the local variable st3Element is not used
01:17:13 1 problem (1 warning)
01:17:13 [INFO] 
01:17:13 [INFO] --- maven-resources-plugin:3.1.0:testResources (default-testResources) @ org.eclipse.papyrus.views.properties.toolsmiths.tests ---
01:17:13 [INFO] Using 'UTF-8' encoding to copy filtered resources.
01:17:13 [INFO] skip non existing resourceDirectory /jobs/genie.papyrus/Papyrus-Master-Tests/workspace/source/tests/junit/plugins/views/org.eclipse.papyrus.views.properties.toolsmiths.tests/src/test/resources
01:17:13 [INFO] 
01:17:13 [INFO] --- target-platform-configuration:1.3.0:target-platform (default-target-platform) @ org.eclipse.papyrus.views.properties.toolsmiths.tests ---
01:17:13 [INFO] 
01:17:13 [INFO] --- tycho-packaging-plugin:1.3.0:package-plugin (default-package-plugin) @ org.eclipse.papyrus.views.properties.toolsmiths.tests ---
01:17:13 [INFO] Building jar: /jobs/genie.papyrus/Papyrus-Master-Tests/workspace/source/tests/junit/plugins/views/org.eclipse.papyrus.views.properties.toolsmiths.tests/target/org.eclipse.papyrus.views.properties.toolsmiths.tests-1.2.100-SNAPSHOT.jar
01:17:13 [INFO] 
01:17:13 [INFO] --- tycho-p2-plugin:1.3.0:p2-metadata-default (default-p2-metadata-default) @ org.eclipse.papyrus.views.properties.toolsmiths.tests ---
01:17:13 [INFO] 
01:17:13 [INFO] --- tycho-surefire-plugin:1.3.0:test (default-test) @ org.eclipse.papyrus.views.properties.toolsmiths.tests ---
01:17:13 [INFO] Skipping tests
01:17:13 [INFO] 
01:17:13 [INFO] --- jacoco-maven-plugin:0.8.2:report (default-report) @ org.eclipse.papyrus.views.properties.toolsmiths.tests ---
01:17:13 [INFO] Skipping JaCoCo execution due to missing execution data file.
01:17:13 [INFO] 
01:17:13 [INFO] --< org.eclipse.papyrus.tests:org.eclipse.papyrus.views.suite.tests >---
01:17:13 [INFO] Building org.eclipse.papyrus.views.suite.tests 0.0.1-SNAPSHOT  [162/167]
01:17:13 [INFO] ------------------------[ eclipse-test-plugin ]-------------------------
01:17:13 [INFO] 
01:17:13 [INFO] --- maven-clean-plugin:3.1.0:clean (default-clean) @ org.eclipse.papyrus.views.suite.tests ---
01:17:13 [INFO] 
01:17:13 [INFO] --- tycho-packaging-plugin:1.3.0:build-qualifier (default-build-qualifier) @ org.eclipse.papyrus.views.suite.tests ---
01:17:13 [INFO] The project's OSGi version is 0.0.1.202008060424
01:17:13 [INFO] 
01:17:13 [INFO] --- tycho-packaging-plugin:1.3.0:validate-id (default-validate-id) @ org.eclipse.papyrus.views.suite.tests ---
01:17:13 [INFO] 
01:17:13 [INFO] --- tycho-packaging-plugin:1.3.0:validate-version (default-validate-version) @ org.eclipse.papyrus.views.suite.tests ---
01:17:13 [INFO] 
01:17:13 [INFO] --- jacoco-maven-plugin:0.8.2:prepare-agent (default-prepare-agent) @ org.eclipse.papyrus.views.suite.tests ---
01:17:13 [INFO] tycho.testArgLine set to -javaagent:/home/hudson/genie.papyrus/.jenkins/jobs/Papyrus-Master-Tests/workspace/.repository/org/jacoco/org.jacoco.agent/0.8.2/org.jacoco.agent-0.8.2-runtime.jar=destfile=/jobs/genie.papyrus/Papyrus-Master-Tests/workspace/source/tests/junit/plugins/views/org.eclipse.papyrus.views.suite.tests/target/jacoco.exec,includes=org.eclipse.papyrus.*,excludes=org.eclipse.uml2
01:17:13 [INFO] 
01:17:13 [INFO] --- maven-resources-plugin:3.1.0:resources (default-resources) @ org.eclipse.papyrus.views.suite.tests ---
01:17:13 [INFO] Using 'UTF-8' encoding to copy filtered resources.
01:17:13 [INFO] skip non existing resourceDirectory /jobs/genie.papyrus/Papyrus-Master-Tests/workspace/source/tests/junit/plugins/views/org.eclipse.papyrus.views.suite.tests/src/main/resources
01:17:13 [INFO] 
01:17:13 [INFO] --- tycho-compiler-plugin:1.3.0:compile (default-compile) @ org.eclipse.papyrus.views.suite.tests ---
01:17:13 [INFO] Compiling 2 source files to /jobs/genie.papyrus/Papyrus-Master-Tests/workspace/source/tests/junit/plugins/views/org.eclipse.papyrus.views.suite.tests/bin
01:17:14 [INFO] 
01:17:14 [INFO] --- maven-resources-plugin:3.1.0:testResources (default-testResources) @ org.eclipse.papyrus.views.suite.tests ---
01:17:14 [INFO] Using 'UTF-8' encoding to copy filtered resources.
01:17:14 [INFO] skip non existing resourceDirectory /jobs/genie.papyrus/Papyrus-Master-Tests/workspace/source/tests/junit/plugins/views/org.eclipse.papyrus.views.suite.tests/src/test/resources
01:17:14 [INFO] 
01:17:14 [INFO] --- target-platform-configuration:1.3.0:target-platform (default-target-platform) @ org.eclipse.papyrus.views.suite.tests ---
01:17:14 [INFO] 
01:17:14 [INFO] --- tycho-packaging-plugin:1.3.0:package-plugin (default-package-plugin) @ org.eclipse.papyrus.views.suite.tests ---
01:17:14 [INFO] Building jar: /jobs/genie.papyrus/Papyrus-Master-Tests/workspace/source/tests/junit/plugins/views/org.eclipse.papyrus.views.suite.tests/target/org.eclipse.papyrus.views.suite.tests-0.0.1-SNAPSHOT.jar
01:17:14 [INFO] 
01:17:14 [INFO] --- tycho-p2-plugin:1.3.0:p2-metadata-default (default-p2-metadata-default) @ org.eclipse.papyrus.views.suite.tests ---
01:17:14 [INFO] 
01:17:14 [INFO] --- tycho-surefire-plugin:1.3.0:test (default-test) @ org.eclipse.papyrus.views.suite.tests ---
01:17:25 [INFO] Expected eclipse log file: /jobs/genie.papyrus/Papyrus-Master-Tests/workspace/source/tests/junit/plugins/views/org.eclipse.papyrus.views.suite.tests/target/work/data/.metadata/.log
01:17:25 [INFO] Command line:
01:17:25 	[/opt/public/common/java/oracle/jdk1.8.0_202_x64/jre/bin/java, -Dosgi.noShutdown=false, -Dosgi.os=linux, -Dosgi.ws=gtk, -Dosgi.arch=x86_64, -javaagent:/home/hudson/genie.papyrus/.jenkins/jobs/Papyrus-Master-Tests/workspace/.repository/org/jacoco/org.jacoco.agent/0.8.2/org.jacoco.agent-0.8.2-runtime.jar=destfile=/jobs/genie.papyrus/Papyrus-Master-Tests/workspace/source/tests/junit/plugins/views/org.eclipse.papyrus.views.suite.tests/target/jacoco.exec,includes=org.eclipse.papyrus.*,excludes=org.eclipse.uml2, -Xms512m, -Xmx2048m, -XX:SoftRefLRUPolicyMSPerMB=100, -Dosgi.clean=true, -jar, /jobs/genie.papyrus/Papyrus-Master-Tests/workspace/.repository/p2/osgi/bundle/org.eclipse.equinox.launcher/1.5.700.v20200207-2156/org.eclipse.equinox.launcher-1.5.700.v20200207-2156.jar, -data, /jobs/genie.papyrus/Papyrus-Master-Tests/workspace/source/tests/junit/plugins/views/org.eclipse.papyrus.views.suite.tests/target/work/data, -install, /jobs/genie.papyrus/Papyrus-Master-Tests/workspace/source/tests/junit/plugins/views/org.eclipse.papyrus.views.suite.tests/target/work, -configuration, /jobs/genie.papyrus/Papyrus-Master-Tests/workspace/source/tests/junit/plugins/views/org.eclipse.papyrus.views.suite.tests/target/work/configuration, -application, org.eclipse.tycho.surefire.osgibooter.uitest, -testproperties, /jobs/genie.papyrus/Papyrus-Master-Tests/workspace/source/tests/junit/plugins/views/org.eclipse.papyrus.views.suite.tests/target/surefire.properties, -product, org.eclipse.sdk.ide, -testConfig=CI_TESTS_CONFIG]
01:17:25 Picked up JAVA_TOOL_OPTIONS: -Xmx2G -Djava.io.tmpdir=/tmp/genie.papyrus -DforkCount=1
01:17:29 ***WARNING: GTK+ version too old (micro mismatch)
01:17:29 ***WARNING: SWT requires GTK 3.20.0
01:17:29 ***WARNING: Detected: 3.10.9
01:17:29 
01:17:29 (Eclipse:14980): Gtk-WARNING **: Theme parsing error: <data>:31:11: 'min-height' is not a valid property name
01:17:34 SWT Webkit: Warning, You are using an old version of webkitgtk. (pre 2.4) BrowserFunction functionality will not be avaliable
01:17:34 SWT WebKit: error initializing DBus server, dBusServer == 0
01:17:35 Running org.eclipse.papyrus.views.suite.tests.AllTests
01:17:42 No JFaces support for org.eclipse.jface.viewers.TableTreeViewer
01:17:53 Tests run: 11, Failures: 0, Errors: 0, Skipped: 0, Time elapsed: 18.153 s - in org.eclipse.papyrus.views.suite.tests.AllTests
01:17:53 revealSemanticElement_rootTest(org.eclipse.papyrus.views.modelexplorer.tests.ModelExplorerViewTests)  Time elapsed: 8.859 s
01:17:53 deleteDiagramTest(org.eclipse.papyrus.views.modelexplorer.tests.DeleteHandlerTest)  Time elapsed: 1.984 s
01:17:53 deleteTableTest(org.eclipse.papyrus.views.modelexplorer.tests.DeleteHandlerTest)  Time elapsed: 1.376 s
01:17:53 deleteLinkItemTest(org.eclipse.papyrus.views.modelexplorer.tests.DeleteHandlerTest)  Time elapsed: 1.017 s
01:17:53 deleteRootOfTheModel(org.eclipse.papyrus.views.modelexplorer.tests.DeleteHandlerTest)  Time elapsed: 1.105 s
01:17:53 testOpendiagramTest(org.eclipse.papyrus.views.modelexplorer.tests.OpendiagramTest)  Time elapsed: 0.453 s
01:17:53 documentationViewTests(org.eclipse.papyrus.views.documentation.tests.DocumentationViewTests)  Time elapsed: 1.411 s
01:17:53 handleXWTFileFromResourceSet(org.eclipse.papyrus.views.properties.toolsmiths.tests.qvt.TransformationsTests)  Time elapsed: 0.9 s
01:17:53 handleXWTFileFromResource(org.eclipse.papyrus.views.properties.toolsmiths.tests.qvt.TransformationsTests)  Time elapsed: 0.118 s
01:17:53 generateEcoreContext(org.eclipse.papyrus.views.properties.toolsmiths.tests.qvt.TransformationsTests)  Time elapsed: 0.071 s
01:17:53 generateProfileContext(org.eclipse.papyrus.views.properties.toolsmiths.tests.qvt.TransformationsTests)  Time elapsed: 0.367 s
01:17:53 
01:17:53 Results:
01:17:53 
01:17:53 Tests run: 11, Failures: 0, Errors: 0, Skipped: 0
01:17:53 
01:17:56 [INFO] All tests passed!
01:17:56 [INFO] 
01:17:56 [INFO] --- jacoco-maven-plugin:0.8.2:report (default-report) @ org.eclipse.papyrus.views.suite.tests ---
01:17:56 [INFO] Loading execution data file /jobs/genie.papyrus/Papyrus-Master-Tests/workspace/source/tests/junit/plugins/views/org.eclipse.papyrus.views.suite.tests/target/jacoco.exec
01:17:57 [INFO] Analyzed bundle 'org.eclipse.papyrus.views.suite.tests' with 0 classes
01:17:57 [INFO] 
01:17:57 [INFO] --< org.eclipse.papyrus.tests:org.eclipse.papyrus.views.documentation.tests.releng >--
01:17:57 [INFO] Building org.eclipse.papyrus.views.documentation.tests.releng 0.0.1-SNAPSHOT [163/167]
01:17:57 [INFO] --------------------------------[ pom ]---------------------------------
01:17:57 [INFO] 
01:17:57 [INFO] --- maven-clean-plugin:3.1.0:clean (default-clean) @ org.eclipse.papyrus.views.documentation.tests.releng ---
01:17:57 [INFO] 
01:17:57 [INFO] --- jacoco-maven-plugin:0.8.2:prepare-agent (default-prepare-agent) @ org.eclipse.papyrus.views.documentation.tests.releng ---
01:17:57 [INFO] argLine set to -javaagent:/home/hudson/genie.papyrus/.jenkins/jobs/Papyrus-Master-Tests/workspace/.repository/org/jacoco/org.jacoco.agent/0.8.2/org.jacoco.agent-0.8.2-runtime.jar=destfile=/jobs/genie.papyrus/Papyrus-Master-Tests/workspace/source/tests/junit/plugins/views/documentation/target/jacoco.exec,includes=org.eclipse.papyrus.*,excludes=org.eclipse.uml2
01:17:57 [INFO] 
01:17:57 [INFO] --- jacoco-maven-plugin:0.8.2:report (default-report) @ org.eclipse.papyrus.views.documentation.tests.releng ---
01:17:57 [INFO] Skipping JaCoCo execution due to missing execution data file.
01:17:57 [INFO] 
01:17:57 [INFO] --< org.eclipse.papyrus.tests:org.eclipse.papyrus.toolsmiths.suite.tests >--
01:17:57 [INFO] Building org.eclipse.papyrus.toolsmiths.suite.tests 0.0.1-SNAPSHOT [164/167]
01:17:57 [INFO] ------------------------[ eclipse-test-plugin ]-------------------------
01:17:58 [INFO] 
01:17:58 [INFO] --- maven-clean-plugin:3.1.0:clean (default-clean) @ org.eclipse.papyrus.toolsmiths.suite.tests ---
01:17:58 [INFO] 
01:17:58 [INFO] --- tycho-packaging-plugin:1.3.0:build-qualifier (default-build-qualifier) @ org.eclipse.papyrus.toolsmiths.suite.tests ---
01:17:58 [INFO] The project's OSGi version is 0.0.1.202008060424
01:17:58 [INFO] 
01:17:58 [INFO] --- tycho-packaging-plugin:1.3.0:validate-id (default-validate-id) @ org.eclipse.papyrus.toolsmiths.suite.tests ---
01:17:58 [INFO] 
01:17:58 [INFO] --- tycho-packaging-plugin:1.3.0:validate-version (default-validate-version) @ org.eclipse.papyrus.toolsmiths.suite.tests ---
01:17:58 [INFO] 
01:17:58 [INFO] --- jacoco-maven-plugin:0.8.2:prepare-agent (default-prepare-agent) @ org.eclipse.papyrus.toolsmiths.suite.tests ---
01:17:58 [INFO] tycho.testArgLine set to -javaagent:/home/hudson/genie.papyrus/.jenkins/jobs/Papyrus-Master-Tests/workspace/.repository/org/jacoco/org.jacoco.agent/0.8.2/org.jacoco.agent-0.8.2-runtime.jar=destfile=/jobs/genie.papyrus/Papyrus-Master-Tests/workspace/source/tests/junit/plugins/toolsmiths/org.eclipse.papyrus.toolsmiths.suite.tests/target/jacoco.exec,includes=org.eclipse.papyrus.*,excludes=org.eclipse.uml2
01:17:58 [INFO] 
01:17:58 [INFO] --- maven-resources-plugin:3.1.0:resources (default-resources) @ org.eclipse.papyrus.toolsmiths.suite.tests ---
01:17:58 [INFO] Using 'UTF-8' encoding to copy filtered resources.
01:17:58 [INFO] skip non existing resourceDirectory /jobs/genie.papyrus/Papyrus-Master-Tests/workspace/source/tests/junit/plugins/toolsmiths/org.eclipse.papyrus.toolsmiths.suite.tests/src/main/resources
01:17:58 [INFO] 
01:17:58 [INFO] --- tycho-compiler-plugin:1.3.0:compile (default-compile) @ org.eclipse.papyrus.toolsmiths.suite.tests ---
01:17:58 [INFO] Compiling 2 source files to /jobs/genie.papyrus/Papyrus-Master-Tests/workspace/source/tests/junit/plugins/toolsmiths/org.eclipse.papyrus.toolsmiths.suite.tests/bin
01:17:58 [INFO] 
01:17:58 [INFO] --- maven-resources-plugin:3.1.0:testResources (default-testResources) @ org.eclipse.papyrus.toolsmiths.suite.tests ---
01:17:58 [INFO] Using 'UTF-8' encoding to copy filtered resources.
01:17:58 [INFO] skip non existing resourceDirectory /jobs/genie.papyrus/Papyrus-Master-Tests/workspace/source/tests/junit/plugins/toolsmiths/org.eclipse.papyrus.toolsmiths.suite.tests/src/test/resources
01:17:58 [INFO] 
01:17:58 [INFO] --- target-platform-configuration:1.3.0:target-platform (default-target-platform) @ org.eclipse.papyrus.toolsmiths.suite.tests ---
01:17:58 [INFO] 
01:17:58 [INFO] --- tycho-packaging-plugin:1.3.0:package-plugin (default-package-plugin) @ org.eclipse.papyrus.toolsmiths.suite.tests ---
01:17:58 [INFO] Building jar: /jobs/genie.papyrus/Papyrus-Master-Tests/workspace/source/tests/junit/plugins/toolsmiths/org.eclipse.papyrus.toolsmiths.suite.tests/target/org.eclipse.papyrus.toolsmiths.suite.tests-0.0.1-SNAPSHOT.jar
01:17:58 [INFO] 
01:17:58 [INFO] --- tycho-p2-plugin:1.3.0:p2-metadata-default (default-p2-metadata-default) @ org.eclipse.papyrus.toolsmiths.suite.tests ---
01:17:58 [INFO] 
01:17:58 [INFO] --- tycho-surefire-plugin:1.3.0:test (default-test) @ org.eclipse.papyrus.toolsmiths.suite.tests ---
01:18:07 [INFO] Expected eclipse log file: /jobs/genie.papyrus/Papyrus-Master-Tests/workspace/source/tests/junit/plugins/toolsmiths/org.eclipse.papyrus.toolsmiths.suite.tests/target/work/data/.metadata/.log
01:18:07 [INFO] Command line:
01:18:07 	[/opt/public/common/java/oracle/jdk1.8.0_202_x64/jre/bin/java, -Dosgi.noShutdown=false, -Dosgi.os=linux, -Dosgi.ws=gtk, -Dosgi.arch=x86_64, -javaagent:/home/hudson/genie.papyrus/.jenkins/jobs/Papyrus-Master-Tests/workspace/.repository/org/jacoco/org.jacoco.agent/0.8.2/org.jacoco.agent-0.8.2-runtime.jar=destfile=/jobs/genie.papyrus/Papyrus-Master-Tests/workspace/source/tests/junit/plugins/toolsmiths/org.eclipse.papyrus.toolsmiths.suite.tests/target/jacoco.exec,includes=org.eclipse.papyrus.*,excludes=org.eclipse.uml2, -Xms512m, -Xmx2048m, -XX:SoftRefLRUPolicyMSPerMB=100, -Dosgi.clean=true, -jar, /jobs/genie.papyrus/Papyrus-Master-Tests/workspace/.repository/p2/osgi/bundle/org.eclipse.equinox.launcher/1.5.700.v20200207-2156/org.eclipse.equinox.launcher-1.5.700.v20200207-2156.jar, -data, /jobs/genie.papyrus/Papyrus-Master-Tests/workspace/source/tests/junit/plugins/toolsmiths/org.eclipse.papyrus.toolsmiths.suite.tests/target/work/data, -install, /jobs/genie.papyrus/Papyrus-Master-Tests/workspace/source/tests/junit/plugins/toolsmiths/org.eclipse.papyrus.toolsmiths.suite.tests/target/work, -configuration, /jobs/genie.papyrus/Papyrus-Master-Tests/workspace/source/tests/junit/plugins/toolsmiths/org.eclipse.papyrus.toolsmiths.suite.tests/target/work/configuration, -application, org.eclipse.tycho.surefire.osgibooter.uitest, -testproperties, /jobs/genie.papyrus/Papyrus-Master-Tests/workspace/source/tests/junit/plugins/toolsmiths/org.eclipse.papyrus.toolsmiths.suite.tests/target/surefire.properties, -product, org.eclipse.sdk.ide, -testConfig=CI_TESTS_CONFIG]
01:18:07 Picked up JAVA_TOOL_OPTIONS: -Xmx2G -Djava.io.tmpdir=/tmp/genie.papyrus -DforkCount=1
01:18:11 ***WARNING: GTK+ version too old (micro mismatch)
01:18:11 ***WARNING: SWT requires GTK 3.20.0
01:18:11 ***WARNING: Detected: 3.10.9
01:18:11 
01:18:11 (Eclipse:15567): Gtk-WARNING **: Theme parsing error: <data>:31:11: 'min-height' is not a valid property name
01:18:17 SWT Webkit: Warning, You are using an old version of webkitgtk. (pre 2.4) BrowserFunction functionality will not be avaliable
01:18:17 SWT WebKit: error initializing DBus server, dBusServer == 0
01:18:18 Running org.eclipse.papyrus.toolsmiths.suite.tests.AllTests
01:18:19 log4j:WARN No appenders could be found for logger (org.eclipse.emf.compare.EMFCompare).
01:18:19 log4j:WARN Please initialize the log4j system properly.
01:18:21 Tests run: 21, Failures: 0, Errors: 0, Skipped: 0, Time elapsed: 2.519 s - in org.eclipse.papyrus.toolsmiths.suite.tests.AllTests
01:18:21 ProfileAutomaticMigrationTest(org.eclipse.papyrus.toolsmiths.profilemigration.tests.automatic.AutomaticMigrationTest)  Time elapsed: 0.003 s
01:18:21 PackageAutomaticMigrationTest(org.eclipse.papyrus.toolsmiths.profilemigration.tests.automatic.AutomaticMigrationTest)  Time elapsed: 0.001 s
01:18:21 StereotypeAutomaticMigrationTest_Stereotype_delete_Property(org.eclipse.papyrus.toolsmiths.profilemigration.tests.automatic.AutomaticMigrationTest)  Time elapsed: 0 s
01:18:21 PropertyAutomaticMigrationTest(org.eclipse.papyrus.toolsmiths.profilemigration.tests.automatic.AutomaticMigrationTest)  Time elapsed: 0.001 s
01:18:21 StereotypeAutomaticMigrationTest(org.eclipse.papyrus.toolsmiths.profilemigration.tests.automatic.AutomaticMigrationTest)  Time elapsed: 0.001 s
01:18:21 GeneralizationAutomaticMigrationTest(org.eclipse.papyrus.toolsmiths.profilemigration.tests.automatic.AutomaticMigrationTest)  Time elapsed: 0 s
01:18:21 atomicListTest(org.eclipse.papyrus.toolsmiths.profilemigration.tests.migrators.ChangeIsAbstractFromStereotypeTest)  Time elapsed: 0.001 s
01:18:21 atomicListMoveProfileIntoNonApplyProfileTest(org.eclipse.papyrus.toolsmiths.profilemigration.tests.migrators.MoveMigratorTest)  Time elapsed: 0.028 s
01:18:21 atomicListMoveStereotypeIntoNonApplyProfileTest(org.eclipse.papyrus.toolsmiths.profilemigration.tests.migrators.MoveMigratorTest)  Time elapsed: 0.025 s
01:18:21 atomicListMovePackageIntoAlreadyApplyProfileTest(org.eclipse.papyrus.toolsmiths.profilemigration.tests.migrators.MoveMigratorTest)  Time elapsed: 0.025 s
01:18:21 atomicListMoveStereotypeIntoAlreadyApplyProfileTest(org.eclipse.papyrus.toolsmiths.profilemigration.tests.migrators.MoveMigratorTest)  Time elapsed: 0.025 s
01:18:21 atomicListMovePackageIntoNonApplyProfileTest(org.eclipse.papyrus.toolsmiths.profilemigration.tests.migrators.MoveMigratorTest)  Time elapsed: 0.026 s
01:18:21 atomicListMoveProfileIntoAlreadyApplyProfileTest(org.eclipse.papyrus.toolsmiths.profilemigration.tests.migrators.MoveMigratorTest)  Time elapsed: 0.025 s
01:18:21 UpperMultiplicityTest(org.eclipse.papyrus.toolsmiths.profilemigration.tests.migrators.ChangeMultiplicityFromPropertyMigratorTest)  Time elapsed: 0.001 s
01:18:21 atomicListTest(org.eclipse.papyrus.toolsmiths.profilemigration.tests.migrators.ChangeMultiplicityFromPropertyMigratorTest)  Time elapsed: 0 s
01:18:21 LowerMultiplicityTest(org.eclipse.papyrus.toolsmiths.profilemigration.tests.migrators.ChangeMultiplicityFromPropertyMigratorTest)  Time elapsed: 0.001 s
01:18:21 DeleteEnumerationLiteralTest(org.eclipse.papyrus.toolsmiths.profilemigration.tests.migrators.DeleteEnumLiteralFromEnumerationTest)  Time elapsed: 0.002 s
01:18:21 MoveEnumerationLiteralTest(org.eclipse.papyrus.toolsmiths.profilemigration.tests.migrators.DeleteEnumLiteralFromEnumerationTest)  Time elapsed: 0 s
01:18:21 atomicListTest(org.eclipse.papyrus.toolsmiths.profilemigration.tests.migrators.DeleteEnumLiteralFromEnumerationTest)  Time elapsed: 0 s
01:18:21 atomicListTest(org.eclipse.papyrus.toolsmiths.profilemigration.tests.migrators.ChangeIsStaticFromPropertyTest)  Time elapsed: 0.001 s
01:18:21 atomicListTest(org.eclipse.papyrus.toolsmiths.profilemigration.tests.migrators.AddPropertyToStereotypeTest)  Time elapsed: 0.001 s
01:18:21 
01:18:21 Results:
01:18:21 
01:18:21 Tests run: 21, Failures: 0, Errors: 0, Skipped: 0
01:18:21 
01:18:22 [INFO] All tests passed!
01:18:22 [INFO] 
01:18:22 [INFO] --- jacoco-maven-plugin:0.8.2:report (default-report) @ org.eclipse.papyrus.toolsmiths.suite.tests ---
01:18:22 [INFO] Loading execution data file /jobs/genie.papyrus/Papyrus-Master-Tests/workspace/source/tests/junit/plugins/toolsmiths/org.eclipse.papyrus.toolsmiths.suite.tests/target/jacoco.exec
01:18:23 [INFO] Analyzed bundle 'org.eclipse.papyrus.toolsmiths.suite.tests' with 0 classes
01:18:23 [INFO] 
01:18:23 [INFO] -----< org.eclipse.papyrus:org.eclipse.papyrus.tests.main.releng >------
01:18:23 [INFO] Building org.eclipse.papyrus.tests.main.releng 1.2.0-SNAPSHOT  [165/167]
01:18:23 [INFO] --------------------------------[ pom ]---------------------------------
01:18:23 [INFO] 
01:18:23 [INFO] --- maven-clean-plugin:3.1.0:clean (default-clean) @ org.eclipse.papyrus.tests.main.releng ---
01:18:23 [INFO] 
01:18:23 [INFO] --- jacoco-maven-plugin:0.8.2:prepare-agent (default-prepare-agent) @ org.eclipse.papyrus.tests.main.releng ---
01:18:23 [INFO] argLine set to -javaagent:/home/hudson/genie.papyrus/.jenkins/jobs/Papyrus-Master-Tests/workspace/.repository/org/jacoco/org.jacoco.agent/0.8.2/org.jacoco.agent-0.8.2-runtime.jar=destfile=/jobs/genie.papyrus/Papyrus-Master-Tests/workspace/source/releng/tests/main-tests/target/jacoco.exec,includes=org.eclipse.papyrus.*,excludes=org.eclipse.uml2
01:18:23 [INFO] 
01:18:23 [INFO] --- jacoco-maven-plugin:0.8.2:report (default-report) @ org.eclipse.papyrus.tests.main.releng ---
01:18:23 [INFO] Skipping JaCoCo execution due to missing execution data file.
01:18:23 [INFO] 
01:18:23 [INFO] --< org.eclipse.papyrus:org.eclipse.papyrus.main.tests.target.parent >--
01:18:23 [INFO] Building org.eclipse.papyrus.main.tests.target.parent 0.0.1-SNAPSHOT [166/167]
01:18:23 [INFO] --------------------------------[ pom ]---------------------------------
01:18:23 [INFO] 
01:18:23 [INFO] --- maven-clean-plugin:3.1.0:clean (default-clean) @ org.eclipse.papyrus.main.tests.target.parent ---
01:18:23 [INFO] 
01:18:23 [INFO] --- jacoco-maven-plugin:0.8.2:prepare-agent (default-prepare-agent) @ org.eclipse.papyrus.main.tests.target.parent ---
01:18:23 [INFO] argLine set to -javaagent:/home/hudson/genie.papyrus/.jenkins/jobs/Papyrus-Master-Tests/workspace/.repository/org/jacoco/org.jacoco.agent/0.8.2/org.jacoco.agent-0.8.2-runtime.jar=destfile=/jobs/genie.papyrus/Papyrus-Master-Tests/workspace/source/releng/tests/main-tests/targetPlatform/target/jacoco.exec,includes=org.eclipse.papyrus.*,excludes=org.eclipse.uml2
01:18:23 [INFO] 
01:18:23 [INFO] --- jacoco-maven-plugin:0.8.2:report (default-report) @ org.eclipse.papyrus.main.tests.target.parent ---
01:18:23 [INFO] Skipping JaCoCo execution due to missing execution data file.
01:18:23 [INFO] 
01:18:23 [INFO] --< org.eclipse.papyrus:org.eclipse.papyrus.main.tests.portable.target >--
01:18:23 [INFO] Building org.eclipse.papyrus.main.tests.portable.target 0.0.1-SNAPSHOT [167/167]
01:18:23 [INFO] ---------------------[ eclipse-target-definition ]----------------------
01:18:23 [INFO] 
01:18:23 [INFO] --- maven-clean-plugin:3.1.0:clean (default-clean) @ org.eclipse.papyrus.main.tests.portable.target ---
01:18:23 [INFO] 
01:18:23 [INFO] --- jacoco-maven-plugin:0.8.2:prepare-agent (default-prepare-agent) @ org.eclipse.papyrus.main.tests.portable.target ---
01:18:23 [INFO] argLine set to -javaagent:/home/hudson/genie.papyrus/.jenkins/jobs/Papyrus-Master-Tests/workspace/.repository/org/jacoco/org.jacoco.agent/0.8.2/org.jacoco.agent-0.8.2-runtime.jar=destfile=/jobs/genie.papyrus/Papyrus-Master-Tests/workspace/source/releng/tests/main-tests/targetPlatform/portable/target/jacoco.exec,includes=org.eclipse.papyrus.*,excludes=org.eclipse.uml2
01:18:23 [INFO] 
01:18:23 [INFO] --- tycho-packaging-plugin:1.3.0:package-target-definition (default-package-target-definition) @ org.eclipse.papyrus.main.tests.portable.target ---
01:18:23 [INFO] 
01:18:23 [INFO] --- jacoco-maven-plugin:0.8.2:report (default-report) @ org.eclipse.papyrus.main.tests.portable.target ---
01:18:23 [INFO] Skipping JaCoCo execution due to missing execution data file.
01:18:23 [INFO] ------------------------------------------------------------------------
01:18:23 [INFO] Reactor Summary:
01:18:23 [INFO] 
01:18:23 [INFO] org.eclipse.papyrus.tests.releng 0.0.1-SNAPSHOT .... SUCCESS [  0.377 s]
01:18:23 [INFO] org.eclipse.papyrus.plugins.tests.releng 0.0.1-SNAPSHOT SUCCESS [  0.008 s]
01:18:23 [INFO] org.eclipse.papyrus.editor.tests.releng 0.0.1-SNAPSHOT SUCCESS [  0.004 s]
01:18:23 [INFO] org.eclipse.papyrus.editor.integration.tests 1.5.0-SNAPSHOT SUCCESS [  1.628 s]
01:18:23 [INFO] org.eclipse.papyrus.infra.tests.releng 0.0.1-SNAPSHOT SUCCESS [  0.005 s]
01:18:23 [INFO] org.eclipse.papyrus.infra.core.tests.releng 0.0.1-SNAPSHOT SUCCESS [  0.006 s]
01:18:23 [INFO] org.eclipse.papyrus.infra.core.clipboard.tests 1.3.0-SNAPSHOT SUCCESS [  0.597 s]
01:18:23 [INFO] org.eclipse.papyrus.infra.core.sasheditor.tests 1.2.0-SNAPSHOT SUCCESS [  0.731 s]
01:18:23 [INFO] org.eclipse.papyrus.infra.core.sasheditor.di.tests 1.2.0-SNAPSHOT SUCCESS [  0.915 s]
01:18:23 [INFO] org.eclipse.papyrus.infra.core.tests 3.1.0-SNAPSHOT  SUCCESS [  0.813 s]
01:18:23 [INFO] org.eclipse.papyrus.infra.editor.tests.releng 0.0.1-SNAPSHOT SUCCESS [  0.006 s]
01:18:23 [INFO] org.eclipse.papyrus.infra.editor.welcome.tests 1.2.100-SNAPSHOT SUCCESS [  0.558 s]
01:18:23 [INFO] org.eclipse.papyrus.infra.emf.tests.releng 0.0.1-SNAPSHOT SUCCESS [  0.004 s]
01:18:23 [INFO] org.eclipse.papyrus.infra.emf.gmf.tests 1.2.100-SNAPSHOT SUCCESS [  0.414 s]
01:18:23 [INFO] org.eclipse.papyrus.infra.emf.readonly.tests 1.4.0-SNAPSHOT SUCCESS [  0.349 s]
01:18:23 [INFO] org.eclipse.papyrus.infra.emf.tests 1.5.100-SNAPSHOT SUCCESS [  0.672 s]
01:18:23 [INFO] org.eclipse.papyrus.infra.filters.tests 1.2.0-SNAPSHOT SUCCESS [  0.127 s]
01:18:23 [INFO] org.eclipse.papyrus.infra.gmfdiag.tests.releng 0.0.1-SNAPSHOT SUCCESS [  0.006 s]
01:18:23 [INFO] org.eclipse.papyrus.infra.gmfdiag.assistant.tests.releng 0.0.1-SNAPSHOT SUCCESS [  0.004 s]
01:18:23 [INFO] org.eclipse.papyrus.infra.gmfdiag.assistant.tests 1.3.100-SNAPSHOT SUCCESS [  0.431 s]
01:18:23 [INFO] org.eclipse.papyrus.infra.gmfdiag.canonical.tests 1.3.100-SNAPSHOT SUCCESS [  0.565 s]
01:18:23 [INFO] org.eclipse.papyrus.infra.gmfdiag.commands.tests 1.3.100-SNAPSHOT SUCCESS [  0.463 s]
01:18:23 [INFO] org.eclipse.papyrus.infra.gmfdiag.common.tests 3.1.100-SNAPSHOT SUCCESS [  0.662 s]
01:18:23 [INFO] org.eclipse.papyrus.infra.gmfdiag.css.tests 1.3.0-SNAPSHOT SUCCESS [  0.399 s]
01:18:23 [INFO] org.eclipse.papyrus.infra.gmfdiag.menu.tests 1.2.200-SNAPSHOT SUCCESS [  0.376 s]
01:18:23 [INFO] org.eclipse.papyrus.infra.gmfdiag.paletteconfiguration.tests 1.3.100-SNAPSHOT SUCCESS [  0.344 s]
01:18:23 [INFO] org.eclipse.papyrus.infra.gmfdiag.welcome.tests 1.2.0-SNAPSHOT SUCCESS [  0.470 s]
01:18:23 [INFO] org.eclipse.papyrus.infra.nattable.main.test 1.2.0-SNAPSHOT SUCCESS [  0.004 s]
01:18:23 [INFO] org.eclipse.papyrus.infra.nattable.common.tests 1.2.200-SNAPSHOT SUCCESS [  0.465 s]
01:18:23 [INFO] org.eclipse.papyrus.infra.nattable.model.tests 1.2.100-SNAPSHOT SUCCESS [  0.319 s]
01:18:23 [INFO] org.eclipse.papyrus.infra.nattable.tests 1.2.200-SNAPSHOT SUCCESS [  0.762 s]
01:18:23 [INFO] org.eclipse.papyrus.infra.nattable.views.tests 1.2.100-SNAPSHOT SUCCESS [  0.415 s]
01:18:23 [INFO] org.eclipse.papyrus.infra.properties.tests.releng 0.0.1-SNAPSHOT SUCCESS [  0.005 s]
01:18:23 [INFO] org.eclipse.papyrus.infra.properties.ui.tests 2.0.0-SNAPSHOT SUCCESS [  0.550 s]
01:18:23 [INFO] org.eclipse.papyrus.infra.services.tests.releng 0.0.1-SNAPSHOT SUCCESS [  0.004 s]
01:18:23 [INFO] org.eclipse.papyrus.infra.services.controlmode.tests 1.5.100-SNAPSHOT SUCCESS [  0.835 s]
01:18:23 [INFO] org.eclipse.papyrus.infra.services.edit.tests 1.2.100-SNAPSHOT SUCCESS [  0.448 s]
01:18:23 [INFO] org.eclipse.papyrus.infra.services.edit.ui.tests 1.2.0-SNAPSHOT SUCCESS [  0.335 s]
01:18:23 [INFO] org.eclipse.papyrus.infra.services.resourceloading.tests 1.3.0-SNAPSHOT SUCCESS [  0.442 s]
01:18:23 [INFO] org.eclipse.papyrus.infra.services.semantic.tests 1.2.200-SNAPSHOT SUCCESS [  0.389 s]
01:18:23 [INFO] org.eclipse.papyrus.infra.tools.tests 1.3.0-SNAPSHOT SUCCESS [  0.638 s]
01:18:23 [INFO] org.eclipse.papyrus.infra.types.tests.releng 0.0.1-SNAPSHOT SUCCESS [  0.004 s]
01:18:23 [INFO] org.eclipse.papyrus.infra.types.tests 3.0.200-SNAPSHOT SUCCESS [  0.647 s]
01:18:23 [INFO] org.eclipse.papyrus.infra.types.ui.tests 3.0.100-SNAPSHOT SUCCESS [  0.579 s]
01:18:23 [INFO] org.eclipse.papyrus.infra.ui.emf.tests 1.4.0-SNAPSHOT SUCCESS [  0.625 s]
01:18:23 [INFO] org.eclipse.papyrus.infra.ui.tests 1.2.0-SNAPSHOT .. SUCCESS [  0.475 s]
01:18:23 [INFO] org.eclipse.papyrus.infra.viewpoints.tests.releng 0.0.1-SNAPSHOT SUCCESS [  0.003 s]
01:18:23 [INFO] org.eclipse.papyrus.infra.viewpoints.policy.tests 1.2.100-SNAPSHOT SUCCESS [  0.699 s]
01:18:23 [INFO] org.eclipse.papyrus.uml.tests.releng 0.0.1-SNAPSHOT  SUCCESS [  0.009 s]
01:18:23 [INFO] org.eclipse.papyrus.uml.diagram.tests.releng 1.2.0-SNAPSHOT SUCCESS [  0.005 s]
01:18:23 [INFO] org.eclipse.papyrus.uml.diagram.tests 1.3.100-SNAPSHOT SUCCESS [  0.845 s]
01:18:23 [INFO] org.eclipse.papyrus.uml.diagram.clazz.tests 1.3.200-SNAPSHOT SUCCESS [  0.720 s]
01:18:23 [INFO] org.eclipse.papyrus.uml.diagram.activity.tests 1.2.100-SNAPSHOT SUCCESS [  0.753 s]
01:18:23 [INFO] org.eclipse.papyrus.uml.diagram.usecase.tests 4.0.200-SNAPSHOT SUCCESS [  0.674 s]
01:18:23 [INFO] org.eclipse.papyrus.uml.diagram.deployment.tests 1.2.100-SNAPSHOT SUCCESS [  0.698 s]
01:18:23 [INFO] org.eclipse.papyrus.uml.diagram.component.tests 1.2.100-SNAPSHOT SUCCESS [  0.680 s]
01:18:23 [INFO] org.eclipse.papyrus.uml.diagram.timing.tests 1.2.100-SNAPSHOT SUCCESS [  0.838 s]
01:18:23 [INFO] org.eclipse.papyrus.uml.diagram.stereotypeproperty.tests 1.2.200-SNAPSHOT SUCCESS [  0.546 s]
01:18:23 [INFO] org.eclipse.papyrus.uml.diagram.sequence.tests 1.3.200-SNAPSHOT SUCCESS [  1.207 s]
01:18:23 [INFO] org.eclipse.papyrus.uml.diagram.composite.tests 1.2.200-SNAPSHOT SUCCESS [  0.606 s]
01:18:23 [INFO] org.eclipse.papyrus.uml.diagram.profile.tests 1.2.200-SNAPSHOT SUCCESS [  0.760 s]
01:18:23 [INFO] org.eclipse.papyrus.uml.dynamic.profile.tests 1.2.100-SNAPSHOT SUCCESS [  0.039 s]
01:18:23 [INFO] org.eclipse.papyrus.uml.diagram.common.tests 1.4.0-SNAPSHOT SUCCESS [  0.603 s]
01:18:23 [INFO] org.eclipse.papyrus.uml.diagram.wizards.tests 1.3.0-SNAPSHOT SUCCESS [  0.499 s]
01:18:23 [INFO] org.eclipse.papyrus.tests.uml.diagram.feature 1.2.0-SNAPSHOT SUCCESS [  0.235 s]
01:18:23 [INFO] org.eclipse.papyrus.tests.infra.services.feature 1.2.0-SNAPSHOT SUCCESS [  0.082 s]
01:18:23 [INFO] org.eclipse.papyrus.views.tests.releng 0.0.1-SNAPSHOT SUCCESS [  0.003 s]
01:18:23 [INFO] org.eclipse.papyrus.views.modelexplorer.tests 1.3.0-SNAPSHOT SUCCESS [  0.424 s]
01:18:23 [INFO] org.eclipse.papyrus.uml.modelexplorer.tests.releng 0.0.1-SNAPSHOT SUCCESS [  0.007 s]
01:18:23 [INFO] org.eclipse.papyrus.uml.modelexplorer.tests 1.3.100-SNAPSHOT SUCCESS [  0.566 s]
01:18:23 [INFO] org.eclipse.papyrus.uml.modelrepair.tests 1.3.100-SNAPSHOT SUCCESS [  0.773 s]
01:18:23 [INFO] org.eclipse.papyrus.uml.properties.tests 1.1.100-SNAPSHOT SUCCESS [  0.853 s]
01:18:23 [INFO] org.eclipse.papyrus.uml.service.types.tests 1.3.100-SNAPSHOT SUCCESS [  0.976 s]
01:18:23 [INFO] org.eclipse.papyrus.uml.service.types.ui.tests 1.2.200-SNAPSHOT SUCCESS [  0.628 s]
01:18:23 [INFO] org.eclipse.papyrus.uml.profile.tests.releng 0.0.1-SNAPSHOT SUCCESS [  0.006 s]
01:18:23 [INFO] org.eclipse.papyrus.uml.profile.drafter.tests 1.3.100-SNAPSHOT SUCCESS [  0.779 s]
01:18:23 [INFO] org.eclipse.papyrus.uml.filters.tests 1.2.0-SNAPSHOT SUCCESS [  0.476 s]
01:18:23 [INFO] org.eclipse.papyrus.uml.profile.tests 1.2.100-SNAPSHOT SUCCESS [  0.564 s]
01:18:23 [INFO] org.eclipse.papyrus.tests.uml.feature 1.2.0-SNAPSHOT SUCCESS [  0.201 s]
01:18:23 [INFO] org.eclipse.papyrus.views.documentation.tests 1.0.100-SNAPSHOT SUCCESS [  0.580 s]
01:18:23 [INFO] org.eclipse.papyrus.tests.views.feature 1.2.0-SNAPSHOT SUCCESS [  0.092 s]
01:18:23 [INFO] org.eclipse.papyrus.tests.infra.nattable.feature 1.4.0-SNAPSHOT SUCCESS [  0.105 s]
01:18:23 [INFO] org.eclipse.papyrus.uml.nattable.main.test 1.2.0-SNAPSHOT SUCCESS [  0.005 s]
01:18:23 [INFO] org.eclipse.papyrus.uml.nattable.tests 1.2.200-SNAPSHOT SUCCESS [  0.460 s]
01:18:23 [INFO] org.eclipse.papyrus.uml.nattable.generic.tests 1.2.300-SNAPSHOT SUCCESS [  0.754 s]
01:18:23 [INFO] org.eclipse.papyrus.uml.nattable.clazz.config.tests 1.2.300-SNAPSHOT SUCCESS [  0.935 s]
01:18:23 [INFO] org.eclipse.papyrus.uml.nattable.stereotyped.elements.tests 1.0.300-SNAPSHOT SUCCESS [  0.710 s]
01:18:23 [INFO] org.eclipse.papyrus.uml.nattable.matrix.tests 1.0.200-SNAPSHOT SUCCESS [  0.453 s]
01:18:23 [INFO] org.eclipse.papyrus.tests.uml.nattable.feature 1.3.0-SNAPSHOT SUCCESS [  0.160 s]
01:18:23 [INFO] org.eclipse.papyrus.tests.infra.feature 1.2.0-SNAPSHOT SUCCESS [  0.210 s]
01:18:23 [INFO] org.eclipse.papyrus.tests.infra.core.feature 1.2.0-SNAPSHOT SUCCESS [  0.052 s]
01:18:23 [INFO] org.eclipse.papyrus.uml.tools.tests.releng 0.0.1-SNAPSHOT SUCCESS [  0.003 s]
01:18:23 [INFO] org.eclipse.papyrus.uml.tools.tests 3.1.100-SNAPSHOT SUCCESS [  0.631 s]
01:18:23 [INFO] org.eclipse.papyrus.uml.tools.utils.tests 1.3.0-SNAPSHOT SUCCESS [  0.372 s]
01:18:23 [INFO] org.eclipse.papyrus.tests.uml.tools.feature 1.2.0-SNAPSHOT SUCCESS [  0.062 s]
01:18:23 [INFO] org.eclipse.papyrus.uml.decoratormodel.tests.releng 0.0.1-SNAPSHOT SUCCESS [  0.004 s]
01:18:23 [INFO] org.eclipse.papyrus.uml.decoratormodel.controlmode.tests 1.3.100-SNAPSHOT SUCCESS [  0.447 s]
01:18:23 [INFO] org.eclipse.papyrus.uml.decoratormodel.tests 1.3.100-SNAPSHOT SUCCESS [  1.269 s]
01:18:23 [INFO] org.eclipse.papyrus.tests.uml.decoratormodel.feature 1.2.0-SNAPSHOT SUCCESS [  0.068 s]
01:18:23 [INFO] org.eclipse.papyrus.uml.textedit.tests.releng 0.0.1-SNAPSHOT SUCCESS [  0.003 s]
01:18:23 [INFO] org.eclipse.papyrus.uml.textedit.parameter.tests 1.2.200-SNAPSHOT SUCCESS [  0.395 s]
01:18:23 [INFO] org.eclipse.papyrus.uml.textedit.port.tests 1.2.200-SNAPSHOT SUCCESS [  0.501 s]
01:18:23 [INFO] org.eclipse.papyrus.uml.textedit.property.tests 1.2.300-SNAPSHOT SUCCESS [  0.714 s]
01:18:23 [INFO] org.eclipse.papyrus.uml.textedit.tests 1.3.200-SNAPSHOT SUCCESS [  0.651 s]
01:18:23 [INFO] org.eclipse.papyrus.uml.textedit.tests.feature 1.2.0-SNAPSHOT SUCCESS [  0.129 s]
01:18:23 [INFO] org.eclipse.papyrus.uml.assistants.tests.releng 0.0.1-SNAPSHOT SUCCESS [  0.013 s]
01:18:23 [INFO] org.eclipse.papyrus.uml.profile.types.generator.tests 1.2.200-SNAPSHOT SUCCESS [  0.939 s]
01:18:23 [INFO] org.eclipse.papyrus.uml.profile.assistants.generator.tests 1.2.200-SNAPSHOT SUCCESS [  0.693 s]
01:18:23 [INFO] org.eclipse.papyrus.tests.uml.assistants.feature 1.2.0-SNAPSHOT SUCCESS [  0.098 s]
01:18:23 [INFO] org.eclipse.papyrus.toolsmiths.tests.releng 0.0.1-SNAPSHOT SUCCESS [  0.003 s]
01:18:23 [INFO] org.eclipse.papyrus.toolsmiths.profilemigration.tests 0.7.100-SNAPSHOT SUCCESS [  0.719 s]
01:18:23 [INFO] org.eclipse.papyrus.toolsmiths.validation.profile.tests 1.0.0-SNAPSHOT SUCCESS [  0.580 s]
01:18:23 [INFO] org.eclipse.papyrus.toolsmiths.validation.elementtypes.tests 1.0.0-SNAPSHOT SUCCESS [  0.768 s]
01:18:23 [INFO] org.eclipse.papyrus.tests.toolsmiths.feature 1.0.0-SNAPSHOT SUCCESS [  0.116 s]
01:18:23 [INFO] org.eclipse.papyrus.tests.feature 2.0.0-SNAPSHOT ... SUCCESS [  0.774 s]
01:18:23 [INFO] org.eclipse.papyrus.infra.emf.expressions.main.tests 0.0.1-SNAPSHOT SUCCESS [  0.004 s]
01:18:23 [INFO] org.eclipse.papyrus.infra.emf.expressions.tests 1.0.0-SNAPSHOT SUCCESS [  0.162 s]
01:18:23 [INFO] org.eclipse.papyrus.tests.infra.emf.expressions.feature 1.0.0-SNAPSHOT SUCCESS [  0.038 s]
01:18:23 [INFO] org.eclipse.papyrus.infra.internationalization.main.test 1.0.0-SNAPSHOT SUCCESS [  0.004 s]
01:18:23 [INFO] org.eclipse.papyrus.infra.internationalization.tests 1.100.100-SNAPSHOT SUCCESS [  0.496 s]
01:18:23 [INFO] org.eclipse.papyrus.tests.infra.internationalization.feature 1.0.0-SNAPSHOT SUCCESS [  0.066 s]
01:18:23 [INFO] org.eclipse.papyrus.uml.expressions.tests.releng 0.0.1-SNAPSHOT SUCCESS [  0.004 s]
01:18:23 [INFO] org.eclipse.papyrus.uml.expressions.tests 1.1.100-SNAPSHOT SUCCESS [  0.636 s]
01:18:23 [INFO] org.eclipse.papyrus.tests.uml.expressions.feature 1.0.0-SNAPSHOT SUCCESS [  0.096 s]
01:18:23 [INFO] org.eclipse.papyrus.uml.internationalization.main.test 1.0.0-SNAPSHOT SUCCESS [  0.007 s]
01:18:23 [INFO] org.eclipse.papyrus.uml.internationalization.tests 1.100.100-SNAPSHOT SUCCESS [  0.868 s]
01:18:23 [INFO] org.eclipse.papyrus.uml.internationalization.controlmode.tests 1.1.100-SNAPSHOT SUCCESS [  0.694 s]
01:18:23 [INFO] org.eclipse.papyrus.tests.uml.internationalization.feature 1.0.0-SNAPSHOT SUCCESS [  0.072 s]
01:18:23 [INFO] org.eclipse.papyrus.uml.alf.tests 1.2.0-SNAPSHOT ... SUCCESS [  8.368 s]
01:18:23 [INFO] org.eclipse.papyrus.uml.alf.tests.feature 1.2.0-SNAPSHOT SUCCESS [  0.099 s]
01:18:23 [INFO] Papyrus Tests Features 0.0.1-SNAPSHOT .............. SUCCESS [  0.004 s]
01:18:23 [INFO] org.eclipse.papyrus.developer.suite.tests 0.0.1-SNAPSHOT SUCCESS [ 29.680 s]
01:18:23 [INFO] org.eclipse.papyrus.bundles.tests 0.0.1-SNAPSHOT ... SUCCESS [  0.009 s]
01:18:23 [INFO] org.eclipse.papyrus.eclipse.project.editors.tests 2.1.0-SNAPSHOT SUCCESS [  0.903 s]
01:18:23 [INFO] org.eclipse.papyrus.editors.suite.tests 0.0.1-SNAPSHOT SUCCESS [05:06 min]
01:18:23 [INFO] org.eclipse.papyrus.infra.core.suite.tests 0.0.1-SNAPSHOT SUCCESS [ 51.555 s]
01:18:23 [INFO] org.eclipse.papyrus.infra.nattable.suite.tests 0.0.1-SNAPSHOT SUCCESS [ 53.594 s]
01:18:23 [INFO] org.eclipse.papyrus.infra.architecture.tests 1.0.0-SNAPSHOT SUCCESS [  0.509 s]
01:18:23 [INFO] org.eclipse.papyrus.infra.services.labelprovider.tests 1.2.200-SNAPSHOT SUCCESS [  0.265 s]
01:18:23 [INFO] org.eclipse.papyrus.infra.ui.architecture.tests 1.0.100-SNAPSHOT SUCCESS [  0.489 s]
01:18:23 [INFO] org.eclipse.papyrus.infra.suite.tests 0.0.1-SNAPSHOT SUCCESS [05:08 min]
01:18:23 [INFO] org.eclipse.papyrus.infra.newchild.tests 1.2.100-SNAPSHOT SUCCESS [  0.614 s]
01:18:23 [INFO] org.eclipse.papyrus.uml.diagram.communication.tests 1.2.100-SNAPSHOT SUCCESS [  0.860 s]
01:18:23 [INFO] org.eclipse.papyrus.uml.diagram.interactionoverview.tests 1.2.0-SNAPSHOT SUCCESS [  0.651 s]
01:18:23 [INFO] org.eclipse.papyrus.uml.diagram.statemachine.tests 1.2.200-SNAPSHOT SUCCESS [  0.883 s]
01:18:23 [INFO] org.eclipse.papyrus.uml.diagram.suite.tests 0.0.1-SNAPSHOT SUCCESS [10:37 min]
01:18:23 [INFO] org.eclipse.papyrus.uml.diagram.dnd.tests 1.2.200-SNAPSHOT SUCCESS [  0.445 s]
01:18:23 [INFO] org.eclipse.papyrus.uml.diagram.properties.tests 1.0.100-SNAPSHOT SUCCESS [  0.752 s]
01:18:23 [INFO] org.eclipse.papyrus.uml.nattable.stereotype.display.tests 1.3.0-SNAPSHOT SUCCESS [  0.723 s]
01:18:23 [INFO] org.eclipse.papyrus.uml.nattable.suite.tests 0.0.1-SNAPSHOT SUCCESS [10:11 min]
01:18:23 [INFO] org.eclipse.papyrus.uml.textedit.valuespecification.tests 1.2.200-SNAPSHOT SUCCESS [  0.654 s]
01:18:23 [INFO] org.eclipse.papyrus.uml.textedit.suite.tests 0.0.1-SNAPSHOT SUCCESS [ 29.528 s]
01:18:23 [INFO] org.eclipse.papyrus.uml.architecture.tests 1.1.200-SNAPSHOT SUCCESS [  0.181 s]
01:18:23 [INFO] org.eclipse.papyrus.uml.validation.tests.releng 0.0.1-SNAPSHOT SUCCESS [  0.004 s]
01:18:23 [INFO] org.eclipse.papyrus.uml.validation.tests.staticprofile 1.2.100-SNAPSHOT SUCCESS [  0.240 s]
01:18:23 [INFO] org.eclipse.papyrus.uml.validation.tests.genvalidation 1.2.0-SNAPSHOT SUCCESS [  0.231 s]
01:18:23 [INFO] org.eclipse.papyrus.uml.validation.tests 1.2.200-SNAPSHOT SUCCESS [  0.389 s]
01:18:23 [INFO] org.eclipse.papyrus.uml.suite.tests 0.0.1-SNAPSHOT . SUCCESS [05:06 min]
01:18:23 [INFO] org.eclipse.papyrus.uml.alf.tests.releng 0.0.1-SNAPSHOT SUCCESS [  0.005 s]
01:18:23 [INFO] org.eclipse.papyrus.uml.alf.backend.tests 1.1.100-SNAPSHOT SUCCESS [  1.249 s]
01:18:23 [INFO] org.eclipse.papyrus.views.properties.toolsmiths.tests 1.2.100-SNAPSHOT SUCCESS [  0.340 s]
01:18:23 [INFO] org.eclipse.papyrus.views.suite.tests 0.0.1-SNAPSHOT SUCCESS [ 44.496 s]
01:18:23 [INFO] org.eclipse.papyrus.views.documentation.tests.releng 0.0.1-SNAPSHOT SUCCESS [  0.007 s]
01:18:23 [INFO] org.eclipse.papyrus.toolsmiths.suite.tests 0.0.1-SNAPSHOT SUCCESS [ 25.194 s]
01:18:23 [INFO] org.eclipse.papyrus.tests.main.releng 1.2.0-SNAPSHOT SUCCESS [  0.006 s]
01:18:23 [INFO] org.eclipse.papyrus.main.tests.target.parent 0.0.1-SNAPSHOT SUCCESS [  0.006 s]
01:18:23 [INFO] org.eclipse.papyrus.main.tests.portable.target 0.0.1-SNAPSHOT SUCCESS [  0.005 s]
01:18:23 [INFO] ------------------------------------------------------------------------
01:18:23 [INFO] BUILD SUCCESS
01:18:23 [INFO] ------------------------------------------------------------------------
01:18:23 [INFO] Total time:  53:40 min
01:18:23 [INFO] Finished at: 2020-08-06T01:18:23-04:00
01:18:23 [INFO] ------------------------------------------------------------------------
01:18:24 Taking screenshot.
01:18:24 [workspace] $ echo $XAUTHORITY
01:18:24 /home/hudson/genie.papyrus/.jenkins/jobs/Papyrus-Master-Tests/workspace/.Xauthority-5740257672677342668
01:18:24 [workspace] $ ls -l $XAUTHORITY
01:18:24 -rw-rw-r-- 1 genie.papyrus 8303 0 Aug  6 00:24 /home/hudson/genie.papyrus/.jenkins/jobs/Papyrus-Master-Tests/workspace/.Xauthority-5740257672677342668
01:18:24 [workspace] $ import -window root -display :724 screenshot.jpg
01:18:24 Terminating xvnc.
01:18:39 Sending e-mails to: patrick.tessier@cea.fr vincent.lorenzo@cea.fr quentin.lemenez@cea.fr
01:18:39 Recording test results
01:18:40 Build step 'Publish JUnit test result report' changed build result to UNSTABLE
01:18:40 Started calculate disk usage of build
01:18:40 Finished Calculation of disk usage of build in 0 seconds
01:18:41 Started calculate disk usage of workspace
01:18:43 Finished Calculation of disk usage of workspace in  2 second
01:18:43 Finished: UNSTABLE