AbortedConsole Output

Skipping 3,616 KB.. Full Log
cContentProviderFactoryTest)  Time elapsed: 0.001 s
02:45:01 getElements_Object(org.eclipse.papyrus.infra.ui.providers.SemanticContentProviderFactoryTest)  Time elapsed: 0.001 s
02:45:01 getChildren(org.eclipse.papyrus.infra.ui.providers.SemanticContentProviderFactoryTest)  Time elapsed: 0.001 s
02:45:01 hasChildren(org.eclipse.papyrus.infra.ui.providers.SemanticContentProviderFactoryTest)  Time elapsed: 0 s
02:45:01 getParent(org.eclipse.papyrus.infra.ui.providers.SemanticContentProviderFactoryTest)  Time elapsed: 0.001 s
02:45:01 dispose(org.eclipse.papyrus.infra.ui.providers.SemanticContentProviderFactoryTest)  Time elapsed: 0.001 s
02:45:01 getElements(org.eclipse.papyrus.infra.ui.providers.SemanticContentProviderFactoryTest)  Time elapsed: 0 s
02:45:01 isValidValue(org.eclipse.papyrus.infra.ui.providers.SemanticContentProviderFactoryTest)  Time elapsed: 0.001 s
02:45:01 testClientContextExist(org.eclipse.papyrus.infra.services.edit.tests.context.TestClientContext) skipped
02:45:01 org.eclipse.papyrus.infra.services.edit.tests.context.TestClientContext skipped
02:45:01 testGetAdapter(org.eclipse.papyrus.infra.services.edit.tests.service.TestElementEditService) skipped
02:45:01 testGetDisplayName(org.eclipse.papyrus.infra.services.edit.tests.service.TestElementEditService) skipped
02:45:01 testCanEdit(org.eclipse.papyrus.infra.services.edit.tests.service.TestElementEditService) skipped
02:45:01 testGetEditCommand(org.eclipse.papyrus.infra.services.edit.tests.service.TestElementEditService) skipped
02:45:01 org.eclipse.papyrus.infra.services.edit.tests.service.TestElementEditService skipped
02:45:01 testIsKnownElementType(org.eclipse.papyrus.infra.services.edit.tests.service.TestElementEditServiceProvider) skipped
02:45:01 testGetEditService_EObject(org.eclipse.papyrus.infra.services.edit.tests.service.TestElementEditServiceProvider) skipped
02:45:01 testGetEditService_IElementType(org.eclipse.papyrus.infra.services.edit.tests.service.TestElementEditServiceProvider) skipped
02:45:01 testGetEditService_EClass(org.eclipse.papyrus.infra.services.edit.tests.service.TestElementEditServiceProvider) skipped
02:45:01 testGetEditService_Unknown(org.eclipse.papyrus.infra.services.edit.tests.service.TestElementEditServiceProvider) skipped
02:45:01 testGetContainedTypeEditServices(org.eclipse.papyrus.infra.services.edit.tests.service.TestElementEditServiceProvider) skipped
02:45:01 org.eclipse.papyrus.infra.services.edit.tests.service.TestElementEditServiceProvider skipped
02:45:01 testCreateServiceInstance(org.eclipse.papyrus.infra.services.edit.tests.service.TestElementEditServiceProviderFactory) skipped
02:45:01 org.eclipse.papyrus.infra.services.edit.tests.service.TestElementEditServiceProviderFactory skipped
02:45:01 testGetCommandProvider(org.eclipse.papyrus.infra.services.edit.tests.service.TestElementEditServiceUtils) skipped
02:45:01 org.eclipse.papyrus.infra.services.edit.tests.service.TestElementEditServiceUtils skipped
02:45:01 testGetCommandEObjectResult(org.eclipse.papyrus.infra.services.edit.tests.utils.TestGMFCommandUtils) skipped
02:45:01 org.eclipse.papyrus.infra.services.edit.tests.utils.TestGMFCommandUtils skipped
02:45:01 testGetEditCommand(org.eclipse.papyrus.infra.services.edit.tests.commands.TestConfigureFeatureCommandFactory) skipped
02:45:01 org.eclipse.papyrus.infra.services.edit.tests.commands.TestConfigureFeatureCommandFactory skipped
02:45:01 testGetEditCommand(org.eclipse.papyrus.infra.services.edit.tests.commands.TestConfigureFeatureListCommandFactory) skipped
02:45:01 org.eclipse.papyrus.infra.services.edit.tests.commands.TestConfigureFeatureListCommandFactory skipped
02:45:01 testDeleteMarkers(org.eclipse.papyrus.infra.services.edit.tests.edit.advice.MarkerDeletionAdviceTest) skipped
02:45:01 testDeleteMarkers_relatedElements_diagram(org.eclipse.papyrus.infra.services.edit.tests.edit.advice.MarkerDeletionAdviceTest) skipped
02:45:01 testDeleteMarkers_integration(org.eclipse.papyrus.infra.services.edit.tests.edit.advice.MarkerDeletionAdviceTest) skipped
02:45:01 testDeleteMarkers_relatedElements(org.eclipse.papyrus.infra.services.edit.tests.edit.advice.MarkerDeletionAdviceTest) skipped
02:45:01 org.eclipse.papyrus.infra.services.edit.tests.edit.advice.MarkerDeletionAdviceTest skipped
02:45:01 org.eclipse.papyrus.infra.services.edit.tests.suites.AllTests skipped
02:45:01 testValidate(org.eclipse.papyrus.infra.services.edit.ui.dialogs.tests.TestElementTypeValidator) skipped
02:45:01 org.eclipse.papyrus.infra.services.edit.ui.dialogs.tests.TestElementTypeValidator skipped
02:45:01 org.eclipse.papyrus.infra.services.edit.ui.tests.AllTests skipped
02:45:01 testInvalidContext(org.eclipse.papyrus.infra.services.labelprovider.tests.LabelProviderServiceTest) skipped
02:45:01 testDefaultLabelProvider(org.eclipse.papyrus.infra.services.labelprovider.tests.LabelProviderServiceTest) skipped
02:45:01 testEMFLabelProvider(org.eclipse.papyrus.infra.services.labelprovider.tests.LabelProviderServiceTest) skipped
02:45:01 testUMLLabelProvider(org.eclipse.papyrus.infra.services.labelprovider.tests.LabelProviderServiceTest) skipped
02:45:01 testUMLLabelProviderChangeEvents(org.eclipse.papyrus.infra.services.labelprovider.tests.LabelProviderServiceTest) skipped
02:45:01 org.eclipse.papyrus.infra.services.labelprovider.tests.LabelProviderServiceTest skipped
02:45:01 org.eclipse.papyrus.infra.services.labelprovider.tests.AllTests skipped
02:45:01 getSemanticRoots(org.eclipse.papyrus.infra.services.semantic.tests.SemanticServiceTest) skipped
02:45:01 getSemanticIModels(org.eclipse.papyrus.infra.services.semantic.tests.SemanticServiceTest) skipped
02:45:01 org.eclipse.papyrus.infra.services.semantic.tests.SemanticServiceTest skipped
02:45:01 org.eclipse.papyrus.infra.services.semantic.tests.AllTests skipped
02:45:01 testReorientReferenceCommand_sourceOldReadOnly[model is writable in workspace](org.eclipse.papyrus.infra.emf.advice.ReadOnlyObjectEditAdviceTest) skipped
02:45:01 testMoveCommand_rootFromReadOnly[model is writable in workspace](org.eclipse.papyrus.infra.emf.advice.ReadOnlyObjectEditAdviceTest) skipped
02:45:01 testSetCommand_containmentOldContainerReadonly[model is writable in workspace](org.eclipse.papyrus.infra.emf.advice.ReadOnlyObjectEditAdviceTest) skipped
02:45:01 testDestroyElementCommand[model is writable in workspace](org.eclipse.papyrus.infra.emf.advice.ReadOnlyObjectEditAdviceTest) skipped
02:45:01 testReorientRelationshipCommand_sourceOldReadOnly[model is writable in workspace](org.eclipse.papyrus.infra.emf.advice.ReadOnlyObjectEditAdviceTest) skipped
02:45:01 testSetCommand_attribute[model is writable in workspace](org.eclipse.papyrus.infra.emf.advice.ReadOnlyObjectEditAdviceTest) skipped
02:45:01 testSetCommand_containmentOldContainerReadonlyMany[model is writable in workspace](org.eclipse.papyrus.infra.emf.advice.ReadOnlyObjectEditAdviceTest) skipped
02:45:01 testReorientReferenceCommand_targetNewReadonly[model is writable in workspace](org.eclipse.papyrus.infra.emf.advice.ReadOnlyObjectEditAdviceTest) skipped
02:45:01 testReorientRelationshipCommand_targetNewReadOnly[model is writable in workspace](org.eclipse.papyrus.infra.emf.advice.ReadOnlyObjectEditAdviceTest) skipped
02:45:01 testReorientReferenceCommand_targetOldReadonly[model is writable in workspace](org.eclipse.papyrus.infra.emf.advice.ReadOnlyObjectEditAdviceTest) skipped
02:45:01 testSetCommand_referenceOppositeAdd[model is writable in workspace](org.eclipse.papyrus.infra.emf.advice.ReadOnlyObjectEditAdviceTest) skipped
02:45:01 testDestroyReferenceCommand_owner[model is writable in workspace](org.eclipse.papyrus.infra.emf.advice.ReadOnlyObjectEditAdviceTest) skipped
02:45:01 testCreateCommand[model is writable in workspace](org.eclipse.papyrus.infra.emf.advice.ReadOnlyObjectEditAdviceTest) skipped
02:45:01 testReorientRelationshipCommand_targetOldReadonly[model is writable in workspace](org.eclipse.papyrus.infra.emf.advice.ReadOnlyObjectEditAdviceTest) skipped
02:45:01 testMoveCommand_fromReadOnly[model is writable in workspace](org.eclipse.papyrus.infra.emf.advice.ReadOnlyObjectEditAdviceTest) skipped
02:45:01 testReorientReferenceCommand_sourceNewReadonly[model is writable in workspace](org.eclipse.papyrus.infra.emf.advice.ReadOnlyObjectEditAdviceTest) skipped
02:45:01 testDestroyReferenceCommand_referencedOpposite[model is writable in workspace](org.eclipse.papyrus.infra.emf.advice.ReadOnlyObjectEditAdviceTest) skipped
02:45:01 testSetCommand_referenceOppositeRemove[model is writable in workspace](org.eclipse.papyrus.infra.emf.advice.ReadOnlyObjectEditAdviceTest) skipped
02:45:01 testDuplicateCommand[model is writable in workspace](org.eclipse.papyrus.infra.emf.advice.ReadOnlyObjectEditAdviceTest) skipped
02:45:01 testReorientRelationshipCommand_sourceNewReadOnly[model is writable in workspace](org.eclipse.papyrus.infra.emf.advice.ReadOnlyObjectEditAdviceTest) skipped
02:45:01 testCreateRelationshipCommand[model is writable in workspace](org.eclipse.papyrus.infra.emf.advice.ReadOnlyObjectEditAdviceTest) skipped
02:45:01 testMoveCommand_toReadOnly[model is writable in workspace](org.eclipse.papyrus.infra.emf.advice.ReadOnlyObjectEditAdviceTest) skipped
02:45:01 [model is writable in workspace] skipped
02:45:01 testReorientReferenceCommand_sourceOldReadOnly[model is read-only in workspace](org.eclipse.papyrus.infra.emf.advice.ReadOnlyObjectEditAdviceTest) skipped
02:45:01 testMoveCommand_rootFromReadOnly[model is read-only in workspace](org.eclipse.papyrus.infra.emf.advice.ReadOnlyObjectEditAdviceTest) skipped
02:45:01 testSetCommand_containmentOldContainerReadonly[model is read-only in workspace](org.eclipse.papyrus.infra.emf.advice.ReadOnlyObjectEditAdviceTest) skipped
02:45:01 testDestroyElementCommand[model is read-only in workspace](org.eclipse.papyrus.infra.emf.advice.ReadOnlyObjectEditAdviceTest) skipped
02:45:01 testReorientRelationshipCommand_sourceOldReadOnly[model is read-only in workspace](org.eclipse.papyrus.infra.emf.advice.ReadOnlyObjectEditAdviceTest) skipped
02:45:01 testSetCommand_attribute[model is read-only in workspace](org.eclipse.papyrus.infra.emf.advice.ReadOnlyObjectEditAdviceTest) skipped
02:45:01 testSetCommand_containmentOldContainerReadonlyMany[model is read-only in workspace](org.eclipse.papyrus.infra.emf.advice.ReadOnlyObjectEditAdviceTest) skipped
02:45:01 testReorientReferenceCommand_targetNewReadonly[model is read-only in workspace](org.eclipse.papyrus.infra.emf.advice.ReadOnlyObjectEditAdviceTest) skipped
02:45:01 testReorientRelationshipCommand_targetNewReadOnly[model is read-only in workspace](org.eclipse.papyrus.infra.emf.advice.ReadOnlyObjectEditAdviceTest) skipped
02:45:01 testReorientReferenceCommand_targetOldReadonly[model is read-only in workspace](org.eclipse.papyrus.infra.emf.advice.ReadOnlyObjectEditAdviceTest) skipped
02:45:01 testSetCommand_referenceOppositeAdd[model is read-only in workspace](org.eclipse.papyrus.infra.emf.advice.ReadOnlyObjectEditAdviceTest) skipped
02:45:01 testDestroyReferenceCommand_owner[model is read-only in workspace](org.eclipse.papyrus.infra.emf.advice.ReadOnlyObjectEditAdviceTest) skipped
02:45:01 testCreateCommand[model is read-only in workspace](org.eclipse.papyrus.infra.emf.advice.ReadOnlyObjectEditAdviceTest) skipped
02:45:01 testReorientRelationshipCommand_targetOldReadonly[model is read-only in workspace](org.eclipse.papyrus.infra.emf.advice.ReadOnlyObjectEditAdviceTest) skipped
02:45:01 testMoveCommand_fromReadOnly[model is read-only in workspace](org.eclipse.papyrus.infra.emf.advice.ReadOnlyObjectEditAdviceTest) skipped
02:45:01 testReorientReferenceCommand_sourceNewReadonly[model is read-only in workspace](org.eclipse.papyrus.infra.emf.advice.ReadOnlyObjectEditAdviceTest) skipped
02:45:01 testDestroyReferenceCommand_referencedOpposite[model is read-only in workspace](org.eclipse.papyrus.infra.emf.advice.ReadOnlyObjectEditAdviceTest) skipped
02:45:01 testSetCommand_referenceOppositeRemove[model is read-only in workspace](org.eclipse.papyrus.infra.emf.advice.ReadOnlyObjectEditAdviceTest) skipped
02:45:01 testDuplicateCommand[model is read-only in workspace](org.eclipse.papyrus.infra.emf.advice.ReadOnlyObjectEditAdviceTest) skipped
02:45:01 testReorientRelationshipCommand_sourceNewReadOnly[model is read-only in workspace](org.eclipse.papyrus.infra.emf.advice.ReadOnlyObjectEditAdviceTest) skipped
02:45:01 testCreateRelationshipCommand[model is read-only in workspace](org.eclipse.papyrus.infra.emf.advice.ReadOnlyObjectEditAdviceTest) skipped
02:45:01 testMoveCommand_toReadOnly[model is read-only in workspace](org.eclipse.papyrus.infra.emf.advice.ReadOnlyObjectEditAdviceTest) skipped
02:45:01 [model is read-only in workspace] skipped
02:45:01 testReorientReferenceCommand_sourceOldReadOnly[model is deployed in plug-in, advice disabled](org.eclipse.papyrus.infra.emf.advice.ReadOnlyObjectEditAdviceTest) skipped
02:45:01 testMoveCommand_rootFromReadOnly[model is deployed in plug-in, advice disabled](org.eclipse.papyrus.infra.emf.advice.ReadOnlyObjectEditAdviceTest) skipped
02:45:01 testSetCommand_containmentOldContainerReadonly[model is deployed in plug-in, advice disabled](org.eclipse.papyrus.infra.emf.advice.ReadOnlyObjectEditAdviceTest) skipped
02:45:01 testDestroyElementCommand[model is deployed in plug-in, advice disabled](org.eclipse.papyrus.infra.emf.advice.ReadOnlyObjectEditAdviceTest) skipped
02:45:01 testReorientRelationshipCommand_sourceOldReadOnly[model is deployed in plug-in, advice disabled](org.eclipse.papyrus.infra.emf.advice.ReadOnlyObjectEditAdviceTest) skipped
02:45:01 testSetCommand_attribute[model is deployed in plug-in, advice disabled](org.eclipse.papyrus.infra.emf.advice.ReadOnlyObjectEditAdviceTest) skipped
02:45:01 testSetCommand_containmentOldContainerReadonlyMany[model is deployed in plug-in, advice disabled](org.eclipse.papyrus.infra.emf.advice.ReadOnlyObjectEditAdviceTest) skipped
02:45:01 testReorientReferenceCommand_targetNewReadonly[model is deployed in plug-in, advice disabled](org.eclipse.papyrus.infra.emf.advice.ReadOnlyObjectEditAdviceTest) skipped
02:45:01 testReorientRelationshipCommand_targetNewReadOnly[model is deployed in plug-in, advice disabled](org.eclipse.papyrus.infra.emf.advice.ReadOnlyObjectEditAdviceTest) skipped
02:45:01 testReorientReferenceCommand_targetOldReadonly[model is deployed in plug-in, advice disabled](org.eclipse.papyrus.infra.emf.advice.ReadOnlyObjectEditAdviceTest) skipped
02:45:01 testSetCommand_referenceOppositeAdd[model is deployed in plug-in, advice disabled](org.eclipse.papyrus.infra.emf.advice.ReadOnlyObjectEditAdviceTest) skipped
02:45:01 testDestroyReferenceCommand_owner[model is deployed in plug-in, advice disabled](org.eclipse.papyrus.infra.emf.advice.ReadOnlyObjectEditAdviceTest) skipped
02:45:01 testCreateCommand[model is deployed in plug-in, advice disabled](org.eclipse.papyrus.infra.emf.advice.ReadOnlyObjectEditAdviceTest) skipped
02:45:01 testReorientRelationshipCommand_targetOldReadonly[model is deployed in plug-in, advice disabled](org.eclipse.papyrus.infra.emf.advice.ReadOnlyObjectEditAdviceTest) skipped
02:45:01 testMoveCommand_fromReadOnly[model is deployed in plug-in, advice disabled](org.eclipse.papyrus.infra.emf.advice.ReadOnlyObjectEditAdviceTest) skipped
02:45:01 testReorientReferenceCommand_sourceNewReadonly[model is deployed in plug-in, advice disabled](org.eclipse.papyrus.infra.emf.advice.ReadOnlyObjectEditAdviceTest) skipped
02:45:01 testDestroyReferenceCommand_referencedOpposite[model is deployed in plug-in, advice disabled](org.eclipse.papyrus.infra.emf.advice.ReadOnlyObjectEditAdviceTest) skipped
02:45:01 testSetCommand_referenceOppositeRemove[model is deployed in plug-in, advice disabled](org.eclipse.papyrus.infra.emf.advice.ReadOnlyObjectEditAdviceTest) skipped
02:45:01 testDuplicateCommand[model is deployed in plug-in, advice disabled](org.eclipse.papyrus.infra.emf.advice.ReadOnlyObjectEditAdviceTest) skipped
02:45:01 testReorientRelationshipCommand_sourceNewReadOnly[model is deployed in plug-in, advice disabled](org.eclipse.papyrus.infra.emf.advice.ReadOnlyObjectEditAdviceTest) skipped
02:45:01 testCreateRelationshipCommand[model is deployed in plug-in, advice disabled](org.eclipse.papyrus.infra.emf.advice.ReadOnlyObjectEditAdviceTest) skipped
02:45:01 testMoveCommand_toReadOnly[model is deployed in plug-in, advice disabled](org.eclipse.papyrus.infra.emf.advice.ReadOnlyObjectEditAdviceTest) skipped
02:45:01 [model is deployed in plug-in, advice disabled] skipped
02:45:01 testReorientReferenceCommand_sourceOldReadOnly[model is deployed in plug-in](org.eclipse.papyrus.infra.emf.advice.ReadOnlyObjectEditAdviceTest) skipped
02:45:01 testMoveCommand_rootFromReadOnly[model is deployed in plug-in](org.eclipse.papyrus.infra.emf.advice.ReadOnlyObjectEditAdviceTest) skipped
02:45:01 testSetCommand_containmentOldContainerReadonly[model is deployed in plug-in](org.eclipse.papyrus.infra.emf.advice.ReadOnlyObjectEditAdviceTest) skipped
02:45:01 testDestroyElementCommand[model is deployed in plug-in](org.eclipse.papyrus.infra.emf.advice.ReadOnlyObjectEditAdviceTest) skipped
02:45:01 testReorientRelationshipCommand_sourceOldReadOnly[model is deployed in plug-in](org.eclipse.papyrus.infra.emf.advice.ReadOnlyObjectEditAdviceTest) skipped
02:45:01 testSetCommand_attribute[model is deployed in plug-in](org.eclipse.papyrus.infra.emf.advice.ReadOnlyObjectEditAdviceTest) skipped
02:45:01 testSetCommand_containmentOldContainerReadonlyMany[model is deployed in plug-in](org.eclipse.papyrus.infra.emf.advice.ReadOnlyObjectEditAdviceTest) skipped
02:45:01 testReorientReferenceCommand_targetNewReadonly[model is deployed in plug-in](org.eclipse.papyrus.infra.emf.advice.ReadOnlyObjectEditAdviceTest) skipped
02:45:01 testReorientRelationshipCommand_targetNewReadOnly[model is deployed in plug-in](org.eclipse.papyrus.infra.emf.advice.ReadOnlyObjectEditAdviceTest) skipped
02:45:01 testReorientReferenceCommand_targetOldReadonly[model is deployed in plug-in](org.eclipse.papyrus.infra.emf.advice.ReadOnlyObjectEditAdviceTest) skipped
02:45:01 testSetCommand_referenceOppositeAdd[model is deployed in plug-in](org.eclipse.papyrus.infra.emf.advice.ReadOnlyObjectEditAdviceTest) skipped
02:45:01 testDestroyReferenceCommand_owner[model is deployed in plug-in](org.eclipse.papyrus.infra.emf.advice.ReadOnlyObjectEditAdviceTest) skipped
02:45:01 testCreateCommand[model is deployed in plug-in](org.eclipse.papyrus.infra.emf.advice.ReadOnlyObjectEditAdviceTest) skipped
02:45:01 testReorientRelationshipCommand_targetOldReadonly[model is deployed in plug-in](org.eclipse.papyrus.infra.emf.advice.ReadOnlyObjectEditAdviceTest) skipped
02:45:01 testMoveCommand_fromReadOnly[model is deployed in plug-in](org.eclipse.papyrus.infra.emf.advice.ReadOnlyObjectEditAdviceTest) skipped
02:45:01 testReorientReferenceCommand_sourceNewReadonly[model is deployed in plug-in](org.eclipse.papyrus.infra.emf.advice.ReadOnlyObjectEditAdviceTest) skipped
02:45:01 testDestroyReferenceCommand_referencedOpposite[model is deployed in plug-in](org.eclipse.papyrus.infra.emf.advice.ReadOnlyObjectEditAdviceTest) skipped
02:45:01 testSetCommand_referenceOppositeRemove[model is deployed in plug-in](org.eclipse.papyrus.infra.emf.advice.ReadOnlyObjectEditAdviceTest) skipped
02:45:01 testDuplicateCommand[model is deployed in plug-in](org.eclipse.papyrus.infra.emf.advice.ReadOnlyObjectEditAdviceTest) skipped
02:45:01 testReorientRelationshipCommand_sourceNewReadOnly[model is deployed in plug-in](org.eclipse.papyrus.infra.emf.advice.ReadOnlyObjectEditAdviceTest) skipped
02:45:01 testCreateRelationshipCommand[model is deployed in plug-in](org.eclipse.papyrus.infra.emf.advice.ReadOnlyObjectEditAdviceTest) skipped
02:45:01 testMoveCommand_toReadOnly[model is deployed in plug-in](org.eclipse.papyrus.infra.emf.advice.ReadOnlyObjectEditAdviceTest) skipped
02:45:01 [model is deployed in plug-in] skipped
02:45:01 org.eclipse.papyrus.infra.emf.advice.ReadOnlyObjectEditAdviceTest skipped
02:45:01 testDeleteWithCrossReferences:commands(org.eclipse.papyrus.infra.emf.edit.domain.PapyrusTransactionalEditingDomainTest) skipped
02:45:01 testDeleteWithCrossReferences:delete(org.eclipse.papyrus.infra.emf.edit.domain.PapyrusTransactionalEditingDomainTest) skipped
02:45:01 testDeleteWithCrossReferences:changes(org.eclipse.papyrus.infra.emf.edit.domain.PapyrusTransactionalEditingDomainTest) skipped
02:45:01 testDeleteWithCrossReferences skipped
02:45:01 org.eclipse.papyrus.infra.emf.edit.domain.PapyrusTransactionalEditingDomainTest skipped
02:45:01 testGetServiceRegistryResource(org.eclipse.papyrus.infra.emf.utils.ServiceUtilsForResourceTest) skipped
02:45:01 testGetInstance(org.eclipse.papyrus.infra.emf.utils.ServiceUtilsForResourceTest) skipped
02:45:01 org.eclipse.papyrus.infra.emf.utils.ServiceUtilsForResourceTest skipped
02:45:01 makeNotShardObservedByOtherHelper[0: useCommands=false](org.eclipse.papyrus.infra.emf.resource.ShardResourceHelperTest) skipped
02:45:01 makeNotShard[0: useCommands=false](org.eclipse.papyrus.infra.emf.resource.ShardResourceHelperTest) skipped
02:45:01 makeShardObservedByOtherHelper[0: useCommands=false](org.eclipse.papyrus.infra.emf.resource.ShardResourceHelperTest) skipped
02:45:01 attemptToUseClosedHelper[0: useCommands=false](org.eclipse.papyrus.infra.emf.resource.ShardResourceHelperTest) skipped
02:45:01 makeShard[0: useCommands=false](org.eclipse.papyrus.infra.emf.resource.ShardResourceHelperTest) skipped
02:45:01 [0: useCommands=false] skipped
02:45:01 makeNotShardObservedByOtherHelper[1: useCommands=true](org.eclipse.papyrus.infra.emf.resource.ShardResourceHelperTest) skipped
02:45:01 makeNotShard[1: useCommands=true](org.eclipse.papyrus.infra.emf.resource.ShardResourceHelperTest) skipped
02:45:01 makeShardObservedByOtherHelper[1: useCommands=true](org.eclipse.papyrus.infra.emf.resource.ShardResourceHelperTest) skipped
02:45:01 attemptToUseClosedHelper[1: useCommands=true](org.eclipse.papyrus.infra.emf.resource.ShardResourceHelperTest) skipped
02:45:01 makeShard[1: useCommands=true](org.eclipse.papyrus.infra.emf.resource.ShardResourceHelperTest) skipped
02:45:01 [1: useCommands=true] skipped
02:45:01 org.eclipse.papyrus.infra.emf.resource.ShardResourceHelperTest skipped
02:45:01 proxyResolutionLoadsShardFromTheTop[0: full index](org.eclipse.papyrus.infra.emf.resource.ShardResourceLocatorTest) skipped
02:45:01 shardLoadsContainersAndDoesntLoseStereotypes[0: full index](org.eclipse.papyrus.infra.emf.resource.ShardResourceLocatorTest) skipped
02:45:01 [0: full index] skipped
02:45:01 proxyResolutionLoadsShardFromTheTop[1: on-demand index](org.eclipse.papyrus.infra.emf.resource.ShardResourceLocatorTest) skipped
02:45:01 shardLoadsContainersAndDoesntLoseStereotypes[1: on-demand index](org.eclipse.papyrus.infra.emf.resource.ShardResourceLocatorTest) skipped
02:45:01 [1: on-demand index] skipped
02:45:01 org.eclipse.papyrus.infra.emf.resource.ShardResourceLocatorTest skipped
02:45:01 subunits(org.eclipse.papyrus.infra.emf.resource.CrossReferenceIndexTest$ShardsTest) skipped
02:45:01 parents(org.eclipse.papyrus.infra.emf.resource.CrossReferenceIndexTest$ShardsTest) skipped
02:45:01 outgoingReferences_givenURI(org.eclipse.papyrus.infra.emf.resource.CrossReferenceIndexTest$ShardsTest) skipped
02:45:01 incomingReferences_givenURI(org.eclipse.papyrus.infra.emf.resource.CrossReferenceIndexTest$ShardsTest) skipped
02:45:01 roots(org.eclipse.papyrus.infra.emf.resource.CrossReferenceIndexTest$ShardsTest) skipped
02:45:01 roots_alternate(org.eclipse.papyrus.infra.emf.resource.CrossReferenceIndexTest$ShardsTest) skipped
02:45:01 outgoingReferences(org.eclipse.papyrus.infra.emf.resource.CrossReferenceIndexTest$ShardsTest) skipped
02:45:01 incomingReferences(org.eclipse.papyrus.infra.emf.resource.CrossReferenceIndexTest$ShardsTest) skipped
02:45:01 isShard(org.eclipse.papyrus.infra.emf.resource.CrossReferenceIndexTest$ShardsTest) skipped
02:45:01 org.eclipse.papyrus.infra.emf.resource.CrossReferenceIndexTest$ShardsTest skipped
02:45:01 subunits(org.eclipse.papyrus.infra.emf.resource.CrossReferenceIndexTest$SubmodelsTest) skipped
02:45:01 parents(org.eclipse.papyrus.infra.emf.resource.CrossReferenceIndexTest$SubmodelsTest) skipped
02:45:01 outgoingReferences_givenURI(org.eclipse.papyrus.infra.emf.resource.CrossReferenceIndexTest$SubmodelsTest) skipped
02:45:01 incomingReferences_givenURI(org.eclipse.papyrus.infra.emf.resource.CrossReferenceIndexTest$SubmodelsTest) skipped
02:45:01 roots(org.eclipse.papyrus.infra.emf.resource.CrossReferenceIndexTest$SubmodelsTest) skipped
02:45:01 roots_alternate(org.eclipse.papyrus.infra.emf.resource.CrossReferenceIndexTest$SubmodelsTest) skipped
02:45:01 outgoingReferences(org.eclipse.papyrus.infra.emf.resource.CrossReferenceIndexTest$SubmodelsTest) skipped
02:45:01 incomingReferences(org.eclipse.papyrus.infra.emf.resource.CrossReferenceIndexTest$SubmodelsTest) skipped
02:45:01 isShard(org.eclipse.papyrus.infra.emf.resource.CrossReferenceIndexTest$SubmodelsTest) skipped
02:45:01 org.eclipse.papyrus.infra.emf.resource.CrossReferenceIndexTest$SubmodelsTest skipped
02:45:01 org.eclipse.papyrus.infra.emf.resource.CrossReferenceIndexTest skipped
02:45:01 indexRebuiltOnDeletion(org.eclipse.papyrus.infra.emf.resource.index.WorkspaceModelIndexTest) skipped
02:45:01 indexRebuiltOnProjectClose(org.eclipse.papyrus.infra.emf.resource.index.WorkspaceModelIndexTest) skipped
02:45:01 indexNotifiesOnReindex(org.eclipse.papyrus.infra.emf.resource.index.WorkspaceModelIndexTest) skipped
02:45:01 indexRefreshesIfNecessary_bug473154(org.eclipse.papyrus.infra.emf.resource.index.WorkspaceModelIndexTest) skipped
02:45:01 indexBuilt(org.eclipse.papyrus.infra.emf.resource.index.WorkspaceModelIndexTest) skipped
02:45:01 indexRebuiltOnChanges(org.eclipse.papyrus.infra.emf.resource.index.WorkspaceModelIndexTest) skipped
02:45:01 indexRebuiltOnProjectDelete(org.eclipse.papyrus.infra.emf.resource.index.WorkspaceModelIndexTest) skipped
02:45:01 indexRecoversFromCancel(org.eclipse.papyrus.infra.emf.resource.index.WorkspaceModelIndexTest) skipped
02:45:01 org.eclipse.papyrus.infra.emf.resource.index.WorkspaceModelIndexTest skipped
02:45:01 org.eclipse.papyrus.infra.emf.tests.AllTests skipped
02:45:01 AndExpression_Test1(org.eclipse.papyrus.infra.emf.expressions.tests.AndExpressionTests) skipped
02:45:01 AndExpression_Test2(org.eclipse.papyrus.infra.emf.expressions.tests.AndExpressionTests) skipped
02:45:01 AndExpression_Test3(org.eclipse.papyrus.infra.emf.expressions.tests.AndExpressionTests) skipped
02:45:01 AndExpression_Test4(org.eclipse.papyrus.infra.emf.expressions.tests.AndExpressionTests) skipped
02:45:01 AndExpression_Test5(org.eclipse.papyrus.infra.emf.expressions.tests.AndExpressionTests) skipped
02:45:01 AndExpression_Test6(org.eclipse.papyrus.infra.emf.expressions.tests.AndExpressionTests) skipped
02:45:01 AndExpression_Test7(org.eclipse.papyrus.infra.emf.expressions.tests.AndExpressionTests) skipped
02:45:01 AndExpression_Test8(org.eclipse.papyrus.infra.emf.expressions.tests.AndExpressionTests) skipped
02:45:01 AndExpression_Test9(org.eclipse.papyrus.infra.emf.expressions.tests.AndExpressionTests) skipped
02:45:01 AndExpression_Test10(org.eclipse.papyrus.infra.emf.expressions.tests.AndExpressionTests) skipped
02:45:01 AndExpression_Test11(org.eclipse.papyrus.infra.emf.expressions.tests.AndExpressionTests) skipped
02:45:01 AndExpression_Test12(org.eclipse.papyrus.infra.emf.expressions.tests.AndExpressionTests) skipped
02:45:01 AndExpression_Test13(org.eclipse.papyrus.infra.emf.expressions.tests.AndExpressionTests) skipped
02:45:01 AndExpression_Test14(org.eclipse.papyrus.infra.emf.expressions.tests.AndExpressionTests) skipped
02:45:01 AndExpression_Test15(org.eclipse.papyrus.infra.emf.expressions.tests.AndExpressionTests) skipped
02:45:01 AndExpression_Test16(org.eclipse.papyrus.infra.emf.expressions.tests.AndExpressionTests) skipped
02:45:01 AndExpression_Test17(org.eclipse.papyrus.infra.emf.expressions.tests.AndExpressionTests) skipped
02:45:01 AndExpression_Test18(org.eclipse.papyrus.infra.emf.expressions.tests.AndExpressionTests) skipped
02:45:01 AndExpression_Test19(org.eclipse.papyrus.infra.emf.expressions.tests.AndExpressionTests) skipped
02:45:01 AndExpression_Test20(org.eclipse.papyrus.infra.emf.expressions.tests.AndExpressionTests) skipped
02:45:01 AndExpression_Test21(org.eclipse.papyrus.infra.emf.expressions.tests.AndExpressionTests) skipped
02:45:01 AndExpression_Test22(org.eclipse.papyrus.infra.emf.expressions.tests.AndExpressionTests) skipped
02:45:01 AndExpression_Test23(org.eclipse.papyrus.infra.emf.expressions.tests.AndExpressionTests) skipped
02:45:01 AndExpression_Test24(org.eclipse.papyrus.infra.emf.expressions.tests.AndExpressionTests) skipped
02:45:01 AndExpression_Test25(org.eclipse.papyrus.infra.emf.expressions.tests.AndExpressionTests) skipped
02:45:01 AndExpression_Test26(org.eclipse.papyrus.infra.emf.expressions.tests.AndExpressionTests) skipped
02:45:01 org.eclipse.papyrus.infra.emf.expressions.tests.AndExpressionTests skipped
02:45:01 LiteralFalseExpression_Test1(org.eclipse.papyrus.infra.emf.expressions.tests.LiteralFalseExpressionTests) skipped
02:45:01 LiteralFalseExpression_Test2(org.eclipse.papyrus.infra.emf.expressions.tests.LiteralFalseExpressionTests) skipped
02:45:01 org.eclipse.papyrus.infra.emf.expressions.tests.LiteralFalseExpressionTests skipped
02:45:01 LiteralTrueExpression_Test1(org.eclipse.papyrus.infra.emf.expressions.tests.LiteralTrueExpressionTests) skipped
02:45:01 LiteralTrueExpression_Test2(org.eclipse.papyrus.infra.emf.expressions.tests.LiteralTrueExpressionTests) skipped
02:45:01 org.eclipse.papyrus.infra.emf.expressions.tests.LiteralTrueExpressionTests skipped
02:45:01 NotExpression_Test1_1(org.eclipse.papyrus.infra.emf.expressions.tests.NotExpressionTests) skipped
02:45:01 NotExpression_Test1_2(org.eclipse.papyrus.infra.emf.expressions.tests.NotExpressionTests) skipped
02:45:01 NotExpression_Test2_1(org.eclipse.papyrus.infra.emf.expressions.tests.NotExpressionTests) skipped
02:45:01 NotExpression_Test2_2(org.eclipse.papyrus.infra.emf.expressions.tests.NotExpressionTests) skipped
02:45:01 NotExpression_Test3_1(org.eclipse.papyrus.infra.emf.expressions.tests.NotExpressionTests) skipped
02:45:01 NotExpression_Test3_2(org.eclipse.papyrus.infra.emf.expressions.tests.NotExpressionTests) skipped
02:45:01 NotExpression_Test4_1(org.eclipse.papyrus.infra.emf.expressions.tests.NotExpressionTests) skipped
02:45:01 NotExpression_Test4_2(org.eclipse.papyrus.infra.emf.expressions.tests.NotExpressionTests) skipped
02:45:01 NotExpression_Test4_3(org.eclipse.papyrus.infra.emf.expressions.tests.NotExpressionTests) skipped
02:45:01 NotExpression_Test4_4(org.eclipse.papyrus.infra.emf.expressions.tests.NotExpressionTests) skipped
02:45:01 org.eclipse.papyrus.infra.emf.expressions.tests.NotExpressionTests skipped
02:45:01 OrExpression_Test10(org.eclipse.papyrus.infra.emf.expressions.tests.OrExpressionTests) skipped
02:45:01 OrExpression_Test11(org.eclipse.papyrus.infra.emf.expressions.tests.OrExpressionTests) skipped
02:45:01 OrExpression_Test12(org.eclipse.papyrus.infra.emf.expressions.tests.OrExpressionTests) skipped
02:45:01 OrExpression_Test13(org.eclipse.papyrus.infra.emf.expressions.tests.OrExpressionTests) skipped
02:45:01 OrExpression_Test14(org.eclipse.papyrus.infra.emf.expressions.tests.OrExpressionTests) skipped
02:45:01 OrExpression_Test15(org.eclipse.papyrus.infra.emf.expressions.tests.OrExpressionTests) skipped
02:45:01 OrExpression_Test16(org.eclipse.papyrus.infra.emf.expressions.tests.OrExpressionTests) skipped
02:45:01 OrExpression_Test17(org.eclipse.papyrus.infra.emf.expressions.tests.OrExpressionTests) skipped
02:45:01 OrExpression_Test18(org.eclipse.papyrus.infra.emf.expressions.tests.OrExpressionTests) skipped
02:45:01 OrExpression_Test19(org.eclipse.papyrus.infra.emf.expressions.tests.OrExpressionTests) skipped
02:45:01 OrExpression_Test20(org.eclipse.papyrus.infra.emf.expressions.tests.OrExpressionTests) skipped
02:45:01 OrExpression_Test21(org.eclipse.papyrus.infra.emf.expressions.tests.OrExpressionTests) skipped
02:45:01 OrExpression_Test22(org.eclipse.papyrus.infra.emf.expressions.tests.OrExpressionTests) skipped
02:45:01 OrExpression_Test23(org.eclipse.papyrus.infra.emf.expressions.tests.OrExpressionTests) skipped
02:45:01 OrExpression_Test24(org.eclipse.papyrus.infra.emf.expressions.tests.OrExpressionTests) skipped
02:45:01 OrExpression_Test25(org.eclipse.papyrus.infra.emf.expressions.tests.OrExpressionTests) skipped
02:45:01 OrExpression_Test26(org.eclipse.papyrus.infra.emf.expressions.tests.OrExpressionTests) skipped
02:45:01 OrExpression_Test1(org.eclipse.papyrus.infra.emf.expressions.tests.OrExpressionTests) skipped
02:45:01 OrExpression_Test2(org.eclipse.papyrus.infra.emf.expressions.tests.OrExpressionTests) skipped
02:45:01 OrExpression_Test3(org.eclipse.papyrus.infra.emf.expressions.tests.OrExpressionTests) skipped
02:45:01 OrExpression_Test4(org.eclipse.papyrus.infra.emf.expressions.tests.OrExpressionTests) skipped
02:45:01 OrExpression_Test5(org.eclipse.papyrus.infra.emf.expressions.tests.OrExpressionTests) skipped
02:45:01 OrExpression_Test6(org.eclipse.papyrus.infra.emf.expressions.tests.OrExpressionTests) skipped
02:45:01 OrExpression_Test7(org.eclipse.papyrus.infra.emf.expressions.tests.OrExpressionTests) skipped
02:45:01 OrExpression_Test8(org.eclipse.papyrus.infra.emf.expressions.tests.OrExpressionTests) skipped
02:45:01 OrExpression_Test9(org.eclipse.papyrus.infra.emf.expressions.tests.OrExpressionTests) skipped
02:45:01 org.eclipse.papyrus.infra.emf.expressions.tests.OrExpressionTests skipped
02:45:01 ReferenceExpression_Test1(org.eclipse.papyrus.infra.emf.expressions.tests.ReferenceExpressionTests) skipped
02:45:01 ReferenceExpression_Test2(org.eclipse.papyrus.infra.emf.expressions.tests.ReferenceExpressionTests) skipped
02:45:01 ReferenceExpression_Test3(org.eclipse.papyrus.infra.emf.expressions.tests.ReferenceExpressionTests) skipped
02:45:01 ReferenceExpression_Test4(org.eclipse.papyrus.infra.emf.expressions.tests.ReferenceExpressionTests) skipped
02:45:01 ReferenceExpression_Test5(org.eclipse.papyrus.infra.emf.expressions.tests.ReferenceExpressionTests) skipped
02:45:01 org.eclipse.papyrus.infra.emf.expressions.tests.ReferenceExpressionTests skipped
02:45:01 singleEAttributeEqualityExpression_Test1(org.eclipse.papyrus.infra.emf.expressions.tests.SingleEAttributeValueEqualityExpressionTests) skipped
02:45:01 singleEAttributeEqualityExpression_Test2(org.eclipse.papyrus.infra.emf.expressions.tests.SingleEAttributeValueEqualityExpressionTests) skipped
02:45:01 singleEAttributeEqualityExpression_Test3(org.eclipse.papyrus.infra.emf.expressions.tests.SingleEAttributeValueEqualityExpressionTests) skipped
02:45:01 singleEAttributeEqualityExpression_Test4(org.eclipse.papyrus.infra.emf.expressions.tests.SingleEAttributeValueEqualityExpressionTests) skipped
02:45:01 singleEAttributeEqualityExpression_Test5(org.eclipse.papyrus.infra.emf.expressions.tests.SingleEAttributeValueEqualityExpressionTests) skipped
02:45:01 singleEAttributeEqualityExpression_Test6(org.eclipse.papyrus.infra.emf.expressions.tests.SingleEAttributeValueEqualityExpressionTests) skipped
02:45:01 singleEAttributeEqualityExpression_Test7(org.eclipse.papyrus.infra.emf.expressions.tests.SingleEAttributeValueEqualityExpressionTests) skipped
02:45:01 singleEAttributeEqualityExpression_Test8(org.eclipse.papyrus.infra.emf.expressions.tests.SingleEAttributeValueEqualityExpressionTests) skipped
02:45:01 org.eclipse.papyrus.infra.emf.expressions.tests.SingleEAttributeValueEqualityExpressionTests skipped
02:45:01 org.eclipse.papyrus.infra.emf.expressions.tests.AllTests skipped
02:45:01 handlesWrapperChains(org.eclipse.papyrus.infra.emf.gmf.util.tests.CommandTreeIteratorTest) skipped
02:45:01 org.eclipse.papyrus.infra.emf.gmf.util.tests.CommandTreeIteratorTest skipped
02:45:01 org.eclipse.papyrus.infra.emf.gmf.tests.AllTests skipped
02:45:01 testMainModelElementsAreUnhandled(org.eclipse.papyrus.infra.ui.internal.emf.readonly.handlers.ReferencedModelReadOnlyHandlerTest) skipped
02:45:01 testNonExistentResourceIsUnhandled(org.eclipse.papyrus.infra.ui.internal.emf.readonly.handlers.ReferencedModelReadOnlyHandlerTest) skipped
02:45:01 testCrossReferencedPluginModelElementsAreUnhandled(org.eclipse.papyrus.infra.ui.internal.emf.readonly.handlers.ReferencedModelReadOnlyHandlerTest) skipped
02:45:01 testCrossReferencedWorkspaceModelElementsMadeWritable(org.eclipse.papyrus.infra.ui.internal.emf.readonly.handlers.ReferencedModelReadOnlyHandlerTest) skipped
02:45:01 testSubModelElementsAreUnhandled(org.eclipse.papyrus.infra.ui.internal.emf.readonly.handlers.ReferencedModelReadOnlyHandlerTest) skipped
02:45:01 testObjectURIsWithFragment(org.eclipse.papyrus.infra.ui.internal.emf.readonly.handlers.ReferencedModelReadOnlyHandlerTest) skipped
02:45:01 testCrossReferencedWorkspaceModelElementsAreReadOnly(org.eclipse.papyrus.infra.ui.internal.emf.readonly.handlers.ReferencedModelReadOnlyHandlerTest) skipped
02:45:01 org.eclipse.papyrus.infra.ui.internal.emf.readonly.handlers.ReferencedModelReadOnlyHandlerTest skipped
02:45:01 labelProviderChangeNotifications(org.eclipse.papyrus.infra.ui.emf.providers.tests.EMFLabelProviderTest) skipped
02:45:01 getText(org.eclipse.papyrus.infra.ui.emf.providers.tests.EMFLabelProviderTest) skipped
02:45:01 org.eclipse.papyrus.infra.ui.emf.providers.tests.EMFLabelProviderTest skipped
02:45:01 notificationsOnDependentWhenItChanges(org.eclipse.papyrus.infra.ui.emf.providers.tests.DependentEMFLabelProviderTest) skipped
02:45:01 getText(org.eclipse.papyrus.infra.ui.emf.providers.tests.DependentEMFLabelProviderTest) skipped
02:45:01 safeSubscriptionRemovalOnDestroy_bug507241(org.eclipse.papyrus.infra.ui.emf.providers.tests.DependentEMFLabelProviderTest) skipped
02:45:01 notificationsOnDependentWhenDependencyChanges(org.eclipse.papyrus.infra.ui.emf.providers.tests.DependentEMFLabelProviderTest) skipped
02:45:01 org.eclipse.papyrus.infra.ui.emf.providers.tests.DependentEMFLabelProviderTest skipped
02:45:01 org.eclipse.papyrus.infra.ui.emf.tests.AllTests skipped
02:45:01 testGetTypeRegisteredInplugin(org.eclipse.papyrus.infra.types.tests.ElementTypesRegistryTests) skipped
02:45:01 org.eclipse.papyrus.infra.types.tests.ElementTypesRegistryTests skipped
02:45:01 testPACKAGE_WITH_COMPONENTSType(org.eclipse.papyrus.infra.types.tests.ElementEditHelperAdviceTests) skipped
02:45:01 testSemanticMoveComponentFromWrongPackageToWrongPackage(org.eclipse.papyrus.infra.types.tests.ElementEditHelperAdviceTests) skipped
02:45:01 testDeleteComponentFromGoodPackage(org.eclipse.papyrus.infra.types.tests.ElementEditHelperAdviceTests) skipped
02:45:01 testSemanticCreateComponentInWrongPackage(org.eclipse.papyrus.infra.types.tests.ElementEditHelperAdviceTests) skipped
02:45:01 testCyclicAdvices(org.eclipse.papyrus.infra.types.tests.ElementEditHelperAdviceTests) skipped
02:45:01 testDeleteComponentFromWrongPackage(org.eclipse.papyrus.infra.types.tests.ElementEditHelperAdviceTests) skipped
02:45:01 testSemanticMoveComponentFromWrongPackageToGoodPackage(org.eclipse.papyrus.infra.types.tests.ElementEditHelperAdviceTests) skipped
02:45:01 testSemanticCreateComponentInGoodPackage(org.eclipse.papyrus.infra.types.tests.ElementEditHelperAdviceTests) skipped
02:45:01 testValidAdvicesOrder(org.eclipse.papyrus.infra.types.tests.ElementEditHelperAdviceTests) skipped
02:45:01 testSemanticMoveComponentFromGoodPackageToWrongPackage(org.eclipse.papyrus.infra.types.tests.ElementEditHelperAdviceTests) skipped
02:45:01 testPACKAGE_WITH_ALL_ELEMENTSType(org.eclipse.papyrus.infra.types.tests.ElementEditHelperAdviceTests) skipped
02:45:01 testSemanticMoveComponentFromGoodPackageToGoodPackage(org.eclipse.papyrus.infra.types.tests.ElementEditHelperAdviceTests) skipped
02:45:01 org.eclipse.papyrus.infra.types.tests.ElementEditHelperAdviceTests skipped
02:45:01 org.eclipse.papyrus.infra.types.tests.AllTests skipped
02:45:01 testGetTypeRegisteredInplugin(org.eclipse.papyrus.infra.types.tests.ElementTypesRegistryTests) skipped
02:45:01 org.eclipse.papyrus.infra.types.tests.ElementTypesRegistryTests skipped
02:45:01 org.eclipse.papyrus.infra.types.ui.tests.AllTests skipped
02:45:01 notDirtyAfterExecute_save_execute_undo_undo_redo(org.eclipse.papyrus.commands.NotifyingWorkspaceCommandStackTest) skipped
02:45:01 notDirtyAfterExecute_save_executeNonDirtying_undo_undo_redo_redo(org.eclipse.papyrus.commands.NotifyingWorkspaceCommandStackTest) skipped
02:45:01 notDirtyAfterExecuteNonDirtying_undo(org.eclipse.papyrus.commands.NotifyingWorkspaceCommandStackTest) skipped
02:45:01 dirtyAfterExecute(org.eclipse.papyrus.commands.NotifyingWorkspaceCommandStackTest) skipped
02:45:01 notDirtyAfterExecute_save(org.eclipse.papyrus.commands.NotifyingWorkspaceCommandStackTest) skipped
02:45:01 notDirtyAfterExecute_undo(org.eclipse.papyrus.commands.NotifyingWorkspaceCommandStackTest) skipped
02:45:01 dirtyAfterExecute_save_undo_save_redo(org.eclipse.papyrus.commands.NotifyingWorkspaceCommandStackTest) skipped
02:45:01 dirtyAfterExecute_save_undo(org.eclipse.papyrus.commands.NotifyingWorkspaceCommandStackTest) skipped
02:45:01 notDirtyAfterExecuteNonDirtying(org.eclipse.papyrus.commands.NotifyingWorkspaceCommandStackTest) skipped
02:45:01 notDirtyAfterExecute_save_undo_save(org.eclipse.papyrus.commands.NotifyingWorkspaceCommandStackTest) skipped
02:45:01 dirtyAfterExecute_save_execute_undo_undo_save_redo(org.eclipse.papyrus.commands.NotifyingWorkspaceCommandStackTest) skipped
02:45:01 org.eclipse.papyrus.commands.NotifyingWorkspaceCommandStackTest skipped
02:45:01 testCancelUnnestedCommand(org.eclipse.papyrus.commands.NestingNotifyingWorkspaceCommandStackTest) skipped
02:45:01 testCompleteNestedCommand(org.eclipse.papyrus.commands.NestingNotifyingWorkspaceCommandStackTest) skipped
02:45:01 testCancelTripleNestedCommand(org.eclipse.papyrus.commands.NestingNotifyingWorkspaceCommandStackTest) skipped
02:45:01 testCompleteTripleNestedCommand(org.eclipse.papyrus.commands.NestingNotifyingWorkspaceCommandStackTest) skipped
02:45:01 testCancelNestedCommand(org.eclipse.papyrus.commands.NestingNotifyingWorkspaceCommandStackTest) skipped
02:45:01 testCompleteUnnestedCommand(org.eclipse.papyrus.commands.NestingNotifyingWorkspaceCommandStackTest) skipped
02:45:01 org.eclipse.papyrus.commands.NestingNotifyingWorkspaceCommandStackTest skipped
02:45:01 genericCompoundsAndWrappers(org.eclipse.papyrus.commands.util.CommandTreeIteratorTest) skipped
02:45:01 gmfCompoundsAndWrappers(org.eclipse.papyrus.commands.util.CommandTreeIteratorTest) skipped
02:45:01 emfCompoundsAndWrappers(org.eclipse.papyrus.commands.util.CommandTreeIteratorTest) skipped
02:45:01 gefCompoundsAndWrappers(org.eclipse.papyrus.commands.util.CommandTreeIteratorTest) skipped
02:45:01 org.eclipse.papyrus.commands.util.CommandTreeIteratorTest skipped
02:45:01 undoChangesFromDiagramCommandStack(org.eclipse.papyrus.commands.CheckedDiagramCommandStackTest) skipped
02:45:01 undoChangesFromOperationHistory(org.eclipse.papyrus.commands.CheckedDiagramCommandStackTest) skipped
02:45:01 undoChangesFromEMFCommandStack(org.eclipse.papyrus.commands.CheckedDiagramCommandStackTest) skipped
02:45:01 org.eclipse.papyrus.commands.CheckedDiagramCommandStackTest skipped
02:45:01 org.eclipse.papyrus.infra.gmfdiag.commands.tests.AllTests skipped
02:45:01 load_BadelementTypeDiagramExpansion(org.eclipse.papyrus.infra.gmfdiag.common.tests.LoadExpansionModel) skipped
02:45:01 load_BadProviderDiagramExpansion(org.eclipse.papyrus.infra.gmfdiag.common.tests.LoadExpansionModel) skipped
02:45:01 init_DiagramExpansionRegistry(org.eclipse.papyrus.infra.gmfdiag.common.tests.LoadExpansionModel) skipped
02:45:01 load_BadDiagramExpansion(org.eclipse.papyrus.infra.gmfdiag.common.tests.LoadExpansionModel) skipped
02:45:01 load_DiagramExpansion(org.eclipse.papyrus.infra.gmfdiag.common.tests.LoadExpansionModel) skipped
02:45:01 org.eclipse.papyrus.infra.gmfdiag.common.tests.LoadExpansionModel skipped
02:45:01 verifyMetaclassCreationWithCompartment(org.eclipse.papyrus.infra.gmfdiag.common.tests.ExpansionAddCompartment) skipped
02:45:01 verifyClassCreationWithCompartment(org.eclipse.papyrus.infra.gmfdiag.common.tests.ExpansionAddCompartment) skipped
02:45:01 load_DiagramExpansion(org.eclipse.papyrus.infra.gmfdiag.common.tests.ExpansionAddCompartment) skipped
02:45:01 org.eclipse.papyrus.infra.gmfdiag.common.tests.ExpansionAddCompartment skipped
02:45:01 load_DiagramExpansion(org.eclipse.papyrus.infra.gmfdiag.common.tests.ExpansionAddChildLabel) skipped
02:45:01 org.eclipse.papyrus.infra.gmfdiag.common.tests.ExpansionAddChildLabel skipped
02:45:01 load_DiagramExpansion(org.eclipse.papyrus.infra.gmfdiag.common.tests.ExpansionAddBorderItem) skipped
02:45:01 org.eclipse.papyrus.infra.gmfdiag.common.tests.ExpansionAddBorderItem skipped
02:45:01 load_DiagramExpansion(org.eclipse.papyrus.infra.gmfdiag.common.tests.ExpansionAddCompartmentWithKind) skipped
02:45:01 org.eclipse.papyrus.infra.gmfdiag.common.tests.ExpansionAddCompartmentWithKind skipped
02:45:01 load_DiagramExpansion(org.eclipse.papyrus.infra.gmfdiag.common.tests.ExpansionAddLink) skipped
02:45:01 org.eclipse.papyrus.infra.gmfdiag.common.tests.ExpansionAddLink skipped
02:45:01 testDropInsideBadcontainer(org.eclipse.papyrus.infra.gmfdiag.common.tests.ExpansionDropElements) skipped
02:45:01 testDropInsidecontainer(org.eclipse.papyrus.infra.gmfdiag.common.tests.ExpansionDropElements) skipped
02:45:01 org.eclipse.papyrus.infra.gmfdiag.common.tests.ExpansionDropElements skipped
02:45:01 testAssistantForLabelNode(org.eclipse.papyrus.infra.gmfdiag.common.tests.AssistantUsage) skipped
02:45:01 org.eclipse.papyrus.infra.gmfdiag.common.tests.AssistantUsage skipped
02:45:01 testWrap(org.eclipse.papyrus.infra.gmfdiag.common.utils.GMFUnsafeTest) skipped
02:45:01 testWrite_command(org.eclipse.papyrus.infra.gmfdiag.common.utils.GMFUnsafeTest) skipped
02:45:01 testWrite_gmfCommand(org.eclipse.papyrus.infra.gmfdiag.common.utils.GMFUnsafeTest) skipped
02:45:01 testWrite_runnable(org.eclipse.papyrus.infra.gmfdiag.common.utils.GMFUnsafeTest) skipped
02:45:01 org.eclipse.papyrus.infra.gmfdiag.common.utils.GMFUnsafeTest skipped
02:45:01 initialSyncOfEmptyDiagram(org.eclipse.papyrus.infra.gmfdiag.common.sync.tests.MasterSlaveNotationSyncTest) skipped
02:45:01 newNodeOfWrongMetaclassNotSynchronized(org.eclipse.papyrus.infra.gmfdiag.common.sync.tests.MasterSlaveNotationSyncTest) skipped
02:45:01 createNewNode:create(org.eclipse.papyrus.infra.gmfdiag.common.sync.tests.MasterSlaveNotationSyncTest) skipped
02:45:01 createNewNode:undo(org.eclipse.papyrus.infra.gmfdiag.common.sync.tests.MasterSlaveNotationSyncTest) skipped
02:45:01 createNewNode:redo(org.eclipse.papyrus.infra.gmfdiag.common.sync.tests.MasterSlaveNotationSyncTest) skipped
02:45:01 createNewNode skipped
02:45:01 syncNodeLocation:move(org.eclipse.papyrus.infra.gmfdiag.common.sync.tests.MasterSlaveNotationSyncTest) skipped
02:45:01 syncNodeLocation:undo(org.eclipse.papyrus.infra.gmfdiag.common.sync.tests.MasterSlaveNotationSyncTest) skipped
02:45:01 syncNodeLocation:redo(org.eclipse.papyrus.infra.gmfdiag.common.sync.tests.MasterSlaveNotationSyncTest) skipped
02:45:01 syncNodeLocation skipped
02:45:01 deleteNode:deleteView(org.eclipse.papyrus.infra.gmfdiag.common.sync.tests.MasterSlaveNotationSyncTest) skipped
02:45:01 deleteNode:undo(org.eclipse.papyrus.infra.gmfdiag.common.sync.tests.MasterSlaveNotationSyncTest) skipped
02:45:01 deleteNode:redo(org.eclipse.papyrus.infra.gmfdiag.common.sync.tests.MasterSlaveNotationSyncTest) skipped
02:45:01 deleteNode skipped
02:45:01 syncNodeSize:resize(org.eclipse.papyrus.infra.gmfdiag.common.sync.tests.MasterSlaveNotationSyncTest) skipped
02:45:01 syncNodeSize:undo(org.eclipse.papyrus.infra.gmfdiag.common.sync.tests.MasterSlaveNotationSyncTest) skipped
02:45:01 syncNodeSize:redo(org.eclipse.papyrus.infra.gmfdiag.common.sync.tests.MasterSlaveNotationSyncTest) skipped
02:45:01 syncNodeSize skipped
02:45:01 org.eclipse.papyrus.infra.gmfdiag.common.sync.tests.MasterSlaveNotationSyncTest skipped
02:45:01 overrideSyncNodeSize:move(org.eclipse.papyrus.infra.gmfdiag.common.sync.tests.NotationSyncOverrideTest) skipped
02:45:01 overrideSyncNodeSize:override(org.eclipse.papyrus.infra.gmfdiag.common.sync.tests.NotationSyncOverrideTest) skipped
02:45:01 overrideSyncNodeSize:undo(org.eclipse.papyrus.infra.gmfdiag.common.sync.tests.NotationSyncOverrideTest) skipped
02:45:01 overrideSyncNodeSize:redo(org.eclipse.papyrus.infra.gmfdiag.common.sync.tests.NotationSyncOverrideTest) skipped
02:45:01 overrideSyncNodeSize skipped
02:45:01 overrideSyncNodeLocation:move(org.eclipse.papyrus.infra.gmfdiag.common.sync.tests.NotationSyncOverrideTest) skipped
02:45:01 overrideSyncNodeLocation:override(org.eclipse.papyrus.infra.gmfdiag.common.sync.tests.NotationSyncOverrideTest) skipped
02:45:01 overrideSyncNodeLocation:undo(org.eclipse.papyrus.infra.gmfdiag.common.sync.tests.NotationSyncOverrideTest) skipped
02:45:01 overrideSyncNodeLocation:redo(org.eclipse.papyrus.infra.gmfdiag.common.sync.tests.NotationSyncOverrideTest) skipped
02:45:01 overrideSyncNodeLocation skipped
02:45:01 org.eclipse.papyrus.infra.gmfdiag.common.sync.tests.NotationSyncOverrideTest skipped
02:45:01 org.eclipse.papyrus.infra.gmfdiag.common.sync.tests.SyncTests skipped
02:45:01 getText_unnamedDiagramNotifications(org.eclipse.papyrus.infra.gmfdiag.common.providers.tests.NotationLabelProviderTest) skipped
02:45:01 getText_namedDiagramNotifications(org.eclipse.papyrus.infra.gmfdiag.common.providers.tests.NotationLabelProviderTest) skipped
02:45:01 getText_unnamedDiagram(org.eclipse.papyrus.infra.gmfdiag.common.providers.tests.NotationLabelProviderTest) skipped
02:45:01 getText_unnamedDiagramChangeContextName(org.eclipse.papyrus.infra.gmfdiag.common.providers.tests.NotationLabelProviderTest) skipped
02:45:01 getText_namedDiagram(org.eclipse.papyrus.infra.gmfdiag.common.providers.tests.NotationLabelProviderTest) skipped
02:45:01 org.eclipse.papyrus.infra.gmfdiag.common.providers.tests.NotationLabelProviderTest skipped
02:45:01 createElement(org.eclipse.papyrus.infra.gmfdiag.common.commands.tests.CreateEditBasedElementCommandTest) skipped
02:45:01 org.eclipse.papyrus.infra.gmfdiag.common.commands.tests.CreateEditBasedElementCommandTest skipped
02:45:01 copyElement(org.eclipse.papyrus.infra.gmfdiag.common.commands.tests.DefaultCopyCommandTest) skipped
02:45:01 org.eclipse.papyrus.infra.gmfdiag.common.commands.tests.DefaultCopyCommandTest skipped
02:45:01 pasteElement(org.eclipse.papyrus.infra.gmfdiag.common.commands.tests.DefaultPasteCommandTest) skipped
02:45:01 org.eclipse.papyrus.infra.gmfdiag.common.commands.tests.DefaultPasteCommandTest skipped
02:45:01 copyElement(org.eclipse.papyrus.infra.gmfdiag.common.commands.tests.DefaultDiagramCopyCommandTest) skipped
02:45:01 org.eclipse.papyrus.infra.gmfdiag.common.commands.tests.DefaultDiagramCopyCommandTest skipped
02:45:01 pasteElement(org.eclipse.papyrus.infra.gmfdiag.common.commands.tests.DefaultDiagramPasteCommandTest) skipped
02:45:01 pasteProperty(org.eclipse.papyrus.infra.gmfdiag.common.commands.tests.DefaultDiagramPasteCommandTest) skipped
02:45:01 org.eclipse.papyrus.infra.gmfdiag.common.commands.tests.DefaultDiagramPasteCommandTest skipped
02:45:01 validateModel[0](org.eclipse.papyrus.infra.gmfdiag.common.tests.resources.ModelValidationTest) skipped
02:45:01 [0] skipped
02:45:01 validateModel[1](org.eclipse.papyrus.infra.gmfdiag.common.tests.resources.ModelValidationTest) skipped
02:45:01 [1] skipped
02:45:01 org.eclipse.papyrus.infra.gmfdiag.common.tests.resources.ModelValidationTest skipped
02:45:01 validateModel[0](org.eclipse.papyrus.infra.gmfdiag.common.tests.resources.TestModelValidationTest) skipped
02:45:01 [0] skipped
02:45:01 validateModel[1](org.eclipse.papyrus.infra.gmfdiag.common.tests.resources.TestModelValidationTest) skipped
02:45:01 [1] skipped
02:45:01 validateModel[2](org.eclipse.papyrus.infra.gmfdiag.common.tests.resources.TestModelValidationTest) skipped
02:45:01 [2] skipped
02:45:01 validateModel[3](org.eclipse.papyrus.infra.gmfdiag.common.tests.resources.TestModelValidationTest) skipped
02:45:01 [3] skipped
02:45:01 validateModel[4](org.eclipse.papyrus.infra.gmfdiag.common.tests.resources.TestModelValidationTest) skipped
02:45:01 [4] skipped
02:45:01 validateModel[5](org.eclipse.papyrus.infra.gmfdiag.common.tests.resources.TestModelValidationTest) skipped
02:45:01 [5] skipped
02:45:01 validateModel[6](org.eclipse.papyrus.infra.gmfdiag.common.tests.resources.TestModelValidationTest) skipped
02:45:01 [6] skipped
02:45:01 validateModel[7](org.eclipse.papyrus.infra.gmfdiag.common.tests.resources.TestModelValidationTest) skipped
02:45:01 [7] skipped
02:45:01 org.eclipse.papyrus.infra.gmfdiag.common.tests.resources.TestModelValidationTest skipped
02:45:01 org.eclipse.papyrus.infra.gmfdiag.common.tests.AllTests skipped
02:45:01 canonicalEdgesInClassDiagram(org.eclipse.papyrus.infra.gmfdiag.canonical.tests.BasicCanonicalClassDiagramTest) skipped
02:45:01 noCanonicalViewInCanonicalView(org.eclipse.papyrus.infra.gmfdiag.canonical.tests.BasicCanonicalClassDiagramTest) skipped
02:45:01 canonicalNodesInClassDiagram(org.eclipse.papyrus.infra.gmfdiag.canonical.tests.BasicCanonicalClassDiagramTest) skipped
02:45:01 noCanonicalEdgeOnCanonicalView(org.eclipse.papyrus.infra.gmfdiag.canonical.tests.BasicCanonicalClassDiagramTest) skipped
02:45:01 controlTestForNothingCanonical(org.eclipse.papyrus.infra.gmfdiag.canonical.tests.CanonicalStateInClassDiagramTest) skipped
02:45:01 toggleCanonicalOn:execute(org.eclipse.papyrus.infra.gmfdiag.canonical.tests.CanonicalStateInClassDiagramTest) skipped
02:45:01 toggleCanonicalOn:undo(org.eclipse.papyrus.infra.gmfdiag.canonical.tests.CanonicalStateInClassDiagramTest) skipped
02:45:01 toggleCanonicalOn:redo(org.eclipse.papyrus.infra.gmfdiag.canonical.tests.CanonicalStateInClassDiagramTest) skipped
02:45:01 toggleCanonicalInCanonicalNestedViews:on(org.eclipse.papyrus.infra.gmfdiag.canonical.tests.CanonicalStateInClassDiagramTest) skipped
02:45:01 toggleCanonicalInCanonicalNestedViews:off(org.eclipse.papyrus.infra.gmfdiag.canonical.tests.CanonicalStateInClassDiagramTest) skipped
02:45:01 toggleCanonicalOff:execute(org.eclipse.papyrus.infra.gmfdiag.canonical.tests.CanonicalStateInClassDiagramTest) skipped
02:45:01 toggleCanonicalOff:undo(org.eclipse.papyrus.infra.gmfdiag.canonical.tests.CanonicalStateInClassDiagramTest) skipped
02:45:01 toggleCanonicalOff:redo(org.eclipse.papyrus.infra.gmfdiag.canonical.tests.CanonicalStateInClassDiagramTest) skipped
02:45:01 reorderPropertiesInClass_bug420549:execute(org.eclipse.papyrus.infra.gmfdiag.canonical.tests.EditingInModelInClassDiagramTest) skipped
02:45:01 reorderPropertiesInClass_bug420549:undo(org.eclipse.papyrus.infra.gmfdiag.canonical.tests.EditingInModelInClassDiagramTest) skipped
02:45:01 reorderPropertiesInClass_bug420549:redo(org.eclipse.papyrus.infra.gmfdiag.canonical.tests.EditingInModelInClassDiagramTest) skipped
02:45:01 removeGeneralizationFromClass:execute(org.eclipse.papyrus.infra.gmfdiag.canonical.tests.EditingInModelInClassDiagramTest) skipped
02:45:01 removeGeneralizationFromClass:undo(org.eclipse.papyrus.infra.gmfdiag.canonical.tests.EditingInModelInClassDiagramTest) skipped
02:45:01 removeGeneralizationFromClass:redo(org.eclipse.papyrus.infra.gmfdiag.canonical.tests.EditingInModelInClassDiagramTest) skipped
02:45:01 addAssociationToClass:execute(org.eclipse.papyrus.infra.gmfdiag.canonical.tests.EditingInModelInClassDiagramTest) skipped
02:45:01 addAssociationToClass:undo(org.eclipse.papyrus.infra.gmfdiag.canonical.tests.EditingInModelInClassDiagramTest) skipped
02:45:01 addAssociationToClass:redo(org.eclipse.papyrus.infra.gmfdiag.canonical.tests.EditingInModelInClassDiagramTest) skipped
02:45:01 addElementImportToPackage:execute(org.eclipse.papyrus.infra.gmfdiag.canonical.tests.EditingInModelInClassDiagramTest) skipped
02:45:01 addElementImportToPackage:undo(org.eclipse.papyrus.infra.gmfdiag.canonical.tests.EditingInModelInClassDiagramTest) skipped
02:45:01 addElementImportToPackage:redo(org.eclipse.papyrus.infra.gmfdiag.canonical.tests.EditingInModelInClassDiagramTest) skipped
02:45:01 removeOperationFromClass:execute(org.eclipse.papyrus.infra.gmfdiag.canonical.tests.EditingInModelInClassDiagramTest) skipped
02:45:01 removeOperationFromClass:undo(org.eclipse.papyrus.infra.gmfdiag.canonical.tests.EditingInModelInClassDiagramTest) skipped
02:45:01 removeOperationFromClass:redo(org.eclipse.papyrus.infra.gmfdiag.canonical.tests.EditingInModelInClassDiagramTest) skipped
02:45:01 addInterfaceToPackage:execute(org.eclipse.papyrus.infra.gmfdiag.canonical.tests.EditingInModelInClassDiagramTest) skipped
02:45:01 addInterfaceToPackage:undo(org.eclipse.papyrus.infra.gmfdiag.canonical.tests.EditingInModelInClassDiagramTest) skipped
02:45:01 addInterfaceToPackage:redo(org.eclipse.papyrus.infra.gmfdiag.canonical.tests.EditingInModelInClassDiagramTest) skipped
02:45:01 removeClassFromPackage:execute(org.eclipse.papyrus.infra.gmfdiag.canonical.tests.EditingInModelInClassDiagramTest) skipped
02:45:01 removeClassFromPackage:undo(org.eclipse.papyrus.infra.gmfdiag.canonical.tests.EditingInModelInClassDiagramTest) skipped
02:45:01 removeClassFromPackage:redo(org.eclipse.papyrus.infra.gmfdiag.canonical.tests.EditingInModelInClassDiagramTest) skipped
02:45:01 addPropertyToClass:execute(org.eclipse.papyrus.infra.gmfdiag.canonical.tests.EditingInModelInClassDiagramTest) skipped
02:45:01 addPropertyToClass:undo(org.eclipse.papyrus.infra.gmfdiag.canonical.tests.EditingInModelInClassDiagramTest) skipped
02:45:01 addPropertyToClass:redo(org.eclipse.papyrus.infra.gmfdiag.canonical.tests.EditingInModelInClassDiagramTest) skipped
02:45:01 addDependencyToClass:execute(org.eclipse.papyrus.infra.gmfdiag.canonical.tests.EditingInModelInClassDiagramTest) skipped
02:45:01 addDependencyToClass:undo(org.eclipse.papyrus.infra.gmfdiag.canonical.tests.EditingInModelInClassDiagramTest) skipped
02:45:01 addDependencyToClass:redo(org.eclipse.papyrus.infra.gmfdiag.canonical.tests.EditingInModelInClassDiagramTest) skipped
02:45:01 deleteGeneralizationViewFromClass:execute(org.eclipse.papyrus.infra.gmfdiag.canonical.tests.CanonicalViewDeletionInClassDiagramTest) skipped
02:45:01 deleteGeneralizationViewFromClass:undo(org.eclipse.papyrus.infra.gmfdiag.canonical.tests.CanonicalViewDeletionInClassDiagramTest) skipped
02:45:01 deleteGeneralizationViewFromClass:redo(org.eclipse.papyrus.infra.gmfdiag.canonical.tests.CanonicalViewDeletionInClassDiagramTest) skipped
02:45:01 deleteAssociationViewFromClass:execute(org.eclipse.papyrus.infra.gmfdiag.canonical.tests.CanonicalViewDeletionInClassDiagramTest) skipped
02:45:01 deleteAssociationViewFromClass:undo(org.eclipse.papyrus.infra.gmfdiag.canonical.tests.CanonicalViewDeletionInClassDiagramTest) skipped
02:45:01 deleteAssociationViewFromClass:redo(org.eclipse.papyrus.infra.gmfdiag.canonical.tests.CanonicalViewDeletionInClassDiagramTest) skipped
02:45:01 deleteClassViewFromPackage:execute(org.eclipse.papyrus.infra.gmfdiag.canonical.tests.CanonicalViewDeletionInClassDiagramTest) skipped
02:45:01 deleteClassViewFromPackage:undo(org.eclipse.papyrus.infra.gmfdiag.canonical.tests.CanonicalViewDeletionInClassDiagramTest) skipped
02:45:01 deleteClassViewFromPackage:redo(org.eclipse.papyrus.infra.gmfdiag.canonical.tests.CanonicalViewDeletionInClassDiagramTest) skipped
02:45:01 deleteOperationViewFromClass:execute(org.eclipse.papyrus.infra.gmfdiag.canonical.tests.CanonicalViewDeletionInClassDiagramTest) skipped
02:45:01 deleteOperationViewFromClass:undo(org.eclipse.papyrus.infra.gmfdiag.canonical.tests.CanonicalViewDeletionInClassDiagramTest) skipped
02:45:01 deleteOperationViewFromClass:redo(org.eclipse.papyrus.infra.gmfdiag.canonical.tests.CanonicalViewDeletionInClassDiagramTest) skipped
02:45:01 deleteDataTypeFromPackage:execute(org.eclipse.papyrus.infra.gmfdiag.canonical.tests.EditingInClassDiagramRegressionTest) skipped
02:45:01 deleteDataTypeFromPackage:undo(org.eclipse.papyrus.infra.gmfdiag.canonical.tests.EditingInClassDiagramRegressionTest) skipped
02:45:01 deleteDataTypeFromPackage:redo(org.eclipse.papyrus.infra.gmfdiag.canonical.tests.EditingInClassDiagramRegressionTest) skipped
02:45:01 deleteAssociationFromClass:execute(org.eclipse.papyrus.infra.gmfdiag.canonical.tests.EditingInClassDiagramRegressionTest) skipped
02:45:01 deleteAssociationFromClass:undo(org.eclipse.papyrus.infra.gmfdiag.canonical.tests.EditingInClassDiagramRegressionTest) skipped
02:45:01 deleteAssociationFromClass:redo(org.eclipse.papyrus.infra.gmfdiag.canonical.tests.EditingInClassDiagramRegressionTest) skipped
02:45:01 deleteLiteralInEnumeration:execute(org.eclipse.papyrus.infra.gmfdiag.canonical.tests.EditingInClassDiagramRegressionTest) skipped
02:45:01 deleteLiteralInEnumeration:undo(org.eclipse.papyrus.infra.gmfdiag.canonical.tests.EditingInClassDiagramRegressionTest) skipped
02:45:01 deleteLiteralInEnumeration:redo(org.eclipse.papyrus.infra.gmfdiag.canonical.tests.EditingInClassDiagramRegressionTest) skipped
02:45:01 createPropertyInClass:execute(org.eclipse.papyrus.infra.gmfdiag.canonical.tests.EditingInClassDiagramRegressionTest) skipped
02:45:01 createPropertyInClass:undo(org.eclipse.papyrus.infra.gmfdiag.canonical.tests.EditingInClassDiagramRegressionTest) skipped
02:45:01 createPropertyInClass:redo(org.eclipse.papyrus.infra.gmfdiag.canonical.tests.EditingInClassDiagramRegressionTest) skipped
02:45:01 createDependencyInClass:execute(org.eclipse.papyrus.infra.gmfdiag.canonical.tests.EditingInClassDiagramRegressionTest) skipped
02:45:01 createDependencyInClass:undo(org.eclipse.papyrus.infra.gmfdiag.canonical.tests.EditingInClassDiagramRegressionTest) skipped
02:45:01 createDependencyInClass:redo(org.eclipse.papyrus.infra.gmfdiag.canonical.tests.EditingInClassDiagramRegressionTest) skipped
02:45:01 createInterfaceInPackage:execute(org.eclipse.papyrus.infra.gmfdiag.canonical.tests.EditingInClassDiagramRegressionTest) skipped
02:45:01 createInterfaceInPackage:undo(org.eclipse.papyrus.infra.gmfdiag.canonical.tests.EditingInClassDiagramRegressionTest) skipped
02:45:01 createInterfaceInPackage:redo(org.eclipse.papyrus.infra.gmfdiag.canonical.tests.EditingInClassDiagramRegressionTest) skipped
02:45:01 canonicalEdgesInClassDiagram(org.eclipse.papyrus.infra.gmfdiag.canonical.tests.CSSCanonicalClassDiagramTest) skipped
02:45:01 nestedCanonicalNodesByMetaclassSelectorInCanonicalView(org.eclipse.papyrus.infra.gmfdiag.canonical.tests.CSSCanonicalClassDiagramTest) skipped
02:45:01 nestedCanonicalEdgesInCanonicalView(org.eclipse.papyrus.infra.gmfdiag.canonical.tests.CSSCanonicalClassDiagramTest) skipped
02:45:01 canonicalNodesByMetaclassSelectorInClassDiagram(org.eclipse.papyrus.infra.gmfdiag.canonical.tests.CSSCanonicalClassDiagramTest) skipped
02:45:01 canonicalNodesByExplicitStyleClassInClassDiagram(org.eclipse.papyrus.infra.gmfdiag.canonical.tests.CSSCanonicalClassDiagramTest) skipped
02:45:01 controlTestForNothingCanonical(org.eclipse.papyrus.infra.gmfdiag.canonical.tests.CSSCanonicalStateInClassDiagramTest) skipped
02:45:01 overrideSelectorRule(org.eclipse.papyrus.infra.gmfdiag.canonical.tests.CSSCanonicalStateInClassDiagramTest) skipped
02:45:01 overrideExplicitClassRule(org.eclipse.papyrus.infra.gmfdiag.canonical.tests.CSSCanonicalStateInClassDiagramTest) skipped
02:45:01 addStyleClass:execute(org.eclipse.papyrus.infra.gmfdiag.canonical.tests.CSSCanonicalStateInClassDiagramTest) skipped
02:45:01 addStyleClass:undo(org.eclipse.papyrus.infra.gmfdiag.canonical.tests.CSSCanonicalStateInClassDiagramTest) skipped
02:45:01 addStyleClass:redo(org.eclipse.papyrus.infra.gmfdiag.canonical.tests.CSSCanonicalStateInClassDiagramTest) skipped
02:45:01 addStylesheet:execute(org.eclipse.papyrus.infra.gmfdiag.canonical.tests.CSSCanonicalStateInClassDiagramTest) skipped
02:45:01 addStylesheet:undo(org.eclipse.papyrus.infra.gmfdiag.canonical.tests.CSSCanonicalStateInClassDiagramTest) skipped
02:45:01 addStylesheet:redo(org.eclipse.papyrus.infra.gmfdiag.canonical.tests.CSSCanonicalStateInClassDiagramTest) skipped
02:45:01 editStylesheetRefresh:initial(org.eclipse.papyrus.infra.gmfdiag.canonical.tests.CSSExternalStylesheetInClassDiagramTest) skipped
02:45:01 editStylesheetRefresh:non-canonical(org.eclipse.papyrus.infra.gmfdiag.canonical.tests.CSSExternalStylesheetInClassDiagramTest) skipped
02:45:01 editStylesheetRefresh:canonical(org.eclipse.papyrus.infra.gmfdiag.canonical.tests.CSSExternalStylesheetInClassDiagramTest) skipped
02:45:01 editStylesheetRefresh:undo(org.eclipse.papyrus.infra.gmfdiag.canonical.tests.CSSExternalStylesheetInClassDiagramTest) skipped
02:45:01 editStylesheetRefresh:redo(org.eclipse.papyrus.infra.gmfdiag.canonical.tests.CSSExternalStylesheetInClassDiagramTest) skipped
02:45:01 editStylesheetRefresh_closeReopenDiagram_undo:initial(org.eclipse.papyrus.infra.gmfdiag.canonical.tests.CSSExternalStylesheetInClassDiagramTest) skipped
02:45:01 editStylesheetRefresh_closeReopenDiagram_undo:close-reopen(org.eclipse.papyrus.infra.gmfdiag.canonical.tests.CSSExternalStylesheetInClassDiagramTest) skipped
02:45:01 editStylesheetRefresh_closeReopenDiagram_undo:undo(org.eclipse.papyrus.infra.gmfdiag.canonical.tests.CSSExternalStylesheetInClassDiagramTest) skipped
02:45:01 associationEndWhenNoAssociationEdge_bug473148(org.eclipse.papyrus.infra.gmfdiag.canonical.tests.RegressionTest)  Time elapsed: 11.785 s
02:45:01 nestedClassifiersDontCauseLoopInCompositeDiagram_bug474489(org.eclipse.papyrus.infra.gmfdiag.canonical.tests.RegressionTest) skipped
02:45:01 associationEndCanonicalPresentation_bug473148(org.eclipse.papyrus.infra.gmfdiag.canonical.tests.RegressionTest) skipped
02:45:01 referenceConnectionNotDeleted_bug472155:initial(org.eclipse.papyrus.infra.gmfdiag.canonical.tests.RegressionTest) skipped
02:45:01 referenceConnectionNotDeleted_bug472155:synch(org.eclipse.papyrus.infra.gmfdiag.canonical.tests.RegressionTest) skipped
02:45:01 referenceConnectionNotDeleted_bug472155:undo(org.eclipse.papyrus.infra.gmfdiag.canonical.tests.RegressionTest) skipped
02:45:01 referenceConnectionNotDeleted_bug472155:redo(org.eclipse.papyrus.infra.gmfdiag.canonical.tests.RegressionTest) skipped
02:45:01 testReadOnlyAxisTransactionOption(org.eclipse.papyrus.infra.emf.readonly.PapyrusROTransactionalEditingDomainTest) skipped
02:45:01 testReferenceToReadOnlyObjectWithOppositeRolledBackCommand(org.eclipse.papyrus.infra.emf.readonly.PapyrusROTransactionalEditingDomainTest) skipped
02:45:01 testReferenceToReadOnlyObjectWithOppositeRolledBackOperation(org.eclipse.papyrus.infra.emf.readonly.PapyrusROTransactionalEditingDomainTest) skipped
02:45:01 org.eclipse.papyrus.infra.emf.readonly.PapyrusROTransactionalEditingDomainTest skipped
02:45:01 testIsReadOnlyEObject(org.eclipse.papyrus.infra.emf.readonly.ReadOnlyManagerTest) skipped
02:45:01 testSashModelReadOnlyIfPermissionReadOnly(org.eclipse.papyrus.infra.emf.readonly.ReadOnlyManagerTest) skipped
02:45:01 testAnyReadOnlyURIs(org.eclipse.papyrus.infra.emf.readonly.ReadOnlyManagerTest) skipped
02:45:01 testCanMakeWritableEObject(org.eclipse.papyrus.infra.emf.readonly.ReadOnlyManagerTest) skipped
02:45:01 testCanMakeWritableURIs(org.eclipse.papyrus.infra.emf.readonly.ReadOnlyManagerTest) skipped
02:45:01 org.eclipse.papyrus.infra.emf.readonly.ReadOnlyManagerTest skipped
02:45:01 testCanMakeWritable(org.eclipse.papyrus.infra.emf.readonly.ReadOnlyTesterTest) skipped
02:45:01 testAsBoolean(org.eclipse.papyrus.infra.emf.readonly.ReadOnlyTesterTest) skipped
02:45:01 testIsReadOnly(org.eclipse.papyrus.infra.emf.readonly.ReadOnlyTesterTest) skipped
02:45:01 org.eclipse.papyrus.infra.emf.readonly.ReadOnlyTesterTest skipped
02:45:01 org.eclipse.papyrus.infra.emf.readonly.tests.AllTests skipped
02:45:01 testGetSashRow__int_int(org.eclipse.papyrus.infra.editor.welcome.tests.WelcomePageTest) skipped
02:45:01 testGetVisibleSections(org.eclipse.papyrus.infra.editor.welcome.tests.WelcomePageTest) skipped
02:45:01 testGetSashColumn__int(org.eclipse.papyrus.infra.editor.welcome.tests.WelcomePageTest) skipped
02:45:01 testGetSection__String(org.eclipse.papyrus.infra.editor.welcome.tests.WelcomePageTest) skipped
02:45:01 org.eclipse.papyrus.infra.editor.welcome.tests.WelcomePageTest skipped
02:45:01 testIsIdentifiedBy__String(org.eclipse.papyrus.infra.editor.welcome.tests.WelcomeSectionTest) skipped
02:45:01 org.eclipse.papyrus.infra.editor.welcome.tests.WelcomeSectionTest skipped
02:45:01 testGetSashRow__int(org.eclipse.papyrus.infra.editor.welcome.tests.SashColumnTest) skipped
02:45:01 org.eclipse.papyrus.infra.editor.welcome.tests.SashColumnTest skipped
02:45:01 welcome Tests skipped
02:45:01 Welcome Tests skipped
02:45:01 openWelcomePage(org.eclipse.papyrus.infra.editor.welcome.tests.WelcomePageServiceTest) skipped
02:45:01 closeWelcomePage(org.eclipse.papyrus.infra.editor.welcome.tests.WelcomePageServiceTest) skipped
02:45:01 pageRemovalValidator(org.eclipse.papyrus.infra.editor.welcome.tests.WelcomePageServiceTest) skipped
02:45:01 emptyModelShowsWelcomePage(org.eclipse.papyrus.infra.editor.welcome.tests.WelcomePageServiceTest) skipped
02:45:01 emptyModelCannotCloseWelcomePage(org.eclipse.papyrus.infra.editor.welcome.tests.WelcomePageServiceTest) skipped
02:45:01 canCloseWelcomePage(org.eclipse.papyrus.infra.editor.welcome.tests.WelcomePageServiceTest) skipped
02:45:01 welcomeModelResource(org.eclipse.papyrus.infra.editor.welcome.tests.WelcomePageServiceTest) skipped
02:45:01 welcomeModelElement(org.eclipse.papyrus.infra.editor.welcome.tests.WelcomePageServiceTest) skipped
02:45:01 getOwner(org.eclipse.papyrus.infra.editor.welcome.tests.WelcomePageServiceTest) skipped
02:45:01 org.eclipse.papyrus.infra.editor.welcome.tests.WelcomePageServiceTest skipped
02:45:01 languagesProperty(org.eclipse.papyrus.infra.editor.welcome.tests.WelcomeModelElementTest) skipped
02:45:01 isEditableRestoreActivePage(org.eclipse.papyrus.infra.editor.welcome.tests.WelcomeModelElementTest) skipped
02:45:01 privateLayoutProperty(org.eclipse.papyrus.infra.editor.welcome.tests.WelcomeModelElementTest) skipped
02:45:01 restoreActivePageProperty(org.eclipse.papyrus.infra.editor.welcome.tests.WelcomeModelElementTest) skipped
02:45:01 isEditable(org.eclipse.papyrus.infra.editor.welcome.tests.WelcomeModelElementTest) skipped
02:45:01 dispose_bug487027(org.eclipse.papyrus.infra.editor.welcome.tests.WelcomeModelElementTest) skipped
02:45:01 org.eclipse.papyrus.infra.editor.welcome.tests.WelcomeModelElementTest skipped
02:45:01 org.eclipse.papyrus.infra.editor.welcome.tests.AllTests skipped
02:45:01 viewsProperty(org.eclipse.papyrus.infra.gmfdiag.welcome.tests.WelcomeModelElementTest) skipped
02:45:01 isEditable(org.eclipse.papyrus.infra.gmfdiag.welcome.tests.WelcomeModelElementTest) skipped
02:45:01 createView(org.eclipse.papyrus.infra.gmfdiag.welcome.tests.WelcomeModelElementTest) skipped
02:45:01 dispose_bug487027(org.eclipse.papyrus.infra.gmfdiag.welcome.tests.WelcomeModelElementTest) skipped
02:45:01 deleteView(org.eclipse.papyrus.infra.gmfdiag.welcome.tests.WelcomeModelElementTest) skipped
02:45:01 org.eclipse.papyrus.infra.gmfdiag.welcome.tests.WelcomeModelElementTest skipped
02:45:01 viewsPropertyExcludesPluginDeployedModels_bug493668(org.eclipse.papyrus.infra.gmfdiag.welcome.tests.NotationObservablePropertyTest) skipped
02:45:01 org.eclipse.papyrus.infra.gmfdiag.welcome.tests.NotationObservablePropertyTest skipped
02:45:01 org.eclipse.papyrus.infra.gmfdiag.welcome.tests.AllTests skipped
02:45:01 labelProviderChange(org.eclipse.papyrus.infra.properties.ui.providers.tests.PropertiesHeaderLabelProviderTest) skipped
02:45:01 org.eclipse.papyrus.infra.properties.ui.providers.tests.PropertiesHeaderLabelProviderTest skipped
02:45:01 createWithLocalFactory(org.eclipse.papyrus.infra.properties.ui.tests.EcorePropertyEditorFactoryTest) skipped
02:45:01 org.eclipse.papyrus.infra.properties.ui.tests.EcorePropertyEditorFactoryTest skipped
02:45:01 org.eclipse.papyrus.infra.properties.ui.tests.AllTests skipped
02:45:01 testMatches__Object_not(org.eclipse.papyrus.infra.filters.tests.CompoundFilterTest) skipped
02:45:01 testMatches__Object_xor(org.eclipse.papyrus.infra.filters.tests.CompoundFilterTest) skipped
02:45:01 testMatches__Object(org.eclipse.papyrus.infra.filters.tests.CompoundFilterTest) skipped
02:45:01 testMatches__Object_or(org.eclipse.papyrus.infra.filters.tests.CompoundFilterTest) skipped
02:45:01 testValidateAcyclic__DiagnosticChain_Map(org.eclipse.papyrus.infra.filters.tests.CompoundFilterTest) skipped
02:45:01 org.eclipse.papyrus.infra.filters.tests.CompoundFilterTest skipped
02:45:01 testMatches__Object(org.eclipse.papyrus.infra.filters.tests.EqualsTest) skipped
02:45:01 org.eclipse.papyrus.infra.filters.tests.EqualsTest skipped
02:45:01 filters Tests skipped
02:45:01 Filters Tests skipped
02:45:01 org.eclipse.papyrus.infra.filters.tests.AllTests skipped
02:45:01 testMatches__Object(org.eclipse.papyrus.infra.gmfdiag.assistant.tests.AssistedElementTypeFilterTest) skipped
02:45:01 testGetProvider(org.eclipse.papyrus.infra.gmfdiag.assistant.tests.AssistedElementTypeFilterTest) skipped
02:45:01 org.eclipse.papyrus.infra.gmfdiag.assistant.tests.AssistedElementTypeFilterTest skipped
02:45:01 testGetRelTypesOnSourceAndTarget__IAdaptable_IAdaptable(org.eclipse.papyrus.infra.gmfdiag.assistant.tests.ModelingAssistantProviderTest) skipped
02:45:01 testGetRelTypesForSREOnSource__IAdaptable(org.eclipse.papyrus.infra.gmfdiag.assistant.tests.ModelingAssistantProviderTest) skipped
02:45:01 testRemoveProviderChangeListener__IProviderChangeListener(org.eclipse.papyrus.infra.gmfdiag.assistant.tests.ModelingAssistantProviderTest) skipped
02:45:01 testGetTypesForTarget__IAdaptable_IElementType(org.eclipse.papyrus.infra.gmfdiag.assistant.tests.ModelingAssistantProviderTest) skipped
02:45:01 testGetClientContext(org.eclipse.papyrus.infra.gmfdiag.assistant.tests.ModelingAssistantProviderTest) skipped
02:45:01 testAddProviderChangeListener__IProviderChangeListener(org.eclipse.papyrus.infra.gmfdiag.assistant.tests.ModelingAssistantProviderTest) skipped
02:45:01 testSelectExistingElementForTarget__IAdaptable_IElementType(org.eclipse.papyrus.infra.gmfdiag.assistant.tests.ModelingAssistantProviderTest) skipped
02:45:01 testGetRelTypesOnSource__IAdaptable(org.eclipse.papyrus.infra.gmfdiag.assistant.tests.ModelingAssistantProviderTest) skipped
02:45:01 testGetElementType__String(org.eclipse.papyrus.infra.gmfdiag.assistant.tests.ModelingAssistantProviderTest) skipped
02:45:01 testGetExcludedElementTypes(org.eclipse.papyrus.infra.gmfdiag.assistant.tests.ModelingAssistantProviderTest) skipped
02:45:01 testGetTypesForSource__IAdaptable_IElementType(org.eclipse.papyrus.infra.gmfdiag.assistant.tests.ModelingAssistantProviderTest) skipped
02:45:01 testSelectExistingElementForSource__IAdaptable_IElementType(org.eclipse.papyrus.infra.gmfdiag.assistant.tests.ModelingAssistantProviderTest) skipped
02:45:01 testGetTypesForPopupBar__IAdaptable(org.eclipse.papyrus.infra.gmfdiag.assistant.tests.ModelingAssistantProviderTest) skipped
02:45:01 testGetRelTypesForSREOnTarget__IAdaptable(org.eclipse.papyrus.infra.gmfdiag.assistant.tests.ModelingAssistantProviderTest) skipped
02:45:01 testGetElementTypes(org.eclipse.papyrus.infra.gmfdiag.assistant.tests.ModelingAssistantProviderTest) skipped
02:45:01 testIsRelationshipType__IElementType(org.eclipse.papyrus.infra.gmfdiag.assistant.tests.ModelingAssistantProviderTest) skipped
02:45:01 testGetTypes__String_IAdaptable(org.eclipse.papyrus.infra.gmfdiag.assistant.tests.ModelingAssistantProviderTest) skipped
02:45:01 testGetRelationshipTypes(org.eclipse.papyrus.infra.gmfdiag.assistant.tests.ModelingAssistantProviderTest) skipped
02:45:01 testGetRelTypesOnTarget__IAdaptable(org.eclipse.papyrus.infra.gmfdiag.assistant.tests.ModelingAssistantProviderTest) skipped
02:45:01 testProvides__IOperation(org.eclipse.papyrus.infra.gmfdiag.assistant.tests.ModelingAssistantProviderTest) skipped
02:45:01 org.eclipse.papyrus.infra.gmfdiag.assistant.tests.ModelingAssistantProviderTest skipped
02:45:01 testGetElementType(org.eclipse.papyrus.infra.gmfdiag.assistant.tests.PopupAssistantTest) skipped
02:45:01 org.eclipse.papyrus.infra.gmfdiag.assistant.tests.PopupAssistantTest skipped
02:45:01 testGetElementType(org.eclipse.papyrus.infra.gmfdiag.assistant.tests.ConnectionAssistantTest) skipped
02:45:01 org.eclipse.papyrus.infra.gmfdiag.assistant.tests.ConnectionAssistantTest skipped
02:45:01 testGetElementType(org.eclipse.papyrus.infra.gmfdiag.assistant.tests.ElementTypeFilterTest) skipped
02:45:01 testMatches__Object(org.eclipse.papyrus.infra.gmfdiag.assistant.tests.ElementTypeFilterTest) skipped
02:45:01 testGetProvider(org.eclipse.papyrus.infra.gmfdiag.assistant.tests.ElementTypeFilterTest) skipped
02:45:01 org.eclipse.papyrus.infra.gmfdiag.assistant.tests.ElementTypeFilterTest skipped
02:45:01 assistant Tests skipped
02:45:01 Assistant Tests skipped
02:45:01 sourceForConnectionToTarget(org.eclipse.papyrus.infra.gmfdiag.assistant.tests.GenericModelingAssistantIntegrationTest) skipped
02:45:01 excludedConnectionFromSource(org.eclipse.papyrus.infra.gmfdiag.assistant.tests.GenericModelingAssistantIntegrationTest) skipped
02:45:01 connectionToTarget(org.eclipse.papyrus.infra.gmfdiag.assistant.tests.GenericModelingAssistantIntegrationTest) skipped
02:45:01 excludedConnectionToTarget(org.eclipse.papyrus.infra.gmfdiag.assistant.tests.GenericModelingAssistantIntegrationTest) skipped
02:45:01 excludedTargetForConnectionFromSource(org.eclipse.papyrus.infra.gmfdiag.assistant.tests.GenericModelingAssistantIntegrationTest) skipped
02:45:01 excludedSourceForConnectionToTarget(org.eclipse.papyrus.infra.gmfdiag.assistant.tests.GenericModelingAssistantIntegrationTest) skipped
02:45:01 excludedConnectionFromSourceToTarget(org.eclipse.papyrus.infra.gmfdiag.assistant.tests.GenericModelingAssistantIntegrationTest) skipped
02:45:01 targetForConnectionFromSource(org.eclipse.papyrus.infra.gmfdiag.assistant.tests.GenericModelingAssistantIntegrationTest) skipped
02:45:01 popupOnDiagramSurface(org.eclipse.papyrus.infra.gmfdiag.assistant.tests.GenericModelingAssistantIntegrationTest) skipped
02:45:01 connectionFromSource(org.eclipse.papyrus.infra.gmfdiag.assistant.tests.GenericModelingAssistantIntegrationTest) skipped
02:45:01 popupOnShape(org.eclipse.papyrus.infra.gmfdiag.assistant.tests.GenericModelingAssistantIntegrationTest) skipped
02:45:01 excludedPopupOnDiagramSurface(org.eclipse.papyrus.infra.gmfdiag.assistant.tests.GenericModelingAssistantIntegrationTest) skipped
02:45:01 connectionFromSourceToTarget(org.eclipse.papyrus.infra.gmfdiag.assistant.tests.GenericModelingAssistantIntegrationTest) skipped
02:45:01 org.eclipse.papyrus.infra.gmfdiag.assistant.tests.GenericModelingAssistantIntegrationTest skipped
02:45:01 sourceForConnectionToTarget(org.eclipse.papyrus.infra.gmfdiag.assistant.tests.DiagramSpecificModelingAssistantIntegrationTest) skipped
02:45:01 connectionToTarget(org.eclipse.papyrus.infra.gmfdiag.assistant.tests.DiagramSpecificModelingAssistantIntegrationTest) skipped
02:45:01 targetForConnectionFromSource(org.eclipse.papyrus.infra.gmfdiag.assistant.tests.DiagramSpecificModelingAssistantIntegrationTest) skipped
02:45:01 popupOnDiagramSurface(org.eclipse.papyrus.infra.gmfdiag.assistant.tests.DiagramSpecificModelingAssistantIntegrationTest) skipped
02:45:01 connectionFromSource(org.eclipse.papyrus.infra.gmfdiag.assistant.tests.DiagramSpecificModelingAssistantIntegrationTest) skipped
02:45:01 popupOnShape(org.eclipse.papyrus.infra.gmfdiag.assistant.tests.DiagramSpecificModelingAssistantIntegrationTest) skipped
02:45:01 connectionFromSourceToTarget(org.eclipse.papyrus.infra.gmfdiag.assistant.tests.DiagramSpecificModelingAssistantIntegrationTest) skipped
02:45:01 org.eclipse.papyrus.infra.gmfdiag.assistant.tests.DiagramSpecificModelingAssistantIntegrationTest skipped
02:45:01 org.eclipse.papyrus.infra.gmfdiag.assistant.tests.AllTests skipped
02:45:01 testGetObjectOfPathmapResource(org.eclipse.papyrus.infra.services.resourceloading.tests.testModel1.Strategy1TestModel1) skipped
02:45:01 testGetObjectOfProfileResource(org.eclipse.papyrus.infra.services.resourceloading.tests.testModel1.Strategy1TestModel1) skipped
02:45:01 testGetDanglingReferenceFromAControlledResource(org.eclipse.papyrus.infra.services.resourceloading.tests.testModel1.Strategy1TestModel1) skipped
02:45:01 testGetObjectOfControlledResource(org.eclipse.papyrus.infra.services.resourceloading.tests.testModel1.Strategy1TestModel1) skipped
02:45:01 testGetDiagramOfControlledResource(org.eclipse.papyrus.infra.services.resourceloading.tests.testModel1.Strategy1TestModel1) skipped
02:45:01 org.eclipse.papyrus.infra.services.resourceloading.tests.testModel1.Strategy1TestModel1 skipped
02:45:01 testGetObjectOfPathmapResource(org.eclipse.papyrus.infra.services.resourceloading.tests.testModel1.Strategy2TestModel1) skipped
02:45:01 testGetObjectOfProfileResource(org.eclipse.papyrus.infra.services.resourceloading.tests.testModel1.Strategy2TestModel1) skipped
02:45:01 testGetDanglingReferenceFromAControlledResource(org.eclipse.papyrus.infra.services.resourceloading.tests.testModel1.Strategy2TestModel1) skipped
02:45:01 testGetObjectOfControlledResource(org.eclipse.papyrus.infra.services.resourceloading.tests.testModel1.Strategy2TestModel1) skipped
02:45:01 testGetDiagramOfControlledResource(org.eclipse.papyrus.infra.services.resourceloading.tests.testModel1.Strategy2TestModel1) skipped
02:45:01 org.eclipse.papyrus.infra.services.resourceloading.tests.testModel1.Strategy2TestModel1 skipped
02:45:01 testGetObjectOfPathmapResource(org.eclipse.papyrus.infra.services.resourceloading.tests.testModel1.Strategy0TestModel1) skipped
02:45:01 testGetObjectOfProfileResource(org.eclipse.papyrus.infra.services.resourceloading.tests.testModel1.Strategy0TestModel1) skipped
02:45:01 testGetDanglingReferenceFromAControlledResource(org.eclipse.papyrus.infra.services.resourceloading.tests.testModel1.Strategy0TestModel1) skipped
02:45:01 testGetObjectOfControlledResource(org.eclipse.papyrus.infra.services.resourceloading.tests.testModel1.Strategy0TestModel1) skipped
02:45:01 testGetDiagramOfControlledResource(org.eclipse.papyrus.infra.services.resourceloading.tests.testModel1.Strategy0TestModel1) skipped
02:45:01 org.eclipse.papyrus.infra.services.resourceloading.tests.testModel1.Strategy0TestModel1 skipped
02:45:01 testGetFigureInControlledRessource(org.eclipse.papyrus.infra.services.resourceloading.tests.testModel2.Strategy0TestModel2WithModel1) skipped
02:45:01 testGetReferenceInControlledRessource(org.eclipse.papyrus.infra.services.resourceloading.tests.testModel2.Strategy0TestModel2WithModel1) skipped
02:45:01 org.eclipse.papyrus.infra.services.resourceloading.tests.testModel2.Strategy0TestModel2WithModel1 skipped
02:45:01 testGetFigureInControlledRessource(org.eclipse.papyrus.infra.services.resourceloading.tests.testModel2.Strategy0TestModel2WithPackage0) skipped
02:45:01 testGetReferenceInControlledRessource(org.eclipse.papyrus.infra.services.resourceloading.tests.testModel2.Strategy0TestModel2WithPackage0) skipped
02:45:01 org.eclipse.papyrus.infra.services.resourceloading.tests.testModel2.Strategy0TestModel2WithPackage0 skipped
02:45:01 testGetFigureInControlledRessource(org.eclipse.papyrus.infra.services.resourceloading.tests.testModel2.Strategy1TestModel2WithModel1) skipped
02:45:01 testGetReferenceInControlledRessource(org.eclipse.papyrus.infra.services.resourceloading.tests.testModel2.Strategy1TestModel2WithModel1) skipped
02:45:01 org.eclipse.papyrus.infra.services.resourceloading.tests.testModel2.Strategy1TestModel2WithModel1 skipped
02:45:01 testGetFigureInControlledRessource(org.eclipse.papyrus.infra.services.resourceloading.tests.testModel2.Strategy1TestModel2WithPackage0) skipped
02:45:01 testGetReferenceInControlledRessource(org.eclipse.papyrus.infra.services.resourceloading.tests.testModel2.Strategy1TestModel2WithPackage0) skipped
02:45:01 org.eclipse.papyrus.infra.services.resourceloading.tests.testModel2.Strategy1TestModel2WithPackage0 skipped
02:45:01 testGetFigureInControlledRessource(org.eclipse.papyrus.infra.services.resourceloading.tests.testModel2.Strategy2TestModel2WithModel1) skipped
02:45:01 testGetReferenceInControlledRessource(org.eclipse.papyrus.infra.services.resourceloading.tests.testModel2.Strategy2TestModel2WithModel1) skipped
02:45:01 org.eclipse.papyrus.infra.services.resourceloading.tests.testModel2.Strategy2TestModel2WithModel1 skipped
02:45:01 testGetFigureInControlledRessource(org.eclipse.papyrus.infra.services.resourceloading.tests.testModel2.Strategy2TestModel2WithPackage0) skipped
02:45:01 testGetReferenceInControlledRessource(org.eclipse.papyrus.infra.services.resourceloading.tests.testModel2.Strategy2TestModel2WithPackage0) skipped
02:45:01 org.eclipse.papyrus.infra.services.resourceloading.tests.testModel2.Strategy2TestModel2WithPackage0 skipped
02:45:01 org.eclipse.papyrus.infra.services.resourceloading.tests.AllTests skipped
02:45:01 testControlSeveralModelsWithProfile(org.eclipse.papyrus.infra.services.controlmode.tests.control.ControlModelWithProfileTest) skipped
02:45:01 testUndoControlSeveralModelsWithProfileInSameResource(org.eclipse.papyrus.infra.services.controlmode.tests.control.ControlModelWithProfileTest) skipped
02:45:01 testUndoControlModelWithProfile(org.eclipse.papyrus.infra.services.controlmode.tests.control.ControlModelWithProfileTest) skipped
02:45:01 testControlSeveralModelsWithProfileInSameResource(org.eclipse.papyrus.infra.services.controlmode.tests.control.ControlModelWithProfileTest) skipped
02:45:01 testControlModelWithProfile(org.eclipse.papyrus.infra.services.controlmode.tests.control.ControlModelWithProfileTest) skipped
02:45:01 testUndoControlSeveralModelsWithProfile(org.eclipse.papyrus.infra.services.controlmode.tests.control.ControlModelWithProfileTest) skipped
02:45:01 org.eclipse.papyrus.infra.services.controlmode.tests.control.ControlModelWithProfileTest skipped
02:45:01 testUncontrolShardSubunit(org.eclipse.papyrus.infra.services.controlmode.tests.uncontrol.UncontrolModelTest) skipped
02:45:01 testUncontrolOneSubmodel(org.eclipse.papyrus.infra.services.controlmode.tests.uncontrol.UncontrolModelTest) skipped
02:45:01 testUncontrolSeveralSubmodelsInSameResource(org.eclipse.papyrus.infra.services.controlmode.tests.uncontrol.UncontrolModelTest) skipped
02:45:01 testDeleteSubmodel(org.eclipse.papyrus.infra.services.controlmode.tests.uncontrol.UncontrolModelTest) skipped
02:45:01 testUncontrolSeveralSubmodels(org.eclipse.papyrus.infra.services.controlmode.tests.uncontrol.UncontrolModelTest) skipped
02:45:01 testUndoUncontrolOneSubmodel(org.eclipse.papyrus.infra.services.controlmode.tests.uncontrol.UncontrolModelTest) skipped
02:45:01 testUndoUncontrolSeveralSubmodelsWithoutSave(org.eclipse.papyrus.infra.services.controlmode.tests.uncontrol.UncontrolModelTest) skipped
02:45:01 testUndoUncontrolSeveralSubmodelsInSameResource(org.eclipse.papyrus.infra.services.controlmode.tests.uncontrol.UncontrolModelTest) skipped
02:45:01 testUncontrolUpdatesReferencesToRootObject_bug480209(org.eclipse.papyrus.infra.services.controlmode.tests.uncontrol.UncontrolModelTest) skipped
02:45:01 testUndoUncontrolSeveralSubmodels(org.eclipse.papyrus.infra.services.controlmode.tests.uncontrol.UncontrolModelTest) skipped
02:45:01 org.eclipse.papyrus.infra.services.controlmode.tests.uncontrol.UncontrolModelTest skipped
02:45:01 testControlModeUseCase1(org.eclipse.papyrus.infra.services.controlmode.tests.control.ControlModelTest) skipped
02:45:01 testControlModeUseCase2(org.eclipse.papyrus.infra.services.controlmode.tests.control.ControlModelTest) skipped
02:45:01 testControlModeUseCase3(org.eclipse.papyrus.infra.services.controlmode.tests.control.ControlModelTest) skipped
02:45:01 testControlSeveralModels(org.eclipse.papyrus.infra.services.controlmode.tests.control.ControlModelTest) skipped
02:45:01 testUndoControlOneSubmodel(org.eclipse.papyrus.infra.services.controlmode.tests.control.ControlModelTest) skipped
02:45:01 testUndoControlSeveralModels(org.eclipse.papyrus.infra.services.controlmode.tests.control.ControlModelTest) skipped
02:45:01 testControlSeveralModelsInSameResource(org.eclipse.papyrus.infra.services.controlmode.tests.control.ControlModelTest) skipped
02:45:01 testUndoControlSeveralModelsInSameResource(org.eclipse.papyrus.infra.services.controlmode.tests.control.ControlModelTest) skipped
02:45:01 testControlOneSubmodel(org.eclipse.papyrus.infra.services.controlmode.tests.control.ControlModelTest) skipped
02:45:01 org.eclipse.papyrus.infra.services.controlmode.tests.control.ControlModelTest skipped
02:45:01 testUncontrolModelWithProfile(org.eclipse.papyrus.infra.services.controlmode.tests.uncontrol.UncontrolModelWithProfileTest) skipped
02:45:01 testUncontrolSeveralModelsWithProfileInSameResource(org.eclipse.papyrus.infra.services.controlmode.tests.uncontrol.UncontrolModelWithProfileTest) skipped
02:45:01 testUndoUncontrolSeveralModelsWithProfile(org.eclipse.papyrus.infra.services.controlmode.tests.uncontrol.UncontrolModelWithProfileTest) skipped
02:45:01 testUndoUncontrolSeveralModelsWithProfileInSameResource(org.eclipse.papyrus.infra.services.controlmode.tests.uncontrol.UncontrolModelWithProfileTest) skipped
02:45:01 testUncontrolSeveralModelsWithProfile(org.eclipse.papyrus.infra.services.controlmode.tests.uncontrol.UncontrolModelWithProfileTest) skipped
02:45:01 testUndoUncontrolModelWithProfile(org.eclipse.papyrus.infra.services.controlmode.tests.uncontrol.UncontrolModelWithProfileTest) skipped
02:45:01 org.eclipse.papyrus.infra.services.controlmode.tests.uncontrol.UncontrolModelWithProfileTest skipped
02:45:01 testControlLegacyModel(org.eclipse.papyrus.infra.services.controlmode.tests.control.ControlLegacyModelTest) skipped
02:45:01 org.eclipse.papyrus.infra.services.controlmode.tests.control.ControlLegacyModelTest skipped
02:45:01 canCreateSubModel(org.eclipse.papyrus.infra.services.controlmode.tests.control.ControlModeManagerTest) skipped
02:45:01 approveUncontrolRequest(org.eclipse.papyrus.infra.services.controlmode.tests.control.ControlModeManagerTest) skipped
02:45:01 approveControlRequest(org.eclipse.papyrus.infra.services.controlmode.tests.control.ControlModeManagerTest) skipped
02:45:01 disapproveUncontrolRequest(org.eclipse.papyrus.infra.services.controlmode.tests.control.ControlModeManagerTest) skipped
02:45:01 disapproveControlRequest(org.eclipse.papyrus.infra.services.controlmode.tests.control.ControlModeManagerTest) skipped
02:45:01 org.eclipse.papyrus.infra.services.controlmode.tests.control.ControlModeManagerTest skipped
02:45:01 convertSubmodelToShard(org.eclipse.papyrus.infra.services.controlmode.tests.control.ShardModeTest) skipped
02:45:01 convertShardToSubmodel(org.eclipse.papyrus.infra.services.controlmode.tests.control.ShardModeTest) skipped
02:45:01 org.eclipse.papyrus.infra.services.controlmode.tests.control.ShardModeTest skipped
02:45:01 org.eclipse.papyrus.infra.services.controlmode.tests.AllTests skipped
02:45:01 testIsCanonicalWithNote(org.eclipse.papyrus.infra.gmfdiag.menu.utils.DeleteActionUtilTest) skipped
02:45:01 testDeleteNotOrphanElement(org.eclipse.papyrus.infra.gmfdiag.menu.utils.DeleteActionUtilTest) skipped
02:45:01 testIsCanonicalViewWithNotOrphan(org.eclipse.papyrus.infra.gmfdiag.menu.utils.DeleteActionUtilTest) skipped
02:45:01 testIsSupportViewWithOrphan(org.eclipse.papyrus.infra.gmfdiag.menu.utils.DeleteActionUtilTest) skipped
02:45:01 testIsCanonicalWithConnection(org.eclipse.papyrus.infra.gmfdiag.menu.utils.DeleteActionUtilTest) skipped
02:45:01 testIsCanonicalViewWithOrphan(org.eclipse.papyrus.infra.gmfdiag.menu.utils.DeleteActionUtilTest) skipped
02:45:01 testDeleteTextNode(org.eclipse.papyrus.infra.gmfdiag.menu.utils.DeleteActionUtilTest) skipped
02:45:01 testDeleteOrphan(org.eclipse.papyrus.infra.gmfdiag.menu.utils.DeleteActionUtilTest) skipped
02:45:01 testIsCanonicalWithNotOrphan(org.eclipse.papyrus.infra.gmfdiag.menu.utils.DeleteActionUtilTest) skipped
02:45:01 testIsSupportViewWithNote(org.eclipse.papyrus.infra.gmfdiag.menu.utils.DeleteActionUtilTest) skipped
02:45:01 testIsSupportViews(org.eclipse.papyrus.infra.gmfdiag.menu.utils.DeleteActionUtilTest) skipped
02:45:01 testIsCanonicalWithOrphan(org.eclipse.papyrus.infra.gmfdiag.menu.utils.DeleteActionUtilTest) skipped
02:45:01 testIsCanonical(org.eclipse.papyrus.infra.gmfdiag.menu.utils.DeleteActionUtilTest) skipped
02:45:01 testIsCanonicalViewWithNote(org.eclipse.papyrus.infra.gmfdiag.menu.utils.DeleteActionUtilTest) skipped
02:45:01 testIsSupportViewWithNotOrphan(org.eclipse.papyrus.infra.gmfdiag.menu.utils.DeleteActionUtilTest) skipped
02:45:01 org.eclipse.papyrus.infra.gmfdiag.menu.utils.DeleteActionUtilTest skipped
02:45:01 org.eclipse.papyrus.infra.gmfdiag.menu.tests.tests.AllTests skipped
02:45:01 testCSSClassContentProvider(org.eclipse.papyrus.infra.gmfdiag.css.tests.tests.CSSClassProviderTest) skipped
02:45:01 testPackage(org.eclipse.papyrus.infra.gmfdiag.css.tests.tests.CSSStylesheetTest) skipped
02:45:01 testClassStyle(org.eclipse.papyrus.infra.gmfdiag.css.tests.tests.CSSStylesheetTest) skipped
02:45:01 testCSSClassStyle(org.eclipse.papyrus.infra.gmfdiag.css.tests.tests.CSSStylesheetTest) skipped
02:45:01 testPriorities(org.eclipse.papyrus.infra.gmfdiag.css.tests.tests.CSSStylesheetTest) skipped
02:45:01 testInterfaceStyle(org.eclipse.papyrus.infra.gmfdiag.css.tests.tests.CSSStylesheetTest) skipped
02:45:01 testStyleSheetsPriorities(org.eclipse.papyrus.infra.gmfdiag.css.tests.tests.CSSModelStylesheetTest) skipped
02:45:01 testPackage(org.eclipse.papyrus.infra.gmfdiag.css.tests.tests.CSSModelStylesheetTest) skipped
02:45:01 testClassStyle(org.eclipse.papyrus.infra.gmfdiag.css.tests.tests.CSSModelStylesheetTest) skipped
02:45:01 testCSSClassStyle(org.eclipse.papyrus.infra.gmfdiag.css.tests.tests.CSSModelStylesheetTest) skipped
02:45:01 testPriorities(org.eclipse.papyrus.infra.gmfdiag.css.tests.tests.CSSModelStylesheetTest) skipped
02:45:01 testInterfaceStyle(org.eclipse.papyrus.infra.gmfdiag.css.tests.tests.CSSModelStylesheetTest) skipped
02:45:01 testStylesDisabled(org.eclipse.papyrus.infra.gmfdiag.css.tests.tests.CSSNamedStyleTest) skipped
02:45:01 testShowAllCompartmentsTitles(org.eclipse.papyrus.infra.gmfdiag.css.tests.tests.CSSCompartmentsTests) skipped
02:45:01 testCaseInsensitiveForEnumeration(org.eclipse.papyrus.infra.gmfdiag.css.tests.tests.CSSCompartmentsTests)  Time elapsed: 0.04 s  <<< FAILURE!
02:45:01 java.lang.AssertionError: EnumerationLiteral Compartment should not be collapsed
02:45:01 	at org.eclipse.papyrus.infra.gmfdiag.css.tests.tests.CSSCompartmentsTests.testCaseInsensitiveForEnumeration(CSSCompartmentsTests.java:138)
02:45:01 
02:45:01 testAttributeCompartment(org.eclipse.papyrus.infra.gmfdiag.css.tests.tests.CSSCompartmentsTests) skipped
02:45:01 testCompartmentForceValue(org.eclipse.papyrus.infra.gmfdiag.css.tests.tests.CSSCompartmentsTests) skipped
02:45:01 testAttributeCompartmentForInterface(org.eclipse.papyrus.infra.gmfdiag.css.tests.tests.CSSCompartmentsTests) skipped
02:45:01 testWithoutCSSSupport(org.eclipse.papyrus.infra.gmfdiag.css.tests.tests.CSSSupportTest) skipped
02:45:01 testCSSSupport(org.eclipse.papyrus.infra.gmfdiag.css.tests.tests.CSSSupportTest) skipped
02:45:01 testProjectStylesheets(org.eclipse.papyrus.infra.gmfdiag.css.tests.tests.CSSProjectStylesheetsTest) skipped
02:45:01 testPackage(org.eclipse.papyrus.infra.gmfdiag.css.tests.tests.CSSProjectStylesheetsTest) skipped
02:45:01 testClassStyle(org.eclipse.papyrus.infra.gmfdiag.css.tests.tests.CSSProjectStylesheetsTest) skipped
02:45:01 testCSSClassStyle(org.eclipse.papyrus.infra.gmfdiag.css.tests.tests.CSSProjectStylesheetsTest) skipped
02:45:01 testPriorities(org.eclipse.papyrus.infra.gmfdiag.css.tests.tests.CSSProjectStylesheetsTest) skipped
02:45:01 testInterfaceStyle(org.eclipse.papyrus.infra.gmfdiag.css.tests.tests.CSSProjectStylesheetsTest) skipped
02:45:01 testWorkspaceTheme(org.eclipse.papyrus.infra.gmfdiag.css.tests.tests.CSSWorkspaceThemeTest) skipped
02:45:01 testPackage(org.eclipse.papyrus.infra.gmfdiag.css.tests.tests.CSSWorkspaceThemeTest) skipped
02:45:01 testClassStyle(org.eclipse.papyrus.infra.gmfdiag.css.tests.tests.CSSWorkspaceThemeTest) skipped
02:45:01 testCSSClassStyle(org.eclipse.papyrus.infra.gmfdiag.css.tests.tests.CSSWorkspaceThemeTest) skipped
02:45:01 testPriorities(org.eclipse.papyrus.infra.gmfdiag.css.tests.tests.CSSWorkspaceThemeTest) skipped
02:45:01 testInterfaceStyle(org.eclipse.papyrus.infra.gmfdiag.css.tests.tests.CSSWorkspaceThemeTest) skipped
02:45:01 canonicalStyleNotInferred(org.eclipse.papyrus.infra.gmfdiag.css.tests.tests.InferredNotationStylesTest) skipped
02:45:01 canonicalStyleInferred(org.eclipse.papyrus.infra.gmfdiag.css.tests.tests.InferredNotationStylesTest) skipped
02:45:01 overrideInferredStyle(org.eclipse.papyrus.infra.gmfdiag.css.tests.tests.InferredNotationStylesTest) skipped
02:45:01 testUnnamedReference(org.eclipse.papyrus.infra.gmfdiag.css.tests.tests.CSSNamedElementsTest) skipped
02:45:01 testNamedReference(org.eclipse.papyrus.infra.gmfdiag.css.tests.tests.CSSNamedElementsTest) skipped
02:45:01 testEmptyNameReference(org.eclipse.papyrus.infra.gmfdiag.css.tests.tests.CSSNamedElementsTest) skipped
02:45:01 testUntypedReference(org.eclipse.papyrus.infra.gmfdiag.css.tests.tests.CSSNamedElementsTest) skipped
02:45:01 testKindSelectorForCompartment(org.eclipse.papyrus.infra.gmfdiag.css.tests.tests.CSSKindSelectorTest) skipped
02:45:01 testKindSelectorForLabel(org.eclipse.papyrus.infra.gmfdiag.css.tests.tests.CSSKindSelectorTest) skipped
02:45:01 testLabels(org.eclipse.papyrus.infra.internationalization.tests.tests.InternationalizationLabelProviderTest) skipped
02:45:01 org.eclipse.papyrus.infra.internationalization.tests.tests.InternationalizationLabelProviderTest skipped
02:45:01 testUseInternationalizationModification(org.eclipse.papyrus.infra.internationalization.tests.tests.InternationalizationChangePreferencesTest) skipped
02:45:01 testLanguageModification(org.eclipse.papyrus.infra.internationalization.tests.tests.InternationalizationChangePreferencesTest) skipped
02:45:01 org.eclipse.papyrus.infra.internationalization.tests.tests.InternationalizationChangePreferencesTest skipped
02:45:01 enablementNotification(org.eclipse.papyrus.infra.internationalization.tests.tests.InternationalizationPreferenceChangeEventTest) skipped
02:45:01 localeNotificationByPreferences(org.eclipse.papyrus.infra.internationalization.tests.tests.InternationalizationPreferenceChangeEventTest) skipped
02:45:01 localeNotification(org.eclipse.papyrus.infra.internationalization.tests.tests.InternationalizationPreferenceChangeEventTest) skipped
02:45:01 removePreferenceListener(org.eclipse.papyrus.infra.internationalization.tests.tests.InternationalizationPreferenceChangeEventTest) skipped
02:45:01 enablementNotificationByPreferences(org.eclipse.papyrus.infra.internationalization.tests.tests.InternationalizationPreferenceChangeEventTest) skipped
02:45:01 org.eclipse.papyrus.infra.internationalization.tests.tests.InternationalizationPreferenceChangeEventTest skipped
02:45:01 org.eclipse.papyrus.infra.internationalization.tests.tests.AllTests skipped
02:45:01 getViewCountOn(org.eclipse.papyrus.infra.viewpoints.policy.tests.ViewPrototypeTest) skipped
02:45:01 getOwnedViewCount(org.eclipse.papyrus.infra.viewpoints.policy.tests.ViewPrototypeTest) skipped
02:45:01 org.eclipse.papyrus.infra.viewpoints.policy.tests.ViewPrototypeTest skipped
02:45:01 testIsInViewpoint(org.eclipse.papyrus.infra.viewpoints.policy.tests.PolicyCheckerTest) skipped
02:45:01 org.eclipse.papyrus.infra.viewpoints.policy.tests.PolicyCheckerTest skipped
02:45:01 org.eclipse.papyrus.infra.viewpoints.policy.tests.AllTests skipped
02:45:01 testMergeContextSameName(org.eclipse.papyrus.infra.architecture.tests.merged.MergedArchitectureDomainTest) skipped
02:45:01 testMergeContextDifferentName(org.eclipse.papyrus.infra.architecture.tests.merged.MergedArchitectureDomainTest) skipped
02:45:01 org.eclipse.papyrus.infra.architecture.tests.merged.MergedArchitectureDomainTest skipped
02:45:01 org.eclipse.papyrus.infra.architecture.tests.AllTests skipped
02:45:01 switchViewpoints(org.eclipse.papyrus.infra.ui.architecture.tests.editors.SwitchViewpointsTest) skipped
02:45:01 org.eclipse.papyrus.infra.ui.architecture.tests.editors.SwitchViewpointsTest skipped
02:45:01 revealDiagramsAndTables(org.eclipse.papyrus.infra.ui.architecture.tests.editors.ModelExplorerViewpointFilterTest) skipped
02:45:01 org.eclipse.papyrus.infra.ui.architecture.tests.editors.ModelExplorerViewpointFilterTest skipped
02:45:01 checkIcons(org.eclipse.papyrus.infra.ui.architecture.tests.editors.GrayedIconTest) skipped
02:45:01 org.eclipse.papyrus.infra.ui.architecture.tests.editors.GrayedIconTest skipped
02:45:01 org.eclipse.papyrus.infra.ui.architecture.tests.AllTests skipped
02:45:01 
02:45:01 Results:
02:45:01 
02:45:01 Failures: 
02:45:01   CSSCompartmentsTests.testCaseInsensitiveForEnumeration:138 EnumerationLiteral Compartment should not be collapsed
02:45:01   SaveAndDirtyServiceTest.testDoSave:54 Not yet implemented
02:45:01   SaveAndDirtyServiceTest.testDoSaveAs:62 Not yet implemented
02:45:01   SaveAndDirtyServiceTest.testIsDirty:70 Not yet implemented
02:45:01   SaveAndDirtyServiceTest.testIsSaveAsAllowed:78 Not yet implemented
02:45:01   SaveAndDirtyServiceTest.testIsSaveOnCloseNeeded:86 Not yet implemented
02:45:01   SaveAndDirtyServiceTest.testRegisterIsaveablePart:94 Not yet implemented
02:45:01   SaveAndDirtyServiceTest.testRemoveIsaveablePart:102 Not yet implemented
02:45:01 
02:45:01 Tests run: 1093, Failures: 8, Errors: 0, Skipped: 1067
02:45:01 
02:45:03 [ERROR] There are test failures.
02:45:03 
02:45:03 Please refer to /jobs/genie.papyrus/Papyrus-Master-Tests-Failures/workspace/source/tests/junit/plugins/infra/org.eclipse.papyrus.infra.suite.tests/target/surefire-reports for the individual test results.
02:45:03 [INFO] 
02:45:03 [INFO] --- jacoco-maven-plugin:0.8.2:report (default-report) @ org.eclipse.papyrus.infra.suite.tests ---
02:45:03 [INFO] Loading execution data file /jobs/genie.papyrus/Papyrus-Master-Tests-Failures/workspace/source/tests/junit/plugins/infra/org.eclipse.papyrus.infra.suite.tests/target/jacoco.exec
02:45:03 [INFO] Analyzed bundle 'org.eclipse.papyrus.infra.suite.tests' with 0 classes
02:45:03 [INFO] 
02:45:03 [INFO] --< org.eclipse.papyrus.tests:org.eclipse.papyrus.infra.newchild.tests >--
02:45:03 [INFO] Building org.eclipse.papyrus.infra.newchild.tests 1.2.100-SNAPSHOT [142/167]
02:45:03 [INFO] ---------------------------[ eclipse-plugin ]---------------------------
02:45:03 [INFO] 
02:45:03 [INFO] --- maven-clean-plugin:3.1.0:clean (default-clean) @ org.eclipse.papyrus.infra.newchild.tests ---
02:45:03 [INFO] 
02:45:03 [INFO] --- tycho-packaging-plugin:1.3.0:build-qualifier (default-build-qualifier) @ org.eclipse.papyrus.infra.newchild.tests ---
02:45:03 [INFO] The project's OSGi version is 1.2.100.201911170719
02:45:03 [INFO] 
02:45:03 [INFO] --- tycho-packaging-plugin:1.3.0:validate-id (default-validate-id) @ org.eclipse.papyrus.infra.newchild.tests ---
02:45:03 [INFO] 
02:45:03 [INFO] --- tycho-packaging-plugin:1.3.0:validate-version (default-validate-version) @ org.eclipse.papyrus.infra.newchild.tests ---
02:45:03 [INFO] 
02:45:03 [INFO] --- jacoco-maven-plugin:0.8.2:prepare-agent (default-prepare-agent) @ org.eclipse.papyrus.infra.newchild.tests ---
02:45:03 [INFO] argLine set to -javaagent:/home/hudson/genie.papyrus/.jenkins/jobs/Papyrus-Master-Tests-Failures/workspace/.repository/org/jacoco/org.jacoco.agent/0.8.2/org.jacoco.agent-0.8.2-runtime.jar=destfile=/jobs/genie.papyrus/Papyrus-Master-Tests-Failures/workspace/source/tests/junit/plugins/infra/org.eclipse.papyrus.infra.newchild.tests/target/jacoco.exec,includes=org.eclipse.papyrus.*,excludes=org.eclipse.uml2
02:45:03 [INFO] 
02:45:03 [INFO] --- maven-resources-plugin:3.1.0:resources (default-resources) @ org.eclipse.papyrus.infra.newchild.tests ---
02:45:03 [INFO] Using 'UTF-8' encoding to copy filtered resources.
02:45:03 [INFO] skip non existing resourceDirectory /jobs/genie.papyrus/Papyrus-Master-Tests-Failures/workspace/source/tests/junit/plugins/infra/org.eclipse.papyrus.infra.newchild.tests/src/main/resources
02:45:03 [INFO] 
02:45:03 [INFO] --- tycho-compiler-plugin:1.3.0:compile (default-compile) @ org.eclipse.papyrus.infra.newchild.tests ---
02:45:03 [INFO] Compiling 3 source files to /jobs/genie.papyrus/Papyrus-Master-Tests-Failures/workspace/source/tests/junit/plugins/infra/org.eclipse.papyrus.infra.newchild.tests/bin
02:45:04 [INFO] 
02:45:04 [INFO] --- maven-resources-plugin:3.1.0:testResources (default-testResources) @ org.eclipse.papyrus.infra.newchild.tests ---
02:45:04 [INFO] Using 'UTF-8' encoding to copy filtered resources.
02:45:04 [INFO] skip non existing resourceDirectory /jobs/genie.papyrus/Papyrus-Master-Tests-Failures/workspace/source/tests/junit/plugins/infra/org.eclipse.papyrus.infra.newchild.tests/src/test/resources
02:45:04 [INFO] 
02:45:04 [INFO] --- target-platform-configuration:1.3.0:target-platform (default-target-platform) @ org.eclipse.papyrus.infra.newchild.tests ---
02:45:04 [INFO] 
02:45:04 [INFO] --- tycho-packaging-plugin:1.3.0:package-plugin (default-package-plugin) @ org.eclipse.papyrus.infra.newchild.tests ---
02:45:04 [INFO] Building jar: /jobs/genie.papyrus/Papyrus-Master-Tests-Failures/workspace/source/tests/junit/plugins/infra/org.eclipse.papyrus.infra.newchild.tests/target/org.eclipse.papyrus.infra.newchild.tests-1.2.100-SNAPSHOT.jar
02:45:04 [INFO] 
02:45:04 [INFO] --- tycho-p2-plugin:1.3.0:p2-metadata-default (default-p2-metadata-default) @ org.eclipse.papyrus.infra.newchild.tests ---
02:45:04 [INFO] 
02:45:04 [INFO] --- jacoco-maven-plugin:0.8.2:report (default-report) @ org.eclipse.papyrus.infra.newchild.tests ---
02:45:04 [INFO] Skipping JaCoCo execution due to missing execution data file.
02:45:04 [INFO] 
02:45:04 [INFO] --< org.eclipse.papyrus.tests:org.eclipse.papyrus.uml.diagram.communication.tests >--
02:45:04 [INFO] Building org.eclipse.papyrus.uml.diagram.communication.tests 1.2.100-SNAPSHOT [143/167]
02:45:04 [INFO] ------------------------[ eclipse-test-plugin ]-------------------------
02:45:04 [INFO] 
02:45:04 [INFO] --- maven-clean-plugin:3.1.0:clean (default-clean) @ org.eclipse.papyrus.uml.diagram.communication.tests ---
02:45:04 [INFO] 
02:45:04 [INFO] --- tycho-packaging-plugin:1.3.0:build-qualifier (default-build-qualifier) @ org.eclipse.papyrus.uml.diagram.communication.tests ---
02:45:04 [INFO] The project's OSGi version is 1.2.100.201911170719
02:45:04 [INFO] 
02:45:04 [INFO] --- tycho-packaging-plugin:1.3.0:validate-id (default-validate-id) @ org.eclipse.papyrus.uml.diagram.communication.tests ---
02:45:04 [INFO] 
02:45:04 [INFO] --- tycho-packaging-plugin:1.3.0:validate-version (default-validate-version) @ org.eclipse.papyrus.uml.diagram.communication.tests ---
02:45:04 [INFO] 
02:45:04 [INFO] --- jacoco-maven-plugin:0.8.2:prepare-agent (default-prepare-agent) @ org.eclipse.papyrus.uml.diagram.communication.tests ---
02:45:04 [INFO] tycho.testArgLine set to -javaagent:/home/hudson/genie.papyrus/.jenkins/jobs/Papyrus-Master-Tests-Failures/workspace/.repository/org/jacoco/org.jacoco.agent/0.8.2/org.jacoco.agent-0.8.2-runtime.jar=destfile=/jobs/genie.papyrus/Papyrus-Master-Tests-Failures/workspace/source/tests/junit/plugins/uml/diagram/org.eclipse.papyrus.uml.diagram.communication.tests/target/jacoco.exec,includes=org.eclipse.papyrus.*,excludes=org.eclipse.uml2
02:45:04 [INFO] 
02:45:04 [INFO] --- maven-resources-plugin:3.1.0:resources (default-resources) @ org.eclipse.papyrus.uml.diagram.communication.tests ---
02:45:04 [INFO] Using 'UTF-8' encoding to copy filtered resources.
02:45:04 [INFO] skip non existing resourceDirectory /jobs/genie.papyrus/Papyrus-Master-Tests-Failures/workspace/source/tests/junit/plugins/uml/diagram/org.eclipse.papyrus.uml.diagram.communication.tests/src/main/resources
02:45:04 [INFO] 
02:45:04 [INFO] --- tycho-compiler-plugin:1.3.0:compile (default-compile) @ org.eclipse.papyrus.uml.diagram.communication.tests ---
02:45:04 [WARNING] The effective compiler target level 1.8 is incompatible with the following OSGi execution environments: [JavaSE-1.7 (assumes 1.7)] @ MavenProject: org.eclipse.papyrus.tests:org.eclipse.papyrus.uml.diagram.communication.tests:1.2.100-SNAPSHOT @ /jobs/genie.papyrus/Papyrus-Master-Tests-Failures/workspace/source/tests/junit/plugins/uml/diagram/org.eclipse.papyrus.uml.diagram.communication.tests/pom.xml
02:45:04 [INFO] Compiling 7 source files to /jobs/genie.papyrus/Papyrus-Master-Tests-Failures/workspace/source/tests/junit/plugins/uml/diagram/org.eclipse.papyrus.uml.diagram.communication.tests/bin
02:45:04 [INFO] 
02:45:04 [INFO] --- maven-resources-plugin:3.1.0:testResources (default-testResources) @ org.eclipse.papyrus.uml.diagram.communication.tests ---
02:45:04 [INFO] Using 'UTF-8' encoding to copy filtered resources.
02:45:04 [INFO] skip non existing resourceDirectory /jobs/genie.papyrus/Papyrus-Master-Tests-Failures/workspace/source/tests/junit/plugins/uml/diagram/org.eclipse.papyrus.uml.diagram.communication.tests/src/test/resources
02:45:04 [INFO] 
02:45:04 [INFO] --- target-platform-configuration:1.3.0:target-platform (default-target-platform) @ org.eclipse.papyrus.uml.diagram.communication.tests ---
02:45:04 [INFO] 
02:45:04 [INFO] --- tycho-packaging-plugin:1.3.0:package-plugin (default-package-plugin) @ org.eclipse.papyrus.uml.diagram.communication.tests ---
02:45:04 [INFO] Building jar: /jobs/genie.papyrus/Papyrus-Master-Tests-Failures/workspace/source/tests/junit/plugins/uml/diagram/org.eclipse.papyrus.uml.diagram.communication.tests/target/org.eclipse.papyrus.uml.diagram.communication.tests-1.2.100-SNAPSHOT.jar
02:45:04 [INFO] 
02:45:04 [INFO] --- tycho-p2-plugin:1.3.0:p2-metadata-default (default-p2-metadata-default) @ org.eclipse.papyrus.uml.diagram.communication.tests ---
02:45:04 [INFO] 
02:45:04 [INFO] --- tycho-surefire-plugin:1.3.0:test (default-test) @ org.eclipse.papyrus.uml.diagram.communication.tests ---
02:45:04 [INFO] Skipping tests
02:45:04 [INFO] 
02:45:04 [INFO] --- jacoco-maven-plugin:0.8.2:report (default-report) @ org.eclipse.papyrus.uml.diagram.communication.tests ---
02:45:04 [INFO] Skipping JaCoCo execution due to missing execution data file.
02:45:04 [INFO] 
02:45:04 [INFO] --< org.eclipse.papyrus.tests:org.eclipse.papyrus.uml.diagram.interactionoverview.tests >--
02:45:04 [INFO] Building org.eclipse.papyrus.uml.diagram.interactionoverview.tests 1.2.0-SNAPSHOT [144/167]
02:45:04 [INFO] ------------------------[ eclipse-test-plugin ]-------------------------
02:45:04 [INFO] 
02:45:04 [INFO] --- maven-clean-plugin:3.1.0:clean (default-clean) @ org.eclipse.papyrus.uml.diagram.interactionoverview.tests ---
02:45:04 [INFO] 
02:45:04 [INFO] --- tycho-packaging-plugin:1.3.0:build-qualifier (default-build-qualifier) @ org.eclipse.papyrus.uml.diagram.interactionoverview.tests ---
02:45:04 [INFO] The project's OSGi version is 1.2.0.201911170719
02:45:04 [INFO] 
02:45:04 [INFO] --- tycho-packaging-plugin:1.3.0:validate-id (default-validate-id) @ org.eclipse.papyrus.uml.diagram.interactionoverview.tests ---
02:45:04 [INFO] 
02:45:04 [INFO] --- tycho-packaging-plugin:1.3.0:validate-version (default-validate-version) @ org.eclipse.papyrus.uml.diagram.interactionoverview.tests ---
02:45:04 [INFO] 
02:45:04 [INFO] --- jacoco-maven-plugin:0.8.2:prepare-agent (default-prepare-agent) @ org.eclipse.papyrus.uml.diagram.interactionoverview.tests ---
02:45:04 [INFO] tycho.testArgLine set to -javaagent:/home/hudson/genie.papyrus/.jenkins/jobs/Papyrus-Master-Tests-Failures/workspace/.repository/org/jacoco/org.jacoco.agent/0.8.2/org.jacoco.agent-0.8.2-runtime.jar=destfile=/jobs/genie.papyrus/Papyrus-Master-Tests-Failures/workspace/source/tests/junit/plugins/uml/diagram/org.eclipse.papyrus.uml.diagram.interactionoverview.tests/target/jacoco.exec,includes=org.eclipse.papyrus.*,excludes=org.eclipse.uml2
02:45:04 [INFO] 
02:45:04 [INFO] --- maven-resources-plugin:3.1.0:resources (default-resources) @ org.eclipse.papyrus.uml.diagram.interactionoverview.tests ---
02:45:04 [INFO] Using 'UTF-8' encoding to copy filtered resources.
02:45:04 [INFO] skip non existing resourceDirectory /jobs/genie.papyrus/Papyrus-Master-Tests-Failures/workspace/source/tests/junit/plugins/uml/diagram/org.eclipse.papyrus.uml.diagram.interactionoverview.tests/src/main/resources
02:45:04 [INFO] 
02:45:04 [INFO] --- tycho-compiler-plugin:1.3.0:compile (default-compile) @ org.eclipse.papyrus.uml.diagram.interactionoverview.tests ---
02:45:04 [WARNING] The effective compiler target level 1.8 is incompatible with the following OSGi execution environments: [J2SE-1.5 (assumes 1.5)] @ MavenProject: org.eclipse.papyrus.tests:org.eclipse.papyrus.uml.diagram.interactionoverview.tests:1.2.0-SNAPSHOT @ /jobs/genie.papyrus/Papyrus-Master-Tests-Failures/workspace/source/tests/junit/plugins/uml/diagram/org.eclipse.papyrus.uml.diagram.interactionoverview.tests/pom.xml
02:45:04 [INFO] Compiling 10 source files to /jobs/genie.papyrus/Papyrus-Master-Tests-Failures/workspace/source/tests/junit/plugins/uml/diagram/org.eclipse.papyrus.uml.diagram.interactionoverview.tests/bin
02:45:05 [WARNING] /jobs/genie.papyrus/Papyrus-Master-Tests-Failures/workspace/source/tests/junit/plugins/uml/diagram/org.eclipse.papyrus.uml.diagram.interactionoverview.tests/src/org/eclipse/papyrus/uml/diagram/interactionoverview/tests/canonical/TestInteractionUse.java:[25] 
02:45:05 	import org.eclipse.papyrus.uml.diagram.timing.custom.utils.EditPartUtils;
02:45:05 	       ^^^^^^^^^^^^^^^^^^^^^^^^^^^^^^^^^^^^^^^^^^^^^^^^^^^^^^^^^^^^^^^^^
02:45:05 Discouraged access: The type 'EditPartUtils' is not API (restriction on classpath entry '/home/hudson/genie.papyrus/.jenkins/jobs/Papyrus-Master-Tests-Failures/workspace/.repository/p2/osgi/bundle/org.eclipse.papyrus.uml.diagram.timing/1.4.200.201911170357/org.eclipse.papyrus.uml.diagram.timing-1.4.200.201911170357.jar')
02:45:05 [WARNING] /jobs/genie.papyrus/Papyrus-Master-Tests-Failures/workspace/source/tests/junit/plugins/uml/diagram/org.eclipse.papyrus.uml.diagram.interactionoverview.tests/src/org/eclipse/papyrus/uml/diagram/interactionoverview/tests/canonical/TestInteractionUse.java:[79] 
02:45:05 	final CustomInteractionUseNameEditPart callBehaviorNameEditPart = (CustomInteractionUseNameEditPart)EditPartUtils.findFirstChildEditPartWithId(interactionUse, CustomInteractionUseNameEditPart.VISUAL_ID);
02:45:05 	                                                                                                    ^^^^^^^^^^^^^
02:45:05 Discouraged access: The type 'EditPartUtils' is not API (restriction on classpath entry '/home/hudson/genie.papyrus/.jenkins/jobs/Papyrus-Master-Tests-Failures/workspace/.repository/p2/osgi/bundle/org.eclipse.papyrus.uml.diagram.timing/1.4.200.201911170357/org.eclipse.papyrus.uml.diagram.timing-1.4.200.201911170357.jar')
02:45:05 [WARNING] /jobs/genie.papyrus/Papyrus-Master-Tests-Failures/workspace/source/tests/junit/plugins/uml/diagram/org.eclipse.papyrus.uml.diagram.interactionoverview.tests/src/org/eclipse/papyrus/uml/diagram/interactionoverview/tests/canonical/TestInteractionUse.java:[79] 
02:45:05 	final CustomInteractionUseNameEditPart callBehaviorNameEditPart = (CustomInteractionUseNameEditPart)EditPartUtils.findFirstChildEditPartWithId(interactionUse, CustomInteractionUseNameEditPart.VISUAL_ID);
02:45:05 	                                                                                                    ^^^^^^^^^^^^^^^^^^^^^^^^^^^^^^^^^^^^^^^^^^^^^^^^^^^^^^^^^^^^^^^^^^^^^^^^^^^^^^^^^^^^^^^^^^^^^^^^^^^^^^
02:45:05 Discouraged access: The method 'EditPartUtils.findFirstChildEditPartWithId(EditPart, String)' is not API (restriction on classpath entry '/home/hudson/genie.papyrus/.jenkins/jobs/Papyrus-Master-Tests-Failures/workspace/.repository/p2/osgi/bundle/org.eclipse.papyrus.uml.diagram.timing/1.4.200.201911170357/org.eclipse.papyrus.uml.diagram.timing-1.4.200.201911170357.jar')
02:45:05 [WARNING] /jobs/genie.papyrus/Papyrus-Master-Tests-Failures/workspace/source/tests/junit/plugins/uml/diagram/org.eclipse.papyrus.uml.diagram.interactionoverview.tests/src/org/eclipse/papyrus/uml/diagram/interactionoverview/tests/canonical/TestInteractionOverviewDiagramActivityTN.java:[31] 
02:45:05 	import org.eclipse.papyrus.uml.diagram.timing.custom.utils.EditPartUtils;
02:45:05 	       ^^^^^^^^^^^^^^^^^^^^^^^^^^^^^^^^^^^^^^^^^^^^^^^^^^^^^^^^^^^^^^^^^
02:45:05 Discouraged access: The type 'EditPartUtils' is not API (restriction on classpath entry '/home/hudson/genie.papyrus/.jenkins/jobs/Papyrus-Master-Tests-Failures/workspace/.repository/p2/osgi/bundle/org.eclipse.papyrus.uml.diagram.timing/1.4.200.201911170357/org.eclipse.papyrus.uml.diagram.timing-1.4.200.201911170357.jar')
02:45:05 [WARNING] /jobs/genie.papyrus/Papyrus-Master-Tests-Failures/workspace/source/tests/junit/plugins/uml/diagram/org.eclipse.papyrus.uml.diagram.interactionoverview.tests/src/org/eclipse/papyrus/uml/diagram/interactionoverview/tests/canonical/TestInteractionOverviewDiagramActivityTN.java:[101] 
02:45:05 	final ActivityNameEditPart activityNameEditPart = (ActivityNameEditPart) EditPartUtils.findFirstChildEditPartWithId(activityEditPart, ActivityNameEditPart.VISUAL_ID);
02:45:05 	                                                                         ^^^^^^^^^^^^^
02:45:05 Discouraged access: The type 'EditPartUtils' is not API (restriction on classpath entry '/home/hudson/genie.papyrus/.jenkins/jobs/Papyrus-Master-Tests-Failures/workspace/.repository/p2/osgi/bundle/org.eclipse.papyrus.uml.diagram.timing/1.4.200.201911170357/org.eclipse.papyrus.uml.diagram.timing-1.4.200.201911170357.jar')
02:45:05 [WARNING] /jobs/genie.papyrus/Papyrus-Master-Tests-Failures/workspace/source/tests/junit/plugins/uml/diagram/org.eclipse.papyrus.uml.diagram.interactionoverview.tests/src/org/eclipse/papyrus/uml/diagram/interactionoverview/tests/canonical/TestInteractionOverviewDiagramActivityTN.java:[101] 
02:45:05 	final ActivityNameEditPart activityNameEditPart = (ActivityNameEditPart) EditPartUtils.findFirstChildEditPartWithId(activityEditPart, ActivityNameEditPart.VISUAL_ID);
02:45:05 	                                                                         ^^^^^^^^^^^^^^^^^^^^^^^^^^^^^^^^^^^^^^^^^^^^^^^^^^^^^^^^^^^^^^^^^^^^^^^^^^^^^^^^^^^^^^^^^^^^
02:45:05 Discouraged access: The method 'EditPartUtils.findFirstChildEditPartWithId(EditPart, String)' is not API (restriction on classpath entry '/home/hudson/genie.papyrus/.jenkins/jobs/Papyrus-Master-Tests-Failures/workspace/.repository/p2/osgi/bundle/org.eclipse.papyrus.uml.diagram.timing/1.4.200.201911170357/org.eclipse.papyrus.uml.diagram.timing-1.4.200.201911170357.jar')
02:45:05 6 problems (6 warnings)
02:45:05 [INFO] 
02:45:05 [INFO] --- maven-resources-plugin:3.1.0:testResources (default-testResources) @ org.eclipse.papyrus.uml.diagram.interactionoverview.tests ---
02:45:05 [INFO] Using 'UTF-8' encoding to copy filtered resources.
02:45:05 [INFO] skip non existing resourceDirectory /jobs/genie.papyrus/Papyrus-Master-Tests-Failures/workspace/source/tests/junit/plugins/uml/diagram/org.eclipse.papyrus.uml.diagram.interactionoverview.tests/src/test/resources
02:45:05 [INFO] 
02:45:05 [INFO] --- target-platform-configuration:1.3.0:target-platform (default-target-platform) @ org.eclipse.papyrus.uml.diagram.interactionoverview.tests ---
02:45:05 [INFO] 
02:45:05 [INFO] --- tycho-packaging-plugin:1.3.0:package-plugin (default-package-plugin) @ org.eclipse.papyrus.uml.diagram.interactionoverview.tests ---
02:45:05 [INFO] Building jar: /jobs/genie.papyrus/Papyrus-Master-Tests-Failures/workspace/source/tests/junit/plugins/uml/diagram/org.eclipse.papyrus.uml.diagram.interactionoverview.tests/target/org.eclipse.papyrus.uml.diagram.interactionoverview.tests-1.2.0-SNAPSHOT.jar
02:45:05 [INFO] 
02:45:05 [INFO] --- tycho-p2-plugin:1.3.0:p2-metadata-default (default-p2-metadata-default) @ org.eclipse.papyrus.uml.diagram.interactionoverview.tests ---
02:45:05 [INFO] 
02:45:05 [INFO] --- tycho-surefire-plugin:1.3.0:test (default-test) @ org.eclipse.papyrus.uml.diagram.interactionoverview.tests ---
02:45:05 [INFO] Skipping tests
02:45:05 [INFO] 
02:45:05 [INFO] --- jacoco-maven-plugin:0.8.2:report (default-report) @ org.eclipse.papyrus.uml.diagram.interactionoverview.tests ---
02:45:05 [INFO] Skipping JaCoCo execution due to missing execution data file.
02:45:05 [INFO] 
02:45:05 [INFO] --< org.eclipse.papyrus.tests:org.eclipse.papyrus.uml.diagram.statemachine.tests >--
02:45:05 [INFO] Building org.eclipse.papyrus.uml.diagram.statemachine.tests 1.2.100-SNAPSHOT [145/167]
02:45:05 [INFO] ------------------------[ eclipse-test-plugin ]-------------------------
02:45:05 [INFO] 
02:45:05 [INFO] --- maven-clean-plugin:3.1.0:clean (default-clean) @ org.eclipse.papyrus.uml.diagram.statemachine.tests ---
02:45:05 [INFO] 
02:45:05 [INFO] --- tycho-packaging-plugin:1.3.0:build-qualifier (default-build-qualifier) @ org.eclipse.papyrus.uml.diagram.statemachine.tests ---
02:45:05 [INFO] The project's OSGi version is 1.2.100.201911170719
02:45:05 [INFO] 
02:45:05 [INFO] --- tycho-packaging-plugin:1.3.0:validate-id (default-validate-id) @ org.eclipse.papyrus.uml.diagram.statemachine.tests ---
02:45:05 [INFO] 
02:45:05 [INFO] --- tycho-packaging-plugin:1.3.0:validate-version (default-validate-version) @ org.eclipse.papyrus.uml.diagram.statemachine.tests ---
02:45:05 [INFO] 
02:45:05 [INFO] --- jacoco-maven-plugin:0.8.2:prepare-agent (default-prepare-agent) @ org.eclipse.papyrus.uml.diagram.statemachine.tests ---
02:45:05 [INFO] tycho.testArgLine set to -javaagent:/home/hudson/genie.papyrus/.jenkins/jobs/Papyrus-Master-Tests-Failures/workspace/.repository/org/jacoco/org.jacoco.agent/0.8.2/org.jacoco.agent-0.8.2-runtime.jar=destfile=/jobs/genie.papyrus/Papyrus-Master-Tests-Failures/workspace/source/tests/junit/plugins/uml/diagram/org.eclipse.papyrus.uml.diagram.statemachine.tests/target/jacoco.exec,includes=org.eclipse.papyrus.*,excludes=org.eclipse.uml2
02:45:05 [INFO] 
02:45:05 [INFO] --- maven-resources-plugin:3.1.0:resources (default-resources) @ org.eclipse.papyrus.uml.diagram.statemachine.tests ---
02:45:05 [INFO] Using 'UTF-8' encoding to copy filtered resources.
02:45:05 [INFO] skip non existing resourceDirectory /jobs/genie.papyrus/Papyrus-Master-Tests-Failures/workspace/source/tests/junit/plugins/uml/diagram/org.eclipse.papyrus.uml.diagram.statemachine.tests/src/main/resources
02:45:05 [INFO] 
02:45:05 [INFO] --- tycho-compiler-plugin:1.3.0:compile (default-compile) @ org.eclipse.papyrus.uml.diagram.statemachine.tests ---
02:45:05 [WARNING] The effective compiler target level 1.8 is incompatible with the following OSGi execution environments: [JavaSE-1.7 (assumes 1.7)] @ MavenProject: org.eclipse.papyrus.tests:org.eclipse.papyrus.uml.diagram.statemachine.tests:1.2.100-SNAPSHOT @ /jobs/genie.papyrus/Papyrus-Master-Tests-Failures/workspace/source/tests/junit/plugins/uml/diagram/org.eclipse.papyrus.uml.diagram.statemachine.tests/pom.xml
02:45:05 [INFO] Compiling 17 source files to /jobs/genie.papyrus/Papyrus-Master-Tests-Failures/workspace/source/tests/junit/plugins/uml/diagram/org.eclipse.papyrus.uml.diagram.statemachine.tests/bin
02:45:05 [INFO] 
02:45:05 [INFO] --- maven-resources-plugin:3.1.0:testResources (default-testResources) @ org.eclipse.papyrus.uml.diagram.statemachine.tests ---
02:45:05 [INFO] Using 'UTF-8' encoding to copy filtered resources.
02:45:05 [INFO] skip non existing resourceDirectory /jobs/genie.papyrus/Papyrus-Master-Tests-Failures/workspace/source/tests/junit/plugins/uml/diagram/org.eclipse.papyrus.uml.diagram.statemachine.tests/src/test/resources
02:45:05 [INFO] 
02:45:05 [INFO] --- target-platform-configuration:1.3.0:target-platform (default-target-platform) @ org.eclipse.papyrus.uml.diagram.statemachine.tests ---
02:45:05 [INFO] 
02:45:05 [INFO] --- tycho-packaging-plugin:1.3.0:package-plugin (default-package-plugin) @ org.eclipse.papyrus.uml.diagram.statemachine.tests ---
02:45:05 [INFO] Building jar: /jobs/genie.papyrus/Papyrus-Master-Tests-Failures/workspace/source/tests/junit/plugins/uml/diagram/org.eclipse.papyrus.uml.diagram.statemachine.tests/target/org.eclipse.papyrus.uml.diagram.statemachine.tests-1.2.100-SNAPSHOT.jar
02:45:05 [INFO] 
02:45:05 [INFO] --- tycho-p2-plugin:1.3.0:p2-metadata-default (default-p2-metadata-default) @ org.eclipse.papyrus.uml.diagram.statemachine.tests ---
02:45:05 [INFO] 
02:45:05 [INFO] --- tycho-surefire-plugin:1.3.0:test (default-test) @ org.eclipse.papyrus.uml.diagram.statemachine.tests ---
02:45:05 [INFO] Skipping tests
02:45:05 [INFO] 
02:45:05 [INFO] --- jacoco-maven-plugin:0.8.2:report (default-report) @ org.eclipse.papyrus.uml.diagram.statemachine.tests ---
02:45:05 [INFO] Skipping JaCoCo execution due to missing execution data file.
02:45:05 [INFO] 
02:45:05 [INFO] --< org.eclipse.papyrus.tests:org.eclipse.papyrus.uml.diagram.suite.tests >--
02:45:05 [INFO] Building org.eclipse.papyrus.uml.diagram.suite.tests 0.0.1-SNAPSHOT [146/167]
02:45:05 [INFO] ------------------------[ eclipse-test-plugin ]-------------------------
02:45:06 [INFO] 
02:45:06 [INFO] --- maven-clean-plugin:3.1.0:clean (default-clean) @ org.eclipse.papyrus.uml.diagram.suite.tests ---
02:45:06 [INFO] 
02:45:06 [INFO] --- tycho-packaging-plugin:1.3.0:build-qualifier (default-build-qualifier) @ org.eclipse.papyrus.uml.diagram.suite.tests ---
02:45:06 [INFO] The project's OSGi version is 0.0.1.201911170719
02:45:06 [INFO] 
02:45:06 [INFO] --- tycho-packaging-plugin:1.3.0:validate-id (default-validate-id) @ org.eclipse.papyrus.uml.diagram.suite.tests ---
02:45:06 [INFO] 
02:45:06 [INFO] --- tycho-packaging-plugin:1.3.0:validate-version (default-validate-version) @ org.eclipse.papyrus.uml.diagram.suite.tests ---
02:45:06 [INFO] 
02:45:06 [INFO] --- jacoco-maven-plugin:0.8.2:prepare-agent (default-prepare-agent) @ org.eclipse.papyrus.uml.diagram.suite.tests ---
02:45:06 [INFO] tycho.testArgLine set to -javaagent:/home/hudson/genie.papyrus/.jenkins/jobs/Papyrus-Master-Tests-Failures/workspace/.repository/org/jacoco/org.jacoco.agent/0.8.2/org.jacoco.agent-0.8.2-runtime.jar=destfile=/jobs/genie.papyrus/Papyrus-Master-Tests-Failures/workspace/source/tests/junit/plugins/uml/diagram/org.eclipse.papyrus.uml.diagram.suite.tests/target/jacoco.exec,includes=org.eclipse.papyrus.*,excludes=org.eclipse.uml2
02:45:06 [INFO] 
02:45:06 [INFO] --- maven-resources-plugin:3.1.0:resources (default-resources) @ org.eclipse.papyrus.uml.diagram.suite.tests ---
02:45:06 [INFO] Using 'UTF-8' encoding to copy filtered resources.
02:45:06 [INFO] skip non existing resourceDirectory /jobs/genie.papyrus/Papyrus-Master-Tests-Failures/workspace/source/tests/junit/plugins/uml/diagram/org.eclipse.papyrus.uml.diagram.suite.tests/src/main/resources
02:45:06 [INFO] 
02:45:06 [INFO] --- tycho-compiler-plugin:1.3.0:compile (default-compile) @ org.eclipse.papyrus.uml.diagram.suite.tests ---
02:45:06 [INFO] Compiling 2 source files to /jobs/genie.papyrus/Papyrus-Master-Tests-Failures/workspace/source/tests/junit/plugins/uml/diagram/org.eclipse.papyrus.uml.diagram.suite.tests/bin
02:45:06 [INFO] 
02:45:06 [INFO] --- maven-resources-plugin:3.1.0:testResources (default-testResources) @ org.eclipse.papyrus.uml.diagram.suite.tests ---
02:45:06 [INFO] Using 'UTF-8' encoding to copy filtered resources.
02:45:06 [INFO] skip non existing resourceDirectory /jobs/genie.papyrus/Papyrus-Master-Tests-Failures/workspace/source/tests/junit/plugins/uml/diagram/org.eclipse.papyrus.uml.diagram.suite.tests/src/test/resources
02:45:06 [INFO] 
02:45:06 [INFO] --- target-platform-configuration:1.3.0:target-platform (default-target-platform) @ org.eclipse.papyrus.uml.diagram.suite.tests ---
02:45:06 [INFO] 
02:45:06 [INFO] --- tycho-packaging-plugin:1.3.0:package-plugin (default-package-plugin) @ org.eclipse.papyrus.uml.diagram.suite.tests ---
02:45:06 [INFO] Building jar: /jobs/genie.papyrus/Papyrus-Master-Tests-Failures/workspace/source/tests/junit/plugins/uml/diagram/org.eclipse.papyrus.uml.diagram.suite.tests/target/org.eclipse.papyrus.uml.diagram.suite.tests-0.0.1-SNAPSHOT.jar
02:45:06 [INFO] 
02:45:06 [INFO] --- tycho-p2-plugin:1.3.0:p2-metadata-default (default-p2-metadata-default) @ org.eclipse.papyrus.uml.diagram.suite.tests ---
02:45:06 [INFO] 
02:45:06 [INFO] --- tycho-surefire-plugin:1.3.0:test (default-test) @ org.eclipse.papyrus.uml.diagram.suite.tests ---
02:45:17 [INFO] Expected eclipse log file: /jobs/genie.papyrus/Papyrus-Master-Tests-Failures/workspace/source/tests/junit/plugins/uml/diagram/org.eclipse.papyrus.uml.diagram.suite.tests/target/work/data/.metadata/.log
02:45:17 [INFO] Command line:
02:45:17 	[/opt/public/common/java/oracle/jdk1.8.0_192_x64/jre/bin/java, -Dosgi.noShutdown=false, -Dosgi.os=linux, -Dosgi.ws=gtk, -Dosgi.arch=x86_64, -javaagent:/home/hudson/genie.papyrus/.jenkins/jobs/Papyrus-Master-Tests-Failures/workspace/.repository/org/jacoco/org.jacoco.agent/0.8.2/org.jacoco.agent-0.8.2-runtime.jar=destfile=/jobs/genie.papyrus/Papyrus-Master-Tests-Failures/workspace/source/tests/junit/plugins/uml/diagram/org.eclipse.papyrus.uml.diagram.suite.tests/target/jacoco.exec,includes=org.eclipse.papyrus.*,excludes=org.eclipse.uml2, -Xms512m, -Xmx2048m, -XX:SoftRefLRUPolicyMSPerMB=100, -Dosgi.clean=true, -jar, /jobs/genie.papyrus/Papyrus-Master-Tests-Failures/workspace/.repository/p2/osgi/bundle/org.eclipse.equinox.launcher/1.5.600.v20191014-2022/org.eclipse.equinox.launcher-1.5.600.v20191014-2022.jar, -data, /jobs/genie.papyrus/Papyrus-Master-Tests-Failures/workspace/source/tests/junit/plugins/uml/diagram/org.eclipse.papyrus.uml.diagram.suite.tests/target/work/data, -install, /jobs/genie.papyrus/Papyrus-Master-Tests-Failures/workspace/source/tests/junit/plugins/uml/diagram/org.eclipse.papyrus.uml.diagram.suite.tests/target/work, -configuration, /jobs/genie.papyrus/Papyrus-Master-Tests-Failures/workspace/source/tests/junit/plugins/uml/diagram/org.eclipse.papyrus.uml.diagram.suite.tests/target/work/configuration, -application, org.eclipse.tycho.surefire.osgibooter.uitest, -testproperties, /jobs/genie.papyrus/Papyrus-Master-Tests-Failures/workspace/source/tests/junit/plugins/uml/diagram/org.eclipse.papyrus.uml.diagram.suite.tests/target/surefire.properties, -product, org.eclipse.sdk.ide, -testConfig=FAILING_TESTS_CONFIG]
02:45:17 Picked up JAVA_TOOL_OPTIONS: -Xmx2G -Djava.io.tmpdir=/tmp/genie.papyrus -DforkCount=1
02:45:26 Running org.eclipse.papyrus.uml.diagram.suite.tests.AllTests
02:45:34 No JFaces support for org.eclipse.jface.viewers.TableTreeViewer
03:19:41 Build timed out (after 60 minutes). Marking the build as aborted.
03:19:42 [INFO] ------------------------------------------------------------------------
03:19:42 [INFO] Reactor Summary:
03:19:42 [INFO] 
03:19:42 [INFO] org.eclipse.papyrus.tests.releng 0.0.1-SNAPSHOT .... SUCCESS [ 30.088 s]
03:19:42 [INFO] org.eclipse.papyrus.plugins.tests.releng 0.0.1-SNAPSHOT SUCCESS [  0.005 s]
03:19:42 [INFO] org.eclipse.papyrus.editor.tests.releng 0.0.1-SNAPSHOT SUCCESS [  0.005 s]
03:19:42 [INFO] org.eclipse.papyrus.editor.integration.tests 1.4.0-SNAPSHOT SUCCESS [  9.420 s]
03:19:42 [INFO] org.eclipse.papyrus.infra.tests.releng 0.0.1-SNAPSHOT SUCCESS [  0.006 s]
03:19:42 [INFO] org.eclipse.papyrus.infra.core.tests.releng 0.0.1-SNAPSHOT SUCCESS [  0.004 s]
03:19:42 [INFO] org.eclipse.papyrus.infra.core.clipboard.tests 1.3.0-SNAPSHOT SUCCESS [  0.645 s]
03:19:42 [INFO] org.eclipse.papyrus.infra.core.sasheditor.tests 1.2.0-SNAPSHOT SUCCESS [  0.788 s]
03:19:42 [INFO] org.eclipse.papyrus.infra.core.sasheditor.di.tests 1.2.0-SNAPSHOT SUCCESS [  0.338 s]
03:19:42 [INFO] org.eclipse.papyrus.infra.core.tests 3.1.0-SNAPSHOT  SUCCESS [  0.896 s]
03:19:42 [INFO] org.eclipse.papyrus.infra.editor.tests.releng 0.0.1-SNAPSHOT SUCCESS [  0.004 s]
03:19:42 [INFO] org.eclipse.papyrus.infra.editor.welcome.tests 1.2.0-SNAPSHOT SUCCESS [  0.598 s]
03:19:42 [INFO] org.eclipse.papyrus.infra.emf.tests.releng 0.0.1-SNAPSHOT SUCCESS [  0.005 s]
03:19:42 [INFO] org.eclipse.papyrus.infra.emf.gmf.tests 1.2.100-SNAPSHOT SUCCESS [  0.369 s]
03:19:42 [INFO] org.eclipse.papyrus.infra.emf.readonly.tests 1.3.0-SNAPSHOT SUCCESS [  0.361 s]
03:19:42 [INFO] org.eclipse.papyrus.infra.emf.tests 1.5.0-SNAPSHOT . SUCCESS [  0.638 s]
03:19:42 [INFO] org.eclipse.papyrus.infra.filters.tests 1.2.0-SNAPSHOT SUCCESS [  0.105 s]
03:19:42 [INFO] org.eclipse.papyrus.infra.gmfdiag.tests.releng 0.0.1-SNAPSHOT SUCCESS [  0.004 s]
03:19:42 [INFO] org.eclipse.papyrus.infra.gmfdiag.assistant.tests.releng 0.0.1-SNAPSHOT SUCCESS [  0.004 s]
03:19:42 [INFO] org.eclipse.papyrus.infra.gmfdiag.assistant.tests 1.3.0-SNAPSHOT SUCCESS [  0.559 s]
03:19:42 [INFO] org.eclipse.papyrus.infra.gmfdiag.canonical.tests 1.3.0-SNAPSHOT SUCCESS [  0.695 s]
03:19:42 [INFO] org.eclipse.papyrus.infra.gmfdiag.commands.tests 1.3.0-SNAPSHOT SUCCESS [  0.658 s]
03:19:42 [INFO] org.eclipse.papyrus.infra.gmfdiag.common.tests 3.1.0-SNAPSHOT SUCCESS [  0.699 s]
03:19:42 [INFO] org.eclipse.papyrus.infra.gmfdiag.css.tests 1.2.0-SNAPSHOT SUCCESS [  0.496 s]
03:19:42 [INFO] org.eclipse.papyrus.infra.gmfdiag.menu.tests 1.2.100-SNAPSHOT SUCCESS [  0.464 s]
03:19:42 [INFO] org.eclipse.papyrus.infra.gmfdiag.paletteconfiguration.tests 1.3.0-SNAPSHOT SUCCESS [  0.348 s]
03:19:42 [INFO] org.eclipse.papyrus.infra.gmfdiag.welcome.tests 1.2.0-SNAPSHOT SUCCESS [  0.402 s]
03:19:42 [INFO] org.eclipse.papyrus.infra.nattable.main.test 1.2.0-SNAPSHOT SUCCESS [  0.004 s]
03:19:42 [INFO] org.eclipse.papyrus.infra.nattable.common.tests 1.2.200-SNAPSHOT SUCCESS [  0.518 s]
03:19:42 [INFO] org.eclipse.papyrus.infra.nattable.model.tests 1.2.100-SNAPSHOT SUCCESS [  0.499 s]
03:19:42 [INFO] org.eclipse.papyrus.infra.nattable.tests 1.2.200-SNAPSHOT SUCCESS [  0.537 s]
03:19:42 [INFO] org.eclipse.papyrus.infra.nattable.views.tests 1.2.100-SNAPSHOT SUCCESS [  0.504 s]
03:19:42 [INFO] org.eclipse.papyrus.infra.properties.tests.releng 0.0.1-SNAPSHOT SUCCESS [  0.004 s]
03:19:42 [INFO] org.eclipse.papyrus.infra.properties.ui.tests 2.0.0-SNAPSHOT SUCCESS [  0.456 s]
03:19:42 [INFO] org.eclipse.papyrus.infra.services.tests.releng 0.0.1-SNAPSHOT SUCCESS [  0.004 s]
03:19:42 [INFO] org.eclipse.papyrus.infra.services.controlmode.tests 1.5.0-SNAPSHOT SUCCESS [  0.544 s]
03:19:42 [INFO] org.eclipse.papyrus.infra.services.edit.tests 1.2.0-SNAPSHOT SUCCESS [  0.321 s]
03:19:42 [INFO] org.eclipse.papyrus.infra.services.edit.ui.tests 1.2.0-SNAPSHOT SUCCESS [  0.249 s]
03:19:42 [INFO] org.eclipse.papyrus.infra.services.resourceloading.tests 1.2.0-SNAPSHOT SUCCESS [  0.340 s]
03:19:42 [INFO] org.eclipse.papyrus.infra.services.semantic.tests 1.2.100-SNAPSHOT SUCCESS [  0.375 s]
03:19:42 [INFO] org.eclipse.papyrus.infra.tools.tests 1.3.0-SNAPSHOT SUCCESS [  0.866 s]
03:19:42 [INFO] org.eclipse.papyrus.infra.types.tests.releng 0.0.1-SNAPSHOT SUCCESS [  0.005 s]
03:19:42 [INFO] org.eclipse.papyrus.infra.types.tests 3.0.100-SNAPSHOT SUCCESS [  0.523 s]
03:19:42 [INFO] org.eclipse.papyrus.infra.types.ui.tests 3.0.100-SNAPSHOT SUCCESS [  0.472 s]
03:19:42 [INFO] org.eclipse.papyrus.infra.ui.emf.tests 1.3.0-SNAPSHOT SUCCESS [  0.646 s]
03:19:42 [INFO] org.eclipse.papyrus.infra.ui.tests 1.2.0-SNAPSHOT .. SUCCESS [  0.505 s]
03:19:42 [INFO] org.eclipse.papyrus.infra.viewpoints.tests.releng 1.2.0-SNAPSHOT SUCCESS [  0.003 s]
03:19:42 [INFO] org.eclipse.papyrus.infra.viewpoints.policy.tests 1.2.0-SNAPSHOT SUCCESS [  0.666 s]
03:19:42 [INFO] org.eclipse.papyrus.uml.tests.releng 0.0.1-SNAPSHOT  SUCCESS [  0.007 s]
03:19:42 [INFO] org.eclipse.papyrus.uml.diagram.tests.releng 1.2.0-SNAPSHOT SUCCESS [  0.004 s]
03:19:42 [INFO] org.eclipse.papyrus.uml.diagram.tests 1.3.100-SNAPSHOT SUCCESS [  0.817 s]
03:19:42 [INFO] org.eclipse.papyrus.uml.diagram.clazz.tests 1.3.100-SNAPSHOT SUCCESS [  0.681 s]
03:19:42 [INFO] org.eclipse.papyrus.uml.diagram.activity.tests 1.2.100-SNAPSHOT SUCCESS [  0.685 s]
03:19:42 [INFO] org.eclipse.papyrus.uml.diagram.usecase.tests 4.0.100-SNAPSHOT SUCCESS [  0.512 s]
03:19:42 [INFO] org.eclipse.papyrus.uml.diagram.deployment.tests 1.2.100-SNAPSHOT SUCCESS [  0.546 s]
03:19:42 [INFO] org.eclipse.papyrus.uml.diagram.component.tests 1.2.100-SNAPSHOT SUCCESS [  0.500 s]
03:19:42 [INFO] org.eclipse.papyrus.uml.diagram.timing.tests 1.2.100-SNAPSHOT SUCCESS [  0.460 s]
03:19:42 [INFO] org.eclipse.papyrus.uml.diagram.stereotypeproperty.tests 1.2.100-SNAPSHOT SUCCESS [  0.398 s]
03:19:42 [INFO] org.eclipse.papyrus.uml.diagram.sequence.tests 1.3.100-SNAPSHOT SUCCESS [  0.879 s]
03:19:42 [INFO] org.eclipse.papyrus.uml.diagram.composite.tests 1.2.100-SNAPSHOT SUCCESS [  0.542 s]
03:19:42 [INFO] org.eclipse.papyrus.uml.diagram.profile.tests 1.2.100-SNAPSHOT SUCCESS [  0.431 s]
03:19:42 [INFO] org.eclipse.papyrus.uml.dynamic.profile.tests 1.2.0-SNAPSHOT SUCCESS [  0.032 s]
03:19:42 [INFO] org.eclipse.papyrus.uml.diagram.common.tests 1.3.100-SNAPSHOT SUCCESS [  0.670 s]
03:19:42 [INFO] org.eclipse.papyrus.uml.diagram.wizards.tests 1.3.0-SNAPSHOT SUCCESS [  0.449 s]
03:19:42 [INFO] org.eclipse.papyrus.tests.uml.diagram.feature 1.2.0-SNAPSHOT SUCCESS [  0.316 s]
03:19:42 [INFO] org.eclipse.papyrus.tests.infra.services.feature 1.2.0-SNAPSHOT SUCCESS [  0.091 s]
03:19:42 [INFO] org.eclipse.papyrus.views.tests.releng 0.0.1-SNAPSHOT SUCCESS [  0.003 s]
03:19:42 [INFO] org.eclipse.papyrus.views.modelexplorer.tests 1.2.100-SNAPSHOT SUCCESS [  0.341 s]
03:19:42 [INFO] org.eclipse.papyrus.uml.modelexplorer.tests.releng 0.0.1-SNAPSHOT SUCCESS [  0.003 s]
03:19:42 [INFO] org.eclipse.papyrus.uml.modelexplorer.tests 1.3.100-SNAPSHOT SUCCESS [  0.360 s]
03:19:42 [INFO] org.eclipse.papyrus.uml.modelrepair.tests 1.3.0-SNAPSHOT SUCCESS [  0.646 s]
03:19:42 [INFO] org.eclipse.papyrus.uml.properties.tests 1.1.0-SNAPSHOT SUCCESS [  0.551 s]
03:19:42 [INFO] org.eclipse.papyrus.uml.service.types.tests 1.3.0-SNAPSHOT SUCCESS [  0.581 s]
03:19:42 [INFO] org.eclipse.papyrus.uml.service.types.ui.tests 1.2.100-SNAPSHOT SUCCESS [  0.457 s]
03:19:42 [INFO] org.eclipse.papyrus.uml.profile.tests.releng 0.0.1-SNAPSHOT SUCCESS [  0.003 s]
03:19:42 [INFO] org.eclipse.papyrus.uml.profile.drafter.tests 1.3.0-SNAPSHOT SUCCESS [  0.406 s]
03:19:42 [INFO] org.eclipse.papyrus.uml.filters.tests 1.2.0-SNAPSHOT SUCCESS [  0.448 s]
03:19:42 [INFO] org.eclipse.papyrus.uml.profile.tests 1.2.0-SNAPSHOT SUCCESS [  0.359 s]
03:19:42 [INFO] org.eclipse.papyrus.tests.uml.feature 1.2.0-SNAPSHOT SUCCESS [  0.133 s]
03:19:42 [INFO] org.eclipse.papyrus.views.documentation.tests 1.0.0-SNAPSHOT SUCCESS [  0.344 s]
03:19:42 [INFO] org.eclipse.papyrus.tests.views.feature 1.2.0-SNAPSHOT SUCCESS [  0.141 s]
03:19:42 [INFO] org.eclipse.papyrus.tests.infra.nattable.feature 1.4.0-SNAPSHOT SUCCESS [  0.097 s]
03:19:42 [INFO] org.eclipse.papyrus.uml.nattable.main.test 1.2.0-SNAPSHOT SUCCESS [  0.003 s]
03:19:42 [INFO] org.eclipse.papyrus.uml.nattable.tests 1.2.100-SNAPSHOT SUCCESS [  0.302 s]
03:19:42 [INFO] org.eclipse.papyrus.uml.nattable.generic.tests 1.2.200-SNAPSHOT SUCCESS [  0.618 s]
03:19:42 [INFO] org.eclipse.papyrus.uml.nattable.clazz.config.tests 1.2.200-SNAPSHOT SUCCESS [  0.754 s]
03:19:42 [INFO] org.eclipse.papyrus.uml.nattable.stereotyped.elements.tests 1.0.200-SNAPSHOT SUCCESS [  0.562 s]
03:19:42 [INFO] org.eclipse.papyrus.uml.nattable.matrix.tests 1.0.100-SNAPSHOT SUCCESS [  0.467 s]
03:19:42 [INFO] org.eclipse.papyrus.tests.uml.nattable.feature 1.3.0-SNAPSHOT SUCCESS [  0.120 s]
03:19:42 [INFO] org.eclipse.papyrus.tests.infra.feature 1.2.0-SNAPSHOT SUCCESS [  0.221 s]
03:19:42 [INFO] org.eclipse.papyrus.tests.infra.core.feature 1.2.0-SNAPSHOT SUCCESS [  0.057 s]
03:19:42 [INFO] org.eclipse.papyrus.uml.tools.tests.releng 0.0.1-SNAPSHOT SUCCESS [  0.003 s]
03:19:42 [INFO] org.eclipse.papyrus.uml.tools.tests 3.1.0-SNAPSHOT . SUCCESS [  0.521 s]
03:19:42 [INFO] org.eclipse.papyrus.uml.tools.utils.tests 1.3.0-SNAPSHOT SUCCESS [  0.426 s]
03:19:42 [INFO] org.eclipse.papyrus.tests.uml.tools.feature 1.2.0-SNAPSHOT SUCCESS [  0.062 s]
03:19:42 [INFO] org.eclipse.papyrus.uml.decoratormodel.tests.releng 0.0.1-SNAPSHOT SUCCESS [  0.003 s]
03:19:42 [INFO] org.eclipse.papyrus.uml.decoratormodel.controlmode.tests 1.3.0-SNAPSHOT SUCCESS [  0.446 s]
03:19:42 [INFO] org.eclipse.papyrus.uml.decoratormodel.tests 1.3.0-SNAPSHOT SUCCESS [  0.460 s]
03:19:42 [INFO] org.eclipse.papyrus.tests.uml.decoratormodel.feature 1.2.0-SNAPSHOT SUCCESS [  0.058 s]
03:19:42 [INFO] org.eclipse.papyrus.uml.textedit.tests.releng 0.0.1-SNAPSHOT SUCCESS [  0.003 s]
03:19:42 [INFO] org.eclipse.papyrus.uml.textedit.parameter.tests 1.2.100-SNAPSHOT SUCCESS [  0.411 s]
03:19:42 [INFO] org.eclipse.papyrus.uml.textedit.port.tests 1.2.100-SNAPSHOT SUCCESS [  0.569 s]
03:19:42 [INFO] org.eclipse.papyrus.uml.textedit.property.tests 1.2.200-SNAPSHOT SUCCESS [  0.419 s]
03:19:42 [INFO] org.eclipse.papyrus.uml.textedit.tests 1.3.100-SNAPSHOT SUCCESS [  0.780 s]
03:19:42 [INFO] org.eclipse.papyrus.uml.textedit.tests.feature 1.2.0-SNAPSHOT SUCCESS [  0.088 s]
03:19:42 [INFO] org.eclipse.papyrus.uml.assistants.tests.releng 0.0.1-SNAPSHOT SUCCESS [  0.002 s]
03:19:42 [INFO] org.eclipse.papyrus.uml.profile.types.generator.tests 1.2.100-SNAPSHOT SUCCESS [  0.390 s]
03:19:42 [INFO] org.eclipse.papyrus.uml.profile.assistants.generator.tests 1.2.100-SNAPSHOT SUCCESS [  0.410 s]
03:19:42 [INFO] org.eclipse.papyrus.tests.uml.assistants.feature 1.2.0-SNAPSHOT SUCCESS [  0.056 s]
03:19:42 [INFO] org.eclipse.papyrus.toolsmiths.tests.releng 0.0.1-SNAPSHOT SUCCESS [  0.002 s]
03:19:42 [INFO] org.eclipse.papyrus.toolsmiths.profilemigration.tests 0.7.0-SNAPSHOT SUCCESS [  0.407 s]
03:19:42 [INFO] org.eclipse.papyrus.toolsmiths.validation.profile.tests 1.0.0-SNAPSHOT SUCCESS [  0.438 s]
03:19:42 [INFO] org.eclipse.papyrus.toolsmiths.validation.elementtypes.tests 1.0.0-SNAPSHOT SUCCESS [  0.321 s]
03:19:42 [INFO] org.eclipse.papyrus.tests.toolsmiths.feature 1.0.0-SNAPSHOT SUCCESS [  0.063 s]
03:19:42 [INFO] org.eclipse.papyrus.tests.feature 2.0.0-SNAPSHOT ... SUCCESS [  0.794 s]
03:19:42 [INFO] org.eclipse.papyrus.infra.emf.expressions.main.tests 0.0.1-SNAPSHOT SUCCESS [  0.003 s]
03:19:42 [INFO] org.eclipse.papyrus.infra.emf.expressions.tests 1.0.0-SNAPSHOT SUCCESS [  0.103 s]
03:19:42 [INFO] org.eclipse.papyrus.tests.infra.emf.expressions.feature 1.0.0-SNAPSHOT SUCCESS [  0.029 s]
03:19:42 [INFO] org.eclipse.papyrus.infra.internationalization.main.test 1.0.0-SNAPSHOT SUCCESS [  0.004 s]
03:19:42 [INFO] org.eclipse.papyrus.infra.internationalization.tests 1.100.0-SNAPSHOT SUCCESS [  0.446 s]
03:19:42 [INFO] org.eclipse.papyrus.tests.infra.internationalization.feature 1.0.0-SNAPSHOT SUCCESS [  0.054 s]
03:19:42 [INFO] org.eclipse.papyrus.uml.expressions.tests.releng 0.0.1-SNAPSHOT SUCCESS [  0.003 s]
03:19:42 [INFO] org.eclipse.papyrus.uml.expressions.tests 1.1.0-SNAPSHOT SUCCESS [  0.409 s]
03:19:42 [INFO] org.eclipse.papyrus.tests.uml.expressions.feature 1.0.0-SNAPSHOT SUCCESS [  0.058 s]
03:19:42 [INFO] org.eclipse.papyrus.uml.internationalization.main.test 1.0.0-SNAPSHOT SUCCESS [  0.003 s]
03:19:42 [INFO] org.eclipse.papyrus.uml.internationalization.tests 1.100.0-SNAPSHOT SUCCESS [  0.403 s]
03:19:42 [INFO] org.eclipse.papyrus.uml.internationalization.controlmode.tests 1.1.0-SNAPSHOT SUCCESS [  0.349 s]
03:19:42 [INFO] org.eclipse.papyrus.tests.uml.internationalization.feature 1.0.0-SNAPSHOT SUCCESS [  0.049 s]
03:19:42 [INFO] org.eclipse.papyrus.uml.alf.tests 1.2.0-SNAPSHOT ... SUCCESS [01:00 min]
03:19:42 [INFO] org.eclipse.papyrus.uml.alf.tests.feature 1.2.0-SNAPSHOT SUCCESS [  0.148 s]
03:19:42 [INFO] Papyrus Tests Features 0.0.1-SNAPSHOT .............. SUCCESS [  0.003 s]
03:19:42 [INFO] org.eclipse.papyrus.developer.suite.tests 0.0.1-SNAPSHOT SUCCESS [ 23.482 s]
03:19:42 [INFO] org.eclipse.papyrus.bundles.tests 0.0.1-SNAPSHOT ... SUCCESS [  0.005 s]
03:19:42 [INFO] org.eclipse.papyrus.eclipse.project.editors.tests 2.1.0-SNAPSHOT SUCCESS [  0.490 s]
03:19:42 [INFO] org.eclipse.papyrus.editors.suite.tests 0.0.1-SNAPSHOT SUCCESS [ 25.967 s]
03:19:42 [INFO] org.eclipse.papyrus.infra.core.suite.tests 0.0.1-SNAPSHOT SUCCESS [ 33.525 s]
03:19:42 [INFO] org.eclipse.papyrus.infra.nattable.suite.tests 0.0.1-SNAPSHOT SUCCESS [ 24.615 s]
03:19:42 [INFO] org.eclipse.papyrus.infra.architecture.tests 1.0.0-SNAPSHOT SUCCESS [  0.489 s]
03:19:42 [INFO] org.eclipse.papyrus.infra.services.labelprovider.tests 1.2.200-SNAPSHOT SUCCESS [  0.440 s]
03:19:42 [INFO] org.eclipse.papyrus.infra.ui.architecture.tests 1.0.0-SNAPSHOT SUCCESS [  0.552 s]
03:19:42 [INFO] org.eclipse.papyrus.infra.suite.tests 0.0.1-SNAPSHOT SUCCESS [ 38.363 s]
03:19:42 [INFO] org.eclipse.papyrus.infra.newchild.tests 1.2.100-SNAPSHOT SUCCESS [  0.359 s]
03:19:42 [INFO] org.eclipse.papyrus.uml.diagram.communication.tests 1.2.100-SNAPSHOT SUCCESS [  0.479 s]
03:19:42 [INFO] org.eclipse.papyrus.uml.diagram.interactionoverview.tests 1.2.0-SNAPSHOT SUCCESS [  0.395 s]
03:19:42 [INFO] org.eclipse.papyrus.uml.diagram.statemachine.tests 1.2.100-SNAPSHOT SUCCESS [  0.595 s]
03:19:42 [INFO] org.eclipse.papyrus.uml.diagram.suite.tests 0.0.1-SNAPSHOT FAILURE [34:36 min]
03:19:42 [INFO] org.eclipse.papyrus.uml.diagram.dnd.tests 1.2.100-SNAPSHOT SKIPPED
03:19:42 [INFO] org.eclipse.papyrus.uml.diagram.properties.tests 1.0.0-SNAPSHOT SKIPPED
03:19:42 [INFO] org.eclipse.papyrus.uml.nattable.stereotype.display.tests 1.2.100-SNAPSHOT SKIPPED
03:19:42 [INFO] org.eclipse.papyrus.uml.nattable.suite.tests 0.0.1-SNAPSHOT SKIPPED
03:19:42 [INFO] org.eclipse.papyrus.uml.textedit.valuespecification.tests 1.2.100-SNAPSHOT SKIPPED
03:19:42 [INFO] org.eclipse.papyrus.uml.textedit.suite.tests 0.0.1-SNAPSHOT SKIPPED
03:19:42 [INFO] org.eclipse.papyrus.uml.architecture.tests 1.1.200-SNAPSHOT SKIPPED
03:19:42 [INFO] org.eclipse.papyrus.uml.validation.tests.releng 0.0.1-SNAPSHOT SKIPPED
03:19:42 [INFO] org.eclipse.papyrus.uml.validation.tests.staticprofile 1.2.0-SNAPSHOT SKIPPED
03:19:42 [INFO] org.eclipse.papyrus.uml.validation.tests.genvalidation 1.2.0-SNAPSHOT SKIPPED
03:19:42 [INFO] org.eclipse.papyrus.uml.validation.tests 1.2.100-SNAPSHOT SKIPPED
03:19:42 [INFO] org.eclipse.papyrus.uml.suite.tests 0.0.1-SNAPSHOT . SKIPPED
03:19:42 [INFO] org.eclipse.papyrus.uml.alf.tests.releng 0.0.1-SNAPSHOT SKIPPED
03:19:42 [INFO] org.eclipse.papyrus.uml.alf.backend.tests 1.1.0-SNAPSHOT SKIPPED
03:19:42 [INFO] org.eclipse.papyrus.views.properties.toolsmiths.tests 1.2.0-SNAPSHOT SKIPPED
03:19:42 [INFO] org.eclipse.papyrus.views.suite.tests 0.0.1-SNAPSHOT SKIPPED
03:19:42 [INFO] org.eclipse.papyrus.views.documentation.tests.releng 0.0.1-SNAPSHOT SKIPPED
03:19:42 [INFO] org.eclipse.papyrus.toolsmiths.suite.tests 0.0.1-SNAPSHOT SKIPPED
03:19:42 [INFO] org.eclipse.papyrus.tests.main.releng 1.2.0-SNAPSHOT SKIPPED
03:19:42 [INFO] org.eclipse.papyrus.main.tests.target.parent 0.0.1-SNAPSHOT SKIPPED
03:19:42 [INFO] org.eclipse.papyrus.main.tests.portable.target 0.0.1-SNAPSHOT SKIPPED
03:19:42 [INFO] ------------------------------------------------------------------------
03:19:42 [INFO] BUILD FAILURE
03:19:42 [INFO] ------------------------------------------------------------------------
03:19:42 [INFO] Total time:  59:46 min
03:19:42 [INFO] Finished at: 2019-11-17T03:19:42-05:00
03:19:42 [INFO] ------------------------------------------------------------------------
03:19:42 [ERROR] Failed to execute goal org.eclipse.tycho:tycho-surefire-plugin:1.3.0:test (default-test) on project org.eclipse.papyrus.uml.diagram.suite.tests: An unexpected error occured while launching the test runtime (return code 143). See log /jobs/genie.papyrus/Papyrus-Master-Tests-Failures/workspace/source/tests/junit/plugins/uml/diagram/org.eclipse.papyrus.uml.diagram.suite.tests/target/work/data/.metadata/.log for details. -> [Help 1]
03:19:42 [ERROR] 
03:19:42 [ERROR] To see the full stack trace of the errors, re-run Maven with the -e switch.
03:19:42 [ERROR] Re-run Maven using the -X switch to enable full debug logging.
03:19:42 [ERROR] 
03:19:42 [ERROR] For more information about the errors and possible solutions, please read the following articles:
03:19:42 [ERROR] [Help 1] http://cwiki.apache.org/confluence/display/MAVEN/MojoFailureException
03:19:42 [ERROR] 
03:19:42 [ERROR] After correcting the problems, you can resume the build with the command
03:19:42 [ERROR]   mvn <goals> -rf :org.eclipse.papyrus.uml.diagram.suite.tests
03:19:45 Taking screenshot.
03:19:45 [workspace] $ echo $XAUTHORITY
03:19:45 /home/hudson/genie.papyrus/.jenkins/jobs/Papyrus-Master-Tests-Failures/workspace/.Xauthority-1465285409504706422
03:19:45 [workspace] $ ls -l $XAUTHORITY
03:19:46 -rw-rw-r-- 1 genie.papyrus 8303 0 Nov 17 02:19 /home/hudson/genie.papyrus/.jenkins/jobs/Papyrus-Master-Tests-Failures/workspace/.Xauthority-1465285409504706422
03:19:46 [workspace] $ import -window root -display :727 screenshot.jpg
03:19:46 Terminating xvnc.
03:19:54 Build was aborted
03:19:54 No mail will be sent out, as 'Papyrus-Master-Tests-Failures #1124' does not have a result yet. Please make sure you set a proper result in case of pipeline/build scripts.
03:19:54 Recording test results
03:19:55 Started calculate disk usage of build
03:19:55 Finished Calculation of disk usage of build in 0 seconds
03:19:55 Started calculate disk usage of workspace
03:19:56 Finished Calculation of disk usage of workspace in  1 second
03:19:57 [WS-CLEANUP] Deleting project workspace...
03:19:57 [WS-CLEANUP] Deferred wipeout is used...
03:19:57 [WS-CLEANUP] done
03:19:57 Finished: ABORTED