Skip to content
Failed

Console Output

Skipping 1,013 KB.. Full Log
08:30:40 [2024-07-10T12:30:40.986Z] 30: Missing Implementation: Skipping test: VLoadStore/37
08:30:40 [2024-07-10T12:30:40.986Z] 30:     Vector length is not supported by the target platform
08:30:40 [2024-07-10T12:30:40.986Z] 30: Missing Implementation: Skipping test: VLoadStore/38
08:30:40 [2024-07-10T12:30:40.986Z] 30:     Vector length is not supported by the target platform
08:30:40 [2024-07-10T12:30:40.986Z] 30: Missing Implementation: Skipping test: VLoadStore/39
08:30:40 [2024-07-10T12:30:40.986Z] 30:     Opcode vmulVector128Int16 is not supported by the target platform
08:30:40 [2024-07-10T12:30:40.986Z] 30: Missing Implementation: Skipping test: VLoadStore/40
08:30:40 [2024-07-10T12:30:40.986Z] 30:     Vector length is not supported by the target platform
08:30:40 [2024-07-10T12:30:40.986Z] 30: Missing Implementation: Skipping test: VLoadStore/41
08:30:40 [2024-07-10T12:30:40.986Z] 30:     Vector length is not supported by the target platform
08:30:40 [2024-07-10T12:30:40.986Z] 30: Missing Implementation: Skipping test: VLoadStore/42
08:30:40 [2024-07-10T12:30:40.986Z] 30:     Opcode vmulVector128Int32 is not supported by the target platform
08:30:40 [2024-07-10T12:30:40.986Z] 30: Missing Implementation: Skipping test: VLoadStore/43
08:30:40 [2024-07-10T12:30:40.986Z] 30:     Vector length is not supported by the target platform
08:30:40 [2024-07-10T12:30:40.986Z] 30: Missing Implementation: Skipping test: VLoadStore/44
08:30:40 [2024-07-10T12:30:40.986Z] 30:     Vector length is not supported by the target platform
08:30:40 [2024-07-10T12:30:40.986Z] 30: Missing Implementation: Skipping test: VLoadStore/45
08:30:40 [2024-07-10T12:30:40.986Z] 30:     Opcode vmulVector128Int64 is not supported by the target platform
08:30:40 [2024-07-10T12:30:40.986Z] 30: Missing Implementation: Skipping test: VLoadStore/46
08:30:40 [2024-07-10T12:30:40.986Z] 30:     Vector length is not supported by the target platform
08:30:40 [2024-07-10T12:30:40.986Z] 30: Missing Implementation: Skipping test: VLoadStore/47
08:30:40 [2024-07-10T12:30:40.986Z] 30:     Vector length is not supported by the target platform
08:30:40 [2024-07-10T12:30:40.986Z] 30: Missing Implementation: Skipping test: VLoadStore/48
08:30:40 [2024-07-10T12:30:40.986Z] 30:     Opcode vmulVector128Float is not supported by the target platform
08:30:40 [2024-07-10T12:30:40.986Z] 30: Missing Implementation: Skipping test: VLoadStore/49
08:30:40 [2024-07-10T12:30:40.986Z] 30:     Vector length is not supported by the target platform
08:30:40 [2024-07-10T12:30:40.986Z] 30: Missing Implementation: Skipping test: VLoadStore/50
08:30:40 [2024-07-10T12:30:40.986Z] 30:     Vector length is not supported by the target platform
08:30:40 [2024-07-10T12:30:40.986Z] 30: Missing Implementation: Skipping test: VLoadStore/52
08:30:40 [2024-07-10T12:30:40.986Z] 30:     Vector length is not supported by the target platform
08:30:40 [2024-07-10T12:30:40.986Z] 30: Missing Implementation: Skipping test: VLoadStore/53
08:30:40 [2024-07-10T12:30:40.986Z] 30:     Vector length is not supported by the target platform
08:30:40 [2024-07-10T12:30:40.986Z] 30: Missing Implementation: Skipping test: VLoadStore/54
08:30:40 [2024-07-10T12:30:40.986Z] 30:     Opcode vdivVector128Int8 is not supported by the target platform
08:30:40 [2024-07-10T12:30:40.986Z] 30: Missing Implementation: Skipping test: VLoadStore/55
08:30:40 [2024-07-10T12:30:40.986Z] 30:     Vector length is not supported by the target platform
08:30:40 [2024-07-10T12:30:40.986Z] 30: Missing Implementation: Skipping test: VLoadStore/56
08:30:40 [2024-07-10T12:30:40.986Z] 30:     Vector length is not supported by the target platform
08:30:40 [2024-07-10T12:30:40.986Z] 30: Missing Implementation: Skipping test: VLoadStore/57
08:30:40 [2024-07-10T12:30:40.986Z] 30:     Opcode vdivVector128Int16 is not supported by the target platform
08:30:40 [2024-07-10T12:30:40.986Z] 30: Missing Implementation: Skipping test: VLoadStore/58
08:30:40 [2024-07-10T12:30:40.986Z] 30:     Vector length is not supported by the target platform
08:30:40 [2024-07-10T12:30:40.986Z] 30: Missing Implementation: Skipping test: VLoadStore/59
08:30:40 [2024-07-10T12:30:40.986Z] 30:     Vector length is not supported by the target platform
08:30:40 [2024-07-10T12:30:40.986Z] 30: Missing Implementation: Skipping test: VLoadStore/60
08:30:40 [2024-07-10T12:30:40.986Z] 30:     Opcode vdivVector128Int32 is not supported by the target platform
08:30:40 [2024-07-10T12:30:40.986Z] 30: Missing Implementation: Skipping test: VLoadStore/61
08:30:40 [2024-07-10T12:30:40.986Z] 30:     Vector length is not supported by the target platform
08:30:40 [2024-07-10T12:30:40.986Z] 30: Missing Implementation: Skipping test: VLoadStore/62
08:30:40 [2024-07-10T12:30:40.986Z] 30:     Vector length is not supported by the target platform
08:30:40 [2024-07-10T12:30:40.986Z] 30: Missing Implementation: Skipping test: VLoadStore/63
08:30:40 [2024-07-10T12:30:40.986Z] 30:     Opcode vdivVector128Int64 is not supported by the target platform
08:30:40 [2024-07-10T12:30:40.986Z] 30: Missing Implementation: Skipping test: VLoadStore/64
08:30:40 [2024-07-10T12:30:40.986Z] 30:     Vector length is not supported by the target platform
08:30:40 [2024-07-10T12:30:40.986Z] 30: Missing Implementation: Skipping test: VLoadStore/65
08:30:40 [2024-07-10T12:30:40.986Z] 30:     Vector length is not supported by the target platform
08:30:40 [2024-07-10T12:30:40.986Z] 30: Missing Implementation: Skipping test: VLoadStore/66
08:30:40 [2024-07-10T12:30:40.986Z] 30:     Opcode vdivVector128Float is not supported by the target platform
08:30:40 [2024-07-10T12:30:40.986Z] 30: Missing Implementation: Skipping test: VLoadStore/67
08:30:40 [2024-07-10T12:30:40.986Z] 30:     Vector length is not supported by the target platform
08:30:40 [2024-07-10T12:30:40.986Z] 30: Missing Implementation: Skipping test: VLoadStore/68
08:30:40 [2024-07-10T12:30:40.986Z] 30:     Vector length is not supported by the target platform
08:30:40 [2024-07-10T12:30:40.987Z] 30: Missing Implementation: Skipping test: VLoadStore/70
08:30:40 [2024-07-10T12:30:40.987Z] 30:     Vector length is not supported by the target platform
08:30:40 [2024-07-10T12:30:40.987Z] 30: Missing Implementation: Skipping test: VLoadStore/71
08:30:40 [2024-07-10T12:30:40.987Z] 30:     Vector length is not supported by the target platform
08:30:40 [2024-07-10T12:30:40.987Z] 30: Missing Implementation: Skipping test: VLoadStore/72
08:30:40 [2024-07-10T12:30:40.987Z] 30:     Opcode vandVector128Int8 is not supported by the target platform
08:30:40 [2024-07-10T12:30:40.987Z] 30: Missing Implementation: Skipping test: VLoadStore/73
08:30:40 [2024-07-10T12:30:40.987Z] 30:     Vector length is not supported by the target platform
08:30:40 [2024-07-10T12:30:40.987Z] 30: Missing Implementation: Skipping test: VLoadStore/74
08:30:40 [2024-07-10T12:30:40.987Z] 30:     Vector length is not supported by the target platform
08:30:40 [2024-07-10T12:30:40.987Z] 30: Missing Implementation: Skipping test: VLoadStore/75
08:30:40 [2024-07-10T12:30:40.987Z] 30:     Opcode vandVector128Int16 is not supported by the target platform
08:30:40 [2024-07-10T12:30:40.987Z] 30: Missing Implementation: Skipping test: VLoadStore/76
08:30:40 [2024-07-10T12:30:40.987Z] 30:     Vector length is not supported by the target platform
08:30:40 [2024-07-10T12:30:40.987Z] 30: Missing Implementation: Skipping test: VLoadStore/77
08:30:40 [2024-07-10T12:30:40.987Z] 30:     Vector length is not supported by the target platform
08:30:40 [2024-07-10T12:30:40.987Z] 30: Missing Implementation: Skipping test: VLoadStore/78
08:30:40 [2024-07-10T12:30:40.987Z] 30:     Opcode vandVector128Int32 is not supported by the target platform
08:30:40 [2024-07-10T12:30:40.987Z] 30: Missing Implementation: Skipping test: VLoadStore/79
08:30:40 [2024-07-10T12:30:40.987Z] 30:     Vector length is not supported by the target platform
08:30:40 [2024-07-10T12:30:40.987Z] 30: Missing Implementation: Skipping test: VLoadStore/80
08:30:40 [2024-07-10T12:30:40.987Z] 30:     Vector length is not supported by the target platform
08:30:40 [2024-07-10T12:30:40.987Z] 30: Missing Implementation: Skipping test: VLoadStore/82
08:30:40 [2024-07-10T12:30:40.987Z] 30:     Vector length is not supported by the target platform
08:30:40 [2024-07-10T12:30:40.987Z] 30: Missing Implementation: Skipping test: VLoadStore/83
08:30:40 [2024-07-10T12:30:40.987Z] 30:     Vector length is not supported by the target platform
08:30:40 [2024-07-10T12:30:40.987Z] 30: Missing Implementation: Skipping test: VLoadStore/84
08:30:40 [2024-07-10T12:30:40.987Z] 30:     Opcode vorVector128Int8 is not supported by the target platform
08:30:40 [2024-07-10T12:30:40.987Z] 30: Missing Implementation: Skipping test: VLoadStore/85
08:30:40 [2024-07-10T12:30:40.987Z] 30:     Vector length is not supported by the target platform
08:30:40 [2024-07-10T12:30:40.987Z] 30: Missing Implementation: Skipping test: VLoadStore/86
08:30:40 [2024-07-10T12:30:40.987Z] 30:     Vector length is not supported by the target platform
08:30:40 [2024-07-10T12:30:40.987Z] 30: Missing Implementation: Skipping test: VLoadStore/87
08:30:40 [2024-07-10T12:30:40.987Z] 30:     Opcode vorVector128Int16 is not supported by the target platform
08:30:40 [2024-07-10T12:30:40.987Z] 30: Missing Implementation: Skipping test: VLoadStore/88
08:30:40 [2024-07-10T12:30:40.987Z] 30:     Vector length is not supported by the target platform
08:30:40 [2024-07-10T12:30:40.987Z] 30: Missing Implementation: Skipping test: VLoadStore/89
08:30:40 [2024-07-10T12:30:40.987Z] 30:     Vector length is not supported by the target platform
08:30:40 [2024-07-10T12:30:40.987Z] 30: Missing Implementation: Skipping test: VLoadStore/90
08:30:40 [2024-07-10T12:30:40.987Z] 30:     Opcode vorVector128Int32 is not supported by the target platform
08:30:40 [2024-07-10T12:30:40.987Z] 30: Missing Implementation: Skipping test: VLoadStore/91
08:30:40 [2024-07-10T12:30:40.987Z] 30:     Vector length is not supported by the target platform
08:30:40 [2024-07-10T12:30:40.987Z] 30: Missing Implementation: Skipping test: VLoadStore/92
08:30:40 [2024-07-10T12:30:40.987Z] 30:     Vector length is not supported by the target platform
08:30:40 [2024-07-10T12:30:40.987Z] 30: Missing Implementation: Skipping test: VLoadStore/94
08:30:40 [2024-07-10T12:30:40.987Z] 30:     Vector length is not supported by the target platform
08:30:40 [2024-07-10T12:30:40.987Z] 30: Missing Implementation: Skipping test: VLoadStore/95
08:30:40 [2024-07-10T12:30:40.987Z] 30:     Vector length is not supported by the target platform
08:30:40 [2024-07-10T12:30:40.987Z] 30: Missing Implementation: Skipping test: VLoadStore/96
08:30:40 [2024-07-10T12:30:40.987Z] 30:     Opcode vxorVector128Int8 is not supported by the target platform
08:30:40 [2024-07-10T12:30:40.987Z] 30: Missing Implementation: Skipping test: VLoadStore/97
08:30:40 [2024-07-10T12:30:40.987Z] 30:     Vector length is not supported by the target platform
08:30:40 [2024-07-10T12:30:40.987Z] 30: Missing Implementation: Skipping test: VLoadStore/98
08:30:40 [2024-07-10T12:30:40.987Z] 30:     Vector length is not supported by the target platform
08:30:40 [2024-07-10T12:30:40.987Z] 30: Missing Implementation: Skipping test: VLoadStore/99
08:30:40 [2024-07-10T12:30:40.987Z] 30:     Opcode vxorVector128Int16 is not supported by the target platform
08:30:40 [2024-07-10T12:30:40.987Z] 30: Missing Implementation: Skipping test: VLoadStore/100
08:30:40 [2024-07-10T12:30:40.987Z] 30:     Vector length is not supported by the target platform
08:30:40 [2024-07-10T12:30:40.987Z] 30: Missing Implementation: Skipping test: VLoadStore/101
08:30:40 [2024-07-10T12:30:40.987Z] 30:     Vector length is not supported by the target platform
08:30:40 [2024-07-10T12:30:40.987Z] 30: Missing Implementation: Skipping test: VLoadStore/102
08:30:40 [2024-07-10T12:30:40.987Z] 30:     Opcode vxorVector128Int32 is not supported by the target platform
08:30:40 [2024-07-10T12:30:40.987Z] 30: Missing Implementation: Skipping test: VLoadStore/103
08:30:40 [2024-07-10T12:30:40.987Z] 30:     Vector length is not supported by the target platform
08:30:40 [2024-07-10T12:30:40.987Z] 30: Missing Implementation: Skipping test: VLoadStore/104
08:30:40 [2024-07-10T12:30:40.987Z] 30:     Vector length is not supported by the target platform
08:30:40 [2024-07-10T12:30:40.987Z] 30: Missing Implementation: Skipping test: VLoadStore/106
08:30:40 [2024-07-10T12:30:40.987Z] 30:     Vector length is not supported by the target platform
08:30:40 [2024-07-10T12:30:40.987Z] 30: Missing Implementation: Skipping test: VLoadStore/107
08:30:40 [2024-07-10T12:30:40.987Z] 30:     Vector length is not supported by the target platform
08:30:40 [2024-07-10T12:30:40.987Z] 30: Missing Implementation: Skipping test: VLoadStore/108
08:30:40 [2024-07-10T12:30:40.987Z] 30:     Opcode vminVector128Int32 is not supported by the target platform
08:30:40 [2024-07-10T12:30:40.987Z] 30: Missing Implementation: Skipping test: VLoadStore/109
08:30:40 [2024-07-10T12:30:40.987Z] 30:     Vector length is not supported by the target platform
08:30:40 [2024-07-10T12:30:40.987Z] 30: Missing Implementation: Skipping test: VLoadStore/110
08:30:40 [2024-07-10T12:30:40.987Z] 30:     Vector length is not supported by the target platform
08:30:40 [2024-07-10T12:30:40.987Z] 30: Missing Implementation: Skipping test: VLoadStore/111
08:30:40 [2024-07-10T12:30:40.987Z] 30:     Opcode vminVector128Int64 is not supported by the target platform
08:30:40 [2024-07-10T12:30:40.987Z] 30: Missing Implementation: Skipping test: VLoadStore/112
08:30:40 [2024-07-10T12:30:40.987Z] 30:     Vector length is not supported by the target platform
08:30:40 [2024-07-10T12:30:40.987Z] 30: Missing Implementation: Skipping test: VLoadStore/113
08:30:40 [2024-07-10T12:30:40.987Z] 30:     Vector length is not supported by the target platform
08:30:40 [2024-07-10T12:30:40.987Z] 30: Missing Implementation: Skipping test: VLoadStore/114
08:30:40 [2024-07-10T12:30:40.987Z] 30:     Opcode vmaxVector128Int32 is not supported by the target platform
08:30:40 [2024-07-10T12:30:40.987Z] 30: Missing Implementation: Skipping test: VLoadStore/115
08:30:40 [2024-07-10T12:30:40.987Z] 30:     Vector length is not supported by the target platform
08:30:40 [2024-07-10T12:30:40.987Z] 30: Missing Implementation: Skipping test: VLoadStore/116
08:30:40 [2024-07-10T12:30:40.987Z] 30:     Vector length is not supported by the target platform
08:30:40 [2024-07-10T12:30:40.987Z] 30: Missing Implementation: Skipping test: VLoadStore/117
08:30:40 [2024-07-10T12:30:40.987Z] 30:     Opcode vmaxVector128Int64 is not supported by the target platform
08:30:40 [2024-07-10T12:30:40.987Z] 30: Missing Implementation: Skipping test: VLoadStore/118
08:30:40 [2024-07-10T12:30:40.987Z] 30:     Vector length is not supported by the target platform
08:30:40 [2024-07-10T12:30:40.987Z] 30: Missing Implementation: Skipping test: VLoadStore/119
08:30:40 [2024-07-10T12:30:40.987Z] 30:     Vector length is not supported by the target platform
08:30:40 [2024-07-10T12:30:40.987Z] 30: Missing Implementation: Skipping test: VLoadStore/120
08:30:40 [2024-07-10T12:30:40.987Z] 30:     Opcode vabsVector128Int32 is not supported by the target platform
08:30:40 [2024-07-10T12:30:40.987Z] 30: Missing Implementation: Skipping test: VLoadStore/121
08:30:40 [2024-07-10T12:30:40.987Z] 30:     Vector length is not supported by the target platform
08:30:40 [2024-07-10T12:30:40.987Z] 30: Missing Implementation: Skipping test: VLoadStore/122
08:30:40 [2024-07-10T12:30:40.987Z] 30:     Vector length is not supported by the target platform
08:30:40 [2024-07-10T12:30:40.987Z] 30: Missing Implementation: Skipping test: VLoadStore/123
08:30:40 [2024-07-10T12:30:40.987Z] 30:     Opcode vabsVector128Int64 is not supported by the target platform
08:30:40 [2024-07-10T12:30:40.987Z] 30: Missing Implementation: Skipping test: VLoadStore/124
08:30:40 [2024-07-10T12:30:40.987Z] 30:     Vector length is not supported by the target platform
08:30:40 [2024-07-10T12:30:40.987Z] 30: Missing Implementation: Skipping test: VLoadStore/125
08:30:40 [2024-07-10T12:30:40.987Z] 30:     Vector length is not supported by the target platform
08:30:40 [2024-07-10T12:30:40.987Z] 30: Missing Implementation: Skipping test: VLoadStore/126
08:30:40 [2024-07-10T12:30:40.987Z] 30:     Opcode vabsVector128Float is not supported by the target platform
08:30:40 [2024-07-10T12:30:40.987Z] 30: Missing Implementation: Skipping test: VLoadStore/127
08:30:40 [2024-07-10T12:30:40.987Z] 30:     Vector length is not supported by the target platform
08:30:40 [2024-07-10T12:30:40.987Z] 30: Missing Implementation: Skipping test: VLoadStore/128
08:30:40 [2024-07-10T12:30:40.987Z] 30:     Vector length is not supported by the target platform
08:30:40 [2024-07-10T12:30:40.987Z] 30: Missing Implementation: Skipping test: VLoadStore/130
08:30:40 [2024-07-10T12:30:40.987Z] 30:     Vector length is not supported by the target platform
08:30:40 [2024-07-10T12:30:40.987Z] 30: Missing Implementation: Skipping test: VLoadStore/131
08:30:40 [2024-07-10T12:30:40.987Z] 30:     Vector length is not supported by the target platform
08:30:40 [2024-07-10T12:30:40.987Z] 30: Missing Implementation: Skipping test: VLoadStore/132
08:30:40 [2024-07-10T12:30:40.987Z] 30:     Opcode vsqrtVector128Float is not supported by the target platform
08:30:40 [2024-07-10T12:30:40.987Z] 30: Missing Implementation: Skipping test: VLoadStore/133
08:30:40 [2024-07-10T12:30:40.987Z] 30:     Vector length is not supported by the target platform
08:30:40 [2024-07-10T12:30:40.987Z] 30: Missing Implementation: Skipping test: VLoadStore/134
08:30:40 [2024-07-10T12:30:40.987Z] 30:     Vector length is not supported by the target platform
08:30:40 [2024-07-10T12:30:40.987Z] 30: Missing Implementation: Skipping test: VLoadStore/136
08:30:40 [2024-07-10T12:30:40.987Z] 30:     Vector length is not supported by the target platform
08:30:40 [2024-07-10T12:30:40.987Z] 30: Missing Implementation: Skipping test: VLoadStore/137
08:30:40 [2024-07-10T12:30:40.987Z] 30:     Vector length is not supported by the target platform
08:30:40 [2024-07-10T12:30:40.987Z] 30: Missing Implementation: Skipping test: VLoadStore/138
08:30:40 [2024-07-10T12:30:40.987Z] 30:     Opcode vnegVector128Int8 is not supported by the target platform
08:30:40 [2024-07-10T12:30:40.987Z] 30: Missing Implementation: Skipping test: VLoadStore/139
08:30:40 [2024-07-10T12:30:40.987Z] 30:     Vector length is not supported by the target platform
08:30:40 [2024-07-10T12:30:40.987Z] 30: Missing Implementation: Skipping test: VLoadStore/140
08:30:40 [2024-07-10T12:30:40.987Z] 30:     Vector length is not supported by the target platform
08:30:40 [2024-07-10T12:30:40.987Z] 30: Missing Implementation: Skipping test: VLoadStore/141
08:30:40 [2024-07-10T12:30:40.987Z] 30:     Opcode vnegVector128Int16 is not supported by the target platform
08:30:40 [2024-07-10T12:30:40.987Z] 30: Missing Implementation: Skipping test: VLoadStore/142
08:30:40 [2024-07-10T12:30:40.987Z] 30:     Vector length is not supported by the target platform
08:30:40 [2024-07-10T12:30:40.987Z] 30: Missing Implementation: Skipping test: VLoadStore/143
08:30:40 [2024-07-10T12:30:40.987Z] 30:     Vector length is not supported by the target platform
08:30:40 [2024-07-10T12:30:40.987Z] 30: Missing Implementation: Skipping test: VLoadStore/144
08:30:40 [2024-07-10T12:30:40.987Z] 30:     Opcode vnegVector128Int32 is not supported by the target platform
08:30:40 [2024-07-10T12:30:40.987Z] 30: Missing Implementation: Skipping test: VLoadStore/145
08:30:40 [2024-07-10T12:30:40.987Z] 30:     Vector length is not supported by the target platform
08:30:40 [2024-07-10T12:30:40.987Z] 30: Missing Implementation: Skipping test: VLoadStore/146
08:30:40 [2024-07-10T12:30:40.987Z] 30:     Vector length is not supported by the target platform
08:30:40 [2024-07-10T12:30:40.987Z] 30: Missing Implementation: Skipping test: VLoadStore/148
08:30:40 [2024-07-10T12:30:40.987Z] 30:     Vector length is not supported by the target platform
08:30:40 [2024-07-10T12:30:40.987Z] 30: Missing Implementation: Skipping test: VLoadStore/149
08:30:40 [2024-07-10T12:30:40.987Z] 30:     Vector length is not supported by the target platform
08:30:40 [2024-07-10T12:30:40.987Z] 30: Missing Implementation: Skipping test: VLoadStore/150
08:30:40 [2024-07-10T12:30:40.987Z] 30:     Opcode vnegVector128Float is not supported by the target platform
08:30:40 [2024-07-10T12:30:40.987Z] 30: Missing Implementation: Skipping test: VLoadStore/151
08:30:40 [2024-07-10T12:30:40.987Z] 30:     Vector length is not supported by the target platform
08:30:40 [2024-07-10T12:30:40.987Z] 30: Missing Implementation: Skipping test: VLoadStore/152
08:30:40 [2024-07-10T12:30:40.987Z] 30:     Vector length is not supported by the target platform
08:30:40 [2024-07-10T12:30:40.987Z] 30: Missing Implementation: Skipping test: VLoadStore/154
08:30:40 [2024-07-10T12:30:40.987Z] 30:     Vector length is not supported by the target platform
08:30:40 [2024-07-10T12:30:40.987Z] 30: Missing Implementation: Skipping test: VLoadStore/155
08:30:40 [2024-07-10T12:30:40.987Z] 30:     Vector length is not supported by the target platform
08:30:40 [2024-07-10T12:30:40.987Z] 30: [----------] 156 tests from VectorArithmetic/ParameterizedBinaryVectorArithmeticTest (68 ms total)
08:30:40 [2024-07-10T12:30:40.987Z] 30: 
08:30:40 [2024-07-10T12:30:40.987Z] 30: [----------] 36 tests from VectorTypeParameters/ParameterizedVectorTest
08:30:40 [2024-07-10T12:30:40.987Z] 30: Missing Implementation: Skipping test: VLoadStore/0
08:30:40 [2024-07-10T12:30:40.987Z] 30:     Opcode is not supported by the target platform
08:30:40 [2024-07-10T12:30:40.987Z] 30: Missing Implementation: Skipping test: VLoadStore/1
08:30:40 [2024-07-10T12:30:40.987Z] 30:     Opcode is not supported by the target platform
08:30:40 [2024-07-10T12:30:40.987Z] 30: Missing Implementation: Skipping test: VLoadStore/2
08:30:40 [2024-07-10T12:30:40.987Z] 30:     Opcode is not supported by the target platform
08:30:40 [2024-07-10T12:30:40.987Z] 30: Missing Implementation: Skipping test: VLoadStore/4
08:30:40 [2024-07-10T12:30:40.987Z] 30:     Opcode is not supported by the target platform
08:30:40 [2024-07-10T12:30:40.987Z] 30: Missing Implementation: Skipping test: VLoadStore/6
08:30:40 [2024-07-10T12:30:40.987Z] 30:     Vector length is not supported by the target platform
08:30:40 [2024-07-10T12:30:40.987Z] 30: Missing Implementation: Skipping test: VLoadStore/7
08:30:40 [2024-07-10T12:30:40.987Z] 30:     Vector length is not supported by the target platform
08:30:40 [2024-07-10T12:30:40.987Z] 30: Missing Implementation: Skipping test: VLoadStore/8
08:30:40 [2024-07-10T12:30:40.987Z] 30:     Vector length is not supported by the target platform
08:30:40 [2024-07-10T12:30:40.987Z] 30: Missing Implementation: Skipping test: VLoadStore/9
08:30:40 [2024-07-10T12:30:40.987Z] 30:     Vector length is not supported by the target platform
08:30:40 [2024-07-10T12:30:40.987Z] 30: Missing Implementation: Skipping test: VLoadStore/10
08:30:40 [2024-07-10T12:30:40.987Z] 30:     Vector length is not supported by the target platform
08:30:40 [2024-07-10T12:30:40.987Z] 30: Missing Implementation: Skipping test: VLoadStore/11
08:30:40 [2024-07-10T12:30:40.987Z] 30:     Vector length is not supported by the target platform
08:30:40 [2024-07-10T12:30:40.987Z] 30: Missing Implementation: Skipping test: VLoadStore/12
08:30:40 [2024-07-10T12:30:40.987Z] 30:     Vector length is not supported by the target platform
08:30:40 [2024-07-10T12:30:40.987Z] 30: Missing Implementation: Skipping test: VLoadStore/13
08:30:40 [2024-07-10T12:30:40.987Z] 30:     Vector length is not supported by the target platform
08:30:40 [2024-07-10T12:30:40.987Z] 30: Missing Implementation: Skipping test: VLoadStore/14
08:30:40 [2024-07-10T12:30:40.987Z] 30:     Vector length is not supported by the target platform
08:30:40 [2024-07-10T12:30:40.987Z] 30: Missing Implementation: Skipping test: VLoadStore/15
08:30:40 [2024-07-10T12:30:40.987Z] 30:     Vector length is not supported by the target platform
08:30:40 [2024-07-10T12:30:40.987Z] 30: Missing Implementation: Skipping test: VLoadStore/16
08:30:40 [2024-07-10T12:30:40.987Z] 30:     Vector length is not supported by the target platform
08:30:40 [2024-07-10T12:30:40.987Z] 30: Missing Implementation: Skipping test: VLoadStore/17
08:30:40 [2024-07-10T12:30:40.987Z] 30:     Vector length is not supported by the target platform
08:30:40 [2024-07-10T12:30:40.987Z] 30: Missing Implementation: Skipping test: VSplats/0
08:30:40 [2024-07-10T12:30:40.987Z] 30:     Opcode vsplatsVector128Int8 is not supported by the target platform
08:30:40 [2024-07-10T12:30:40.987Z] 30: Missing Implementation: Skipping test: VSplats/1
08:30:40 [2024-07-10T12:30:40.987Z] 30:     Opcode vsplatsVector128Int16 is not supported by the target platform
08:30:40 [2024-07-10T12:30:40.987Z] 30: Missing Implementation: Skipping test: VSplats/2
08:30:40 [2024-07-10T12:30:40.987Z] 30:     Opcode vsplatsVector128Int32 is not supported by the target platform
08:30:40 [2024-07-10T12:30:40.987Z] 30: Missing Implementation: Skipping test: VSplats/4
08:30:40 [2024-07-10T12:30:40.987Z] 30:     Opcode vsplatsVector128Float is not supported by the target platform
08:30:40 [2024-07-10T12:30:40.987Z] 30: Missing Implementation: Skipping test: VSplats/6
08:30:40 [2024-07-10T12:30:40.987Z] 30:     Vector length is not supported by the target platform
08:30:40 [2024-07-10T12:30:40.987Z] 30: Missing Implementation: Skipping test: VSplats/7
08:30:40 [2024-07-10T12:30:40.987Z] 30:     Vector length is not supported by the target platform
08:30:40 [2024-07-10T12:30:40.987Z] 30: Missing Implementation: Skipping test: VSplats/8
08:30:40 [2024-07-10T12:30:40.987Z] 30:     Vector length is not supported by the target platform
08:30:40 [2024-07-10T12:30:40.987Z] 30: Missing Implementation: Skipping test: VSplats/9
08:30:40 [2024-07-10T12:30:40.987Z] 30:     Vector length is not supported by the target platform
08:30:40 [2024-07-10T12:30:40.987Z] 30: Missing Implementation: Skipping test: VSplats/10
08:30:40 [2024-07-10T12:30:40.987Z] 30:     Vector length is not supported by the target platform
08:30:40 [2024-07-10T12:30:40.987Z] 30: Missing Implementation: Skipping test: VSplats/11
08:30:40 [2024-07-10T12:30:40.987Z] 30:     Vector length is not supported by the target platform
08:30:40 [2024-07-10T12:30:40.987Z] 30: Missing Implementation: Skipping test: VSplats/12
08:30:40 [2024-07-10T12:30:40.987Z] 30:     Vector length is not supported by the target platform
08:30:40 [2024-07-10T12:30:40.987Z] 30: Missing Implementation: Skipping test: VSplats/13
08:30:40 [2024-07-10T12:30:40.987Z] 30:     Vector length is not supported by the target platform
08:30:40 [2024-07-10T12:30:40.987Z] 30: Missing Implementation: Skipping test: VSplats/14
08:30:40 [2024-07-10T12:30:40.987Z] 30:     Vector length is not supported by the target platform
08:30:40 [2024-07-10T12:30:40.987Z] 30: Missing Implementation: Skipping test: VSplats/15
08:30:40 [2024-07-10T12:30:40.987Z] 30:     Vector length is not supported by the target platform
08:30:40 [2024-07-10T12:30:40.987Z] 30: Missing Implementation: Skipping test: VSplats/16
08:30:40 [2024-07-10T12:30:40.987Z] 30:     Vector length is not supported by the target platform
08:30:40 [2024-07-10T12:30:40.987Z] 30: Missing Implementation: Skipping test: VSplats/17
08:30:40 [2024-07-10T12:30:40.987Z] 30:     Vector length is not supported by the target platform
08:30:40 [2024-07-10T12:30:40.987Z] 30: [----------] 36 tests from VectorTypeParameters/ParameterizedVectorTest (13 ms total)
08:30:40 [2024-07-10T12:30:40.987Z] 30: 
08:30:40 [2024-07-10T12:30:40.987Z] 30: [----------] 9 tests from Byte128ReductionTest/BinaryDataDriven128Int8Test
08:30:40 [2024-07-10T12:30:40.987Z] 30: Missing Implementation: Skipping test: BinaryVector128Int8Test/0
08:30:40 [2024-07-10T12:30:40.987Z] 30:     Opcode vreductionAddVector128Int8 is not supported by the target platform
08:30:40 [2024-07-10T12:30:40.987Z] 30: Missing Implementation: Skipping test: BinaryVector128Int8Test/1
08:30:40 [2024-07-10T12:30:40.987Z] 30:     Opcode vreductionMulVector128Int8 is not supported by the target platform
08:30:40 [2024-07-10T12:30:40.987Z] 30: Missing Implementation: Skipping test: BinaryVector128Int8Test/2
08:30:40 [2024-07-10T12:30:40.987Z] 30:     Opcode vreductionMulVector128Int8 is not supported by the target platform
08:30:40 [2024-07-10T12:30:40.987Z] 30: Missing Implementation: Skipping test: BinaryVector128Int8Test/3
08:30:40 [2024-07-10T12:30:40.987Z] 30:     Opcode vreductionAndVector128Int8 is not supported by the target platform
08:30:40 [2024-07-10T12:30:40.987Z] 30: Missing Implementation: Skipping test: BinaryVector128Int8Test/4
08:30:40 [2024-07-10T12:30:40.987Z] 30:     Opcode vreductionOrVector128Int8 is not supported by the target platform
08:30:40 [2024-07-10T12:30:40.987Z] 30: Missing Implementation: Skipping test: BinaryVector128Int8Test/5
08:30:40 [2024-07-10T12:30:40.987Z] 30:     Opcode vreductionXorVector128Int8 is not supported by the target platform
08:30:40 [2024-07-10T12:30:40.987Z] 30: Missing Implementation: Skipping test: BinaryVector128Int8Test/6
08:30:40 [2024-07-10T12:30:40.987Z] 30:     Opcode vreductionXorVector128Int8 is not supported by the target platform
08:30:40 [2024-07-10T12:30:40.987Z] 30: Missing Implementation: Skipping test: BinaryVector128Int8Test/7
08:30:40 [2024-07-10T12:30:40.987Z] 30:     Opcode vreductionMinVector128Int8 is not supported by the target platform
08:30:40 [2024-07-10T12:30:40.987Z] 30: Missing Implementation: Skipping test: BinaryVector128Int8Test/8
08:30:40 [2024-07-10T12:30:40.987Z] 30:     Opcode vreductionMaxVector128Int8 is not supported by the target platform
08:30:40 [2024-07-10T12:30:40.987Z] 30: [----------] 9 tests from Byte128ReductionTest/BinaryDataDriven128Int8Test (3 ms total)
08:30:40 [2024-07-10T12:30:40.987Z] 30: 
08:30:40 [2024-07-10T12:30:40.987Z] 30: [----------] 10 tests from Short128ReductionTest/BinaryDataDriven128Int16Test
08:30:40 [2024-07-10T12:30:40.987Z] 30: Missing Implementation: Skipping test: BinaryVector128Int16Test/0
08:30:40 [2024-07-10T12:30:40.987Z] 30:     Opcode vreductionAddVector128Int16 is not supported by the target platform
08:30:40 [2024-07-10T12:30:40.987Z] 30: Missing Implementation: Skipping test: BinaryVector128Int16Test/1
08:30:40 [2024-07-10T12:30:40.987Z] 30:     Opcode vreductionMulVector128Int16 is not supported by the target platform
08:30:40 [2024-07-10T12:30:40.987Z] 30: Missing Implementation: Skipping test: BinaryVector128Int16Test/2
08:30:40 [2024-07-10T12:30:40.987Z] 30:     Opcode vreductionAndVector128Int16 is not supported by the target platform
08:30:40 [2024-07-10T12:30:40.987Z] 30: Missing Implementation: Skipping test: BinaryVector128Int16Test/3
08:30:40 [2024-07-10T12:30:40.987Z] 30:     Opcode vreductionOrVector128Int16 is not supported by the target platform
08:30:40 [2024-07-10T12:30:40.987Z] 30: Missing Implementation: Skipping test: BinaryVector128Int16Test/4
08:30:40 [2024-07-10T12:30:40.987Z] 30:     Opcode vreductionXorVector128Int16 is not supported by the target platform
08:30:40 [2024-07-10T12:30:40.987Z] 30: Missing Implementation: Skipping test: BinaryVector128Int16Test/5
08:30:40 [2024-07-10T12:30:40.987Z] 30:     Opcode vreductionXorVector128Int16 is not supported by the target platform
08:30:40 [2024-07-10T12:30:40.987Z] 30: Missing Implementation: Skipping test: BinaryVector128Int16Test/6
08:30:40 [2024-07-10T12:30:40.987Z] 30:     Opcode vreductionMinVector128Int16 is not supported by the target platform
08:30:40 [2024-07-10T12:30:40.987Z] 30: Missing Implementation: Skipping test: BinaryVector128Int16Test/7
08:30:40 [2024-07-10T12:30:40.987Z] 30:     Opcode vreductionMinVector128Int16 is not supported by the target platform
08:30:40 [2024-07-10T12:30:40.987Z] 30: Missing Implementation: Skipping test: BinaryVector128Int16Test/8
08:30:40 [2024-07-10T12:30:40.987Z] 30:     Opcode vreductionMaxVector128Int16 is not supported by the target platform
08:30:40 [2024-07-10T12:30:40.987Z] 30: Missing Implementation: Skipping test: BinaryVector128Int16Test/9
08:30:40 [2024-07-10T12:30:40.987Z] 30:     Opcode vreductionMaxVector128Int16 is not supported by the target platform
08:30:40 [2024-07-10T12:30:40.987Z] 30: [----------] 10 tests from Short128ReductionTest/BinaryDataDriven128Int16Test (2 ms total)
08:30:40 [2024-07-10T12:30:40.987Z] 30: 
08:30:40 [2024-07-10T12:30:40.987Z] 30: [----------] 3 tests from Short128ShiftRotateTest/BinaryDataDriven128Int16Test
08:30:40 [2024-07-10T12:30:40.987Z] 30: Missing Implementation: Skipping test: BinaryVector128Int16Test/0
08:30:40 [2024-07-10T12:30:40.987Z] 30:     Opcode vshlVector128Int16 is not supported by the target platform
08:30:40 [2024-07-10T12:30:40.987Z] 30: Missing Implementation: Skipping test: BinaryVector128Int16Test/1
08:30:40 [2024-07-10T12:30:40.987Z] 30:     Opcode vshrVector128Int16 is not supported by the target platform
08:30:40 [2024-07-10T12:30:40.987Z] 30: Missing Implementation: Skipping test: BinaryVector128Int16Test/2
08:30:40 [2024-07-10T12:30:40.987Z] 30:     Opcode vrolVector128Int16 is not supported by the target platform
08:30:40 [2024-07-10T12:30:40.987Z] 30: [----------] 3 tests from Short128ShiftRotateTest/BinaryDataDriven128Int16Test (1 ms total)
08:30:40 [2024-07-10T12:30:40.987Z] 30: 
08:30:40 [2024-07-10T12:30:40.987Z] 30: [----------] 10 tests from Int128ReductionTest/BinaryDataDriven128Int32Test
08:30:40 [2024-07-10T12:30:40.987Z] 30: Missing Implementation: Skipping test: BinaryVector128Int32Test/0
08:30:40 [2024-07-10T12:30:40.987Z] 30:     Opcode vreductionAddVector128Int32 is not supported by the target platform
08:30:40 [2024-07-10T12:30:40.987Z] 30: Missing Implementation: Skipping test: BinaryVector128Int32Test/1
08:30:40 [2024-07-10T12:30:40.987Z] 30:     Opcode vreductionMulVector128Int32 is not supported by the target platform
08:30:40 [2024-07-10T12:30:40.987Z] 30: Missing Implementation: Skipping test: BinaryVector128Int32Test/2
08:30:40 [2024-07-10T12:30:40.987Z] 30:     Opcode vreductionAndVector128Int32 is not supported by the target platform
08:30:40 [2024-07-10T12:30:40.987Z] 30: Missing Implementation: Skipping test: BinaryVector128Int32Test/3
08:30:40 [2024-07-10T12:30:40.987Z] 30:     Opcode vreductionOrVector128Int32 is not supported by the target platform
08:30:40 [2024-07-10T12:30:40.987Z] 30: Missing Implementation: Skipping test: BinaryVector128Int32Test/4
08:30:40 [2024-07-10T12:30:40.987Z] 30:     Opcode vreductionXorVector128Int32 is not supported by the target platform
08:30:40 [2024-07-10T12:30:40.987Z] 30: Missing Implementation: Skipping test: BinaryVector128Int32Test/5
08:30:40 [2024-07-10T12:30:40.987Z] 30:     Opcode vreductionXorVector128Int32 is not supported by the target platform
08:30:40 [2024-07-10T12:30:40.987Z] 30: Missing Implementation: Skipping test: BinaryVector128Int32Test/6
08:30:40 [2024-07-10T12:30:40.987Z] 30:     Opcode vreductionMinVector128Int32 is not supported by the target platform
08:30:40 [2024-07-10T12:30:40.987Z] 30: Missing Implementation: Skipping test: BinaryVector128Int32Test/7
08:30:40 [2024-07-10T12:30:40.987Z] 30:     Opcode vreductionMinVector128Int32 is not supported by the target platform
08:30:40 [2024-07-10T12:30:40.987Z] 30: Missing Implementation: Skipping test: BinaryVector128Int32Test/8
08:30:40 [2024-07-10T12:30:40.987Z] 30:     Opcode vreductionMaxVector128Int32 is not supported by the target platform
08:30:40 [2024-07-10T12:30:40.987Z] 30: Missing Implementation: Skipping test: BinaryVector128Int32Test/9
08:30:40 [2024-07-10T12:30:40.987Z] 30:     Opcode vreductionMaxVector128Int32 is not supported by the target platform
08:30:40 [2024-07-10T12:30:40.987Z] 30: [----------] 10 tests from Int128ReductionTest/BinaryDataDriven128Int32Test (3 ms total)
08:30:40 [2024-07-10T12:30:40.987Z] 30: 
08:30:40 [2024-07-10T12:30:40.987Z] 30: [----------] 3 tests from Int128ShiftRotateTest/BinaryDataDriven128Int32Test
08:30:40 [2024-07-10T12:30:40.987Z] 30: Missing Implementation: Skipping test: BinaryVector128Int32Test/0
08:30:40 [2024-07-10T12:30:40.987Z] 30:     Opcode vshlVector128Int32 is not supported by the target platform
08:30:40 [2024-07-10T12:30:40.987Z] 30: Missing Implementation: Skipping test: BinaryVector128Int32Test/1
08:30:40 [2024-07-10T12:30:40.987Z] 30:     Opcode vshrVector128Int32 is not supported by the target platform
08:30:40 [2024-07-10T12:30:40.987Z] 30: Missing Implementation: Skipping test: BinaryVector128Int32Test/2
08:30:40 [2024-07-10T12:30:40.987Z] 30:     Opcode vrolVector128Int32 is not supported by the target platform
08:30:40 [2024-07-10T12:30:40.987Z] 30: [----------] 3 tests from Int128ShiftRotateTest/BinaryDataDriven128Int32Test (1 ms total)
08:30:40 [2024-07-10T12:30:40.987Z] 30: 
08:30:40 [2024-07-10T12:30:40.987Z] 30: [----------] 13 tests from Long128ReductionTest/BinaryDataDriven128Int64Test
08:30:40 [2024-07-10T12:30:40.987Z] 30: Missing Implementation: Skipping test: BinaryVector128Int64Test/2
08:30:40 [2024-07-10T12:30:40.987Z] 30:     Opcode vreductionMulVector128Int64 is not supported by the target platform
08:30:40 [2024-07-10T12:30:40.987Z] 30: Missing Implementation: Skipping test: BinaryVector128Int64Test/3
08:30:40 [2024-07-10T12:30:40.987Z] 30:     Opcode vreductionMulVector128Int64 is not supported by the target platform
08:30:40 [2024-07-10T12:30:40.987Z] 30: Missing Implementation: Skipping test: BinaryVector128Int64Test/4
08:30:40 [2024-07-10T12:30:40.987Z] 30:     Opcode vreductionAndVector128Int64 is not supported by the target platform
08:30:40 [2024-07-10T12:30:40.987Z] 30: Missing Implementation: Skipping test: BinaryVector128Int64Test/5
08:30:40 [2024-07-10T12:30:40.987Z] 30:     Opcode vreductionAndVector128Int64 is not supported by the target platform
08:30:40 [2024-07-10T12:30:40.987Z] 30: Missing Implementation: Skipping test: BinaryVector128Int64Test/6
08:30:40 [2024-07-10T12:30:40.987Z] 30:     Opcode vreductionOrVector128Int64 is not supported by the target platform
08:30:40 [2024-07-10T12:30:40.987Z] 30: Missing Implementation: Skipping test: BinaryVector128Int64Test/7
08:30:40 [2024-07-10T12:30:40.987Z] 30:     Opcode vreductionXorVector128Int64 is not supported by the target platform
08:30:40 [2024-07-10T12:30:40.987Z] 30: Missing Implementation: Skipping test: BinaryVector128Int64Test/8
08:30:40 [2024-07-10T12:30:40.987Z] 30:     Opcode vreductionXorVector128Int64 is not supported by the target platform
08:30:40 [2024-07-10T12:30:40.987Z] 30: Missing Implementation: Skipping test: BinaryVector128Int64Test/9
08:30:40 [2024-07-10T12:30:40.987Z] 30:     Opcode vreductionMinVector128Int64 is not supported by the target platform
08:30:40 [2024-07-10T12:30:40.987Z] 30: Missing Implementation: Skipping test: BinaryVector128Int64Test/10
08:30:40 [2024-07-10T12:30:40.987Z] 30:     Opcode vreductionMinVector128Int64 is not supported by the target platform
08:30:40 [2024-07-10T12:30:40.987Z] 30: Missing Implementation: Skipping test: BinaryVector128Int64Test/11
08:30:40 [2024-07-10T12:30:40.987Z] 30:     Opcode vreductionMaxVector128Int64 is not supported by the target platform
08:30:40 [2024-07-10T12:30:40.987Z] 30: Missing Implementation: Skipping test: BinaryVector128Int64Test/12
08:30:40 [2024-07-10T12:30:40.987Z] 30:     Opcode vreductionMaxVector128Int64 is not supported by the target platform
08:30:40 [2024-07-10T12:30:40.987Z] 30: [----------] 13 tests from Long128ReductionTest/BinaryDataDriven128Int64Test (6 ms total)
08:30:40 [2024-07-10T12:30:40.987Z] 30: 
08:30:40 [2024-07-10T12:30:40.987Z] 30: [----------] 4 tests from Long128ShiftRotateTest/BinaryDataDriven128Int64Test
08:30:40 [2024-07-10T12:30:40.987Z] 30: Missing Implementation: Skipping test: BinaryVector128Int64Test/0
08:30:40 [2024-07-10T12:30:40.987Z] 30:     Opcode vshlVector128Int64 is not supported by the target platform
08:30:40 [2024-07-10T12:30:40.987Z] 30: Missing Implementation: Skipping test: BinaryVector128Int64Test/1
08:30:40 [2024-07-10T12:30:40.987Z] 30:     Opcode vshrVector128Int64 is not supported by the target platform
08:30:40 [2024-07-10T12:30:40.987Z] 30: Missing Implementation: Skipping test: BinaryVector128Int64Test/2
08:30:40 [2024-07-10T12:30:40.987Z] 30:     Opcode vrolVector128Int64 is not supported by the target platform
08:30:40 [2024-07-10T12:30:40.987Z] 30: Missing Implementation: Skipping test: BinaryVector128Int64Test/3
08:30:40 [2024-07-10T12:30:40.987Z] 30:     Opcode vrolVector128Int64 is not supported by the target platform
08:30:40 [2024-07-10T12:30:40.987Z] 30: [----------] 4 tests from Long128ShiftRotateTest/BinaryDataDriven128Int64Test (1 ms total)
08:30:40 [2024-07-10T12:30:40.987Z] 30: 
08:30:40 [2024-07-10T12:30:40.987Z] 30: [----------] 6 tests from BinaryFloatNaNTest/BinaryDataDrivenFloatTest
08:30:40 [2024-07-10T12:30:40.988Z] 30: Missing Implementation: Skipping test: BinaryVector128FloatTest/0
08:30:40 [2024-07-10T12:30:40.988Z] 30:     Opcode vminVector128Float is not supported by the target platform
08:30:40 [2024-07-10T12:30:40.988Z] 30: Missing Implementation: Skipping test: BinaryVector128FloatTest/1
08:30:40 [2024-07-10T12:30:40.988Z] 30:     Opcode vmaxVector128Float is not supported by the target platform
08:30:40 [2024-07-10T12:30:40.988Z] 30: Missing Implementation: Skipping test: BinaryVector256FloatTest/0
08:30:40 [2024-07-10T12:30:40.988Z] 30:     Vector length is not supported by the target platform
08:30:40 [2024-07-10T12:30:40.988Z] 30: Missing Implementation: Skipping test: BinaryVector256FloatTest/1
08:30:40 [2024-07-10T12:30:40.988Z] 30:     Vector length is not supported by the target platform
08:30:40 [2024-07-10T12:30:40.988Z] 30: Missing Implementation: Skipping test: BinaryVector512FloatTest/0
08:30:40 [2024-07-10T12:30:40.988Z] 30:     Vector length is not supported by the target platform
08:30:40 [2024-07-10T12:30:40.988Z] 30: Missing Implementation: Skipping test: BinaryVector512FloatTest/1
08:30:40 [2024-07-10T12:30:40.988Z] 30:     Vector length is not supported by the target platform
08:30:40 [2024-07-10T12:30:40.988Z] 30: [----------] 6 tests from BinaryFloatNaNTest/BinaryDataDrivenFloatTest (1 ms total)
08:30:40 [2024-07-10T12:30:40.988Z] 30: 
08:30:40 [2024-07-10T12:30:40.988Z] 30: [----------] 3 tests from FloatAbsTest/BinaryDataDrivenFloatTest
08:30:40 [2024-07-10T12:30:40.988Z] 30: Missing Implementation: Skipping test: BinaryVector128FloatTest/0
08:30:40 [2024-07-10T12:30:40.988Z] 30:     Opcode vabsVector128Float is not supported by the target platform
08:30:40 [2024-07-10T12:30:40.988Z] 30: Missing Implementation: Skipping test: BinaryVector256FloatTest/0
08:30:40 [2024-07-10T12:30:40.988Z] 30:     Vector length is not supported by the target platform
08:30:40 [2024-07-10T12:30:40.988Z] 30: Missing Implementation: Skipping test: BinaryVector512FloatTest/0
08:30:40 [2024-07-10T12:30:40.988Z] 30:     Vector length is not supported by the target platform
08:30:40 [2024-07-10T12:30:40.988Z] 30: [----------] 3 tests from FloatAbsTest/BinaryDataDrivenFloatTest (1 ms total)
08:30:40 [2024-07-10T12:30:40.988Z] 30: 
08:30:40 [2024-07-10T12:30:40.988Z] 30: [----------] 6 tests from BinaryFloatTest/BinaryDataDrivenFloatTest
08:30:40 [2024-07-10T12:30:40.988Z] 30: Missing Implementation: Skipping test: BinaryVector128FloatTest/0
08:30:40 [2024-07-10T12:30:40.988Z] 30:     Opcode vminVector128Float is not supported by the target platform
08:30:40 [2024-07-10T12:30:40.988Z] 30: Missing Implementation: Skipping test: BinaryVector128FloatTest/1
08:30:40 [2024-07-10T12:30:40.988Z] 30:     Opcode vmaxVector128Float is not supported by the target platform
08:30:40 [2024-07-10T12:30:40.988Z] 30: Missing Implementation: Skipping test: BinaryVector256FloatTest/0
08:30:40 [2024-07-10T12:30:40.988Z] 30:     Vector length is not supported by the target platform
08:30:40 [2024-07-10T12:30:40.988Z] 30: Missing Implementation: Skipping test: BinaryVector256FloatTest/1
08:30:40 [2024-07-10T12:30:40.988Z] 30:     Vector length is not supported by the target platform
08:30:40 [2024-07-10T12:30:40.988Z] 30: Missing Implementation: Skipping test: BinaryVector512FloatTest/0
08:30:40 [2024-07-10T12:30:40.988Z] 30:     Vector length is not supported by the target platform
08:30:40 [2024-07-10T12:30:40.988Z] 30: Missing Implementation: Skipping test: BinaryVector512FloatTest/1
08:30:40 [2024-07-10T12:30:40.988Z] 30:     Vector length is not supported by the target platform
08:30:40 [2024-07-10T12:30:40.988Z] 30: [----------] 6 tests from BinaryFloatTest/BinaryDataDrivenFloatTest (2 ms total)
08:30:40 [2024-07-10T12:30:40.988Z] 30: 
08:30:40 [2024-07-10T12:30:40.988Z] 30: [----------] 13 tests from Float128NaNInfReductionTest/BinaryDataDriven128FloatTest
08:30:40 [2024-07-10T12:30:40.988Z] 30: Missing Implementation: Skipping test: BinaryVector128FloatTest/0
08:30:40 [2024-07-10T12:30:40.988Z] 30:     Opcode vreductionAddVector128Float is not supported by the target platform
08:30:40 [2024-07-10T12:30:40.988Z] 30: Missing Implementation: Skipping test: BinaryVector128FloatTest/1
08:30:40 [2024-07-10T12:30:40.988Z] 30:     Opcode vreductionAddVector128Float is not supported by the target platform
08:30:40 [2024-07-10T12:30:40.988Z] 30: Missing Implementation: Skipping test: BinaryVector128FloatTest/2
08:30:40 [2024-07-10T12:30:40.988Z] 30:     Opcode vreductionAddVector128Float is not supported by the target platform
08:30:40 [2024-07-10T12:30:40.988Z] 30: Missing Implementation: Skipping test: BinaryVector128FloatTest/3
08:30:40 [2024-07-10T12:30:40.988Z] 30:     Opcode vreductionAddVector128Float is not supported by the target platform
08:30:40 [2024-07-10T12:30:40.988Z] 30: Missing Implementation: Skipping test: BinaryVector128FloatTest/4
08:30:40 [2024-07-10T12:30:40.988Z] 30:     Opcode vreductionAddVector128Float is not supported by the target platform
08:30:40 [2024-07-10T12:30:40.988Z] 30: Missing Implementation: Skipping test: BinaryVector128FloatTest/5
08:30:40 [2024-07-10T12:30:40.988Z] 30:     Opcode vreductionAddVector128Float is not supported by the target platform
08:30:40 [2024-07-10T12:30:40.988Z] 30: Missing Implementation: Skipping test: BinaryVector128FloatTest/6
08:30:40 [2024-07-10T12:30:40.988Z] 30:     Opcode vreductionAddVector128Float is not supported by the target platform
08:30:40 [2024-07-10T12:30:40.988Z] 30: Missing Implementation: Skipping test: BinaryVector128FloatTest/7
08:30:40 [2024-07-10T12:30:40.988Z] 30:     Opcode vreductionAddVector128Float is not supported by the target platform
08:30:40 [2024-07-10T12:30:40.988Z] 30: Missing Implementation: Skipping test: BinaryVector128FloatTest/8
08:30:40 [2024-07-10T12:30:40.988Z] 30:     Opcode vreductionMinVector128Float is not supported by the target platform
08:30:40 [2024-07-10T12:30:40.988Z] 30: Missing Implementation: Skipping test: BinaryVector128FloatTest/9
08:30:40 [2024-07-10T12:30:40.988Z] 30:     Opcode vreductionMinVector128Float is not supported by the target platform
08:30:40 [2024-07-10T12:30:40.988Z] 30: Missing Implementation: Skipping test: BinaryVector128FloatTest/10
08:30:40 [2024-07-10T12:30:40.988Z] 30:     Opcode vreductionMinVector128Float is not supported by the target platform
08:30:40 [2024-07-10T12:30:40.988Z] 30: Missing Implementation: Skipping test: BinaryVector128FloatTest/11
08:30:40 [2024-07-10T12:30:40.988Z] 30:     Opcode vreductionMinVector128Float is not supported by the target platform
08:30:40 [2024-07-10T12:30:40.988Z] 30: Missing Implementation: Skipping test: BinaryVector128FloatTest/12
08:30:40 [2024-07-10T12:30:40.988Z] 30:     Opcode vreductionMinVector128Float is not supported by the target platform
08:30:40 [2024-07-10T12:30:40.988Z] 30: [----------] 13 tests from Float128NaNInfReductionTest/BinaryDataDriven128FloatTest (3 ms total)
08:30:40 [2024-07-10T12:30:40.988Z] 30: 
08:30:40 [2024-07-10T12:30:40.988Z] 30: [----------] 6 tests from Float128ReductionTest/BinaryDataDriven128FloatTest
08:30:40 [2024-07-10T12:30:40.988Z] 30: Missing Implementation: Skipping test: BinaryVector128FloatTest/0
08:30:40 [2024-07-10T12:30:40.988Z] 30:     Opcode vreductionAddVector128Float is not supported by the target platform
08:30:40 [2024-07-10T12:30:40.988Z] 30: Missing Implementation: Skipping test: BinaryVector128FloatTest/1
08:30:40 [2024-07-10T12:30:40.988Z] 30:     Opcode vreductionMulVector128Float is not supported by the target platform
08:30:40 [2024-07-10T12:30:40.988Z] 30: Missing Implementation: Skipping test: BinaryVector128FloatTest/2
08:30:40 [2024-07-10T12:30:40.988Z] 30:     Opcode vreductionMinVector128Float is not supported by the target platform
08:30:40 [2024-07-10T12:30:40.988Z] 30: Missing Implementation: Skipping test: BinaryVector128FloatTest/3
08:30:40 [2024-07-10T12:30:40.988Z] 30:     Opcode vreductionMinVector128Float is not supported by the target platform
08:30:40 [2024-07-10T12:30:40.988Z] 30: Missing Implementation: Skipping test: BinaryVector128FloatTest/4
08:30:40 [2024-07-10T12:30:40.988Z] 30:     Opcode vreductionMaxVector128Float is not supported by the target platform
08:30:40 [2024-07-10T12:30:40.988Z] 30: Missing Implementation: Skipping test: BinaryVector128FloatTest/5
08:30:40 [2024-07-10T12:30:40.988Z] 30:     Opcode vreductionMaxVector128Float is not supported by the target platform
08:30:40 [2024-07-10T12:30:40.988Z] 30: [----------] 6 tests from Float128ReductionTest/BinaryDataDriven128FloatTest (2 ms total)
08:30:40 [2024-07-10T12:30:40.988Z] 30: 
08:30:40 [2024-07-10T12:30:40.988Z] 30: [----------] 8 tests from Float256NaNReductionTest/BinaryDataDriven256FloatTest
08:30:40 [2024-07-10T12:30:40.988Z] 30: Missing Implementation: Skipping test: BinaryVector256FloatTest/0
08:30:40 [2024-07-10T12:30:40.988Z] 30:     Vector length is not supported by the target platform
08:30:40 [2024-07-10T12:30:40.988Z] 30: Missing Implementation: Skipping test: BinaryVector256FloatTest/1
08:30:40 [2024-07-10T12:30:40.988Z] 30:     Vector length is not supported by the target platform
08:30:40 [2024-07-10T12:30:40.988Z] 30: Missing Implementation: Skipping test: BinaryVector256FloatTest/2
08:30:40 [2024-07-10T12:30:40.988Z] 30:     Vector length is not supported by the target platform
08:30:40 [2024-07-10T12:30:40.988Z] 30: Missing Implementation: Skipping test: BinaryVector256FloatTest/3
08:30:40 [2024-07-10T12:30:40.988Z] 30:     Vector length is not supported by the target platform
08:30:40 [2024-07-10T12:30:40.988Z] 30: Missing Implementation: Skipping test: BinaryVector256FloatTest/4
08:30:40 [2024-07-10T12:30:40.988Z] 30:     Vector length is not supported by the target platform
08:30:40 [2024-07-10T12:30:40.988Z] 30: Missing Implementation: Skipping test: BinaryVector256FloatTest/5
08:30:40 [2024-07-10T12:30:40.988Z] 30:     Vector length is not supported by the target platform
08:30:40 [2024-07-10T12:30:40.988Z] 30: Missing Implementation: Skipping test: BinaryVector256FloatTest/6
08:30:40 [2024-07-10T12:30:40.988Z] 30:     Vector length is not supported by the target platform
08:30:40 [2024-07-10T12:30:40.988Z] 30: Missing Implementation: Skipping test: BinaryVector256FloatTest/7
08:30:40 [2024-07-10T12:30:40.988Z] 30:     Vector length is not supported by the target platform
08:30:40 [2024-07-10T12:30:40.988Z] 30: [----------] 8 tests from Float256NaNReductionTest/BinaryDataDriven256FloatTest (2 ms total)
08:30:40 [2024-07-10T12:30:40.988Z] 30: 
08:30:40 [2024-07-10T12:30:40.988Z] 30: [----------] 1 test from Float256ReductionTest/BinaryDataDriven256FloatTest
08:30:40 [2024-07-10T12:30:40.988Z] 30: Missing Implementation: Skipping test: BinaryVector256FloatTest/0
08:30:40 [2024-07-10T12:30:40.988Z] 30:     Vector length is not supported by the target platform
08:30:40 [2024-07-10T12:30:40.988Z] 30: [----------] 1 test from Float256ReductionTest/BinaryDataDriven256FloatTest (0 ms total)
08:30:40 [2024-07-10T12:30:40.988Z] 30: 
08:30:40 [2024-07-10T12:30:40.988Z] 30: [----------] 16 tests from Float512NaNReductionTest/BinaryDataDriven512FloatTest
08:30:40 [2024-07-10T12:30:40.988Z] 30: Missing Implementation: Skipping test: BinaryVector512FloatTest/0
08:30:40 [2024-07-10T12:30:40.988Z] 30:     Vector length is not supported by the target platform
08:30:40 [2024-07-10T12:30:40.988Z] 30: Missing Implementation: Skipping test: BinaryVector512FloatTest/1
08:30:40 [2024-07-10T12:30:40.988Z] 30:     Vector length is not supported by the target platform
08:30:40 [2024-07-10T12:30:40.988Z] 30: Missing Implementation: Skipping test: BinaryVector512FloatTest/2
08:30:40 [2024-07-10T12:30:40.988Z] 30:     Vector length is not supported by the target platform
08:30:40 [2024-07-10T12:30:40.988Z] 30: Missing Implementation: Skipping test: BinaryVector512FloatTest/3
08:30:40 [2024-07-10T12:30:40.988Z] 30:     Vector length is not supported by the target platform
08:30:40 [2024-07-10T12:30:40.988Z] 30: Missing Implementation: Skipping test: BinaryVector512FloatTest/4
08:30:40 [2024-07-10T12:30:40.988Z] 30:     Vector length is not supported by the target platform
08:30:40 [2024-07-10T12:30:40.988Z] 30: Missing Implementation: Skipping test: BinaryVector512FloatTest/5
08:30:40 [2024-07-10T12:30:40.988Z] 30:     Vector length is not supported by the target platform
08:30:40 [2024-07-10T12:30:40.988Z] 30: Missing Implementation: Skipping test: BinaryVector512FloatTest/6
08:30:40 [2024-07-10T12:30:40.988Z] 30:     Vector length is not supported by the target platform
08:30:40 [2024-07-10T12:30:40.988Z] 30: Missing Implementation: Skipping test: BinaryVector512FloatTest/7
08:30:40 [2024-07-10T12:30:40.988Z] 30:     Vector length is not supported by the target platform
08:30:40 [2024-07-10T12:30:40.988Z] 30: Missing Implementation: Skipping test: BinaryVector512FloatTest/8
08:30:40 [2024-07-10T12:30:40.988Z] 30:     Vector length is not supported by the target platform
08:30:40 [2024-07-10T12:30:40.988Z] 30: Missing Implementation: Skipping test: BinaryVector512FloatTest/9
08:30:40 [2024-07-10T12:30:40.988Z] 30:     Vector length is not supported by the target platform
08:30:40 [2024-07-10T12:30:40.988Z] 30: Missing Implementation: Skipping test: BinaryVector512FloatTest/10
08:30:40 [2024-07-10T12:30:40.988Z] 30:     Vector length is not supported by the target platform
08:30:40 [2024-07-10T12:30:40.988Z] 30: Missing Implementation: Skipping test: BinaryVector512FloatTest/11
08:30:40 [2024-07-10T12:30:40.988Z] 30:     Vector length is not supported by the target platform
08:30:40 [2024-07-10T12:30:40.988Z] 30: Missing Implementation: Skipping test: BinaryVector512FloatTest/12
08:30:40 [2024-07-10T12:30:40.988Z] 30:     Vector length is not supported by the target platform
08:30:40 [2024-07-10T12:30:40.988Z] 30: Missing Implementation: Skipping test: BinaryVector512FloatTest/13
08:30:40 [2024-07-10T12:30:40.988Z] 30:     Vector length is not supported by the target platform
08:30:40 [2024-07-10T12:30:40.988Z] 30: Missing Implementation: Skipping test: BinaryVector512FloatTest/14
08:30:40 [2024-07-10T12:30:40.988Z] 30:     Vector length is not supported by the target platform
08:30:40 [2024-07-10T12:30:40.988Z] 30: Missing Implementation: Skipping test: BinaryVector512FloatTest/15
08:30:40 [2024-07-10T12:30:40.988Z] 30:     Vector length is not supported by the target platform
08:30:40 [2024-07-10T12:30:40.988Z] 30: [----------] 16 tests from Float512NaNReductionTest/BinaryDataDriven512FloatTest (5 ms total)
08:30:40 [2024-07-10T12:30:40.988Z] 30: 
08:30:40 [2024-07-10T12:30:40.988Z] 30: [----------] 1 test from Float512ReductionTest/BinaryDataDriven512FloatTest
08:30:40 [2024-07-10T12:30:40.988Z] 30: Missing Implementation: Skipping test: BinaryVector512FloatTest/0
08:30:40 [2024-07-10T12:30:40.988Z] 30:     Vector length is not supported by the target platform
08:30:40 [2024-07-10T12:30:40.988Z] 30: [----------] 1 test from Float512ReductionTest/BinaryDataDriven512FloatTest (0 ms total)
08:30:40 [2024-07-10T12:30:40.988Z] 30: 
08:30:40 [2024-07-10T12:30:40.988Z] 30: [----------] 3 tests from DoubleAbsTest/BinaryDataDrivenDoubleTest
08:30:40 [2024-07-10T12:30:40.988Z] 30: Missing Implementation: Skipping test: BinaryVector256DoubleTest/0
08:30:40 [2024-07-10T12:30:40.988Z] 30:     Vector length is not supported by the target platform
08:30:40 [2024-07-10T12:30:40.988Z] 30: Missing Implementation: Skipping test: BinaryVector512DoubleTest/0
08:30:40 [2024-07-10T12:30:40.988Z] 30:     Vector length is not supported by the target platform
08:30:40 [2024-07-10T12:30:40.988Z] 30: [----------] 3 tests from DoubleAbsTest/BinaryDataDrivenDoubleTest (2 ms total)
08:30:40 [2024-07-10T12:30:40.988Z] 30: 
08:30:40 [2024-07-10T12:30:40.988Z] 30: [----------] 6 tests from BinaryDoubleNaNTest/BinaryDataDrivenDoubleTest
08:30:40 [2024-07-10T12:30:40.988Z] 30: Missing Implementation: Skipping test: BinaryVector128DoubleTest/0
08:30:40 [2024-07-10T12:30:40.988Z] 30:     Opcode vminVector128Double is not supported by the target platform
08:30:40 [2024-07-10T12:30:40.988Z] 30: Missing Implementation: Skipping test: BinaryVector128DoubleTest/1
08:30:40 [2024-07-10T12:30:40.988Z] 30:     Opcode vmaxVector128Double is not supported by the target platform
08:30:40 [2024-07-10T12:30:40.988Z] 30: Missing Implementation: Skipping test: BinaryVector256DoubleTest/0
08:30:40 [2024-07-10T12:30:40.988Z] 30:     Vector length is not supported by the target platform
08:30:40 [2024-07-10T12:30:40.988Z] 30: Missing Implementation: Skipping test: BinaryVector256DoubleTest/1
08:30:40 [2024-07-10T12:30:40.988Z] 30:     Vector length is not supported by the target platform
08:30:40 [2024-07-10T12:30:40.988Z] 30: Missing Implementation: Skipping test: BinaryVector512DoubleTest/0
08:30:40 [2024-07-10T12:30:40.988Z] 30:     Vector length is not supported by the target platform
08:30:40 [2024-07-10T12:30:40.988Z] 30: Missing Implementation: Skipping test: BinaryVector512DoubleTest/1
08:30:40 [2024-07-10T12:30:40.988Z] 30:     Vector length is not supported by the target platform
08:30:40 [2024-07-10T12:30:40.988Z] 30: [----------] 6 tests from BinaryDoubleNaNTest/BinaryDataDrivenDoubleTest (2 ms total)
08:30:40 [2024-07-10T12:30:40.988Z] 30: 
08:30:40 [2024-07-10T12:30:40.988Z] 30: [----------] 6 tests from BinaryDoubleTest/BinaryDataDrivenDoubleTest
08:30:40 [2024-07-10T12:30:40.988Z] 30: Missing Implementation: Skipping test: BinaryVector128DoubleTest/0
08:30:40 [2024-07-10T12:30:40.988Z] 30:     Opcode vminVector128Double is not supported by the target platform
08:30:40 [2024-07-10T12:30:40.988Z] 30: Missing Implementation: Skipping test: BinaryVector128DoubleTest/1
08:30:40 [2024-07-10T12:30:40.988Z] 30:     Opcode vmaxVector128Double is not supported by the target platform
08:30:40 [2024-07-10T12:30:40.988Z] 30: Missing Implementation: Skipping test: BinaryVector256DoubleTest/0
08:30:40 [2024-07-10T12:30:40.988Z] 30:     Vector length is not supported by the target platform
08:30:40 [2024-07-10T12:30:40.988Z] 30: Missing Implementation: Skipping test: BinaryVector256DoubleTest/1
08:30:40 [2024-07-10T12:30:40.988Z] 30:     Vector length is not supported by the target platform
08:30:40 [2024-07-10T12:30:40.988Z] 30: Missing Implementation: Skipping test: BinaryVector512DoubleTest/0
08:30:40 [2024-07-10T12:30:40.988Z] 30:     Vector length is not supported by the target platform
08:30:40 [2024-07-10T12:30:40.988Z] 30: Missing Implementation: Skipping test: BinaryVector512DoubleTest/1
08:30:40 [2024-07-10T12:30:40.988Z] 30:     Vector length is not supported by the target platform
08:30:40 [2024-07-10T12:30:40.988Z] 30: [----------] 6 tests from BinaryDoubleTest/BinaryDataDrivenDoubleTest (1 ms total)
08:30:40 [2024-07-10T12:30:40.988Z] 30: 
08:30:40 [2024-07-10T12:30:40.988Z] 30: [----------] 7 tests from Double128NaNInfReductionTest/BinaryDataDriven128DoubleTest
08:30:40 [2024-07-10T12:30:40.988Z] 30: Missing Implementation: Skipping test: BinaryVector128DoubleTest/0
08:30:40 [2024-07-10T12:30:40.988Z] 30:     Opcode vreductionMulVector128Double is not supported by the target platform
08:30:40 [2024-07-10T12:30:40.988Z] 30: Missing Implementation: Skipping test: BinaryVector128DoubleTest/1
08:30:40 [2024-07-10T12:30:40.988Z] 30:     Opcode vreductionMulVector128Double is not supported by the target platform
08:30:40 [2024-07-10T12:30:40.988Z] 30: Missing Implementation: Skipping test: BinaryVector128DoubleTest/2
08:30:40 [2024-07-10T12:30:40.988Z] 30:     Opcode vreductionMulVector128Double is not supported by the target platform
08:30:40 [2024-07-10T12:30:40.988Z] 30: Missing Implementation: Skipping test: BinaryVector128DoubleTest/3
08:30:40 [2024-07-10T12:30:40.988Z] 30:     Opcode vreductionMulVector128Double is not supported by the target platform
08:30:40 [2024-07-10T12:30:40.988Z] 30: Missing Implementation: Skipping test: BinaryVector128DoubleTest/5
08:30:40 [2024-07-10T12:30:40.988Z] 30:     Opcode vreductionMinVector128Double is not supported by the target platform
08:30:40 [2024-07-10T12:30:40.988Z] 30: Missing Implementation: Skipping test: BinaryVector128DoubleTest/6
08:30:40 [2024-07-10T12:30:40.988Z] 30:     Opcode vreductionMinVector128Double is not supported by the target platform
08:30:40 [2024-07-10T12:30:40.988Z] 30: [----------] 7 tests from Double128NaNInfReductionTest/BinaryDataDriven128DoubleTest (3 ms total)
08:30:40 [2024-07-10T12:30:40.988Z] 30: 
08:30:40 [2024-07-10T12:30:40.988Z] 30: [----------] 10 tests from Double128ReductionTest/BinaryDataDriven128DoubleTest
08:30:40 [2024-07-10T12:30:40.988Z] 30: Missing Implementation: Skipping test: BinaryVector128DoubleTest/2
08:30:40 [2024-07-10T12:30:40.988Z] 30:     Opcode vreductionMulVector128Double is not supported by the target platform
08:30:40 [2024-07-10T12:30:40.988Z] 30: Missing Implementation: Skipping test: BinaryVector128DoubleTest/3
08:30:40 [2024-07-10T12:30:40.988Z] 30:     Opcode vreductionMulVector128Double is not supported by the target platform
08:30:40 [2024-07-10T12:30:40.988Z] 30: Missing Implementation: Skipping test: BinaryVector128DoubleTest/4
08:30:40 [2024-07-10T12:30:40.988Z] 30:     Opcode vreductionMinVector128Double is not supported by the target platform
08:30:40 [2024-07-10T12:30:40.988Z] 30: Missing Implementation: Skipping test: BinaryVector128DoubleTest/5
08:30:40 [2024-07-10T12:30:40.988Z] 30:     Opcode vreductionMinVector128Double is not supported by the target platform
08:30:40 [2024-07-10T12:30:40.988Z] 30: Missing Implementation: Skipping test: BinaryVector128DoubleTest/6
08:30:40 [2024-07-10T12:30:40.988Z] 30:     Opcode vreductionMinVector128Double is not supported by the target platform
08:30:40 [2024-07-10T12:30:40.988Z] 30: Missing Implementation: Skipping test: BinaryVector128DoubleTest/7
08:30:40 [2024-07-10T12:30:40.988Z] 30:     Opcode vreductionMaxVector128Double is not supported by the target platform
08:30:40 [2024-07-10T12:30:40.988Z] 30: Missing Implementation: Skipping test: BinaryVector128DoubleTest/8
08:30:40 [2024-07-10T12:30:40.988Z] 30:     Opcode vreductionMaxVector128Double is not supported by the target platform
08:30:40 [2024-07-10T12:30:40.988Z] 30: Missing Implementation: Skipping test: BinaryVector128DoubleTest/9
08:30:40 [2024-07-10T12:30:40.988Z] 30:     Opcode vreductionMaxVector128Double is not supported by the target platform
08:30:40 [2024-07-10T12:30:40.988Z] 30: [----------] 10 tests from Double128ReductionTest/BinaryDataDriven128DoubleTest (4 ms total)
08:30:40 [2024-07-10T12:30:40.988Z] 30: 
08:30:40 [2024-07-10T12:30:40.988Z] 30: [----------] 4 tests from Double256NaNReductionTest/BinaryDataDriven256DoubleTest
08:30:40 [2024-07-10T12:30:40.988Z] 30: Missing Implementation: Skipping test: BinaryVector256DoubleTest/0
08:30:40 [2024-07-10T12:30:40.988Z] 30:     Vector length is not supported by the target platform
08:30:40 [2024-07-10T12:30:40.988Z] 30: Missing Implementation: Skipping test: BinaryVector256DoubleTest/1
08:30:40 [2024-07-10T12:30:40.988Z] 30:     Vector length is not supported by the target platform
08:30:40 [2024-07-10T12:30:40.988Z] 30: Missing Implementation: Skipping test: BinaryVector256DoubleTest/2
08:30:40 [2024-07-10T12:30:40.988Z] 30:     Vector length is not supported by the target platform
08:30:40 [2024-07-10T12:30:40.988Z] 30: Missing Implementation: Skipping test: BinaryVector256DoubleTest/3
08:30:40 [2024-07-10T12:30:40.988Z] 30:     Vector length is not supported by the target platform
08:30:40 [2024-07-10T12:30:40.988Z] 30: [----------] 4 tests from Double256NaNReductionTest/BinaryDataDriven256DoubleTest (1 ms total)
08:30:40 [2024-07-10T12:30:40.988Z] 30: 
08:30:40 [2024-07-10T12:30:40.988Z] 30: [----------] 8 tests from Double512NaNReductionTest/BinaryDataDriven512DoubleTest
08:30:40 [2024-07-10T12:30:40.988Z] 30: Missing Implementation: Skipping test: BinaryVector512DoubleTest/0
08:30:40 [2024-07-10T12:30:40.988Z] 30:     Vector length is not supported by the target platform
08:30:40 [2024-07-10T12:30:40.988Z] 30: Missing Implementation: Skipping test: BinaryVector512DoubleTest/1
08:30:40 [2024-07-10T12:30:40.988Z] 30:     Vector length is not supported by the target platform
08:30:40 [2024-07-10T12:30:40.988Z] 30: Missing Implementation: Skipping test: BinaryVector512DoubleTest/2
08:30:40 [2024-07-10T12:30:40.988Z] 30:     Vector length is not supported by the target platform
08:30:40 [2024-07-10T12:30:40.988Z] 30: Missing Implementation: Skipping test: BinaryVector512DoubleTest/3
08:30:40 [2024-07-10T12:30:40.988Z] 30:     Vector length is not supported by the target platform
08:30:40 [2024-07-10T12:30:40.988Z] 30: Missing Implementation: Skipping test: BinaryVector512DoubleTest/4
08:30:40 [2024-07-10T12:30:40.988Z] 30:     Vector length is not supported by the target platform
08:30:40 [2024-07-10T12:30:40.988Z] 30: Missing Implementation: Skipping test: BinaryVector512DoubleTest/5
08:30:40 [2024-07-10T12:30:40.988Z] 30:     Vector length is not supported by the target platform
08:30:40 [2024-07-10T12:30:40.988Z] 30: Missing Implementation: Skipping test: BinaryVector512DoubleTest/6
08:30:40 [2024-07-10T12:30:40.988Z] 30:     Vector length is not supported by the target platform
08:30:40 [2024-07-10T12:30:40.988Z] 30: Missing Implementation: Skipping test: BinaryVector512DoubleTest/7
08:30:40 [2024-07-10T12:30:40.988Z] 30:     Vector length is not supported by the target platform
08:30:40 [2024-07-10T12:30:40.988Z] 30: [----------] 8 tests from Double512NaNReductionTest/BinaryDataDriven512DoubleTest (2 ms total)
08:30:40 [2024-07-10T12:30:40.988Z] 30: 
08:30:40 [2024-07-10T12:30:40.988Z] 30: [----------] 12 tests from TarnaryFloatNaNInfTest/TernaryDataDrivenFloatTest
08:30:40 [2024-07-10T12:30:40.988Z] 30: Missing Implementation: Skipping test: TernaryVector128FloatTest/0
08:30:40 [2024-07-10T12:30:40.988Z] 30:     Opcode vfmaVector128Float is not supported by the target platform
08:30:40 [2024-07-10T12:30:40.988Z] 30: Missing Implementation: Skipping test: TernaryVector128FloatTest/1
08:30:40 [2024-07-10T12:30:40.988Z] 30:     Opcode vfmaVector128Float is not supported by the target platform
08:30:40 [2024-07-10T12:30:40.988Z] 30: Missing Implementation: Skipping test: TernaryVector128FloatTest/2
08:30:40 [2024-07-10T12:30:40.988Z] 30:     Opcode vfmaVector128Float is not supported by the target platform
08:30:40 [2024-07-10T12:30:40.988Z] 30: Missing Implementation: Skipping test: TernaryVector128FloatTest/3
08:30:40 [2024-07-10T12:30:40.988Z] 30:     Opcode vfmaVector128Float is not supported by the target platform
08:30:40 [2024-07-10T12:30:40.988Z] 30: Missing Implementation: Skipping test: TernaryVector256FloatTest/0
08:30:40 [2024-07-10T12:30:40.988Z] 30:     Vector length is not supported by the target platform
08:30:40 [2024-07-10T12:30:40.988Z] 30: Missing Implementation: Skipping test: TernaryVector256FloatTest/1
08:30:40 [2024-07-10T12:30:40.988Z] 30:     Vector length is not supported by the target platform
08:30:40 [2024-07-10T12:30:40.988Z] 30: Missing Implementation: Skipping test: TernaryVector256FloatTest/2
08:30:40 [2024-07-10T12:30:40.988Z] 30:     Vector length is not supported by the target platform
08:30:40 [2024-07-10T12:30:40.988Z] 30: Missing Implementation: Skipping test: TernaryVector256FloatTest/3
08:30:40 [2024-07-10T12:30:40.988Z] 30:     Vector length is not supported by the target platform
08:30:40 [2024-07-10T12:30:40.988Z] 30: Missing Implementation: Skipping test: TernaryVector512FloatTest/0
08:30:40 [2024-07-10T12:30:40.988Z] 30:     Vector length is not supported by the target platform
08:30:40 [2024-07-10T12:30:40.988Z] 30: Missing Implementation: Skipping test: TernaryVector512FloatTest/1
08:30:40 [2024-07-10T12:30:40.988Z] 30:     Vector length is not supported by the target platform
08:30:40 [2024-07-10T12:30:40.988Z] 30: Missing Implementation: Skipping test: TernaryVector512FloatTest/2
08:30:40 [2024-07-10T12:30:40.988Z] 30:     Vector length is not supported by the target platform
08:30:40 [2024-07-10T12:30:40.988Z] 30: Missing Implementation: Skipping test: TernaryVector512FloatTest/3
08:30:40 [2024-07-10T12:30:40.988Z] 30:     Vector length is not supported by the target platform
08:30:40 [2024-07-10T12:30:40.988Z] 30: [----------] 12 tests from TarnaryFloatNaNInfTest/TernaryDataDrivenFloatTest (3 ms total)
08:30:40 [2024-07-10T12:30:40.988Z] 30: 
08:30:40 [2024-07-10T12:30:40.988Z] 30: [----------] 3 tests from TarnaryFloatTest/TernaryDataDrivenFloatTest
08:30:40 [2024-07-10T12:30:40.988Z] 30: Missing Implementation: Skipping test: TernaryVector128FloatTest/0
08:30:40 [2024-07-10T12:30:40.988Z] 30:     Opcode vfmaVector128Float is not supported by the target platform
08:30:40 [2024-07-10T12:30:40.988Z] 30: Missing Implementation: Skipping test: TernaryVector256FloatTest/0
08:30:40 [2024-07-10T12:30:40.988Z] 30:     Vector length is not supported by the target platform
08:30:40 [2024-07-10T12:30:40.988Z] 30: Missing Implementation: Skipping test: TernaryVector512FloatTest/0
08:30:40 [2024-07-10T12:30:40.988Z] 30:     Vector length is not supported by the target platform
08:30:40 [2024-07-10T12:30:40.988Z] 30: [----------] 3 tests from TarnaryFloatTest/TernaryDataDrivenFloatTest (0 ms total)
08:30:40 [2024-07-10T12:30:40.988Z] 30: 
08:30:40 [2024-07-10T12:30:40.988Z] 30: [----------] 9 tests from TarnaryDoubleNaNInfTest/TernaryDataDrivenDoubleTest
08:30:40 [2024-07-10T12:30:40.988Z] 30: Missing Implementation: Skipping test: TernaryVector256DoubleTest/0
08:30:40 [2024-07-10T12:30:40.988Z] 30:     Vector length is not supported by the target platform
08:30:40 [2024-07-10T12:30:40.988Z] 30: Missing Implementation: Skipping test: TernaryVector256DoubleTest/1
08:30:40 [2024-07-10T12:30:40.988Z] 30:     Vector length is not supported by the target platform
08:30:40 [2024-07-10T12:30:40.988Z] 30: Missing Implementation: Skipping test: TernaryVector256DoubleTest/2
08:30:40 [2024-07-10T12:30:40.988Z] 30:     Vector length is not supported by the target platform
08:30:40 [2024-07-10T12:30:40.988Z] 30: Missing Implementation: Skipping test: TernaryVector512DoubleTest/0
08:30:40 [2024-07-10T12:30:40.988Z] 30:     Vector length is not supported by the target platform
08:30:40 [2024-07-10T12:30:40.988Z] 30: Missing Implementation: Skipping test: TernaryVector512DoubleTest/1
08:30:40 [2024-07-10T12:30:40.988Z] 30:     Vector length is not supported by the target platform
08:30:40 [2024-07-10T12:30:40.988Z] 30: Missing Implementation: Skipping test: TernaryVector512DoubleTest/2
08:30:40 [2024-07-10T12:30:40.988Z] 30:     Vector length is not supported by the target platform
08:30:40 [2024-07-10T12:30:40.988Z] 30: [----------] 9 tests from TarnaryDoubleNaNInfTest/TernaryDataDrivenDoubleTest (8 ms total)
08:30:40 [2024-07-10T12:30:40.988Z] 30: 
08:30:40 [2024-07-10T12:30:40.988Z] 30: [----------] 6 tests from TarnaryDoubleTest/TernaryDataDrivenDoubleTest
08:30:40 [2024-07-10T12:30:40.988Z] 30: Missing Implementation: Skipping test: TernaryVector256DoubleTest/0
08:30:40 [2024-07-10T12:30:40.988Z] 30:     Vector length is not supported by the target platform
08:30:40 [2024-07-10T12:30:40.988Z] 30: Missing Implementation: Skipping test: TernaryVector256DoubleTest/1
08:30:40 [2024-07-10T12:30:40.988Z] 30:     Vector length is not supported by the target platform
08:30:40 [2024-07-10T12:30:40.988Z] 30: Missing Implementation: Skipping test: TernaryVector512DoubleTest/0
08:30:40 [2024-07-10T12:30:40.988Z] 30:     Vector length is not supported by the target platform
08:30:40 [2024-07-10T12:30:40.988Z] 30: Missing Implementation: Skipping test: TernaryVector512DoubleTest/1
08:30:40 [2024-07-10T12:30:40.989Z] 30:     Vector length is not supported by the target platform
08:30:40 [2024-07-10T12:30:40.989Z] 30: [----------] 6 tests from TarnaryDoubleTest/TernaryDataDrivenDoubleTest (4 ms total)
08:30:40 [2024-07-10T12:30:40.989Z] 30: 
08:30:40 [2024-07-10T12:30:40.989Z] 30: [----------] 864 tests from i2lZerosAroundOnes/i2lLongAndAsRotateTest
08:30:42 [2024-07-10T12:30:42.166Z] 30: [----------] 864 tests from i2lZerosAroundOnes/i2lLongAndAsRotateTest (1024 ms total)
08:30:42 [2024-07-10T12:30:42.166Z] 30: 
08:30:42 [2024-07-10T12:30:42.167Z] 30: [----------] 480 tests from i2lOnesAroundZeros/i2lLongAndAsRotateTest
08:30:42 [2024-07-10T12:30:42.730Z] 30: [----------] 480 tests from i2lOnesAroundZeros/i2lLongAndAsRotateTest (571 ms total)
08:30:42 [2024-07-10T12:30:42.730Z] 30: 
08:30:42 [2024-07-10T12:30:42.730Z] 30: [----------] 144 tests from i2lInvalidPatterns/i2lLongAndAsRotateTest
08:30:42 [2024-07-10T12:30:42.730Z] 30: [----------] 144 tests from i2lInvalidPatterns/i2lLongAndAsRotateTest (171 ms total)
08:30:42 [2024-07-10T12:30:42.730Z] 30: 
08:30:42 [2024-07-10T12:30:42.730Z] 30: [----------] 864 tests from iu2lZerosAroundOnes/iu2lLongAndAsRotateTest
08:30:43 [2024-07-10T12:30:43.908Z] 30: [----------] 864 tests from iu2lZerosAroundOnes/iu2lLongAndAsRotateTest (1021 ms total)
08:30:43 [2024-07-10T12:30:43.908Z] 30: 
08:30:43 [2024-07-10T12:30:43.908Z] 30: [----------] 480 tests from iu2lOnesAroundZeros/iu2lLongAndAsRotateTest
08:30:44 [2024-07-10T12:30:44.472Z] 30: [----------] 480 tests from iu2lOnesAroundZeros/iu2lLongAndAsRotateTest (571 ms total)
08:30:44 [2024-07-10T12:30:44.472Z] 30: 
08:30:44 [2024-07-10T12:30:44.472Z] 30: [----------] 144 tests from iu2lInvalidPatterns/iu2lLongAndAsRotateTest
08:30:44 [2024-07-10T12:30:44.472Z] 30: [----------] 144 tests from iu2lInvalidPatterns/iu2lLongAndAsRotateTest (172 ms total)
08:30:44 [2024-07-10T12:30:44.472Z] 30: 
08:30:44 [2024-07-10T12:30:44.472Z] 30: [----------] 20 tests from LogicalTest/Int16LogicalUnary
08:30:44 [2024-07-10T12:30:44.472Z] 30: [----------] 20 tests from LogicalTest/Int16LogicalUnary (23 ms total)
08:30:44 [2024-07-10T12:30:44.472Z] 30: 
08:30:44 [2024-07-10T12:30:44.472Z] 30: [----------] 96 tests from LogicalTest/Int32LogicalUnary
08:30:44 [2024-07-10T12:30:44.472Z] 30: [----------] 96 tests from LogicalTest/Int32LogicalUnary (102 ms total)
08:30:44 [2024-07-10T12:30:44.472Z] 30: 
08:30:44 [2024-07-10T12:30:44.472Z] 30: [----------] 1536 tests from LogicalTest/Int32LogicalBinary
08:30:46 [2024-07-10T12:30:46.326Z] 30: [----------] 1536 tests from LogicalTest/Int32LogicalBinary (1689 ms total)
08:30:46 [2024-07-10T12:30:46.326Z] 30: 
08:30:46 [2024-07-10T12:30:46.326Z] 30: [----------] 1944 tests from LogicalTest/Int64LogicalBinary
08:30:48 [2024-07-10T12:30:48.922Z] 30: [----------] 1944 tests from LogicalTest/Int64LogicalBinary (2153 ms total)
08:30:48 [2024-07-10T12:30:48.922Z] 30: 
08:30:48 [2024-07-10T12:30:48.922Z] 30: [----------] 72 tests from LogicalTest/Int64LogicalUnary
08:30:48 [2024-07-10T12:30:48.922Z] 30: [----------] 72 tests from LogicalTest/Int64LogicalUnary (78 ms total)
08:30:48 [2024-07-10T12:30:48.922Z] 30: 
08:30:48 [2024-07-10T12:30:48.922Z] 30: [----------] 1024 tests from MaxMin/Int32MaxMin
08:30:50 [2024-07-10T12:30:50.101Z] 30: [----------] 1024 tests from MaxMin/Int32MaxMin (1135 ms total)
08:30:50 [2024-07-10T12:30:50.101Z] 30: 
08:30:50 [2024-07-10T12:30:50.101Z] 30: [----------] 1296 tests from MaxMin/Int64MaxMin
08:30:51 [2024-07-10T12:30:51.428Z] 30: [----------] 1296 tests from MaxMin/Int64MaxMin (1439 ms total)
08:30:51 [2024-07-10T12:30:51.428Z] 30: 
08:30:51 [2024-07-10T12:30:51.428Z] 30: [----------] 1444 tests from MaxMin/FloatMaxMin
08:30:52 [2024-07-10T12:30:52.605Z] 30: [----------] 1444 tests from MaxMin/FloatMaxMin (1615 ms total)
08:30:52 [2024-07-10T12:30:52.605Z] 30: 
08:30:52 [2024-07-10T12:30:52.605Z] 30: [----------] 1600 tests from MaxMin/DoubleMaxMin
08:30:55 [2024-07-10T12:30:55.399Z] 30: [----------] 1600 tests from MaxMin/DoubleMaxMin (1797 ms total)
08:30:55 [2024-07-10T12:30:55.399Z] 30: 
08:30:55 [2024-07-10T12:30:55.399Z] 30: [----------] 4608 tests from CompareTest/Int32Compare
08:30:59 [2024-07-10T12:30:59.763Z] 30: [----------] 4608 tests from CompareTest/Int32Compare (5169 ms total)
08:30:59 [2024-07-10T12:30:59.763Z] 30: 
08:30:59 [2024-07-10T12:30:59.763Z] 30: [----------] 4800 tests from CompareTest/UInt32Compare
08:31:05 [2024-07-10T12:31:05.187Z] 30: [----------] 4800 tests from CompareTest/UInt32Compare (5600 ms total)
08:31:05 [2024-07-10T12:31:05.187Z] 30: 
08:31:05 [2024-07-10T12:31:05.187Z] 30: [----------] 6804 tests from CompareTest/Int64Compare
08:31:13 [2024-07-10T12:31:13.205Z] 30: [----------] 6804 tests from CompareTest/Int64Compare (7680 ms total)
08:31:13 [2024-07-10T12:31:13.205Z] 30: 
08:31:13 [2024-07-10T12:31:13.205Z] 30: [----------] 5808 tests from CompareTest/UInt64Compare
08:31:19 [2024-07-10T12:31:19.837Z] 30: [----------] 5808 tests from CompareTest/UInt64Compare (6583 ms total)
08:31:19 [2024-07-10T12:31:19.837Z] 30: 
08:31:19 [2024-07-10T12:31:19.837Z] 30: [----------] 3072 tests from CompareTest/Int32IfCompare
08:31:25 [2024-07-10T12:31:25.260Z] 30: [----------] 3072 tests from CompareTest/Int32IfCompare (5121 ms total)
08:31:25 [2024-07-10T12:31:25.260Z] 30: 
08:31:25 [2024-07-10T12:31:25.260Z] 30: [----------] 3200 tests from CompareTest/UInt32IfCompare
08:31:30 [2024-07-10T12:31:30.684Z] 30: [----------] 3200 tests from CompareTest/UInt32IfCompare (5338 ms total)
08:31:30 [2024-07-10T12:31:30.684Z] 30: 
08:31:30 [2024-07-10T12:31:30.684Z] 30: [----------] 3888 tests from CompareTest/Int64IfCompare
08:31:37 [2024-07-10T12:31:37.327Z] 30: [----------] 3888 tests from CompareTest/Int64IfCompare (6486 ms total)
08:31:37 [2024-07-10T12:31:37.327Z] 30: 
08:31:37 [2024-07-10T12:31:37.327Z] 30: [----------] 3872 tests from CompareTest/UInt64IfCompare
08:31:43 [2024-07-10T12:31:43.964Z] 30: [----------] 3872 tests from CompareTest/UInt64IfCompare (6463 ms total)
08:31:43 [2024-07-10T12:31:43.964Z] 30: 
08:31:43 [2024-07-10T12:31:43.964Z] 30: [----------] 8664 tests from CompareTest/FloatCompare
08:31:53 [2024-07-10T12:31:53.583Z] 30: [----------] 8664 tests from CompareTest/FloatCompare (10072 ms total)
08:31:53 [2024-07-10T12:31:53.584Z] 30: 
08:31:53 [2024-07-10T12:31:53.584Z] 30: [----------] 9600 tests from CompareTest/DoubleCompare
08:32:05 [2024-07-10T12:32:05.057Z] 30: [----------] 9600 tests from CompareTest/DoubleCompare (11226 ms total)
08:32:05 [2024-07-10T12:32:05.057Z] 30: 
08:32:05 [2024-07-10T12:32:05.057Z] 30: [----------] 4332 tests from CompareTest/FloatIfCompare
08:32:10 [2024-07-10T12:32:10.480Z] 30: Known Bug: Skipping test: UsingConst/61
08:32:10 [2024-07-10T12:32:10.480Z] 30:     iffcmpne returns wrong value on POWER (see #5152)
08:32:10 [2024-07-10T12:32:10.480Z] 30: Known Bug: Skipping test: UsingConst/67
08:32:10 [2024-07-10T12:32:10.480Z] 30:     iffcmpne returns wrong value on POWER (see #5152)
08:32:10 [2024-07-10T12:32:10.480Z] 30: Known Bug: Skipping test: UsingConst/175
08:32:10 [2024-07-10T12:32:10.480Z] 30:     iffcmpne returns wrong value on POWER (see #5152)
08:32:10 [2024-07-10T12:32:10.480Z] 30: Known Bug: Skipping test: UsingConst/181
08:32:10 [2024-07-10T12:32:10.480Z] 30:     iffcmpne returns wrong value on POWER (see #5152)
08:32:10 [2024-07-10T12:32:10.480Z] 30: Known Bug: Skipping test: UsingConst/289
08:32:10 [2024-07-10T12:32:10.480Z] 30:     iffcmpne returns wrong value on POWER (see #5152)
08:32:10 [2024-07-10T12:32:10.480Z] 30: Known Bug: Skipping test: UsingConst/295
08:32:10 [2024-07-10T12:32:10.480Z] 30:     iffcmpne returns wrong value on POWER (see #5152)
08:32:10 [2024-07-10T12:32:10.480Z] 30: Known Bug: Skipping test: UsingConst/403
08:32:10 [2024-07-10T12:32:10.480Z] 30:     iffcmpne returns wrong value on POWER (see #5152)
08:32:10 [2024-07-10T12:32:10.480Z] 30: Known Bug: Skipping test: UsingConst/409
08:32:10 [2024-07-10T12:32:10.480Z] 30:     iffcmpne returns wrong value on POWER (see #5152)
08:32:10 [2024-07-10T12:32:10.480Z] 30: Known Bug: Skipping test: UsingConst/517
08:32:10 [2024-07-10T12:32:10.480Z] 30:     iffcmpne returns wrong value on POWER (see #5152)
08:32:10 [2024-07-10T12:32:10.480Z] 30: Known Bug: Skipping test: UsingConst/523
08:32:10 [2024-07-10T12:32:10.480Z] 30:     iffcmpne returns wrong value on POWER (see #5152)
08:32:10 [2024-07-10T12:32:10.480Z] 30: Known Bug: Skipping test: UsingConst/631
08:32:10 [2024-07-10T12:32:10.480Z] 30:     iffcmpne returns wrong value on POWER (see #5152)
08:32:10 [2024-07-10T12:32:10.480Z] 30: Known Bug: Skipping test: UsingConst/637
08:32:10 [2024-07-10T12:32:10.480Z] 30:     iffcmpne returns wrong value on POWER (see #5152)
08:32:10 [2024-07-10T12:32:10.480Z] 30: Known Bug: Skipping test: UsingConst/745
08:32:10 [2024-07-10T12:32:10.480Z] 30:     iffcmpne returns wrong value on POWER (see #5152)
08:32:10 [2024-07-10T12:32:10.480Z] 30: Known Bug: Skipping test: UsingConst/751
08:32:10 [2024-07-10T12:32:10.480Z] 30:     iffcmpne returns wrong value on POWER (see #5152)
08:32:10 [2024-07-10T12:32:10.480Z] 30: Known Bug: Skipping test: UsingConst/859
08:32:10 [2024-07-10T12:32:10.480Z] 30:     iffcmpne returns wrong value on POWER (see #5152)
08:32:10 [2024-07-10T12:32:10.480Z] 30: Known Bug: Skipping test: UsingConst/865
08:32:10 [2024-07-10T12:32:10.480Z] 30:     iffcmpne returns wrong value on POWER (see #5152)
08:32:10 [2024-07-10T12:32:10.480Z] 30: Known Bug: Skipping test: UsingConst/973
08:32:10 [2024-07-10T12:32:10.480Z] 30:     iffcmpne returns wrong value on POWER (see #5152)
08:32:10 [2024-07-10T12:32:10.480Z] 30: Known Bug: Skipping test: UsingConst/979
08:32:10 [2024-07-10T12:32:10.480Z] 30:     iffcmpne returns wrong value on POWER (see #5152)
08:32:10 [2024-07-10T12:32:10.480Z] 30: Known Bug: Skipping test: UsingConst/1087
08:32:10 [2024-07-10T12:32:10.480Z] 30:     iffcmpne returns wrong value on POWER (see #5152)
08:32:10 [2024-07-10T12:32:10.480Z] 30: Known Bug: Skipping test: UsingConst/1093
08:32:10 [2024-07-10T12:32:10.480Z] 30:     iffcmpne returns wrong value on POWER (see #5152)
08:32:10 [2024-07-10T12:32:10.480Z] 30: Known Bug: Skipping test: UsingConst/1141
08:32:10 [2024-07-10T12:32:10.480Z] 30:     iffcmpne returns wrong value on POWER (see #5152)
08:32:10 [2024-07-10T12:32:10.480Z] 30: Known Bug: Skipping test: UsingConst/1147
08:32:10 [2024-07-10T12:32:10.480Z] 30:     iffcmpne returns wrong value on POWER (see #5152)
08:32:10 [2024-07-10T12:32:10.480Z] 30: Known Bug: Skipping test: UsingConst/1153
08:32:10 [2024-07-10T12:32:10.480Z] 30:     iffcmpne returns wrong value on POWER (see #5152)
08:32:10 [2024-07-10T12:32:10.480Z] 30: Known Bug: Skipping test: UsingConst/1159
08:32:10 [2024-07-10T12:32:10.480Z] 30:     iffcmpne returns wrong value on POWER (see #5152)
08:32:10 [2024-07-10T12:32:10.480Z] 30: Known Bug: Skipping test: UsingConst/1165
08:32:10 [2024-07-10T12:32:10.480Z] 30:     iffcmpne returns wrong value on POWER (see #5152)
08:32:10 [2024-07-10T12:32:10.480Z] 30: Known Bug: Skipping test: UsingConst/1171
08:32:10 [2024-07-10T12:32:10.480Z] 30:     iffcmpne returns wrong value on POWER (see #5152)
08:32:10 [2024-07-10T12:32:10.480Z] 30: Known Bug: Skipping test: UsingConst/1177
08:32:10 [2024-07-10T12:32:10.480Z] 30:     iffcmpne returns wrong value on POWER (see #5152)
08:32:10 [2024-07-10T12:32:10.480Z] 30: Known Bug: Skipping test: UsingConst/1183
08:32:10 [2024-07-10T12:32:10.480Z] 30:     iffcmpne returns wrong value on POWER (see #5152)
08:32:10 [2024-07-10T12:32:10.480Z] 30: Known Bug: Skipping test: UsingConst/1189
08:32:10 [2024-07-10T12:32:10.480Z] 30:     iffcmpne returns wrong value on POWER (see #5152)
08:32:10 [2024-07-10T12:32:10.480Z] 30: Known Bug: Skipping test: UsingConst/1195
08:32:10 [2024-07-10T12:32:10.480Z] 30:     iffcmpne returns wrong value on POWER (see #5152)
08:32:10 [2024-07-10T12:32:10.480Z] 30: Known Bug: Skipping test: UsingConst/1201
08:32:10 [2024-07-10T12:32:10.480Z] 30:     iffcmpne returns wrong value on POWER (see #5152)
08:32:10 [2024-07-10T12:32:10.480Z] 30: Known Bug: Skipping test: UsingConst/1207
08:32:10 [2024-07-10T12:32:10.480Z] 30:     iffcmpne returns wrong value on POWER (see #5152)
08:32:10 [2024-07-10T12:32:10.480Z] 30: Known Bug: Skipping test: UsingConst/1213
08:32:10 [2024-07-10T12:32:10.480Z] 30:     iffcmpne returns wrong value on POWER (see #5152)
08:32:10 [2024-07-10T12:32:10.480Z] 30: Known Bug: Skipping test: UsingConst/1219
08:32:10 [2024-07-10T12:32:10.480Z] 30:     iffcmpne returns wrong value on POWER (see #5152)
08:32:10 [2024-07-10T12:32:10.480Z] 30: Known Bug: Skipping test: UsingConst/1225
08:32:10 [2024-07-10T12:32:10.480Z] 30:     iffcmpne returns wrong value on POWER (see #5152)
08:32:10 [2024-07-10T12:32:10.480Z] 30: Known Bug: Skipping test: UsingConst/1231
08:32:10 [2024-07-10T12:32:10.480Z] 30:     iffcmpne returns wrong value on POWER (see #5152)
08:32:10 [2024-07-10T12:32:10.480Z] 30: Known Bug: Skipping test: UsingConst/1237
08:32:10 [2024-07-10T12:32:10.480Z] 30:     iffcmpne returns wrong value on POWER (see #5152)
08:32:10 [2024-07-10T12:32:10.480Z] 30: Known Bug: Skipping test: UsingConst/1243
08:32:10 [2024-07-10T12:32:10.480Z] 30:     iffcmpne returns wrong value on POWER (see #5152)
08:32:10 [2024-07-10T12:32:10.480Z] 30: Known Bug: Skipping test: UsingConst/1249
08:32:10 [2024-07-10T12:32:10.480Z] 30:     iffcmpne returns wrong value on POWER (see #5152)
08:32:10 [2024-07-10T12:32:10.480Z] 30: Known Bug: Skipping test: UsingConst/1255
08:32:10 [2024-07-10T12:32:10.480Z] 30:     iffcmpne returns wrong value on POWER (see #5152)
08:32:10 [2024-07-10T12:32:10.480Z] 30: Known Bug: Skipping test: UsingConst/1261
08:32:10 [2024-07-10T12:32:10.480Z] 30:     iffcmpne returns wrong value on POWER (see #5152)
08:32:10 [2024-07-10T12:32:10.480Z] 30: Known Bug: Skipping test: UsingConst/1267
08:32:10 [2024-07-10T12:32:10.480Z] 30:     iffcmpne returns wrong value on POWER (see #5152)
08:32:10 [2024-07-10T12:32:10.480Z] 30: Known Bug: Skipping test: UsingConst/1273
08:32:10 [2024-07-10T12:32:10.480Z] 30:     iffcmpne returns wrong value on POWER (see #5152)
08:32:10 [2024-07-10T12:32:10.480Z] 30: Known Bug: Skipping test: UsingConst/1279
08:32:10 [2024-07-10T12:32:10.480Z] 30:     iffcmpne returns wrong value on POWER (see #5152)
08:32:10 [2024-07-10T12:32:10.480Z] 30: Known Bug: Skipping test: UsingConst/1285
08:32:10 [2024-07-10T12:32:10.480Z] 30:     iffcmpne returns wrong value on POWER (see #5152)
08:32:10 [2024-07-10T12:32:10.480Z] 30: Known Bug: Skipping test: UsingConst/1291
08:32:10 [2024-07-10T12:32:10.480Z] 30:     iffcmpne returns wrong value on POWER (see #5152)
08:32:10 [2024-07-10T12:32:10.480Z] 30: Known Bug: Skipping test: UsingConst/1297
08:32:10 [2024-07-10T12:32:10.480Z] 30:     iffcmpne returns wrong value on POWER (see #5152)
08:32:10 [2024-07-10T12:32:10.480Z] 30: Known Bug: Skipping test: UsingConst/1303
08:32:10 [2024-07-10T12:32:10.480Z] 30:     iffcmpne returns wrong value on POWER (see #5152)
08:32:10 [2024-07-10T12:32:10.480Z] 30: Known Bug: Skipping test: UsingConst/1309
08:32:10 [2024-07-10T12:32:10.480Z] 30:     iffcmpne returns wrong value on POWER (see #5152)
08:32:10 [2024-07-10T12:32:10.480Z] 30: Known Bug: Skipping test: UsingConst/1315
08:32:10 [2024-07-10T12:32:10.480Z] 30:     iffcmpne returns wrong value on POWER (see #5152)
08:32:10 [2024-07-10T12:32:10.480Z] 30: Known Bug: Skipping test: UsingConst/1321
08:32:10 [2024-07-10T12:32:10.480Z] 30:     iffcmpne returns wrong value on POWER (see #5152)
08:32:10 [2024-07-10T12:32:10.480Z] 30: Known Bug: Skipping test: UsingConst/1327
08:32:10 [2024-07-10T12:32:10.480Z] 30:     iffcmpne returns wrong value on POWER (see #5152)
08:32:10 [2024-07-10T12:32:10.480Z] 30: Known Bug: Skipping test: UsingConst/1333
08:32:10 [2024-07-10T12:32:10.480Z] 30:     iffcmpne returns wrong value on POWER (see #5152)
08:32:10 [2024-07-10T12:32:10.480Z] 30: Known Bug: Skipping test: UsingConst/1339
08:32:10 [2024-07-10T12:32:10.480Z] 30:     iffcmpne returns wrong value on POWER (see #5152)
08:32:10 [2024-07-10T12:32:10.480Z] 30: Known Bug: Skipping test: UsingConst/1345
08:32:10 [2024-07-10T12:32:10.480Z] 30:     iffcmpne returns wrong value on POWER (see #5152)
08:32:10 [2024-07-10T12:32:10.480Z] 30: Known Bug: Skipping test: UsingConst/1351
08:32:10 [2024-07-10T12:32:10.480Z] 30:     iffcmpne returns wrong value on POWER (see #5152)
08:32:10 [2024-07-10T12:32:10.480Z] 30: Known Bug: Skipping test: UsingConst/1357
08:32:10 [2024-07-10T12:32:10.480Z] 30:     iffcmpne returns wrong value on POWER (see #5152)
08:32:10 [2024-07-10T12:32:10.480Z] 30: Known Bug: Skipping test: UsingConst/1363
08:32:10 [2024-07-10T12:32:10.480Z] 30:     iffcmpne returns wrong value on POWER (see #5152)
08:32:10 [2024-07-10T12:32:10.480Z] 30: Known Bug: Skipping test: UsingConst/1429
08:32:10 [2024-07-10T12:32:10.480Z] 30:     iffcmpne returns wrong value on POWER (see #5152)
08:32:10 [2024-07-10T12:32:10.480Z] 30: Known Bug: Skipping test: UsingConst/1435
08:32:10 [2024-07-10T12:32:10.480Z] 30:     iffcmpne returns wrong value on POWER (see #5152)
08:32:10 [2024-07-10T12:32:10.480Z] 30: Known Bug: Skipping test: UsingConst/1543
08:32:10 [2024-07-10T12:32:10.480Z] 30:     iffcmpne returns wrong value on POWER (see #5152)
08:32:10 [2024-07-10T12:32:10.480Z] 30: Known Bug: Skipping test: UsingConst/1549
08:32:10 [2024-07-10T12:32:10.480Z] 30:     iffcmpne returns wrong value on POWER (see #5152)
08:32:10 [2024-07-10T12:32:10.480Z] 30: Known Bug: Skipping test: UsingConst/1657
08:32:10 [2024-07-10T12:32:10.480Z] 30:     iffcmpne returns wrong value on POWER (see #5152)
08:32:10 [2024-07-10T12:32:10.480Z] 30: Known Bug: Skipping test: UsingConst/1663
08:32:10 [2024-07-10T12:32:10.480Z] 30:     iffcmpne returns wrong value on POWER (see #5152)
08:32:10 [2024-07-10T12:32:10.480Z] 30: Known Bug: Skipping test: UsingConst/1771
08:32:10 [2024-07-10T12:32:10.480Z] 30:     iffcmpne returns wrong value on POWER (see #5152)
08:32:10 [2024-07-10T12:32:10.480Z] 30: Known Bug: Skipping test: UsingConst/1777
08:32:10 [2024-07-10T12:32:10.480Z] 30:     iffcmpne returns wrong value on POWER (see #5152)
08:32:10 [2024-07-10T12:32:10.480Z] 30: Known Bug: Skipping test: UsingConst/1885
08:32:10 [2024-07-10T12:32:10.480Z] 30:     iffcmpne returns wrong value on POWER (see #5152)
08:32:10 [2024-07-10T12:32:10.480Z] 30: Known Bug: Skipping test: UsingConst/1891
08:32:10 [2024-07-10T12:32:10.480Z] 30:     iffcmpne returns wrong value on POWER (see #5152)
08:32:10 [2024-07-10T12:32:10.480Z] 30: Known Bug: Skipping test: UsingConst/1999
08:32:10 [2024-07-10T12:32:10.480Z] 30:     iffcmpne returns wrong value on POWER (see #5152)
08:32:10 [2024-07-10T12:32:10.480Z] 30: Known Bug: Skipping test: UsingConst/2005
08:32:10 [2024-07-10T12:32:10.480Z] 30:     iffcmpne returns wrong value on POWER (see #5152)
08:32:10 [2024-07-10T12:32:10.480Z] 30: Known Bug: Skipping test: UsingConst/2113
08:32:10 [2024-07-10T12:32:10.480Z] 30:     iffcmpne returns wrong value on POWER (see #5152)
08:32:10 [2024-07-10T12:32:10.480Z] 30: Known Bug: Skipping test: UsingConst/2119
08:32:10 [2024-07-10T12:32:10.480Z] 30:     iffcmpne returns wrong value on POWER (see #5152)
08:32:10 [2024-07-10T12:32:10.480Z] 30: Known Bug: Skipping test: UsingLoadParam/61
08:32:10 [2024-07-10T12:32:10.480Z] 30:     iffcmpne returns wrong value on POWER (see #5152)
08:32:10 [2024-07-10T12:32:10.480Z] 30: Known Bug: Skipping test: UsingLoadParam/67
08:32:10 [2024-07-10T12:32:10.480Z] 30:     iffcmpne returns wrong value on POWER (see #5152)
08:32:10 [2024-07-10T12:32:10.480Z] 30: Known Bug: Skipping test: UsingLoadParam/175
08:32:10 [2024-07-10T12:32:10.480Z] 30:     iffcmpne returns wrong value on POWER (see #5152)
08:32:10 [2024-07-10T12:32:10.480Z] 30: Known Bug: Skipping test: UsingLoadParam/181
08:32:10 [2024-07-10T12:32:10.480Z] 30:     iffcmpne returns wrong value on POWER (see #5152)
08:32:10 [2024-07-10T12:32:10.480Z] 30: Known Bug: Skipping test: UsingLoadParam/289
08:32:10 [2024-07-10T12:32:10.480Z] 30:     iffcmpne returns wrong value on POWER (see #5152)
08:32:10 [2024-07-10T12:32:10.480Z] 30: Known Bug: Skipping test: UsingLoadParam/295
08:32:10 [2024-07-10T12:32:10.480Z] 30:     iffcmpne returns wrong value on POWER (see #5152)
08:32:10 [2024-07-10T12:32:10.480Z] 30: Known Bug: Skipping test: UsingLoadParam/403
08:32:10 [2024-07-10T12:32:10.480Z] 30:     iffcmpne returns wrong value on POWER (see #5152)
08:32:10 [2024-07-10T12:32:10.480Z] 30: Known Bug: Skipping test: UsingLoadParam/409
08:32:10 [2024-07-10T12:32:10.480Z] 30:     iffcmpne returns wrong value on POWER (see #5152)
08:32:10 [2024-07-10T12:32:10.480Z] 30: Known Bug: Skipping test: UsingLoadParam/517
08:32:10 [2024-07-10T12:32:10.480Z] 30:     iffcmpne returns wrong value on POWER (see #5152)
08:32:10 [2024-07-10T12:32:10.480Z] 30: Known Bug: Skipping test: UsingLoadParam/523
08:32:10 [2024-07-10T12:32:10.480Z] 30:     iffcmpne returns wrong value on POWER (see #5152)
08:32:10 [2024-07-10T12:32:10.480Z] 30: Known Bug: Skipping test: UsingLoadParam/631
08:32:10 [2024-07-10T12:32:10.480Z] 30:     iffcmpne returns wrong value on POWER (see #5152)
08:32:10 [2024-07-10T12:32:10.480Z] 30: Known Bug: Skipping test: UsingLoadParam/637
08:32:10 [2024-07-10T12:32:10.480Z] 30:     iffcmpne returns wrong value on POWER (see #5152)
08:32:10 [2024-07-10T12:32:10.480Z] 30: Known Bug: Skipping test: UsingLoadParam/745
08:32:10 [2024-07-10T12:32:10.480Z] 30:     iffcmpne returns wrong value on POWER (see #5152)
08:32:13 [2024-07-10T12:32:13.078Z] 30: Known Bug: Skipping test: UsingLoadParam/751
08:32:13 [2024-07-10T12:32:13.078Z] 30:     iffcmpne returns wrong value on POWER (see #5152)
08:32:13 [2024-07-10T12:32:13.078Z] 30: Known Bug: Skipping test: UsingLoadParam/859
08:32:13 [2024-07-10T12:32:13.078Z] 30:     iffcmpne returns wrong value on POWER (see #5152)
08:32:13 [2024-07-10T12:32:13.078Z] 30: Known Bug: Skipping test: UsingLoadParam/865
08:32:13 [2024-07-10T12:32:13.078Z] 30:     iffcmpne returns wrong value on POWER (see #5152)
08:32:13 [2024-07-10T12:32:13.078Z] 30: Known Bug: Skipping test: UsingLoadParam/973
08:32:13 [2024-07-10T12:32:13.078Z] 30:     iffcmpne returns wrong value on POWER (see #5152)
08:32:13 [2024-07-10T12:32:13.078Z] 30: Known Bug: Skipping test: UsingLoadParam/979
08:32:13 [2024-07-10T12:32:13.078Z] 30:     iffcmpne returns wrong value on POWER (see #5152)
08:32:13 [2024-07-10T12:32:13.078Z] 30: Known Bug: Skipping test: UsingLoadParam/1087
08:32:13 [2024-07-10T12:32:13.078Z] 30:     iffcmpne returns wrong value on POWER (see #5152)
08:32:13 [2024-07-10T12:32:13.078Z] 30: Known Bug: Skipping test: UsingLoadParam/1093
08:32:13 [2024-07-10T12:32:13.078Z] 30:     iffcmpne returns wrong value on POWER (see #5152)
08:32:13 [2024-07-10T12:32:13.078Z] 30: Known Bug: Skipping test: UsingLoadParam/1141
08:32:13 [2024-07-10T12:32:13.078Z] 30:     iffcmpne returns wrong value on POWER (see #5152)
08:32:13 [2024-07-10T12:32:13.078Z] 30: Known Bug: Skipping test: UsingLoadParam/1147
08:32:13 [2024-07-10T12:32:13.078Z] 30:     iffcmpne returns wrong value on POWER (see #5152)
08:32:13 [2024-07-10T12:32:13.078Z] 30: Known Bug: Skipping test: UsingLoadParam/1153
08:32:13 [2024-07-10T12:32:13.078Z] 30:     iffcmpne returns wrong value on POWER (see #5152)
08:32:13 [2024-07-10T12:32:13.078Z] 30: Known Bug: Skipping test: UsingLoadParam/1159
08:32:13 [2024-07-10T12:32:13.078Z] 30:     iffcmpne returns wrong value on POWER (see #5152)
08:32:13 [2024-07-10T12:32:13.078Z] 30: Known Bug: Skipping test: UsingLoadParam/1165
08:32:13 [2024-07-10T12:32:13.078Z] 30:     iffcmpne returns wrong value on POWER (see #5152)
08:32:13 [2024-07-10T12:32:13.078Z] 30: Known Bug: Skipping test: UsingLoadParam/1171
08:32:13 [2024-07-10T12:32:13.078Z] 30:     iffcmpne returns wrong value on POWER (see #5152)
08:32:13 [2024-07-10T12:32:13.078Z] 30: Known Bug: Skipping test: UsingLoadParam/1177
08:32:13 [2024-07-10T12:32:13.078Z] 30:     iffcmpne returns wrong value on POWER (see #5152)
08:32:13 [2024-07-10T12:32:13.078Z] 30: Known Bug: Skipping test: UsingLoadParam/1183
08:32:13 [2024-07-10T12:32:13.078Z] 30:     iffcmpne returns wrong value on POWER (see #5152)
08:32:13 [2024-07-10T12:32:13.078Z] 30: Known Bug: Skipping test: UsingLoadParam/1189
08:32:13 [2024-07-10T12:32:13.078Z] 30:     iffcmpne returns wrong value on POWER (see #5152)
08:32:13 [2024-07-10T12:32:13.078Z] 30: Known Bug: Skipping test: UsingLoadParam/1195
08:32:13 [2024-07-10T12:32:13.078Z] 30:     iffcmpne returns wrong value on POWER (see #5152)
08:32:13 [2024-07-10T12:32:13.078Z] 30: Known Bug: Skipping test: UsingLoadParam/1201
08:32:13 [2024-07-10T12:32:13.078Z] 30:     iffcmpne returns wrong value on POWER (see #5152)
08:32:13 [2024-07-10T12:32:13.078Z] 30: Known Bug: Skipping test: UsingLoadParam/1207
08:32:13 [2024-07-10T12:32:13.078Z] 30:     iffcmpne returns wrong value on POWER (see #5152)
08:32:13 [2024-07-10T12:32:13.078Z] 30: Known Bug: Skipping test: UsingLoadParam/1213
08:32:13 [2024-07-10T12:32:13.078Z] 30:     iffcmpne returns wrong value on POWER (see #5152)
08:32:13 [2024-07-10T12:32:13.078Z] 30: Known Bug: Skipping test: UsingLoadParam/1219
08:32:13 [2024-07-10T12:32:13.078Z] 30:     iffcmpne returns wrong value on POWER (see #5152)
08:32:13 [2024-07-10T12:32:13.078Z] 30: Known Bug: Skipping test: UsingLoadParam/1225
08:32:13 [2024-07-10T12:32:13.078Z] 30:     iffcmpne returns wrong value on POWER (see #5152)
08:32:13 [2024-07-10T12:32:13.078Z] 30: Known Bug: Skipping test: UsingLoadParam/1231
08:32:13 [2024-07-10T12:32:13.078Z] 30:     iffcmpne returns wrong value on POWER (see #5152)
08:32:13 [2024-07-10T12:32:13.078Z] 30: Known Bug: Skipping test: UsingLoadParam/1237
08:32:13 [2024-07-10T12:32:13.078Z] 30:     iffcmpne returns wrong value on POWER (see #5152)
08:32:13 [2024-07-10T12:32:13.078Z] 30: Known Bug: Skipping test: UsingLoadParam/1243
08:32:13 [2024-07-10T12:32:13.078Z] 30:     iffcmpne returns wrong value on POWER (see #5152)
08:32:13 [2024-07-10T12:32:13.078Z] 30: Known Bug: Skipping test: UsingLoadParam/1249
08:32:13 [2024-07-10T12:32:13.078Z] 30:     iffcmpne returns wrong value on POWER (see #5152)
08:32:13 [2024-07-10T12:32:13.078Z] 30: Known Bug: Skipping test: UsingLoadParam/1255
08:32:13 [2024-07-10T12:32:13.078Z] 30:     iffcmpne returns wrong value on POWER (see #5152)
08:32:13 [2024-07-10T12:32:13.078Z] 30: Known Bug: Skipping test: UsingLoadParam/1261
08:32:13 [2024-07-10T12:32:13.078Z] 30:     iffcmpne returns wrong value on POWER (see #5152)
08:32:13 [2024-07-10T12:32:13.078Z] 30: Known Bug: Skipping test: UsingLoadParam/1267
08:32:13 [2024-07-10T12:32:13.078Z] 30:     iffcmpne returns wrong value on POWER (see #5152)
08:32:13 [2024-07-10T12:32:13.078Z] 30: Known Bug: Skipping test: UsingLoadParam/1273
08:32:13 [2024-07-10T12:32:13.078Z] 30:     iffcmpne returns wrong value on POWER (see #5152)
08:32:13 [2024-07-10T12:32:13.078Z] 30: Known Bug: Skipping test: UsingLoadParam/1279
08:32:13 [2024-07-10T12:32:13.078Z] 30:     iffcmpne returns wrong value on POWER (see #5152)
08:32:13 [2024-07-10T12:32:13.078Z] 30: Known Bug: Skipping test: UsingLoadParam/1285
08:32:13 [2024-07-10T12:32:13.078Z] 30:     iffcmpne returns wrong value on POWER (see #5152)
08:32:13 [2024-07-10T12:32:13.078Z] 30: Known Bug: Skipping test: UsingLoadParam/1291
08:32:13 [2024-07-10T12:32:13.078Z] 30:     iffcmpne returns wrong value on POWER (see #5152)
08:32:13 [2024-07-10T12:32:13.078Z] 30: Known Bug: Skipping test: UsingLoadParam/1297
08:32:13 [2024-07-10T12:32:13.078Z] 30:     iffcmpne returns wrong value on POWER (see #5152)
08:32:13 [2024-07-10T12:32:13.078Z] 30: Known Bug: Skipping test: UsingLoadParam/1303
08:32:13 [2024-07-10T12:32:13.078Z] 30:     iffcmpne returns wrong value on POWER (see #5152)
08:32:13 [2024-07-10T12:32:13.078Z] 30: Known Bug: Skipping test: UsingLoadParam/1309
08:32:13 [2024-07-10T12:32:13.078Z] 30:     iffcmpne returns wrong value on POWER (see #5152)
08:32:13 [2024-07-10T12:32:13.078Z] 30: Known Bug: Skipping test: UsingLoadParam/1315
08:32:13 [2024-07-10T12:32:13.078Z] 30:     iffcmpne returns wrong value on POWER (see #5152)
08:32:13 [2024-07-10T12:32:13.078Z] 30: Known Bug: Skipping test: UsingLoadParam/1321
08:32:13 [2024-07-10T12:32:13.078Z] 30:     iffcmpne returns wrong value on POWER (see #5152)
08:32:13 [2024-07-10T12:32:13.078Z] 30: Known Bug: Skipping test: UsingLoadParam/1327
08:32:13 [2024-07-10T12:32:13.078Z] 30:     iffcmpne returns wrong value on POWER (see #5152)
08:32:13 [2024-07-10T12:32:13.078Z] 30: Known Bug: Skipping test: UsingLoadParam/1333
08:32:13 [2024-07-10T12:32:13.078Z] 30:     iffcmpne returns wrong value on POWER (see #5152)
08:32:13 [2024-07-10T12:32:13.078Z] 30: Known Bug: Skipping test: UsingLoadParam/1339
08:32:13 [2024-07-10T12:32:13.078Z] 30:     iffcmpne returns wrong value on POWER (see #5152)
08:32:13 [2024-07-10T12:32:13.078Z] 30: Known Bug: Skipping test: UsingLoadParam/1345
08:32:13 [2024-07-10T12:32:13.078Z] 30:     iffcmpne returns wrong value on POWER (see #5152)
08:32:13 [2024-07-10T12:32:13.078Z] 30: Known Bug: Skipping test: UsingLoadParam/1351
08:32:13 [2024-07-10T12:32:13.078Z] 30:     iffcmpne returns wrong value on POWER (see #5152)
08:32:13 [2024-07-10T12:32:13.078Z] 30: Known Bug: Skipping test: UsingLoadParam/1357
08:32:13 [2024-07-10T12:32:13.078Z] 30:     iffcmpne returns wrong value on POWER (see #5152)
08:32:13 [2024-07-10T12:32:13.078Z] 30: Known Bug: Skipping test: UsingLoadParam/1363
08:32:13 [2024-07-10T12:32:13.078Z] 30:     iffcmpne returns wrong value on POWER (see #5152)
08:32:13 [2024-07-10T12:32:13.078Z] 30: Known Bug: Skipping test: UsingLoadParam/1429
08:32:13 [2024-07-10T12:32:13.078Z] 30:     iffcmpne returns wrong value on POWER (see #5152)
08:32:13 [2024-07-10T12:32:13.078Z] 30: Known Bug: Skipping test: UsingLoadParam/1435
08:32:13 [2024-07-10T12:32:13.078Z] 30:     iffcmpne returns wrong value on POWER (see #5152)
08:32:13 [2024-07-10T12:32:13.078Z] 30: Known Bug: Skipping test: UsingLoadParam/1543
08:32:13 [2024-07-10T12:32:13.078Z] 30:     iffcmpne returns wrong value on POWER (see #5152)
08:32:13 [2024-07-10T12:32:13.078Z] 30: Known Bug: Skipping test: UsingLoadParam/1549
08:32:13 [2024-07-10T12:32:13.078Z] 30:     iffcmpne returns wrong value on POWER (see #5152)
08:32:13 [2024-07-10T12:32:13.078Z] 30: Known Bug: Skipping test: UsingLoadParam/1657
08:32:13 [2024-07-10T12:32:13.078Z] 30:     iffcmpne returns wrong value on POWER (see #5152)
08:32:13 [2024-07-10T12:32:13.078Z] 30: Known Bug: Skipping test: UsingLoadParam/1663
08:32:13 [2024-07-10T12:32:13.078Z] 30:     iffcmpne returns wrong value on POWER (see #5152)
08:32:13 [2024-07-10T12:32:13.078Z] 30: Known Bug: Skipping test: UsingLoadParam/1771
08:32:13 [2024-07-10T12:32:13.078Z] 30:     iffcmpne returns wrong value on POWER (see #5152)
08:32:13 [2024-07-10T12:32:13.078Z] 30: Known Bug: Skipping test: UsingLoadParam/1777
08:32:13 [2024-07-10T12:32:13.078Z] 30:     iffcmpne returns wrong value on POWER (see #5152)
08:32:13 [2024-07-10T12:32:13.078Z] 30: Known Bug: Skipping test: UsingLoadParam/1885
08:32:13 [2024-07-10T12:32:13.078Z] 30:     iffcmpne returns wrong value on POWER (see #5152)
08:32:13 [2024-07-10T12:32:13.078Z] 30: Known Bug: Skipping test: UsingLoadParam/1891
08:32:13 [2024-07-10T12:32:13.078Z] 30:     iffcmpne returns wrong value on POWER (see #5152)
08:32:13 [2024-07-10T12:32:13.078Z] 30: Known Bug: Skipping test: UsingLoadParam/1999
08:32:13 [2024-07-10T12:32:13.078Z] 30:     iffcmpne returns wrong value on POWER (see #5152)
08:32:13 [2024-07-10T12:32:13.078Z] 30: Known Bug: Skipping test: UsingLoadParam/2005
08:32:13 [2024-07-10T12:32:13.078Z] 30:     iffcmpne returns wrong value on POWER (see #5152)
08:32:13 [2024-07-10T12:32:13.078Z] 30: Known Bug: Skipping test: UsingLoadParam/2113
08:32:13 [2024-07-10T12:32:13.078Z] 30:     iffcmpne returns wrong value on POWER (see #5152)
08:32:13 [2024-07-10T12:32:13.078Z] 30: Known Bug: Skipping test: UsingLoadParam/2119
08:32:13 [2024-07-10T12:32:13.078Z] 30:     iffcmpne returns wrong value on POWER (see #5152)
08:32:13 [2024-07-10T12:32:13.078Z] 30: [----------] 4332 tests from CompareTest/FloatIfCompare (8250 ms total)
08:32:13 [2024-07-10T12:32:13.078Z] 30: 
08:32:13 [2024-07-10T12:32:13.078Z] 30: [----------] 4800 tests from CompareTest/DoubleIfCompare
08:32:18 [2024-07-10T12:32:18.504Z] 30: Known Bug: Skipping test: UsingConst/61
08:32:18 [2024-07-10T12:32:18.504Z] 30:     ifdcmpne returns wrong value on POWER (see #5152)
08:32:18 [2024-07-10T12:32:18.504Z] 30: Known Bug: Skipping test: UsingConst/67
08:32:18 [2024-07-10T12:32:18.504Z] 30:     ifdcmpne returns wrong value on POWER (see #5152)
08:32:18 [2024-07-10T12:32:18.504Z] 30: Known Bug: Skipping test: UsingConst/181
08:32:18 [2024-07-10T12:32:18.504Z] 30:     ifdcmpne returns wrong value on POWER (see #5152)
08:32:18 [2024-07-10T12:32:18.504Z] 30: Known Bug: Skipping test: UsingConst/187
08:32:18 [2024-07-10T12:32:18.504Z] 30:     ifdcmpne returns wrong value on POWER (see #5152)
08:32:18 [2024-07-10T12:32:18.504Z] 30: Known Bug: Skipping test: UsingConst/301
08:32:18 [2024-07-10T12:32:18.504Z] 30:     ifdcmpne returns wrong value on POWER (see #5152)
08:32:18 [2024-07-10T12:32:18.504Z] 30: Known Bug: Skipping test: UsingConst/307
08:32:18 [2024-07-10T12:32:18.504Z] 30:     ifdcmpne returns wrong value on POWER (see #5152)
08:32:18 [2024-07-10T12:32:18.504Z] 30: Known Bug: Skipping test: UsingConst/421
08:32:18 [2024-07-10T12:32:18.504Z] 30:     ifdcmpne returns wrong value on POWER (see #5152)
08:32:18 [2024-07-10T12:32:18.504Z] 30: Known Bug: Skipping test: UsingConst/427
08:32:18 [2024-07-10T12:32:18.504Z] 30:     ifdcmpne returns wrong value on POWER (see #5152)
08:32:18 [2024-07-10T12:32:18.504Z] 30: Known Bug: Skipping test: UsingConst/541
08:32:18 [2024-07-10T12:32:18.504Z] 30:     ifdcmpne returns wrong value on POWER (see #5152)
08:32:18 [2024-07-10T12:32:18.504Z] 30: Known Bug: Skipping test: UsingConst/547
08:32:18 [2024-07-10T12:32:18.504Z] 30:     ifdcmpne returns wrong value on POWER (see #5152)
08:32:18 [2024-07-10T12:32:18.504Z] 30: Known Bug: Skipping test: UsingConst/661
08:32:18 [2024-07-10T12:32:18.504Z] 30:     ifdcmpne returns wrong value on POWER (see #5152)
08:32:18 [2024-07-10T12:32:18.504Z] 30: Known Bug: Skipping test: UsingConst/667
08:32:18 [2024-07-10T12:32:18.504Z] 30:     ifdcmpne returns wrong value on POWER (see #5152)
08:32:18 [2024-07-10T12:32:18.504Z] 30: Known Bug: Skipping test: UsingConst/781
08:32:18 [2024-07-10T12:32:18.504Z] 30:     ifdcmpne returns wrong value on POWER (see #5152)
08:32:18 [2024-07-10T12:32:18.504Z] 30: Known Bug: Skipping test: UsingConst/787
08:32:18 [2024-07-10T12:32:18.504Z] 30:     ifdcmpne returns wrong value on POWER (see #5152)
08:32:18 [2024-07-10T12:32:18.504Z] 30: Known Bug: Skipping test: UsingConst/901
08:32:18 [2024-07-10T12:32:18.504Z] 30:     ifdcmpne returns wrong value on POWER (see #5152)
08:32:18 [2024-07-10T12:32:18.504Z] 30: Known Bug: Skipping test: UsingConst/907
08:32:18 [2024-07-10T12:32:18.504Z] 30:     ifdcmpne returns wrong value on POWER (see #5152)
08:32:18 [2024-07-10T12:32:18.504Z] 30: Known Bug: Skipping test: UsingConst/1021
08:32:18 [2024-07-10T12:32:18.504Z] 30:     ifdcmpne returns wrong value on POWER (see #5152)
08:32:18 [2024-07-10T12:32:18.504Z] 30: Known Bug: Skipping test: UsingConst/1027
08:32:18 [2024-07-10T12:32:18.504Z] 30:     ifdcmpne returns wrong value on POWER (see #5152)
08:32:18 [2024-07-10T12:32:18.504Z] 30: Known Bug: Skipping test: UsingConst/1141
08:32:18 [2024-07-10T12:32:18.504Z] 30:     ifdcmpne returns wrong value on POWER (see #5152)
08:32:18 [2024-07-10T12:32:18.504Z] 30: Known Bug: Skipping test: UsingConst/1147
08:32:18 [2024-07-10T12:32:18.504Z] 30:     ifdcmpne returns wrong value on POWER (see #5152)
08:32:18 [2024-07-10T12:32:18.504Z] 30: Known Bug: Skipping test: UsingConst/1201
08:32:18 [2024-07-10T12:32:18.504Z] 30:     ifdcmpne returns wrong value on POWER (see #5152)
08:32:18 [2024-07-10T12:32:18.504Z] 30: Known Bug: Skipping test: UsingConst/1207
08:32:18 [2024-07-10T12:32:18.504Z] 30:     ifdcmpne returns wrong value on POWER (see #5152)
08:32:18 [2024-07-10T12:32:18.504Z] 30: Known Bug: Skipping test: UsingConst/1213
08:32:18 [2024-07-10T12:32:18.504Z] 30:     ifdcmpne returns wrong value on POWER (see #5152)
08:32:18 [2024-07-10T12:32:18.504Z] 30: Known Bug: Skipping test: UsingConst/1219
08:32:18 [2024-07-10T12:32:18.504Z] 30:     ifdcmpne returns wrong value on POWER (see #5152)
08:32:18 [2024-07-10T12:32:18.504Z] 30: Known Bug: Skipping test: UsingConst/1225
08:32:18 [2024-07-10T12:32:18.504Z] 30:     ifdcmpne returns wrong value on POWER (see #5152)
08:32:18 [2024-07-10T12:32:18.504Z] 30: Known Bug: Skipping test: UsingConst/1231
08:32:18 [2024-07-10T12:32:18.504Z] 30:     ifdcmpne returns wrong value on POWER (see #5152)
08:32:18 [2024-07-10T12:32:18.504Z] 30: Known Bug: Skipping test: UsingConst/1237
08:32:18 [2024-07-10T12:32:18.504Z] 30:     ifdcmpne returns wrong value on POWER (see #5152)
08:32:18 [2024-07-10T12:32:18.504Z] 30: Known Bug: Skipping test: UsingConst/1243
08:32:18 [2024-07-10T12:32:18.504Z] 30:     ifdcmpne returns wrong value on POWER (see #5152)
08:32:18 [2024-07-10T12:32:18.504Z] 30: Known Bug: Skipping test: UsingConst/1249
08:32:18 [2024-07-10T12:32:18.504Z] 30:     ifdcmpne returns wrong value on POWER (see #5152)
08:32:18 [2024-07-10T12:32:18.504Z] 30: Known Bug: Skipping test: UsingConst/1255
08:32:18 [2024-07-10T12:32:18.504Z] 30:     ifdcmpne returns wrong value on POWER (see #5152)
08:32:18 [2024-07-10T12:32:18.504Z] 30: Known Bug: Skipping test: UsingConst/1261
08:32:18 [2024-07-10T12:32:18.504Z] 30:     ifdcmpne returns wrong value on POWER (see #5152)
08:32:18 [2024-07-10T12:32:18.504Z] 30: Known Bug: Skipping test: UsingConst/1267
08:32:18 [2024-07-10T12:32:18.504Z] 30:     ifdcmpne returns wrong value on POWER (see #5152)
08:32:18 [2024-07-10T12:32:18.504Z] 30: Known Bug: Skipping test: UsingConst/1273
08:32:18 [2024-07-10T12:32:18.504Z] 30:     ifdcmpne returns wrong value on POWER (see #5152)
08:32:18 [2024-07-10T12:32:18.504Z] 30: Known Bug: Skipping test: UsingConst/1279
08:32:18 [2024-07-10T12:32:18.504Z] 30:     ifdcmpne returns wrong value on POWER (see #5152)
08:32:18 [2024-07-10T12:32:18.504Z] 30: Known Bug: Skipping test: UsingConst/1285
08:32:18 [2024-07-10T12:32:18.504Z] 30:     ifdcmpne returns wrong value on POWER (see #5152)
08:32:18 [2024-07-10T12:32:18.504Z] 30: Known Bug: Skipping test: UsingConst/1291
08:32:18 [2024-07-10T12:32:18.504Z] 30:     ifdcmpne returns wrong value on POWER (see #5152)
08:32:18 [2024-07-10T12:32:18.504Z] 30: Known Bug: Skipping test: UsingConst/1297
08:32:18 [2024-07-10T12:32:18.504Z] 30:     ifdcmpne returns wrong value on POWER (see #5152)
08:32:18 [2024-07-10T12:32:18.504Z] 30: Known Bug: Skipping test: UsingConst/1303
08:32:18 [2024-07-10T12:32:18.504Z] 30:     ifdcmpne returns wrong value on POWER (see #5152)
08:32:18 [2024-07-10T12:32:18.504Z] 30: Known Bug: Skipping test: UsingConst/1309
08:32:18 [2024-07-10T12:32:18.504Z] 30:     ifdcmpne returns wrong value on POWER (see #5152)
08:32:18 [2024-07-10T12:32:18.504Z] 30: Known Bug: Skipping test: UsingConst/1315
08:32:18 [2024-07-10T12:32:18.504Z] 30:     ifdcmpne returns wrong value on POWER (see #5152)
08:32:18 [2024-07-10T12:32:18.504Z] 30: Known Bug: Skipping test: UsingConst/1321
08:32:18 [2024-07-10T12:32:18.504Z] 30:     ifdcmpne returns wrong value on POWER (see #5152)
08:32:18 [2024-07-10T12:32:18.504Z] 30: Known Bug: Skipping test: UsingConst/1327
08:32:18 [2024-07-10T12:32:18.504Z] 30:     ifdcmpne returns wrong value on POWER (see #5152)
08:32:18 [2024-07-10T12:32:18.504Z] 30: Known Bug: Skipping test: UsingConst/1333
08:32:18 [2024-07-10T12:32:18.504Z] 30:     ifdcmpne returns wrong value on POWER (see #5152)
08:32:18 [2024-07-10T12:32:18.504Z] 30: Known Bug: Skipping test: UsingConst/1339
08:32:18 [2024-07-10T12:32:18.504Z] 30:     ifdcmpne returns wrong value on POWER (see #5152)
08:32:18 [2024-07-10T12:32:18.504Z] 30: Known Bug: Skipping test: UsingConst/1345
08:32:18 [2024-07-10T12:32:18.504Z] 30:     ifdcmpne returns wrong value on POWER (see #5152)
08:32:18 [2024-07-10T12:32:18.504Z] 30: Known Bug: Skipping test: UsingConst/1351
08:32:18 [2024-07-10T12:32:18.504Z] 30:     ifdcmpne returns wrong value on POWER (see #5152)
08:32:18 [2024-07-10T12:32:18.504Z] 30: Known Bug: Skipping test: UsingConst/1357
08:32:18 [2024-07-10T12:32:18.504Z] 30:     ifdcmpne returns wrong value on POWER (see #5152)
08:32:18 [2024-07-10T12:32:18.504Z] 30: Known Bug: Skipping test: UsingConst/1363
08:32:18 [2024-07-10T12:32:18.504Z] 30:     ifdcmpne returns wrong value on POWER (see #5152)
08:32:18 [2024-07-10T12:32:18.504Z] 30: Known Bug: Skipping test: UsingConst/1369
08:32:18 [2024-07-10T12:32:18.504Z] 30:     ifdcmpne returns wrong value on POWER (see #5152)
08:32:18 [2024-07-10T12:32:18.504Z] 30: Known Bug: Skipping test: UsingConst/1375
08:32:18 [2024-07-10T12:32:18.504Z] 30:     ifdcmpne returns wrong value on POWER (see #5152)
08:32:18 [2024-07-10T12:32:18.504Z] 30: Known Bug: Skipping test: UsingConst/1381
08:32:18 [2024-07-10T12:32:18.504Z] 30:     ifdcmpne returns wrong value on POWER (see #5152)
08:32:18 [2024-07-10T12:32:18.504Z] 30: Known Bug: Skipping test: UsingConst/1387
08:32:18 [2024-07-10T12:32:18.504Z] 30:     ifdcmpne returns wrong value on POWER (see #5152)
08:32:18 [2024-07-10T12:32:18.504Z] 30: Known Bug: Skipping test: UsingConst/1393
08:32:18 [2024-07-10T12:32:18.504Z] 30:     ifdcmpne returns wrong value on POWER (see #5152)
08:32:18 [2024-07-10T12:32:18.504Z] 30: Known Bug: Skipping test: UsingConst/1399
08:32:18 [2024-07-10T12:32:18.504Z] 30:     ifdcmpne returns wrong value on POWER (see #5152)
08:32:18 [2024-07-10T12:32:18.504Z] 30: Known Bug: Skipping test: UsingConst/1405
08:32:18 [2024-07-10T12:32:18.504Z] 30:     ifdcmpne returns wrong value on POWER (see #5152)
08:32:18 [2024-07-10T12:32:18.504Z] 30: Known Bug: Skipping test: UsingConst/1411
08:32:18 [2024-07-10T12:32:18.504Z] 30:     ifdcmpne returns wrong value on POWER (see #5152)
08:32:18 [2024-07-10T12:32:18.504Z] 30: Known Bug: Skipping test: UsingConst/1417
08:32:18 [2024-07-10T12:32:18.504Z] 30:     ifdcmpne returns wrong value on POWER (see #5152)
08:32:18 [2024-07-10T12:32:18.504Z] 30: Known Bug: Skipping test: UsingConst/1423
08:32:18 [2024-07-10T12:32:18.505Z] 30:     ifdcmpne returns wrong value on POWER (see #5152)
08:32:18 [2024-07-10T12:32:18.505Z] 30: Known Bug: Skipping test: UsingConst/1429
08:32:18 [2024-07-10T12:32:18.505Z] 30:     ifdcmpne returns wrong value on POWER (see #5152)
08:32:18 [2024-07-10T12:32:18.505Z] 30: Known Bug: Skipping test: UsingConst/1435
08:32:18 [2024-07-10T12:32:18.505Z] 30:     ifdcmpne returns wrong value on POWER (see #5152)
08:32:18 [2024-07-10T12:32:18.505Z] 30: Known Bug: Skipping test: UsingConst/1501
08:32:18 [2024-07-10T12:32:18.505Z] 30:     ifdcmpne returns wrong value on POWER (see #5152)
08:32:18 [2024-07-10T12:32:18.505Z] 30: Known Bug: Skipping test: UsingConst/1507
08:32:18 [2024-07-10T12:32:18.505Z] 30:     ifdcmpne returns wrong value on POWER (see #5152)
08:32:18 [2024-07-10T12:32:18.505Z] 30: Known Bug: Skipping test: UsingConst/1621
08:32:18 [2024-07-10T12:32:18.505Z] 30:     ifdcmpne returns wrong value on POWER (see #5152)
08:32:18 [2024-07-10T12:32:18.505Z] 30: Known Bug: Skipping test: UsingConst/1627
08:32:18 [2024-07-10T12:32:18.505Z] 30:     ifdcmpne returns wrong value on POWER (see #5152)
08:32:18 [2024-07-10T12:32:18.505Z] 30: Known Bug: Skipping test: UsingConst/1741
08:32:18 [2024-07-10T12:32:18.505Z] 30:     ifdcmpne returns wrong value on POWER (see #5152)
08:32:18 [2024-07-10T12:32:18.505Z] 30: Known Bug: Skipping test: UsingConst/1747
08:32:18 [2024-07-10T12:32:18.505Z] 30:     ifdcmpne returns wrong value on POWER (see #5152)
08:32:18 [2024-07-10T12:32:18.505Z] 30: Known Bug: Skipping test: UsingConst/1861
08:32:18 [2024-07-10T12:32:18.505Z] 30:     ifdcmpne returns wrong value on POWER (see #5152)
08:32:18 [2024-07-10T12:32:18.505Z] 30: Known Bug: Skipping test: UsingConst/1867
08:32:18 [2024-07-10T12:32:18.505Z] 30:     ifdcmpne returns wrong value on POWER (see #5152)
08:32:18 [2024-07-10T12:32:18.505Z] 30: Known Bug: Skipping test: UsingConst/1981
08:32:18 [2024-07-10T12:32:18.505Z] 30:     ifdcmpne returns wrong value on POWER (see #5152)
08:32:18 [2024-07-10T12:32:18.505Z] 30: Known Bug: Skipping test: UsingConst/1987
08:32:18 [2024-07-10T12:32:18.505Z] 30:     ifdcmpne returns wrong value on POWER (see #5152)
08:32:18 [2024-07-10T12:32:18.505Z] 30: Known Bug: Skipping test: UsingConst/2101
08:32:18 [2024-07-10T12:32:18.505Z] 30:     ifdcmpne returns wrong value on POWER (see #5152)
08:32:18 [2024-07-10T12:32:18.505Z] 30: Known Bug: Skipping test: UsingConst/2107
08:32:18 [2024-07-10T12:32:18.505Z] 30:     ifdcmpne returns wrong value on POWER (see #5152)
08:32:18 [2024-07-10T12:32:18.505Z] 30: Known Bug: Skipping test: UsingConst/2221
08:32:18 [2024-07-10T12:32:18.505Z] 30:     ifdcmpne returns wrong value on POWER (see #5152)
08:32:18 [2024-07-10T12:32:18.505Z] 30: Known Bug: Skipping test: UsingConst/2227
08:32:18 [2024-07-10T12:32:18.505Z] 30:     ifdcmpne returns wrong value on POWER (see #5152)
08:32:18 [2024-07-10T12:32:18.505Z] 30: Known Bug: Skipping test: UsingConst/2341
08:32:18 [2024-07-10T12:32:18.505Z] 30:     ifdcmpne returns wrong value on POWER (see #5152)
08:32:18 [2024-07-10T12:32:18.505Z] 30: Known Bug: Skipping test: UsingConst/2347
08:32:18 [2024-07-10T12:32:18.505Z] 30:     ifdcmpne returns wrong value on POWER (see #5152)
08:32:18 [2024-07-10T12:32:18.505Z] 30: Known Bug: Skipping test: UsingLoadParam/61
08:32:18 [2024-07-10T12:32:18.505Z] 30:     ifdcmpne returns wrong value on POWER (see #5152)
08:32:18 [2024-07-10T12:32:18.505Z] 30: Known Bug: Skipping test: UsingLoadParam/67
08:32:18 [2024-07-10T12:32:18.505Z] 30:     ifdcmpne returns wrong value on POWER (see #5152)
08:32:18 [2024-07-10T12:32:18.505Z] 30: Known Bug: Skipping test: UsingLoadParam/181
08:32:18 [2024-07-10T12:32:18.505Z] 30:     ifdcmpne returns wrong value on POWER (see #5152)
08:32:18 [2024-07-10T12:32:18.505Z] 30: Known Bug: Skipping test: UsingLoadParam/187
08:32:18 [2024-07-10T12:32:18.505Z] 30:     ifdcmpne returns wrong value on POWER (see #5152)
08:32:18 [2024-07-10T12:32:18.505Z] 30: Known Bug: Skipping test: UsingLoadParam/301
08:32:18 [2024-07-10T12:32:18.505Z] 30:     ifdcmpne returns wrong value on POWER (see #5152)
08:32:18 [2024-07-10T12:32:18.505Z] 30: Known Bug: Skipping test: UsingLoadParam/307
08:32:18 [2024-07-10T12:32:18.505Z] 30:     ifdcmpne returns wrong value on POWER (see #5152)
08:32:18 [2024-07-10T12:32:18.505Z] 30: Known Bug: Skipping test: UsingLoadParam/421
08:32:18 [2024-07-10T12:32:18.505Z] 30:     ifdcmpne returns wrong value on POWER (see #5152)
08:32:18 [2024-07-10T12:32:18.505Z] 30: Known Bug: Skipping test: UsingLoadParam/427
08:32:18 [2024-07-10T12:32:18.505Z] 30:     ifdcmpne returns wrong value on POWER (see #5152)
08:32:18 [2024-07-10T12:32:18.505Z] 30: Known Bug: Skipping test: UsingLoadParam/541
08:32:18 [2024-07-10T12:32:18.505Z] 30:     ifdcmpne returns wrong value on POWER (see #5152)
08:32:21 [2024-07-10T12:32:21.938Z] 30: Known Bug: Skipping test: UsingLoadParam/547
08:32:21 [2024-07-10T12:32:21.938Z] 30:     ifdcmpne returns wrong value on POWER (see #5152)
08:32:21 [2024-07-10T12:32:21.938Z] 30: Known Bug: Skipping test: UsingLoadParam/661
08:32:21 [2024-07-10T12:32:21.938Z] 30:     ifdcmpne returns wrong value on POWER (see #5152)
08:32:21 [2024-07-10T12:32:21.938Z] 30: Known Bug: Skipping test: UsingLoadParam/667
08:32:21 [2024-07-10T12:32:21.938Z] 30:     ifdcmpne returns wrong value on POWER (see #5152)
08:32:21 [2024-07-10T12:32:21.938Z] 30: Known Bug: Skipping test: UsingLoadParam/781
08:32:21 [2024-07-10T12:32:21.938Z] 30:     ifdcmpne returns wrong value on POWER (see #5152)
08:32:21 [2024-07-10T12:32:21.938Z] 30: Known Bug: Skipping test: UsingLoadParam/787
08:32:21 [2024-07-10T12:32:21.938Z] 30:     ifdcmpne returns wrong value on POWER (see #5152)
08:32:21 [2024-07-10T12:32:21.938Z] 30: Known Bug: Skipping test: UsingLoadParam/901
08:32:21 [2024-07-10T12:32:21.938Z] 30:     ifdcmpne returns wrong value on POWER (see #5152)
08:32:21 [2024-07-10T12:32:21.938Z] 30: Known Bug: Skipping test: UsingLoadParam/907
08:32:21 [2024-07-10T12:32:21.938Z] 30:     ifdcmpne returns wrong value on POWER (see #5152)
08:32:21 [2024-07-10T12:32:21.938Z] 30: Known Bug: Skipping test: UsingLoadParam/1021
08:32:21 [2024-07-10T12:32:21.938Z] 30:     ifdcmpne returns wrong value on POWER (see #5152)
08:32:21 [2024-07-10T12:32:21.938Z] 30: Known Bug: Skipping test: UsingLoadParam/1027
08:32:21 [2024-07-10T12:32:21.938Z] 30:     ifdcmpne returns wrong value on POWER (see #5152)
08:32:21 [2024-07-10T12:32:21.938Z] 30: Known Bug: Skipping test: UsingLoadParam/1141
08:32:21 [2024-07-10T12:32:21.938Z] 30:     ifdcmpne returns wrong value on POWER (see #5152)
08:32:21 [2024-07-10T12:32:21.938Z] 30: Known Bug: Skipping test: UsingLoadParam/1147
08:32:21 [2024-07-10T12:32:21.938Z] 30:     ifdcmpne returns wrong value on POWER (see #5152)
08:32:21 [2024-07-10T12:32:21.938Z] 30: Known Bug: Skipping test: UsingLoadParam/1201
08:32:21 [2024-07-10T12:32:21.938Z] 30:     ifdcmpne returns wrong value on POWER (see #5152)
08:32:21 [2024-07-10T12:32:21.938Z] 30: Known Bug: Skipping test: UsingLoadParam/1207
08:32:21 [2024-07-10T12:32:21.938Z] 30:     ifdcmpne returns wrong value on POWER (see #5152)
08:32:21 [2024-07-10T12:32:21.938Z] 30: Known Bug: Skipping test: UsingLoadParam/1213
08:32:21 [2024-07-10T12:32:21.938Z] 30:     ifdcmpne returns wrong value on POWER (see #5152)
08:32:21 [2024-07-10T12:32:21.938Z] 30: Known Bug: Skipping test: UsingLoadParam/1219
08:32:21 [2024-07-10T12:32:21.938Z] 30:     ifdcmpne returns wrong value on POWER (see #5152)
08:32:21 [2024-07-10T12:32:21.938Z] 30: Known Bug: Skipping test: UsingLoadParam/1225
08:32:21 [2024-07-10T12:32:21.938Z] 30:     ifdcmpne returns wrong value on POWER (see #5152)
08:32:21 [2024-07-10T12:32:21.938Z] 30: Known Bug: Skipping test: UsingLoadParam/1231
08:32:21 [2024-07-10T12:32:21.938Z] 30:     ifdcmpne returns wrong value on POWER (see #5152)
08:32:21 [2024-07-10T12:32:21.938Z] 30: Known Bug: Skipping test: UsingLoadParam/1237
08:32:21 [2024-07-10T12:32:21.938Z] 30:     ifdcmpne returns wrong value on POWER (see #5152)
08:32:21 [2024-07-10T12:32:21.938Z] 30: Known Bug: Skipping test: UsingLoadParam/1243
08:32:21 [2024-07-10T12:32:21.938Z] 30:     ifdcmpne returns wrong value on POWER (see #5152)
08:32:21 [2024-07-10T12:32:21.938Z] 30: Known Bug: Skipping test: UsingLoadParam/1249
08:32:21 [2024-07-10T12:32:21.938Z] 30:     ifdcmpne returns wrong value on POWER (see #5152)
08:32:21 [2024-07-10T12:32:21.938Z] 30: Known Bug: Skipping test: UsingLoadParam/1255
08:32:21 [2024-07-10T12:32:21.938Z] 30:     ifdcmpne returns wrong value on POWER (see #5152)
08:32:21 [2024-07-10T12:32:21.938Z] 30: Known Bug: Skipping test: UsingLoadParam/1261
08:32:21 [2024-07-10T12:32:21.938Z] 30:     ifdcmpne returns wrong value on POWER (see #5152)
08:32:21 [2024-07-10T12:32:21.938Z] 30: Known Bug: Skipping test: UsingLoadParam/1267
08:32:21 [2024-07-10T12:32:21.938Z] 30:     ifdcmpne returns wrong value on POWER (see #5152)
08:32:21 [2024-07-10T12:32:21.938Z] 30: Known Bug: Skipping test: UsingLoadParam/1273
08:32:21 [2024-07-10T12:32:21.938Z] 30:     ifdcmpne returns wrong value on POWER (see #5152)
08:32:21 [2024-07-10T12:32:21.938Z] 30: Known Bug: Skipping test: UsingLoadParam/1279
08:32:21 [2024-07-10T12:32:21.938Z] 30:     ifdcmpne returns wrong value on POWER (see #5152)
08:32:21 [2024-07-10T12:32:21.938Z] 30: Known Bug: Skipping test: UsingLoadParam/1285
08:32:21 [2024-07-10T12:32:21.938Z] 30:     ifdcmpne returns wrong value on POWER (see #5152)
08:32:21 [2024-07-10T12:32:21.938Z] 30: Known Bug: Skipping test: UsingLoadParam/1291
08:32:21 [2024-07-10T12:32:21.938Z] 30:     ifdcmpne returns wrong value on POWER (see #5152)
08:32:21 [2024-07-10T12:32:21.938Z] 30: Known Bug: Skipping test: UsingLoadParam/1297
08:32:21 [2024-07-10T12:32:21.938Z] 30:     ifdcmpne returns wrong value on POWER (see #5152)
08:32:21 [2024-07-10T12:32:21.938Z] 30: Known Bug: Skipping test: UsingLoadParam/1303
08:32:21 [2024-07-10T12:32:21.938Z] 30:     ifdcmpne returns wrong value on POWER (see #5152)
08:32:21 [2024-07-10T12:32:21.938Z] 30: Known Bug: Skipping test: UsingLoadParam/1309
08:32:21 [2024-07-10T12:32:21.938Z] 30:     ifdcmpne returns wrong value on POWER (see #5152)
08:32:21 [2024-07-10T12:32:21.938Z] 30: Known Bug: Skipping test: UsingLoadParam/1315
08:32:21 [2024-07-10T12:32:21.938Z] 30:     ifdcmpne returns wrong value on POWER (see #5152)
08:32:21 [2024-07-10T12:32:21.938Z] 30: Known Bug: Skipping test: UsingLoadParam/1321
08:32:21 [2024-07-10T12:32:21.938Z] 30:     ifdcmpne returns wrong value on POWER (see #5152)
08:32:21 [2024-07-10T12:32:21.938Z] 30: Known Bug: Skipping test: UsingLoadParam/1327
08:32:21 [2024-07-10T12:32:21.938Z] 30:     ifdcmpne returns wrong value on POWER (see #5152)
08:32:21 [2024-07-10T12:32:21.938Z] 30: Known Bug: Skipping test: UsingLoadParam/1333
08:32:21 [2024-07-10T12:32:21.938Z] 30:     ifdcmpne returns wrong value on POWER (see #5152)
08:32:21 [2024-07-10T12:32:21.938Z] 30: Known Bug: Skipping test: UsingLoadParam/1339
08:32:21 [2024-07-10T12:32:21.938Z] 30:     ifdcmpne returns wrong value on POWER (see #5152)
08:32:21 [2024-07-10T12:32:21.938Z] 30: Known Bug: Skipping test: UsingLoadParam/1345
08:32:21 [2024-07-10T12:32:21.938Z] 30:     ifdcmpne returns wrong value on POWER (see #5152)
08:32:21 [2024-07-10T12:32:21.938Z] 30: Known Bug: Skipping test: UsingLoadParam/1351
08:32:21 [2024-07-10T12:32:21.938Z] 30:     ifdcmpne returns wrong value on POWER (see #5152)
08:32:21 [2024-07-10T12:32:21.938Z] 30: Known Bug: Skipping test: UsingLoadParam/1357
08:32:21 [2024-07-10T12:32:21.938Z] 30:     ifdcmpne returns wrong value on POWER (see #5152)
08:32:21 [2024-07-10T12:32:21.938Z] 30: Known Bug: Skipping test: UsingLoadParam/1363
08:32:21 [2024-07-10T12:32:21.938Z] 30:     ifdcmpne returns wrong value on POWER (see #5152)
08:32:21 [2024-07-10T12:32:21.938Z] 30: Known Bug: Skipping test: UsingLoadParam/1369
08:32:21 [2024-07-10T12:32:21.938Z] 30:     ifdcmpne returns wrong value on POWER (see #5152)
08:32:21 [2024-07-10T12:32:21.938Z] 30: Known Bug: Skipping test: UsingLoadParam/1375
08:32:21 [2024-07-10T12:32:21.938Z] 30:     ifdcmpne returns wrong value on POWER (see #5152)
08:32:21 [2024-07-10T12:32:21.938Z] 30: Known Bug: Skipping test: UsingLoadParam/1381
08:32:21 [2024-07-10T12:32:21.938Z] 30:     ifdcmpne returns wrong value on POWER (see #5152)
08:32:21 [2024-07-10T12:32:21.938Z] 30: Known Bug: Skipping test: UsingLoadParam/1387
08:32:21 [2024-07-10T12:32:21.938Z] 30:     ifdcmpne returns wrong value on POWER (see #5152)
08:32:21 [2024-07-10T12:32:21.938Z] 30: Known Bug: Skipping test: UsingLoadParam/1393
08:32:21 [2024-07-10T12:32:21.938Z] 30:     ifdcmpne returns wrong value on POWER (see #5152)
08:32:21 [2024-07-10T12:32:21.938Z] 30: Known Bug: Skipping test: UsingLoadParam/1399
08:32:21 [2024-07-10T12:32:21.938Z] 30:     ifdcmpne returns wrong value on POWER (see #5152)
08:32:21 [2024-07-10T12:32:21.938Z] 30: Known Bug: Skipping test: UsingLoadParam/1405
08:32:21 [2024-07-10T12:32:21.938Z] 30:     ifdcmpne returns wrong value on POWER (see #5152)
08:32:21 [2024-07-10T12:32:21.938Z] 30: Known Bug: Skipping test: UsingLoadParam/1411
08:32:21 [2024-07-10T12:32:21.938Z] 30:     ifdcmpne returns wrong value on POWER (see #5152)
08:32:21 [2024-07-10T12:32:21.938Z] 30: Known Bug: Skipping test: UsingLoadParam/1417
08:32:21 [2024-07-10T12:32:21.938Z] 30:     ifdcmpne returns wrong value on POWER (see #5152)
08:32:21 [2024-07-10T12:32:21.938Z] 30: Known Bug: Skipping test: UsingLoadParam/1423
08:32:21 [2024-07-10T12:32:21.938Z] 30:     ifdcmpne returns wrong value on POWER (see #5152)
08:32:21 [2024-07-10T12:32:21.938Z] 30: Known Bug: Skipping test: UsingLoadParam/1429
08:32:21 [2024-07-10T12:32:21.938Z] 30:     ifdcmpne returns wrong value on POWER (see #5152)
08:32:21 [2024-07-10T12:32:21.938Z] 30: Known Bug: Skipping test: UsingLoadParam/1435
08:32:21 [2024-07-10T12:32:21.938Z] 30:     ifdcmpne returns wrong value on POWER (see #5152)
08:32:21 [2024-07-10T12:32:21.938Z] 30: Known Bug: Skipping test: UsingLoadParam/1501
08:32:21 [2024-07-10T12:32:21.938Z] 30:     ifdcmpne returns wrong value on POWER (see #5152)
08:32:21 [2024-07-10T12:32:21.938Z] 30: Known Bug: Skipping test: UsingLoadParam/1507
08:32:21 [2024-07-10T12:32:21.938Z] 30:     ifdcmpne returns wrong value on POWER (see #5152)
08:32:21 [2024-07-10T12:32:21.938Z] 30: Known Bug: Skipping test: UsingLoadParam/1621
08:32:21 [2024-07-10T12:32:21.938Z] 30:     ifdcmpne returns wrong value on POWER (see #5152)
08:32:21 [2024-07-10T12:32:21.938Z] 30: Known Bug: Skipping test: UsingLoadParam/1627
08:32:21 [2024-07-10T12:32:21.938Z] 30:     ifdcmpne returns wrong value on POWER (see #5152)
08:32:21 [2024-07-10T12:32:21.938Z] 30: Known Bug: Skipping test: UsingLoadParam/1741
08:32:21 [2024-07-10T12:32:21.938Z] 30:     ifdcmpne returns wrong value on POWER (see #5152)
08:32:21 [2024-07-10T12:32:21.938Z] 30: Known Bug: Skipping test: UsingLoadParam/1747
08:32:21 [2024-07-10T12:32:21.938Z] 30:     ifdcmpne returns wrong value on POWER (see #5152)
08:32:21 [2024-07-10T12:32:21.938Z] 30: Known Bug: Skipping test: UsingLoadParam/1861
08:32:21 [2024-07-10T12:32:21.938Z] 30:     ifdcmpne returns wrong value on POWER (see #5152)
08:32:21 [2024-07-10T12:32:21.938Z] 30: Known Bug: Skipping test: UsingLoadParam/1867
08:32:21 [2024-07-10T12:32:21.938Z] 30:     ifdcmpne returns wrong value on POWER (see #5152)
08:32:21 [2024-07-10T12:32:21.938Z] 30: Known Bug: Skipping test: UsingLoadParam/1981
08:32:21 [2024-07-10T12:32:21.938Z] 30:     ifdcmpne returns wrong value on POWER (see #5152)
08:32:21 [2024-07-10T12:32:21.938Z] 30: Known Bug: Skipping test: UsingLoadParam/1987
08:32:21 [2024-07-10T12:32:21.938Z] 30:     ifdcmpne returns wrong value on POWER (see #5152)
08:32:21 [2024-07-10T12:32:21.938Z] 30: Known Bug: Skipping test: UsingLoadParam/2101
08:32:21 [2024-07-10T12:32:21.938Z] 30:     ifdcmpne returns wrong value on POWER (see #5152)
08:32:21 [2024-07-10T12:32:21.938Z] 30: Known Bug: Skipping test: UsingLoadParam/2107
08:32:21 [2024-07-10T12:32:21.938Z] 30:     ifdcmpne returns wrong value on POWER (see #5152)
08:32:21 [2024-07-10T12:32:21.938Z] 30: Known Bug: Skipping test: UsingLoadParam/2221
08:32:21 [2024-07-10T12:32:21.938Z] 30:     ifdcmpne returns wrong value on POWER (see #5152)
08:32:21 [2024-07-10T12:32:21.938Z] 30: Known Bug: Skipping test: UsingLoadParam/2227
08:32:21 [2024-07-10T12:32:21.938Z] 30:     ifdcmpne returns wrong value on POWER (see #5152)
08:32:21 [2024-07-10T12:32:21.938Z] 30: Known Bug: Skipping test: UsingLoadParam/2341
08:32:21 [2024-07-10T12:32:21.938Z] 30:     ifdcmpne returns wrong value on POWER (see #5152)
08:32:21 [2024-07-10T12:32:21.938Z] 30: Known Bug: Skipping test: UsingLoadParam/2347
08:32:21 [2024-07-10T12:32:21.938Z] 30:     ifdcmpne returns wrong value on POWER (see #5152)
08:32:21 [2024-07-10T12:32:21.938Z] 30: [----------] 4800 tests from CompareTest/DoubleIfCompare (9165 ms total)
08:32:21 [2024-07-10T12:32:21.938Z] 30: 
08:32:21 [2024-07-10T12:32:21.938Z] 30: [----------] 6498 tests from CompareTest/FloatCompareOrUnordered
08:32:29 [2024-07-10T12:32:29.955Z] 30: [----------] 6498 tests from CompareTest/FloatCompareOrUnordered (7554 ms total)
08:32:29 [2024-07-10T12:32:29.955Z] 30: 
08:32:29 [2024-07-10T12:32:29.955Z] 30: [----------] 7200 tests from CompareTest/DoubleCompareOrUnordered
08:32:37 [2024-07-10T12:32:37.975Z] 30: [----------] 7200 tests from CompareTest/DoubleCompareOrUnordered (8454 ms total)
08:32:37 [2024-07-10T12:32:37.975Z] 30: 
08:32:37 [2024-07-10T12:32:37.975Z] 30: [----------] 4332 tests from CompareTest/FloatIfCompareOrUnordered
08:32:47 [2024-07-10T12:32:47.595Z] 30: [----------] 4332 tests from CompareTest/FloatIfCompareOrUnordered (8606 ms total)
08:32:47 [2024-07-10T12:32:47.595Z] 30: 
08:32:47 [2024-07-10T12:32:47.595Z] 30: [----------] 4800 tests from CompareTest/DoubleIfCompareOrUnordered
08:32:57 [2024-07-10T12:32:57.223Z] 30: [----------] 4800 tests from CompareTest/DoubleIfCompareOrUnordered (9623 ms total)
08:32:57 [2024-07-10T12:32:57.223Z] 30: 
08:32:57 [2024-07-10T12:32:57.223Z] 30: [----------] 20 tests from TypeConversionTest/Int8ToInt32
08:32:57 [2024-07-10T12:32:57.223Z] 30: [----------] 20 tests from TypeConversionTest/Int8ToInt32 (21 ms total)
08:32:57 [2024-07-10T12:32:57.223Z] 30: 
08:32:57 [2024-07-10T12:32:57.223Z] 30: [----------] 20 tests from TypeConversionTest/UInt8ToInt32
08:32:57 [2024-07-10T12:32:57.223Z] 30: [----------] 20 tests from TypeConversionTest/UInt8ToInt32 (21 ms total)
08:32:57 [2024-07-10T12:32:57.223Z] 30: 
08:32:57 [2024-07-10T12:32:57.223Z] 30: [----------] 20 tests from TypeConversionTest/Int8ToInt64
08:32:57 [2024-07-10T12:32:57.223Z] 30: [----------] 20 tests from TypeConversionTest/Int8ToInt64 (21 ms total)
08:32:57 [2024-07-10T12:32:57.223Z] 30: 
08:32:57 [2024-07-10T12:32:57.223Z] 30: [----------] 20 tests from TypeConversionTest/UInt8ToInt64
08:32:57 [2024-07-10T12:32:57.223Z] 30: [----------] 20 tests from TypeConversionTest/UInt8ToInt64 (21 ms total)
08:32:57 [2024-07-10T12:32:57.223Z] 30: 
08:32:57 [2024-07-10T12:32:57.223Z] 30: [----------] 20 tests from TypeConversionTest/Int16ToInt32
08:32:57 [2024-07-10T12:32:57.223Z] 30: [----------] 20 tests from TypeConversionTest/Int16ToInt32 (21 ms total)
08:32:57 [2024-07-10T12:32:57.223Z] 30: 
08:32:57 [2024-07-10T12:32:57.223Z] 30: [----------] 20 tests from TypeConversionTest/UInt16ToInt32
08:32:57 [2024-07-10T12:32:57.223Z] 30: [----------] 20 tests from TypeConversionTest/UInt16ToInt32 (21 ms total)
08:32:57 [2024-07-10T12:32:57.223Z] 30: 
08:32:57 [2024-07-10T12:32:57.223Z] 30: [----------] 20 tests from TypeConversionTest/Int16ToInt64
08:32:57 [2024-07-10T12:32:57.223Z] 30: [----------] 20 tests from TypeConversionTest/Int16ToInt64 (21 ms total)
08:32:57 [2024-07-10T12:32:57.223Z] 30: 
08:32:57 [2024-07-10T12:32:57.223Z] 30: [----------] 20 tests from TypeConversionTest/UInt16ToInt64
08:32:57 [2024-07-10T12:32:57.223Z] 30: [----------] 20 tests from TypeConversionTest/UInt16ToInt64 (21 ms total)
08:32:57 [2024-07-10T12:32:57.223Z] 30: 
08:32:57 [2024-07-10T12:32:57.223Z] 30: [----------] 32 tests from TypeConversionTest/Int32ToInt64
08:32:57 [2024-07-10T12:32:57.223Z] 30: [----------] 32 tests from TypeConversionTest/Int32ToInt64 (34 ms total)
08:32:57 [2024-07-10T12:32:57.223Z] 30: 
08:32:57 [2024-07-10T12:32:57.223Z] 30: [----------] 40 tests from TypeConversionTest/UInt32ToInt64
08:32:57 [2024-07-10T12:32:57.223Z] 30: [----------] 40 tests from TypeConversionTest/UInt32ToInt64 (42 ms total)
08:32:57 [2024-07-10T12:32:57.223Z] 30: 
08:32:57 [2024-07-10T12:32:57.223Z] 30: [----------] 36 tests from TypeConversionTest/Int64ToInt32
08:32:57 [2024-07-10T12:32:57.223Z] 30: [----------] 36 tests from TypeConversionTest/Int64ToInt32 (38 ms total)
08:32:57 [2024-07-10T12:32:57.223Z] 30: 
08:32:57 [2024-07-10T12:32:57.223Z] 30: [----------] 24 tests from TypeConversionTest/FloatToInt32
08:32:57 [2024-07-10T12:32:57.223Z] 30: [----------] 24 tests from TypeConversionTest/FloatToInt32 (25 ms total)
08:32:57 [2024-07-10T12:32:57.223Z] 30: 
08:32:57 [2024-07-10T12:32:57.223Z] 30: [----------] 30 tests from TypeConversionTest/FloatToInt64
08:32:57 [2024-07-10T12:32:57.223Z] 30: [----------] 30 tests from TypeConversionTest/FloatToInt64 (33 ms total)
08:32:57 [2024-07-10T12:32:57.223Z] 30: 
08:32:57 [2024-07-10T12:32:57.223Z] 30: [----------] 24 tests from TypeConversionTest/DoubleToInt32
08:32:57 [2024-07-10T12:32:57.223Z] 30: [----------] 24 tests from TypeConversionTest/DoubleToInt32 (25 ms total)
08:32:57 [2024-07-10T12:32:57.223Z] 30: 
08:32:57 [2024-07-10T12:32:57.223Z] 30: [----------] 32 tests from TypeConversionTest/DoubleToInt64
08:32:57 [2024-07-10T12:32:57.223Z] 30: [----------] 32 tests from TypeConversionTest/DoubleToInt64 (34 ms total)
08:32:57 [2024-07-10T12:32:57.223Z] 30: 
08:32:57 [2024-07-10T12:32:57.223Z] 30: [----------] 38 tests from TypeConversionTest/FloatToDouble
08:32:57 [2024-07-10T12:32:57.223Z] 30: [----------] 38 tests from TypeConversionTest/FloatToDouble (40 ms total)
08:32:57 [2024-07-10T12:32:57.223Z] 30: 
08:32:57 [2024-07-10T12:32:57.223Z] 30: [----------] 40 tests from TypeConversionTest/DoubleToFloat
08:32:57 [2024-07-10T12:32:57.223Z] 30: [----------] 40 tests from TypeConversionTest/DoubleToFloat (42 ms total)
08:32:57 [2024-07-10T12:32:57.223Z] 30: 
08:32:57 [2024-07-10T12:32:57.223Z] 30: [----------] 33 tests from TypeConversionTest/FloatNormalizeNan
08:32:57 [2024-07-10T12:32:57.223Z] 30: [----------] 33 tests from TypeConversionTest/FloatNormalizeNan (39 ms total)
08:32:57 [2024-07-10T12:32:57.223Z] 30: 
08:32:57 [2024-07-10T12:32:57.223Z] 30: [----------] 33 tests from TypeConversionTest/DoubleNormalizeNan
08:32:57 [2024-07-10T12:32:57.223Z] 30: [----------] 33 tests from TypeConversionTest/DoubleNormalizeNan (38 ms total)
08:32:57 [2024-07-10T12:32:57.223Z] 30: 
08:32:57 [2024-07-10T12:32:57.223Z] 30: [----------] 32 tests from TypeConversionTest/Int32BitsToFloat
08:32:57 [2024-07-10T12:32:57.223Z] 30: [----------] 32 tests from TypeConversionTest/Int32BitsToFloat (34 ms total)
08:32:57 [2024-07-10T12:32:57.223Z] 30: 
08:32:57 [2024-07-10T12:32:57.223Z] 30: [----------] 38 tests from TypeConversionTest/FloatBitsToInt32
08:32:57 [2024-07-10T12:32:57.223Z] 30: [----------] 38 tests from TypeConversionTest/FloatBitsToInt32 (39 ms total)
08:32:57 [2024-07-10T12:32:57.223Z] 30: 
08:32:57 [2024-07-10T12:32:57.223Z] 30: [----------] 36 tests from TypeConversionTest/Int64BitsToDouble
08:32:57 [2024-07-10T12:32:57.223Z] 30: [----------] 36 tests from TypeConversionTest/Int64BitsToDouble (38 ms total)
08:32:57 [2024-07-10T12:32:57.223Z] 30: 
08:32:57 [2024-07-10T12:32:57.223Z] 30: [----------] 40 tests from TypeConversionTest/DoubleBitsToInt64
08:32:57 [2024-07-10T12:32:57.223Z] 30: [----------] 40 tests from TypeConversionTest/DoubleBitsToInt64 (43 ms total)
08:32:57 [2024-07-10T12:32:57.223Z] 30: 
08:32:57 [2024-07-10T12:32:57.223Z] 30: [----------] 60 tests from SelectTest/Int8SelectTest
08:32:57 [2024-07-10T12:32:57.223Z] 30: [----------] 60 tests from SelectTest/Int8SelectTest (79 ms total)
08:32:57 [2024-07-10T12:32:57.223Z] 30: 
08:32:57 [2024-07-10T12:32:57.223Z] 30: [----------] 60 tests from SelectTest/Int16SelectTest
08:32:57 [2024-07-10T12:32:57.223Z] 30: [----------] 60 tests from SelectTest/Int16SelectTest (81 ms total)
08:32:57 [2024-07-10T12:32:57.223Z] 30: 
08:32:57 [2024-07-10T12:32:57.223Z] 30: [----------] 60 tests from SelectTest/Int32SelectTest
08:32:57 [2024-07-10T12:32:57.223Z] 30: [----------] 60 tests from SelectTest/Int32SelectTest (76 ms total)
08:32:57 [2024-07-10T12:32:57.223Z] 30: 
08:32:57 [2024-07-10T12:32:57.223Z] 30: [----------] 60 tests from SelectTest/Int64SelectTest
08:32:57 [2024-07-10T12:32:57.223Z] 30: [----------] 60 tests from SelectTest/Int64SelectTest (76 ms total)
08:32:57 [2024-07-10T12:32:57.223Z] 30: 
08:32:57 [2024-07-10T12:32:57.223Z] 30: [----------] 60 tests from SelectTest/FloatSelectTest
08:32:57 [2024-07-10T12:32:57.223Z] 30: [----------] 60 tests from SelectTest/FloatSelectTest (76 ms total)
08:32:57 [2024-07-10T12:32:57.223Z] 30: 
08:32:57 [2024-07-10T12:32:57.223Z] 30: [----------] 60 tests from SelectTest/DoubleSelectTest
08:32:57 [2024-07-10T12:32:57.223Z] 30: [----------] 60 tests from SelectTest/DoubleSelectTest (77 ms total)
08:32:57 [2024-07-10T12:32:57.223Z] 30: 
08:32:57 [2024-07-10T12:32:57.223Z] 30: [----------] 450 tests from SelectCompareTest/Int8SelectInt32CompareTest
08:32:57 [2024-07-10T12:32:57.788Z] 30: [----------] 450 tests from SelectCompareTest/Int8SelectInt32CompareTest (703 ms total)
08:32:57 [2024-07-10T12:32:57.788Z] 30: 
08:32:57 [2024-07-10T12:32:57.788Z] 30: [----------] 450 tests from SelectCompareTest/Int16SelectInt32CompareTest
08:32:58 [2024-07-10T12:32:58.966Z] 30: [----------] 450 tests from SelectCompareTest/Int16SelectInt32CompareTest (705 ms total)
08:32:58 [2024-07-10T12:32:58.966Z] 30: 
08:32:58 [2024-07-10T12:32:58.966Z] 30: [----------] 450 tests from SelectCompareTest/Int32SelectInt32CompareTest
08:32:59 [2024-07-10T12:32:59.530Z] 30: [----------] 450 tests from SelectCompareTest/Int32SelectInt32CompareTest (667 ms total)
08:32:59 [2024-07-10T12:32:59.530Z] 30: 
08:32:59 [2024-07-10T12:32:59.530Z] 30: [----------] 450 tests from SelectCompareTest/Int64SelectInt32CompareTest
08:33:00 [2024-07-10T12:33:00.095Z] 30: [----------] 450 tests from SelectCompareTest/Int64SelectInt32CompareTest (672 ms total)
08:33:00 [2024-07-10T12:33:00.095Z] 30: 
08:33:00 [2024-07-10T12:33:00.095Z] 30: [----------] 450 tests from SelectCompareTest/FloatSelectInt32CompareTest
08:33:00 [2024-07-10T12:33:00.659Z] 30: [----------] 450 tests from SelectCompareTest/FloatSelectInt32CompareTest (674 ms total)
08:33:00 [2024-07-10T12:33:00.659Z] 30: 
08:33:00 [2024-07-10T12:33:00.659Z] 30: [----------] 450 tests from SelectCompareTest/DoubleSelectInt32CompareTest
08:33:01 [2024-07-10T12:33:01.225Z] 30: [----------] 450 tests from SelectCompareTest/DoubleSelectInt32CompareTest (677 ms total)
08:33:01 [2024-07-10T12:33:01.225Z] 30: 
08:33:01 [2024-07-10T12:33:01.225Z] 30: [----------] 450 tests from SelectCompareTest/Int32SelectInt8CompareTest
08:33:01 [2024-07-10T12:33:01.789Z] 30: [----------] 450 tests from SelectCompareTest/Int32SelectInt8CompareTest (669 ms total)
08:33:01 [2024-07-10T12:33:01.789Z] 30: 
08:33:01 [2024-07-10T12:33:01.789Z] 30: [----------] 450 tests from SelectCompareTest/Int32SelectInt16CompareTest
08:33:02 [2024-07-10T12:33:02.965Z] 30: [----------] 450 tests from SelectCompareTest/Int32SelectInt16CompareTest (670 ms total)
08:33:02 [2024-07-10T12:33:02.965Z] 30: 
08:33:02 [2024-07-10T12:33:02.965Z] 30: [----------] 450 tests from SelectCompareTest/Int32SelectInt64CompareTest
08:33:03 [2024-07-10T12:33:03.529Z] 30: [----------] 450 tests from SelectCompareTest/Int32SelectInt64CompareTest (666 ms total)
08:33:03 [2024-07-10T12:33:03.529Z] 30: 
08:33:03 [2024-07-10T12:33:03.529Z] 30: [----------] 540 tests from SelectCompareTest/Int32SelectFloatCompareTest
08:33:04 [2024-07-10T12:33:04.094Z] 30: [----------] 540 tests from SelectCompareTest/Int32SelectFloatCompareTest (795 ms total)
08:33:04 [2024-07-10T12:33:04.094Z] 30: 
08:33:04 [2024-07-10T12:33:04.094Z] 30: [----------] 540 tests from SelectCompareTest/Int32SelectDoubleCompareTest
08:33:05 [2024-07-10T12:33:05.273Z] 30: [----------] 540 tests from SelectCompareTest/Int32SelectDoubleCompareTest (822 ms total)
08:33:05 [2024-07-10T12:33:05.273Z] 30: 
08:33:05 [2024-07-10T12:33:05.273Z] 30: [----------] 381 tests from ArraycmpTest/ArraycmpEqualTest
08:33:05 [2024-07-10T12:33:05.837Z] 30: [----------] 381 tests from ArraycmpTest/ArraycmpEqualTest (581 ms total)
08:33:05 [2024-07-10T12:33:05.837Z] 30: 
08:33:05 [2024-07-10T12:33:05.837Z] 30: [----------] 4896 tests from ArraycmpTest/ArraycmpNotEqualTest
08:33:13 [2024-07-10T12:33:13.856Z] 30: [----------] 4896 tests from ArraycmpTest/ArraycmpNotEqualTest (7320 ms total)
08:33:13 [2024-07-10T12:33:13.856Z] 30: 
08:33:13 [2024-07-10T12:33:13.856Z] 30: [----------] 381 tests from ArraycmplenTest/ArraycmplenEqualTest
08:33:13 [2024-07-10T12:33:13.856Z] 30: [----------] 381 tests from ArraycmplenTest/ArraycmplenEqualTest (572 ms total)
08:33:13 [2024-07-10T12:33:13.856Z] 30: 
08:33:13 [2024-07-10T12:33:13.856Z] 30: [----------] 2448 tests from ArraycmplenTest/ArraycmplenNotEqualTest
08:33:17 [2024-07-10T12:33:17.287Z] 30: [----------] 2448 tests from ArraycmplenTest/ArraycmplenNotEqualTest (3650 ms total)
08:33:17 [2024-07-10T12:33:17.287Z] 30: 
08:33:17 [2024-07-10T12:33:17.287Z] 30: [==========] 156775 tests from 169 test cases ran. (205877 ms total)
08:33:17 [2024-07-10T12:33:17.287Z] 30: [  PASSED  ] 156775 tests.
08:33:17 [2024-07-10T12:33:17.287Z] 30: [  ALL TESTS PASSED  ] 
08:33:25 [2024-07-10T12:33:25.307Z] 30: 
08:33:25 [2024-07-10T12:33:25.307Z] 30/31 Test #30: comptest ..........................   Passed  218.44 sec
08:33:25 [2024-07-10T12:33:25.307Z] test 31
08:33:25 [2024-07-10T12:33:25.307Z]       Start 31: compunittest
08:33:25 [2024-07-10T12:33:25.307Z] 
08:33:25 [2024-07-10T12:33:25.307Z] 31: Test command: /home/jenkins/jenkins-agent/workspace/Build/build/fvtest/compilerunittest/compunittest "--gtest_color=yes" "--gtest_output=xml:/home/jenkins/jenkins-agent/workspace/Build/build/fvtest/compilerunittest/compunittest-results.xml"
08:33:25 [2024-07-10T12:33:25.307Z] 31: Test timeout computed to be: 10000000
08:33:25 [2024-07-10T12:33:25.307Z] 31: [==========] Running 9141 tests from 117 test cases.
08:33:25 [2024-07-10T12:33:25.307Z] 31: [----------] 26 tests from PPCMemInstructionExpansionTest
08:33:25 [2024-07-10T12:33:25.307Z] 31: [----------] 26 tests from PPCMemInstructionExpansionTest (8 ms total)
08:33:25 [2024-07-10T12:33:25.307Z] 31: 
08:33:25 [2024-07-10T12:33:25.307Z] 31: [----------] 2 tests from PeepholeTest
08:33:25 [2024-07-10T12:33:25.307Z] 31: [----------] 2 tests from PeepholeTest (0 ms total)
08:33:25 [2024-07-10T12:33:25.307Z] 31: 
08:33:25 [2024-07-10T12:33:25.307Z] 31: [----------] 16 tests from AbsVPValueTest
08:33:25 [2024-07-10T12:33:25.307Z] 31: [----------] 16 tests from AbsVPValueTest (5 ms total)
08:33:25 [2024-07-10T12:33:25.307Z] 31: 
08:33:25 [2024-07-10T12:33:25.307Z] 31: [----------] 4 tests from AbsOpStackTest
08:33:25 [2024-07-10T12:33:25.307Z] 31: [----------] 4 tests from AbsOpStackTest (1 ms total)
08:33:25 [2024-07-10T12:33:25.307Z] 31: 
08:33:25 [2024-07-10T12:33:25.307Z] 31: [----------] 4 tests from AbsOpArrayTest
08:33:25 [2024-07-10T12:33:25.307Z] 31: [----------] 4 tests from AbsOpArrayTest (2 ms total)
08:33:25 [2024-07-10T12:33:25.307Z] 31: 
08:33:25 [2024-07-10T12:33:25.307Z] 31: [----------] 10 tests from CCDataTest/0, where TypeParam = unsigned char
08:33:25 [2024-07-10T12:33:25.307Z] 31: [----------] 10 tests from CCDataTest/0 (0 ms total)
08:33:25 [2024-07-10T12:33:25.307Z] 31: 
08:33:25 [2024-07-10T12:33:25.307Z] 31: [----------] 10 tests from CCDataTest/1, where TypeParam = unsigned short
08:33:25 [2024-07-10T12:33:25.307Z] 31: [----------] 10 tests from CCDataTest/1 (0 ms total)
08:33:25 [2024-07-10T12:33:25.307Z] 31: 
08:33:25 [2024-07-10T12:33:25.307Z] 31: [----------] 10 tests from CCDataTest/2, where TypeParam = unsigned int
08:33:25 [2024-07-10T12:33:25.307Z] 31: [----------] 10 tests from CCDataTest/2 (0 ms total)
08:33:25 [2024-07-10T12:33:25.307Z] 31: 
08:33:25 [2024-07-10T12:33:25.307Z] 31: [----------] 10 tests from CCDataTest/3, where TypeParam = unsigned long
08:33:25 [2024-07-10T12:33:25.307Z] 31: [----------] 10 tests from CCDataTest/3 (0 ms total)
08:33:25 [2024-07-10T12:33:25.307Z] 31: 
08:33:25 [2024-07-10T12:33:25.307Z] 31: [----------] 10 tests from CCDataTest/4, where TypeParam = signed char
08:33:25 [2024-07-10T12:33:25.307Z] 31: [----------] 10 tests from CCDataTest/4 (1 ms total)
08:33:25 [2024-07-10T12:33:25.307Z] 31: 
08:33:25 [2024-07-10T12:33:25.307Z] 31: [----------] 10 tests from CCDataTest/5, where TypeParam = short
08:33:25 [2024-07-10T12:33:25.307Z] 31: [----------] 10 tests from CCDataTest/5 (0 ms total)
08:33:25 [2024-07-10T12:33:25.307Z] 31: 
08:33:25 [2024-07-10T12:33:25.307Z] 31: [----------] 10 tests from CCDataTest/6, where TypeParam = int
08:33:25 [2024-07-10T12:33:25.307Z] 31: [----------] 10 tests from CCDataTest/6 (0 ms total)
08:33:25 [2024-07-10T12:33:25.307Z] 31: 
08:33:25 [2024-07-10T12:33:25.307Z] 31: [----------] 10 tests from CCDataTest/7, where TypeParam = long
08:33:25 [2024-07-10T12:33:25.307Z] 31: [----------] 10 tests from CCDataTest/7 (0 ms total)
08:33:25 [2024-07-10T12:33:25.307Z] 31: 
08:33:25 [2024-07-10T12:33:25.307Z] 31: [----------] 10 tests from CCDataTest/8, where TypeParam = odd_sized_t
08:33:25 [2024-07-10T12:33:25.307Z] 31: [----------] 10 tests from CCDataTest/8 (0 ms total)
08:33:25 [2024-07-10T12:33:25.307Z] 31: 
08:33:25 [2024-07-10T12:33:25.307Z] 31: [----------] 1 test from AllTypesCCDataTest
08:33:25 [2024-07-10T12:33:25.307Z] 31: [----------] 1 test from AllTypesCCDataTest (1 ms total)
08:33:25 [2024-07-10T12:33:25.307Z] 31: 
08:33:25 [2024-07-10T12:33:25.307Z] 31: [----------] 21 tests from Special/PPCRecordFormSanityTest
08:33:25 [2024-07-10T12:33:25.307Z] 31: [----------] 21 tests from Special/PPCRecordFormSanityTest (5 ms total)
08:33:25 [2024-07-10T12:33:25.307Z] 31: 
08:33:25 [2024-07-10T12:33:25.307Z] 31: [----------] 78 tests from Branch/PPCRecordFormSanityTest
08:33:25 [2024-07-10T12:33:25.307Z] 31: [----------] 78 tests from Branch/PPCRecordFormSanityTest (23 ms total)
08:33:25 [2024-07-10T12:33:25.307Z] 31: 
08:33:25 [2024-07-10T12:33:25.307Z] 31: [----------] 39 tests from SprMove/PPCRecordFormSanityTest
08:33:25 [2024-07-10T12:33:25.307Z] 31: [----------] 39 tests from SprMove/PPCRecordFormSanityTest (11 ms total)
08:33:25 [2024-07-10T12:33:25.307Z] 31: 
08:33:25 [2024-07-10T12:33:25.307Z] 31: [----------] 120 tests from Trap/PPCRecordFormSanityTest
08:33:25 [2024-07-10T12:33:25.307Z] 31: [----------] 120 tests from Trap/PPCRecordFormSanityTest (34 ms total)
08:33:25 [2024-07-10T12:33:25.307Z] 31: 
08:33:25 [2024-07-10T12:33:25.307Z] 31: [----------] 147 tests from Arithmetic/PPCRecordFormSanityTest
08:33:25 [2024-07-10T12:33:25.307Z] 31: [----------] 147 tests from Arithmetic/PPCRecordFormSanityTest (42 ms total)
08:33:25 [2024-07-10T12:33:25.307Z] 31: 
08:33:25 [2024-07-10T12:33:25.307Z] 31: [----------] 33 tests from Comparison/PPCRecordFormSanityTest
08:33:25 [2024-07-10T12:33:25.307Z] 31: [----------] 33 tests from Comparison/PPCRecordFormSanityTest (9 ms total)
08:33:25 [2024-07-10T12:33:25.307Z] 31: 
08:33:25 [2024-07-10T12:33:25.307Z] 31: [----------] 39 tests from ConditionLogic/PPCRecordFormSanityTest
08:33:25 [2024-07-10T12:33:25.307Z] 31: [----------] 39 tests from ConditionLogic/PPCRecordFormSanityTest (11 ms total)
08:33:25 [2024-07-10T12:33:25.307Z] 31: 
08:33:25 [2024-07-10T12:33:25.307Z] 31: [----------] 57 tests from Bitwise/PPCRecordFormSanityTest
08:33:25 [2024-07-10T12:33:25.307Z] 31: [----------] 57 tests from Bitwise/PPCRecordFormSanityTest (16 ms total)
08:33:25 [2024-07-10T12:33:25.307Z] 31: 
08:33:25 [2024-07-10T12:33:25.307Z] 31: [----------] 12 tests from BitCounting/PPCRecordFormSanityTest
08:33:25 [2024-07-10T12:33:25.307Z] 31: [----------] 12 tests from BitCounting/PPCRecordFormSanityTest (4 ms total)
08:33:25 [2024-07-10T12:33:25.307Z] 31: 
08:33:25 [2024-07-10T12:33:25.307Z] 31: [----------] 51 tests from ShiftAndRotate/PPCRecordFormSanityTest
08:33:25 [2024-07-10T12:33:25.307Z] 31: [----------] 51 tests from ShiftAndRotate/PPCRecordFormSanityTest (14 ms total)
08:33:25 [2024-07-10T12:33:25.307Z] 31: 
08:33:25 [2024-07-10T12:33:25.307Z] 31: [----------] 309 tests from VMX/PPCRecordFormSanityTest
08:33:25 [2024-07-10T12:33:25.307Z] 31: [----------] 309 tests from VMX/PPCRecordFormSanityTest (87 ms total)
08:33:25 [2024-07-10T12:33:25.307Z] 31: 
08:33:25 [2024-07-10T12:33:25.307Z] 31: [----------] 18 tests from VSXScalarFixed/PPCRecordFormSanityTest
08:33:25 [2024-07-10T12:33:25.307Z] 31: [----------] 18 tests from VSXScalarFixed/PPCRecordFormSanityTest (5 ms total)
08:33:25 [2024-07-10T12:33:25.307Z] 31: 
08:33:25 [2024-07-10T12:33:25.307Z] 31: [----------] 12 tests from VSXScalarConvert/PPCRecordFormSanityTest
08:33:25 [2024-07-10T12:33:25.307Z] 31: [----------] 12 tests from VSXScalarConvert/PPCRecordFormSanityTest (3 ms total)
08:33:25 [2024-07-10T12:33:25.307Z] 31: 
08:33:25 [2024-07-10T12:33:25.307Z] 31: [----------] 6 tests from VSXVectorConvert/PPCRecordFormSanityTest
08:33:25 [2024-07-10T12:33:25.307Z] 31: [----------] 6 tests from VSXVectorConvert/PPCRecordFormSanityTest (2 ms total)
08:33:25 [2024-07-10T12:33:25.307Z] 31: 
08:33:25 [2024-07-10T12:33:25.307Z] 31: [----------] 42 tests from VSXVectorFixed/PPCRecordFormSanityTest
08:33:25 [2024-07-10T12:33:25.307Z] 31: [----------] 42 tests from VSXVectorFixed/PPCRecordFormSanityTest (12 ms total)
08:33:25 [2024-07-10T12:33:25.307Z] 31: 
08:33:25 [2024-07-10T12:33:25.307Z] 31: [----------] 120 tests from VSXVectorFloat/PPCRecordFormSanityTest
08:33:25 [2024-07-10T12:33:25.307Z] 31: [----------] 120 tests from VSXVectorFloat/PPCRecordFormSanityTest (34 ms total)
08:33:25 [2024-07-10T12:33:25.307Z] 31: 
08:33:25 [2024-07-10T12:33:25.307Z] 31: [----------] 69 tests from FloatArithmetic/PPCRecordFormSanityTest
08:33:25 [2024-07-10T12:33:25.307Z] 31: [----------] 69 tests from FloatArithmetic/PPCRecordFormSanityTest (19 ms total)
08:33:25 [2024-07-10T12:33:25.307Z] 31: 
08:33:25 [2024-07-10T12:33:25.307Z] 31: [----------] 24 tests from FloatConvert/PPCRecordFormSanityTest
08:33:25 [2024-07-10T12:33:25.307Z] 31: [----------] 24 tests from FloatConvert/PPCRecordFormSanityTest (7 ms total)
08:33:25 [2024-07-10T12:33:25.307Z] 31: 
08:33:25 [2024-07-10T12:33:25.307Z] 31: [----------] 12 tests from FloatRound/PPCRecordFormSanityTest
08:33:25 [2024-07-10T12:33:25.307Z] 31: [----------] 12 tests from FloatRound/PPCRecordFormSanityTest (3 ms total)
08:33:25 [2024-07-10T12:33:25.307Z] 31: 
08:33:25 [2024-07-10T12:33:25.307Z] 31: [----------] 30 tests from DFP/PPCRecordFormSanityTest
08:33:25 [2024-07-10T12:33:25.307Z] 31: [----------] 30 tests from DFP/PPCRecordFormSanityTest (9 ms total)
08:33:25 [2024-07-10T12:33:25.307Z] 31: 
08:33:25 [2024-07-10T12:33:25.307Z] 31: [----------] 72 tests from TM/PPCRecordFormSanityTest
08:33:25 [2024-07-10T12:33:25.872Z] 31: [----------] 72 tests from TM/PPCRecordFormSanityTest (20 ms total)
08:33:25 [2024-07-10T12:33:25.872Z] 31: 
08:33:25 [2024-07-10T12:33:25.872Z] 31: [----------] 9 tests from Prefetch/PPCRecordFormSanityTest
08:33:25 [2024-07-10T12:33:25.872Z] 31: [----------] 9 tests from Prefetch/PPCRecordFormSanityTest (3 ms total)
08:33:25 [2024-07-10T12:33:25.872Z] 31: 
08:33:25 [2024-07-10T12:33:25.872Z] 31: [----------] 36 tests from LoadPrefix/PPCRecordFormSanityTest
08:33:25 [2024-07-10T12:33:25.872Z] 31: [----------] 36 tests from LoadPrefix/PPCRecordFormSanityTest (10 ms total)
08:33:25 [2024-07-10T12:33:25.872Z] 31: 
08:33:25 [2024-07-10T12:33:25.872Z] 31: [----------] 48 tests from LoadDisp/PPCRecordFormSanityTest
08:33:25 [2024-07-10T12:33:25.872Z] 31: [----------] 48 tests from LoadDisp/PPCRecordFormSanityTest (13 ms total)
08:33:25 [2024-07-10T12:33:25.872Z] 31: 
08:33:25 [2024-07-10T12:33:25.872Z] 31: [----------] 105 tests from LoadIndex/PPCRecordFormSanityTest
08:33:25 [2024-07-10T12:33:25.872Z] 31: [----------] 105 tests from LoadIndex/PPCRecordFormSanityTest (30 ms total)
08:33:25 [2024-07-10T12:33:25.872Z] 31: 
08:33:25 [2024-07-10T12:33:25.872Z] 31: [----------] 6 tests from LoadVSXLength/PPCRecordFormSanityTest
08:33:25 [2024-07-10T12:33:25.872Z] 31: [----------] 6 tests from LoadVSXLength/PPCRecordFormSanityTest (2 ms total)
08:33:25 [2024-07-10T12:33:25.872Z] 31: 
08:33:25 [2024-07-10T12:33:25.872Z] 31: [----------] 30 tests from StorePrefix/PPCRecordFormSanityTest
08:33:25 [2024-07-10T12:33:25.872Z] 31: [----------] 30 tests from StorePrefix/PPCRecordFormSanityTest (8 ms total)
08:33:25 [2024-07-10T12:33:25.872Z] 31: 
08:33:25 [2024-07-10T12:33:25.872Z] 31: [----------] 39 tests from StoreDisp/PPCRecordFormSanityTest
08:33:25 [2024-07-10T12:33:25.872Z] 31: [----------] 39 tests from StoreDisp/PPCRecordFormSanityTest (11 ms total)
08:33:25 [2024-07-10T12:33:25.872Z] 31: 
08:33:25 [2024-07-10T12:33:25.872Z] 31: [----------] 87 tests from StoreIndex/PPCRecordFormSanityTest
08:33:25 [2024-07-10T12:33:25.872Z] 31: [----------] 87 tests from StoreIndex/PPCRecordFormSanityTest (25 ms total)
08:33:25 [2024-07-10T12:33:25.872Z] 31: 
08:33:25 [2024-07-10T12:33:25.872Z] 31: [----------] 3 tests from StoreVSXLength/PPCRecordFormSanityTest
08:33:25 [2024-07-10T12:33:25.872Z] 31: [----------] 3 tests from StoreVSXLength/PPCRecordFormSanityTest (1 ms total)
08:33:25 [2024-07-10T12:33:25.872Z] 31: 
08:33:25 [2024-07-10T12:33:25.872Z] 31: [----------] 14 tests from Special/PPCDirectEncodingTest
08:33:25 [2024-07-10T12:33:25.872Z] 31: free(): invalid next size (normal)
08:33:25 [2024-07-10T12:33:25.873Z] 31/31 Test #31: compunittest ......................Child aborted***Exception:   0.91 sec
08:33:25 [2024-07-10T12:33:25.873Z] 
08:33:25 [2024-07-10T12:33:25.873Z] 97% tests passed, 1 tests failed out of 31
08:33:25 [2024-07-10T12:33:25.873Z] 
08:33:25 [2024-07-10T12:33:25.873Z] Total Test time (real) = 492.07 sec
08:33:25 [2024-07-10T12:33:25.873Z] 
08:33:25 [2024-07-10T12:33:25.873Z] The following tests FAILED:
08:33:25 [2024-07-10T12:33:25.873Z] 	 31 - compunittest (Child aborted)
08:33:25 [2024-07-10T12:33:25.873Z] Errors while running CTest
[Pipeline] }
[Pipeline] // dir
[Pipeline] }
[Pipeline] // stage
[Pipeline] }
[Pipeline] // withEnv
[Pipeline] }
[Pipeline] // timeout
[Pipeline] step
08:33:26 [2024-07-10T12:33:26.398Z] [Set GitHub commit status (universal)] SUCCESS on repos [GHRepository@b8d983f0[archived=false,commits={},compareUsePaginatedCommits=false,description=Eclipse OMR™ Cross platform components for building reliable, high performance language runtimes,disabled=false,fork=false,homepage=http://www.eclipse.org/omr,isTemplate=false,language=C++,milestones={},name=omr,nodeId=MDEwOlJlcG9zaXRvcnk1MzA3NzQ3OA==,parent=<null>,size=82164,source=<null>,visibility=public,createdAt=2016-03-03T19:34:17Z,id=53077478,nodeId=<null>,updatedAt=2024-07-10T12:21:21Z,url=https://api.github.com/repos/eclipse/omr]] (sha:5e425eb) with context:continuous-integration/eclipse-omr/branch/linux_ppc-64_le_gcc
08:33:26 [2024-07-10T12:33:26.398Z] Setting commit status on GitHub for https://github.com/eclipse/omr/commit/5e425ebfc8627fe92d3dd9d8ff13dd8abb3e1670
[Pipeline] cleanWs
08:33:26 [2024-07-10T12:33:26.861Z] [WS-CLEANUP] Deleting project workspace...
08:33:26 [2024-07-10T12:33:26.861Z] [WS-CLEANUP] Deferred wipeout is used...
08:33:27 [2024-07-10T12:33:27.023Z] [WS-CLEANUP] done
[Pipeline] }
[Pipeline] // ws
[Pipeline] }
[Pipeline] // node
[Pipeline] }
[Pipeline] // stage
[Pipeline] }
[Pipeline] // timeout
[Pipeline] }
[Pipeline] // timestamps
[Pipeline] End of Pipeline
ERROR: script returned exit code 8
Finished: FAILURE