UnstableConsole Output

Skipping 467 KB.. Full Log
[INFO] 
[INFO] --- tycho-compiler-plugin:2.3.0-SNAPSHOT:compile (default-compile) @ org.eclipse.m2e.editor.lemminx.tests ---
[WARNING] Parameter 'useProjectSettings' is set to true, but preferences file '/home/jenkins/agent/workspace/m2e_master/org.eclipse.m2e.editor.lemminx.tests/.settings/org.eclipse.jdt.core.prefs' could not be found!
[INFO] Compiling 1 source file to /home/jenkins/agent/workspace/m2e_master/org.eclipse.m2e.editor.lemminx.tests/target/classes
[INFO] 
[INFO] --- maven-resources-plugin:2.5:testResources (default-testResources) @ org.eclipse.m2e.editor.lemminx.tests ---
[debug] execute contextualize
[INFO] Using 'UTF-8' encoding to copy filtered resources.
[INFO] skip non existing resourceDirectory /home/jenkins/agent/workspace/m2e_master/org.eclipse.m2e.editor.lemminx.tests/src/test/resources
[INFO] 
[INFO] --- tycho-source-plugin:2.3.0-SNAPSHOT:plugin-source (plugin-source) @ org.eclipse.m2e.editor.lemminx.tests ---
[INFO] Building jar: /home/jenkins/agent/workspace/m2e_master/org.eclipse.m2e.editor.lemminx.tests/target/org.eclipse.m2e.editor.lemminx.tests-1.16.0-SNAPSHOT-sources.jar
[INFO] 
[INFO] --- target-platform-configuration:2.3.0-SNAPSHOT:target-platform (default-target-platform) @ org.eclipse.m2e.editor.lemminx.tests ---
[INFO] 
[INFO] --- tycho-packaging-plugin:2.3.0-SNAPSHOT:package-plugin (default-package-plugin) @ org.eclipse.m2e.editor.lemminx.tests ---
[INFO] Building jar: /home/jenkins/agent/workspace/m2e_master/org.eclipse.m2e.editor.lemminx.tests/target/org.eclipse.m2e.editor.lemminx.tests-1.16.0-SNAPSHOT.jar
[INFO] 
[INFO] --- tycho-p2-plugin:2.3.0-SNAPSHOT:p2-metadata-default (default-p2-metadata-default) @ org.eclipse.m2e.editor.lemminx.tests ---
[INFO] 
[INFO] --- tycho-pack200a-plugin:2.3.0-SNAPSHOT:normalize (pack200-normalize) @ org.eclipse.m2e.editor.lemminx.tests ---
[INFO] Pack200 normalizing jar /home/jenkins/agent/workspace/m2e_master/org.eclipse.m2e.editor.lemminx.tests/target/org.eclipse.m2e.editor.lemminx.tests-1.16.0-SNAPSHOT.jar
[INFO] 
[INFO] --- eclipse-jarsigner-plugin:1.1.7:sign (sign) @ org.eclipse.m2e.editor.lemminx.tests ---
[INFO] Signing of nested jars of '/home/jenkins/agent/workspace/m2e_master/org.eclipse.m2e.editor.lemminx.tests/target/org.eclipse.m2e.editor.lemminx.tests-1.16.0-SNAPSHOT.jar' is disabled.
[INFO] Signing jar: /home/jenkins/agent/workspace/m2e_master/org.eclipse.m2e.editor.lemminx.tests/target/org.eclipse.m2e.editor.lemminx.tests-1.16.0-SNAPSHOT.jar
[INFO] Signing of nested jars of '/home/jenkins/agent/workspace/m2e_master/org.eclipse.m2e.editor.lemminx.tests/target/org.eclipse.m2e.editor.lemminx.tests-1.16.0-SNAPSHOT-sources.jar' is disabled.
[INFO] Signing jar: /home/jenkins/agent/workspace/m2e_master/org.eclipse.m2e.editor.lemminx.tests/target/org.eclipse.m2e.editor.lemminx.tests-1.16.0-SNAPSHOT-sources.jar
[INFO] 
[INFO] --- tycho-pack200b-plugin:2.3.0-SNAPSHOT:pack (pack200-pack) @ org.eclipse.m2e.editor.lemminx.tests ---
[INFO] Pack200 packing jar /home/jenkins/agent/workspace/m2e_master/org.eclipse.m2e.editor.lemminx.tests/target/org.eclipse.m2e.editor.lemminx.tests-1.16.0-SNAPSHOT.jar
[INFO] 
[INFO] --- tycho-p2-plugin:2.3.0-SNAPSHOT:p2-metadata (p2-metadata) @ org.eclipse.m2e.editor.lemminx.tests ---
[INFO] No baseline version MavenProject: org.eclipse.m2e:org.eclipse.m2e.editor.lemminx.tests:1.16.0-SNAPSHOT @ /home/jenkins/agent/workspace/m2e_master/org.eclipse.m2e.editor.lemminx.tests/pom.xml
[INFO] 
[INFO] --- tycho-surefire-plugin:2.3.0-SNAPSHOT:test (default-test) @ org.eclipse.m2e.editor.lemminx.tests ---
[INFO] Executing Test Runtime with timeout 7200, logs (if any) will be placed at: /home/jenkins/agent/workspace/m2e_master/org.eclipse.m2e.editor.lemminx.tests/target/work/data/.metadata/.log
[INFO] Command line:
	[/opt/tools/java/openjdk/jdk-11/11.0.2+9/bin/java, -Dosgi.noShutdown=false, -Dosgi.os=linux, -Dosgi.ws=gtk, -Dosgi.arch=x86_64, -javaagent:/home/jenkins/agent/workspace/m2e_master/.m2/repository/org/jacoco/org.jacoco.agent/0.8.5/org.jacoco.agent-0.8.5-runtime.jar=destfile=/home/jenkins/agent/workspace/m2e_master/target/jacoco.exec,append=true,includes=org.eclipse.m2e*:org.apache.maven*:org.eclipse.aether*, -Xmx800m, -Dosgi.clean=true, -jar, /home/jenkins/agent/workspace/m2e_master/.m2/repository/p2/osgi/bundle/org.eclipse.equinox.launcher/1.6.0.v20200915-1508/org.eclipse.equinox.launcher-1.6.0.v20200915-1508.jar, -data, /home/jenkins/agent/workspace/m2e_master/org.eclipse.m2e.editor.lemminx.tests/target/work/data, -install, /home/jenkins/agent/workspace/m2e_master/org.eclipse.m2e.editor.lemminx.tests/target/work, -configuration, /home/jenkins/agent/workspace/m2e_master/org.eclipse.m2e.editor.lemminx.tests/target/work/configuration, -application, org.eclipse.tycho.surefire.osgibooter.uitest, -testproperties, /home/jenkins/agent/workspace/m2e_master/org.eclipse.m2e.editor.lemminx.tests/target/surefire.properties, -timeout, 7200000]

(process:2071): Gtk-WARNING **: 09:14:47.960: Locale not supported by C library.
	Using the fallback 'C' locale.
SWT SessionManagerDBus: Failed to connect to org.gnome.SessionManager: Failed to execute child process ?dbus-launch? (No such file or directory)
SWT SessionManagerDBus: Failed to connect to org.xfce.SessionManager: Failed to execute child process ?dbus-launch? (No such file or directory)
Running org.eclipse.m2e.editor.lemminx.tests.EditorTest
SLF4J: Failed to load class "org.slf4j.impl.StaticLoggerBinder".
SLF4J: Defaulting to no-operation (NOP) logger implementation
SLF4J: See http://www.slf4j.org/codes.html#StaticLoggerBinder for further details.
Warning: NLS missing message: MavenImpl_error_lookup in: org.eclipse.m2e.editor.internal.messages
Tests run: 2, Failures: 0, Errors: 0, Skipped: 0, Time elapsed: 6.773 s - in org.eclipse.m2e.editor.lemminx.tests.EditorTest
testEditorOpenOnSourcePage(org.eclipse.m2e.editor.lemminx.tests.EditorTest)  Time elapsed: 2.614 s
testGenericEditorHasMavenExtensionEnabled(org.eclipse.m2e.editor.lemminx.tests.EditorTest)  Time elapsed: 4.099 s

Results:

Tests run: 2, Failures: 0, Errors: 0, Skipped: 0

[INFO] All tests passed!
[INFO] 
[INFO] --- tycho-p2-extras-plugin:2.3.0-SNAPSHOT:compare-version-with-baselines (check-no-version-regression) @ org.eclipse.m2e.editor.lemminx.tests ---
[INFO] 
[INFO] -------------< org.eclipse.m2e:org.eclipse.m2e.jdt.tests >--------------
[INFO] Building org.eclipse.m2e.jdt.tests 1.16.0-SNAPSHOT               [38/43]
[INFO] ------------------------[ eclipse-test-plugin ]-------------------------
[INFO] 
[INFO] --- maven-clean-plugin:2.4.1:clean (default-clean) @ org.eclipse.m2e.jdt.tests ---
[INFO] 
[INFO] --- tycho-packaging-plugin:2.3.0-SNAPSHOT:build-qualifier (default-build-qualifier) @ org.eclipse.m2e.jdt.tests ---
[INFO] The project's OSGi version is 1.16.0.20210115-1536
[INFO] 
[INFO] --- tycho-packaging-plugin:2.3.0-SNAPSHOT:validate-id (default-validate-id) @ org.eclipse.m2e.jdt.tests ---
[INFO] 
[INFO] --- tycho-packaging-plugin:2.3.0-SNAPSHOT:validate-version (default-validate-version) @ org.eclipse.m2e.jdt.tests ---
[INFO] 
[INFO] --- jacoco-maven-plugin:0.8.5:prepare-agent (default) @ org.eclipse.m2e.jdt.tests ---
[INFO] tycho.testArgLine set to -javaagent:/home/jenkins/agent/workspace/m2e_master/.m2/repository/org/jacoco/org.jacoco.agent/0.8.5/org.jacoco.agent-0.8.5-runtime.jar=destfile=/home/jenkins/agent/workspace/m2e_master/target/jacoco.exec,append=true,includes=org.eclipse.m2e*:org.apache.maven*:org.eclipse.aether* -Xmx800m
[INFO] 
[INFO] --- maven-resources-plugin:2.5:resources (default-resources) @ org.eclipse.m2e.jdt.tests ---
[debug] execute contextualize
[INFO] Using 'UTF-8' encoding to copy filtered resources.
[INFO] skip non existing resourceDirectory /home/jenkins/agent/workspace/m2e_master/org.eclipse.m2e.jdt.tests/src/main/resources
[INFO] 
[INFO] --- tycho-compiler-plugin:2.3.0-SNAPSHOT:compile (default-compile) @ org.eclipse.m2e.jdt.tests ---
[WARNING] Parameter 'useProjectSettings' is set to true, but preferences file '/home/jenkins/agent/workspace/m2e_master/org.eclipse.m2e.jdt.tests/.settings/org.eclipse.jdt.core.prefs' could not be found!
[INFO] Compiling 1 source file to /home/jenkins/agent/workspace/m2e_master/org.eclipse.m2e.jdt.tests/target/classes
[INFO] 
[INFO] --- maven-resources-plugin:2.5:testResources (default-testResources) @ org.eclipse.m2e.jdt.tests ---
[debug] execute contextualize
[INFO] Using 'UTF-8' encoding to copy filtered resources.
[INFO] skip non existing resourceDirectory /home/jenkins/agent/workspace/m2e_master/org.eclipse.m2e.jdt.tests/src/test/resources
[INFO] 
[INFO] --- tycho-source-plugin:2.3.0-SNAPSHOT:plugin-source (plugin-source) @ org.eclipse.m2e.jdt.tests ---
[WARNING] Bundle-Name header not found in /home/jenkins/agent/workspace/m2e_master/org.eclipse.m2e.jdt.tests/META-INF/MANIFEST.MF, fallback to Bundle-SymbolicName for source bundle
[WARNING] Bundle-Vendor header not found in /home/jenkins/agent/workspace/m2e_master/org.eclipse.m2e.jdt.tests/META-INF/MANIFEST.MF, fallback to 'unknown' for source bundle
[INFO] Building jar: /home/jenkins/agent/workspace/m2e_master/org.eclipse.m2e.jdt.tests/target/org.eclipse.m2e.jdt.tests-1.16.0-SNAPSHOT-sources.jar
[INFO] 
[INFO] --- target-platform-configuration:2.3.0-SNAPSHOT:target-platform (default-target-platform) @ org.eclipse.m2e.jdt.tests ---
[INFO] 
[INFO] --- tycho-packaging-plugin:2.3.0-SNAPSHOT:package-plugin (default-package-plugin) @ org.eclipse.m2e.jdt.tests ---
[INFO] Building jar: /home/jenkins/agent/workspace/m2e_master/org.eclipse.m2e.jdt.tests/target/org.eclipse.m2e.jdt.tests-1.16.0-SNAPSHOT.jar
[INFO] 
[INFO] --- tycho-p2-plugin:2.3.0-SNAPSHOT:p2-metadata-default (default-p2-metadata-default) @ org.eclipse.m2e.jdt.tests ---
[INFO] 
[INFO] --- tycho-pack200a-plugin:2.3.0-SNAPSHOT:normalize (pack200-normalize) @ org.eclipse.m2e.jdt.tests ---
[INFO] Pack200 normalizing jar /home/jenkins/agent/workspace/m2e_master/org.eclipse.m2e.jdt.tests/target/org.eclipse.m2e.jdt.tests-1.16.0-SNAPSHOT.jar
[INFO] 
[INFO] --- eclipse-jarsigner-plugin:1.1.7:sign (sign) @ org.eclipse.m2e.jdt.tests ---
[INFO] Signing of nested jars of '/home/jenkins/agent/workspace/m2e_master/org.eclipse.m2e.jdt.tests/target/org.eclipse.m2e.jdt.tests-1.16.0-SNAPSHOT.jar' is disabled.
[INFO] Signing jar: /home/jenkins/agent/workspace/m2e_master/org.eclipse.m2e.jdt.tests/target/org.eclipse.m2e.jdt.tests-1.16.0-SNAPSHOT.jar
[INFO] Signing of nested jars of '/home/jenkins/agent/workspace/m2e_master/org.eclipse.m2e.jdt.tests/target/org.eclipse.m2e.jdt.tests-1.16.0-SNAPSHOT-sources.jar' is disabled.
[INFO] Signing jar: /home/jenkins/agent/workspace/m2e_master/org.eclipse.m2e.jdt.tests/target/org.eclipse.m2e.jdt.tests-1.16.0-SNAPSHOT-sources.jar
[INFO] 
[INFO] --- tycho-pack200b-plugin:2.3.0-SNAPSHOT:pack (pack200-pack) @ org.eclipse.m2e.jdt.tests ---
[INFO] Pack200 packing jar /home/jenkins/agent/workspace/m2e_master/org.eclipse.m2e.jdt.tests/target/org.eclipse.m2e.jdt.tests-1.16.0-SNAPSHOT.jar
[INFO] 
[INFO] --- tycho-p2-plugin:2.3.0-SNAPSHOT:p2-metadata (p2-metadata) @ org.eclipse.m2e.jdt.tests ---
[INFO] No baseline version MavenProject: org.eclipse.m2e:org.eclipse.m2e.jdt.tests:1.16.0-SNAPSHOT @ /home/jenkins/agent/workspace/m2e_master/org.eclipse.m2e.jdt.tests/pom.xml
[INFO] 
[INFO] --- tycho-surefire-plugin:2.3.0-SNAPSHOT:test (default-test) @ org.eclipse.m2e.jdt.tests ---
[INFO] Executing Test Runtime with timeout 7200, logs (if any) will be placed at: /home/jenkins/agent/workspace/m2e_master/org.eclipse.m2e.jdt.tests/target/work/data/.metadata/.log
[INFO] Command line:
	[/opt/tools/java/openjdk/jdk-11/11.0.2+9/bin/java, -Dosgi.noShutdown=false, -Dosgi.os=linux, -Dosgi.ws=gtk, -Dosgi.arch=x86_64, -javaagent:/home/jenkins/agent/workspace/m2e_master/.m2/repository/org/jacoco/org.jacoco.agent/0.8.5/org.jacoco.agent-0.8.5-runtime.jar=destfile=/home/jenkins/agent/workspace/m2e_master/target/jacoco.exec,append=true,includes=org.eclipse.m2e*:org.apache.maven*:org.eclipse.aether*, -Xmx800m, -Dosgi.clean=true, -jar, /home/jenkins/agent/workspace/m2e_master/.m2/repository/p2/osgi/bundle/org.eclipse.equinox.launcher/1.6.0.v20200915-1508/org.eclipse.equinox.launcher-1.6.0.v20200915-1508.jar, -data, /home/jenkins/agent/workspace/m2e_master/org.eclipse.m2e.jdt.tests/target/work/data, -install, /home/jenkins/agent/workspace/m2e_master/org.eclipse.m2e.jdt.tests/target/work, -configuration, /home/jenkins/agent/workspace/m2e_master/org.eclipse.m2e.jdt.tests/target/work/configuration, -application, org.eclipse.tycho.surefire.osgibooter.uitest, -testproperties, /home/jenkins/agent/workspace/m2e_master/org.eclipse.m2e.jdt.tests/target/surefire.properties, -timeout, 7200000]

(process:2325): Gtk-WARNING **: 09:15:02.685: Locale not supported by C library.
	Using the fallback 'C' locale.
SWT SessionManagerDBus: Failed to connect to org.gnome.SessionManager: Failed to execute child process ?dbus-launch? (No such file or directory)
SWT SessionManagerDBus: Failed to connect to org.xfce.SessionManager: Failed to execute child process ?dbus-launch? (No such file or directory)
Running org.eclipse.m2e.jdt.tests.JavaConfigurationTest
SLF4J: Failed to load class "org.slf4j.impl.StaticLoggerBinder".
SLF4J: Defaulting to no-operation (NOP) logger implementation
SLF4J: See http://www.slf4j.org/codes.html#StaticLoggerBinder for further details.
SLF4J: Failed to load class "org.slf4j.impl.StaticLoggerBinder".
SLF4J: Defaulting to no-operation (NOP) logger implementation
SLF4J: See http://www.slf4j.org/codes.html#StaticLoggerBinder for further details.
Tests run: 1, Failures: 0, Errors: 0, Skipped: 0, Time elapsed: 16.57 s - in org.eclipse.m2e.jdt.tests.JavaConfigurationTest
testFileChangeUpdatesJDTSettings(org.eclipse.m2e.jdt.tests.JavaConfigurationTest)  Time elapsed: 16.112 s

Results:

Tests run: 1, Failures: 0, Errors: 0, Skipped: 0

[INFO] All tests passed!
[INFO] 
[INFO] --- tycho-p2-extras-plugin:2.3.0-SNAPSHOT:compare-version-with-baselines (check-no-version-regression) @ org.eclipse.m2e.jdt.tests ---
[INFO] 
[INFO] --------< org.eclipse.m2e:org.eclipse.m2e.editor.xml.sse.tests >--------
[INFO] Building org.eclipse.m2e.editor.xml.sse.tests 1.16.0-SNAPSHOT    [39/43]
[INFO] ------------------------[ eclipse-test-plugin ]-------------------------
[INFO] 
[INFO] --- maven-clean-plugin:2.4.1:clean (default-clean) @ org.eclipse.m2e.editor.xml.sse.tests ---
[INFO] 
[INFO] --- tycho-packaging-plugin:2.3.0-SNAPSHOT:build-qualifier (default-build-qualifier) @ org.eclipse.m2e.editor.xml.sse.tests ---
[INFO] The project's OSGi version is 1.16.0.20210115-1536
[INFO] 
[INFO] --- tycho-packaging-plugin:2.3.0-SNAPSHOT:validate-id (default-validate-id) @ org.eclipse.m2e.editor.xml.sse.tests ---
[INFO] 
[INFO] --- tycho-packaging-plugin:2.3.0-SNAPSHOT:validate-version (default-validate-version) @ org.eclipse.m2e.editor.xml.sse.tests ---
[INFO] 
[INFO] --- jacoco-maven-plugin:0.8.5:prepare-agent (default) @ org.eclipse.m2e.editor.xml.sse.tests ---
[INFO] tycho.testArgLine set to -javaagent:/home/jenkins/agent/workspace/m2e_master/.m2/repository/org/jacoco/org.jacoco.agent/0.8.5/org.jacoco.agent-0.8.5-runtime.jar=destfile=/home/jenkins/agent/workspace/m2e_master/target/jacoco.exec,append=true,includes=org.eclipse.m2e*:org.apache.maven*:org.eclipse.aether* -Xmx800m
[INFO] 
[INFO] --- maven-resources-plugin:2.5:resources (default-resources) @ org.eclipse.m2e.editor.xml.sse.tests ---
[debug] execute contextualize
[INFO] Using 'UTF-8' encoding to copy filtered resources.
[INFO] skip non existing resourceDirectory /home/jenkins/agent/workspace/m2e_master/org.eclipse.m2e.editor.xml.sse.tests/src/main/resources
[INFO] 
[INFO] --- tycho-compiler-plugin:2.3.0-SNAPSHOT:compile (default-compile) @ org.eclipse.m2e.editor.xml.sse.tests ---
[WARNING] Parameter 'useProjectSettings' is set to true, but preferences file '/home/jenkins/agent/workspace/m2e_master/org.eclipse.m2e.editor.xml.sse.tests/.settings/org.eclipse.jdt.core.prefs' could not be found!
[INFO] Compiling 1 source file to /home/jenkins/agent/workspace/m2e_master/org.eclipse.m2e.editor.xml.sse.tests/target/classes
[INFO] 
[INFO] --- maven-resources-plugin:2.5:testResources (default-testResources) @ org.eclipse.m2e.editor.xml.sse.tests ---
[debug] execute contextualize
[INFO] Using 'UTF-8' encoding to copy filtered resources.
[INFO] skip non existing resourceDirectory /home/jenkins/agent/workspace/m2e_master/org.eclipse.m2e.editor.xml.sse.tests/src/test/resources
[INFO] 
[INFO] --- tycho-source-plugin:2.3.0-SNAPSHOT:plugin-source (plugin-source) @ org.eclipse.m2e.editor.xml.sse.tests ---
[INFO] Building jar: /home/jenkins/agent/workspace/m2e_master/org.eclipse.m2e.editor.xml.sse.tests/target/org.eclipse.m2e.editor.xml.sse.tests-1.16.0-SNAPSHOT-sources.jar
[INFO] 
[INFO] --- target-platform-configuration:2.3.0-SNAPSHOT:target-platform (default-target-platform) @ org.eclipse.m2e.editor.xml.sse.tests ---
[INFO] 
[INFO] --- tycho-packaging-plugin:2.3.0-SNAPSHOT:package-plugin (default-package-plugin) @ org.eclipse.m2e.editor.xml.sse.tests ---
[INFO] Building jar: /home/jenkins/agent/workspace/m2e_master/org.eclipse.m2e.editor.xml.sse.tests/target/org.eclipse.m2e.editor.xml.sse.tests-1.16.0-SNAPSHOT.jar
[INFO] 
[INFO] --- tycho-p2-plugin:2.3.0-SNAPSHOT:p2-metadata-default (default-p2-metadata-default) @ org.eclipse.m2e.editor.xml.sse.tests ---
[INFO] 
[INFO] --- tycho-pack200a-plugin:2.3.0-SNAPSHOT:normalize (pack200-normalize) @ org.eclipse.m2e.editor.xml.sse.tests ---
[INFO] Pack200 normalizing jar /home/jenkins/agent/workspace/m2e_master/org.eclipse.m2e.editor.xml.sse.tests/target/org.eclipse.m2e.editor.xml.sse.tests-1.16.0-SNAPSHOT.jar
[INFO] 
[INFO] --- eclipse-jarsigner-plugin:1.1.7:sign (sign) @ org.eclipse.m2e.editor.xml.sse.tests ---
[INFO] Signing of nested jars of '/home/jenkins/agent/workspace/m2e_master/org.eclipse.m2e.editor.xml.sse.tests/target/org.eclipse.m2e.editor.xml.sse.tests-1.16.0-SNAPSHOT.jar' is disabled.
[INFO] Signing jar: /home/jenkins/agent/workspace/m2e_master/org.eclipse.m2e.editor.xml.sse.tests/target/org.eclipse.m2e.editor.xml.sse.tests-1.16.0-SNAPSHOT.jar
[INFO] Signing of nested jars of '/home/jenkins/agent/workspace/m2e_master/org.eclipse.m2e.editor.xml.sse.tests/target/org.eclipse.m2e.editor.xml.sse.tests-1.16.0-SNAPSHOT-sources.jar' is disabled.
[INFO] Signing jar: /home/jenkins/agent/workspace/m2e_master/org.eclipse.m2e.editor.xml.sse.tests/target/org.eclipse.m2e.editor.xml.sse.tests-1.16.0-SNAPSHOT-sources.jar
[INFO] 
[INFO] --- tycho-pack200b-plugin:2.3.0-SNAPSHOT:pack (pack200-pack) @ org.eclipse.m2e.editor.xml.sse.tests ---
[INFO] Pack200 packing jar /home/jenkins/agent/workspace/m2e_master/org.eclipse.m2e.editor.xml.sse.tests/target/org.eclipse.m2e.editor.xml.sse.tests-1.16.0-SNAPSHOT.jar
[INFO] 
[INFO] --- tycho-p2-plugin:2.3.0-SNAPSHOT:p2-metadata (p2-metadata) @ org.eclipse.m2e.editor.xml.sse.tests ---
[INFO] No baseline version MavenProject: org.eclipse.m2e:org.eclipse.m2e.editor.xml.sse.tests:1.16.0-SNAPSHOT @ /home/jenkins/agent/workspace/m2e_master/org.eclipse.m2e.editor.xml.sse.tests/pom.xml
[INFO] 
[INFO] --- tycho-surefire-plugin:2.3.0-SNAPSHOT:test (default-test) @ org.eclipse.m2e.editor.xml.sse.tests ---
[INFO] Executing Test Runtime with timeout 7200, logs (if any) will be placed at: /home/jenkins/agent/workspace/m2e_master/org.eclipse.m2e.editor.xml.sse.tests/target/work/data/.metadata/.log
[INFO] Command line:
	[/opt/tools/java/openjdk/jdk-11/11.0.2+9/bin/java, -Dosgi.noShutdown=false, -Dosgi.os=linux, -Dosgi.ws=gtk, -Dosgi.arch=x86_64, -javaagent:/home/jenkins/agent/workspace/m2e_master/.m2/repository/org/jacoco/org.jacoco.agent/0.8.5/org.jacoco.agent-0.8.5-runtime.jar=destfile=/home/jenkins/agent/workspace/m2e_master/target/jacoco.exec,append=true,includes=org.eclipse.m2e*:org.apache.maven*:org.eclipse.aether*, -Xmx800m, -Dosgi.clean=true, -jar, /home/jenkins/agent/workspace/m2e_master/.m2/repository/p2/osgi/bundle/org.eclipse.equinox.launcher/1.6.0.v20200915-1508/org.eclipse.equinox.launcher-1.6.0.v20200915-1508.jar, -data, /home/jenkins/agent/workspace/m2e_master/org.eclipse.m2e.editor.xml.sse.tests/target/work/data, -install, /home/jenkins/agent/workspace/m2e_master/org.eclipse.m2e.editor.xml.sse.tests/target/work, -configuration, /home/jenkins/agent/workspace/m2e_master/org.eclipse.m2e.editor.xml.sse.tests/target/work/configuration, -application, org.eclipse.tycho.surefire.osgibooter.uitest, -testproperties, /home/jenkins/agent/workspace/m2e_master/org.eclipse.m2e.editor.xml.sse.tests/target/surefire.properties, -timeout, 7200000]

(process:2420): Gtk-WARNING **: 09:15:29.443: Locale not supported by C library.
	Using the fallback 'C' locale.
SWT SessionManagerDBus: Failed to connect to org.gnome.SessionManager: Failed to execute child process ?dbus-launch? (No such file or directory)
SWT SessionManagerDBus: Failed to connect to org.xfce.SessionManager: Failed to execute child process ?dbus-launch? (No such file or directory)
Running org.eclipse.m2e.editor.xml.sse.tests.WTPEditorTest
SLF4J: Failed to load class "org.slf4j.impl.StaticLoggerBinder".
SLF4J: Defaulting to no-operation (NOP) logger implementation
SLF4J: See http://www.slf4j.org/codes.html#StaticLoggerBinder for further details.
Warning: NLS missing message: MavenImpl_error_lookup in: org.eclipse.m2e.editor.internal.messages
Warning: NLS unused message: MarkerHoverControl_openDiscoveryPrefs in: org.eclipse.m2e.editor.xml.internal.messages
Warning: NLS unused message: MarkerHoverControl_openLifecyclePrefs in: org.eclipse.m2e.editor.xml.internal.messages
Warning: NLS unused message: MarkerHoverControl_openParentDefinition in: org.eclipse.m2e.editor.xml.internal.messages
Warning: NLS unused message: MarkerHoverControl_openWarningsPrefs in: org.eclipse.m2e.editor.xml.internal.messages
Warning: NLS unused message: MavenMarkerResolution_error in: org.eclipse.m2e.editor.xml.internal.messages
Warning: NLS unused message: MavenMarkerResolution_error_title in: org.eclipse.m2e.editor.xml.internal.messages
Warning: NLS unused message: MavenMarkerResolution_schema_label in: org.eclipse.m2e.editor.xml.internal.messages
Tests run: 1, Failures: 0, Errors: 0, Skipped: 0, Time elapsed: 2.506 s - in org.eclipse.m2e.editor.xml.sse.tests.WTPEditorTest
testXSDCompletion(org.eclipse.m2e.editor.xml.sse.tests.WTPEditorTest)  Time elapsed: 2.487 s

Results:

Tests run: 1, Failures: 0, Errors: 0, Skipped: 0

[INFO] All tests passed!
[INFO] 
[INFO] --- tycho-p2-extras-plugin:2.3.0-SNAPSHOT:compare-version-with-baselines (check-no-version-regression) @ org.eclipse.m2e.editor.xml.sse.tests ---
[INFO] 
[INFO] -------------------< org.eclipse.m2e:m2e-core-tests >-------------------
[INFO] Building m2e-core-tests 1.16.0-SNAPSHOT                          [40/43]
[INFO] --------------------------------[ pom ]---------------------------------
[INFO] 
[INFO] --- maven-clean-plugin:2.4.1:clean (default-clean) @ m2e-core-tests ---
[INFO] 
[INFO] --- jacoco-maven-plugin:0.8.5:prepare-agent (default) @ m2e-core-tests ---
[INFO] argLine set to -javaagent:/home/jenkins/agent/workspace/m2e_master/.m2/repository/org/jacoco/org.jacoco.agent/0.8.5/org.jacoco.agent-0.8.5-runtime.jar=destfile=/home/jenkins/agent/workspace/m2e_master/target/jacoco.exec,append=true,includes=org.eclipse.m2e*:org.apache.maven*:org.eclipse.aether*
[INFO] 
[INFO] --- tycho-source-plugin:2.3.0-SNAPSHOT:plugin-source (plugin-source) @ m2e-core-tests ---
[INFO] 
[INFO] --- tycho-pack200a-plugin:2.3.0-SNAPSHOT:normalize (pack200-normalize) @ m2e-core-tests ---
[INFO] 
[INFO] --- eclipse-jarsigner-plugin:1.1.7:sign (sign) @ m2e-core-tests ---
[INFO] 
[INFO] --- tycho-pack200b-plugin:2.3.0-SNAPSHOT:pack (pack200-pack) @ m2e-core-tests ---
[INFO] 
[INFO] --- tycho-p2-plugin:2.3.0-SNAPSHOT:p2-metadata (p2-metadata) @ m2e-core-tests ---
[INFO] 
[INFO] --- tycho-p2-extras-plugin:2.3.0-SNAPSHOT:compare-version-with-baselines (check-no-version-regression) @ m2e-core-tests ---
[INFO] 
[INFO] ---------------< org.eclipse.m2e:org.eclipse.m2e.tests >----------------
[INFO] Building Maven Integration for Eclipse tests 1.16.0-SNAPSHOT     [41/43]
[INFO] ------------------------[ eclipse-test-plugin ]-------------------------
[INFO] 
[INFO] --- maven-clean-plugin:2.4.1:clean (default-clean) @ org.eclipse.m2e.tests ---
[INFO] 
[INFO] --- tycho-packaging-plugin:2.3.0-SNAPSHOT:build-qualifier (default-build-qualifier) @ org.eclipse.m2e.tests ---
[INFO] The project's OSGi version is 1.16.0.20210115-0841
[INFO] 
[INFO] --- tycho-packaging-plugin:2.3.0-SNAPSHOT:validate-id (default-validate-id) @ org.eclipse.m2e.tests ---
[INFO] 
[INFO] --- tycho-packaging-plugin:2.3.0-SNAPSHOT:validate-version (default-validate-version) @ org.eclipse.m2e.tests ---
[INFO] 
[INFO] --- jacoco-maven-plugin:0.8.5:prepare-agent (default) @ org.eclipse.m2e.tests ---
[INFO] tycho.testArgLine set to -javaagent:/home/jenkins/agent/workspace/m2e_master/.m2/repository/org/jacoco/org.jacoco.agent/0.8.5/org.jacoco.agent-0.8.5-runtime.jar=destfile=/home/jenkins/agent/workspace/m2e_master/m2e-core-tests/target/jacoco.exec,append=true,includes=org.eclipse.m2e*:org.apache.maven*:org.eclipse.aether* -Xmx800m
[INFO] 
[INFO] --- maven-resources-plugin:2.5:resources (default-resources) @ org.eclipse.m2e.tests ---
[debug] execute contextualize
[INFO] Using 'UTF-8' encoding to copy filtered resources.
[INFO] skip non existing resourceDirectory /home/jenkins/agent/workspace/m2e_master/m2e-core-tests/org.eclipse.m2e.tests/src/main/resources
[INFO] 
[INFO] --- tycho-compiler-plugin:2.3.0-SNAPSHOT:compile (default-compile) @ org.eclipse.m2e.tests ---
[INFO] Compiling 113 source files to /home/jenkins/agent/workspace/m2e_master/m2e-core-tests/org.eclipse.m2e.tests/target/classes
[INFO] 
[INFO] --- maven-resources-plugin:2.5:testResources (default-testResources) @ org.eclipse.m2e.tests ---
[debug] execute contextualize
[INFO] Using 'UTF-8' encoding to copy filtered resources.
[INFO] skip non existing resourceDirectory /home/jenkins/agent/workspace/m2e_master/m2e-core-tests/org.eclipse.m2e.tests/src/test/resources
[INFO] 
[INFO] --- tycho-source-plugin:2.3.0-SNAPSHOT:plugin-source (plugin-source) @ org.eclipse.m2e.tests ---
[INFO] Building jar: /home/jenkins/agent/workspace/m2e_master/m2e-core-tests/org.eclipse.m2e.tests/target/org.eclipse.m2e.tests-1.16.0-SNAPSHOT-sources.jar
[INFO] 
[INFO] --- target-platform-configuration:2.3.0-SNAPSHOT:target-platform (default-target-platform) @ org.eclipse.m2e.tests ---
[INFO] 
[INFO] --- tycho-packaging-plugin:2.3.0-SNAPSHOT:package-plugin (default-package-plugin) @ org.eclipse.m2e.tests ---
[INFO] Building jar: /home/jenkins/agent/workspace/m2e_master/m2e-core-tests/org.eclipse.m2e.tests/target/org.eclipse.m2e.tests-1.16.0-SNAPSHOT.jar
[INFO] 
[INFO] --- tycho-p2-plugin:2.3.0-SNAPSHOT:p2-metadata-default (default-p2-metadata-default) @ org.eclipse.m2e.tests ---
[INFO] 
[INFO] --- tycho-pack200a-plugin:2.3.0-SNAPSHOT:normalize (pack200-normalize) @ org.eclipse.m2e.tests ---
[INFO] Pack200 normalizing jar /home/jenkins/agent/workspace/m2e_master/m2e-core-tests/org.eclipse.m2e.tests/target/org.eclipse.m2e.tests-1.16.0-SNAPSHOT.jar
[INFO] 
[INFO] --- eclipse-jarsigner-plugin:1.1.7:sign (sign) @ org.eclipse.m2e.tests ---
[INFO] Signing of nested jars of '/home/jenkins/agent/workspace/m2e_master/m2e-core-tests/org.eclipse.m2e.tests/target/org.eclipse.m2e.tests-1.16.0-SNAPSHOT.jar' is disabled.
[INFO] Signing jar: /home/jenkins/agent/workspace/m2e_master/m2e-core-tests/org.eclipse.m2e.tests/target/org.eclipse.m2e.tests-1.16.0-SNAPSHOT.jar
[INFO] Signing of nested jars of '/home/jenkins/agent/workspace/m2e_master/m2e-core-tests/org.eclipse.m2e.tests/target/org.eclipse.m2e.tests-1.16.0-SNAPSHOT-sources.jar' is disabled.
[INFO] Signing jar: /home/jenkins/agent/workspace/m2e_master/m2e-core-tests/org.eclipse.m2e.tests/target/org.eclipse.m2e.tests-1.16.0-SNAPSHOT-sources.jar
[WARNING] [Tue Jan 26 09:16:39 UTC 2021] HTTP request failed.
HTTP Error 500 (reason: Server Error)
HTTP Error 500
Problem accessing '/jar-signing-service'
Reason: Server Error

Caused by: java.io.IOException: The '/usr/java/jdk1.8.0_51/bin/jarsigner' command exited with value '1'
'/usr/java/jdk1.8.0_51/bin/jarsigner' output:
jarsigner: unable to sign jar: java.io.IOException: Server returned HTTP response code: 502 for URL: http://sha256timestamp.ws.symantec.com/sha256/timestamp

	at org.eclipse.cbi.webservice.signing.jar.JarSigner.signJar(JarSigner.java:231)
	at org.eclipse.cbi.webservice.signing.jar.SigningServlet.doSign(SigningServlet.java:66)
	at org.eclipse.cbi.webservice.signing.jar.SigningServlet.doPost(SigningServlet.java:54)
	at javax.servlet.http.HttpServlet.service(HttpServlet.java:707)
	at javax.servlet.http.HttpServlet.service(HttpServlet.java:790)
	at org.eclipse.jetty.servlet.ServletHolder.handle(ServletHolder.java:860)
	at org.eclipse.jetty.servlet.ServletHandler.doHandle(ServletHandler.java:535)
	at org.eclipse.jetty.server.handler.ScopedHandler.nextHandle(ScopedHandler.java:188)
	at org.eclipse.jetty.server.session.SessionHandler.doHandle(SessionHandler.java:1595)
	at org.eclipse.jetty.server.handler.ScopedHandler.nextHandle(ScopedHandler.java:188)
	at org.eclipse.jetty.server.handler.ContextHandler.doHandle(ContextHandler.java:1253)
	at org.eclipse.jetty.server.handler.ScopedHandler.nextScope(ScopedHandler.java:168)
	at org.eclipse.jetty.servlet.ServletHandler.doScope(ServletHandler.java:473)
	at org.eclipse.jetty.server.session.SessionHandler.doScope(SessionHandler.java:1564)
	at org.eclipse.jetty.server.handler.ScopedHandler.nextScope(ScopedHandler.java:166)
	at org.eclipse.jetty.server.handler.ContextHandler.doScope(ContextHandler.java:1155)
	at org.eclipse.jetty.server.handler.ScopedHandler.handle(ScopedHandler.java:141)
...<troncated output>... For complete output, see '/home/jenkins/agent/workspace/m2e_master/m2e-core-tests/org.eclipse.m2e.tests/target/org.eclipse.m2e.tests-1.16.0-SNAPSHOT-sources.jar-3001093166261660736-RemoteJarSigner.log'
[INFO] 
[INFO] --- tycho-pack200b-plugin:2.3.0-SNAPSHOT:pack (pack200-pack) @ org.eclipse.m2e.tests ---
[INFO] Pack200 packing jar /home/jenkins/agent/workspace/m2e_master/m2e-core-tests/org.eclipse.m2e.tests/target/org.eclipse.m2e.tests-1.16.0-SNAPSHOT.jar
[INFO] 
[INFO] --- tycho-p2-plugin:2.3.0-SNAPSHOT:p2-metadata (p2-metadata) @ org.eclipse.m2e.tests ---
[INFO] No baseline version MavenProject: org.eclipse.m2e:org.eclipse.m2e.tests:1.16.0-SNAPSHOT @ /home/jenkins/agent/workspace/m2e_master/m2e-core-tests/org.eclipse.m2e.tests/pom.xml
[INFO] 
[INFO] --- tycho-surefire-plugin:2.3.0-SNAPSHOT:test (default-test) @ org.eclipse.m2e.tests ---
[INFO] Executing Test Runtime with timeout 7200, logs (if any) will be placed at: /home/jenkins/agent/workspace/m2e_master/m2e-core-tests/org.eclipse.m2e.tests/target/work/data/.metadata/.log
[INFO] Command line:
	[/opt/tools/java/openjdk/jdk-11/11.0.2+9/bin/java, -Dosgi.noShutdown=false, -Dosgi.os=linux, -Dosgi.ws=gtk, -Dosgi.arch=x86_64, -javaagent:/home/jenkins/agent/workspace/m2e_master/.m2/repository/org/jacoco/org.jacoco.agent/0.8.5/org.jacoco.agent-0.8.5-runtime.jar=destfile=/home/jenkins/agent/workspace/m2e_master/m2e-core-tests/target/jacoco.exec,append=true,includes=org.eclipse.m2e*:org.apache.maven*:org.eclipse.aether*, -Xmx800m, -Dosgi.clean=true, -jar, /home/jenkins/agent/workspace/m2e_master/.m2/repository/p2/osgi/bundle/org.eclipse.equinox.launcher/1.6.0.v20200915-1508/org.eclipse.equinox.launcher-1.6.0.v20200915-1508.jar, -data, /home/jenkins/agent/workspace/m2e_master/m2e-core-tests/org.eclipse.m2e.tests/target/work/data, -install, /home/jenkins/agent/workspace/m2e_master/m2e-core-tests/org.eclipse.m2e.tests/target/work, -configuration, /home/jenkins/agent/workspace/m2e_master/m2e-core-tests/org.eclipse.m2e.tests/target/work/configuration, -application, org.eclipse.tycho.surefire.osgibooter.uitest, -testproperties, /home/jenkins/agent/workspace/m2e_master/m2e-core-tests/org.eclipse.m2e.tests/target/surefire.properties, -pluginCustomization, /home/jenkins/agent/workspace/m2e_master/m2e-core-tests/org.eclipse.m2e.tests/plugin_customization.ini, -timeout, 7200000]

(process:2554): Gtk-WARNING **: 09:16:53.663: Locale not supported by C library.
	Using the fallback 'C' locale.
SWT SessionManagerDBus: Failed to connect to org.gnome.SessionManager: Failed to execute child process ?dbus-launch? (No such file or directory)
SWT SessionManagerDBus: Failed to connect to org.xfce.SessionManager: Failed to execute child process ?dbus-launch? (No such file or directory)
SLF4J: Failed to load class "org.slf4j.impl.StaticLoggerBinder".
SLF4J: Defaulting to no-operation (NOP) logger implementation
SLF4J: See http://www.slf4j.org/codes.html#StaticLoggerBinder for further details.
SLF4J: Failed to load class "org.slf4j.impl.StaticLoggerBinder".
SLF4J: Defaulting to no-operation (NOP) logger implementation
SLF4J: See http://www.slf4j.org/codes.html#StaticLoggerBinder for further details.
Running org.eclipse.m2e.tests.internal.conversion.ProjectConversionParticipantSorterTest
Tests run: 6, Failures: 0, Errors: 0, Skipped: 0, Time elapsed: 0.07 s - in org.eclipse.m2e.tests.internal.conversion.ProjectConversionParticipantSorterTest
testSortConverters_AfterBefore(org.eclipse.m2e.tests.internal.conversion.ProjectConversionParticipantSorterTest)  Time elapsed: 0.003 s
testSortConverters_After2(org.eclipse.m2e.tests.internal.conversion.ProjectConversionParticipantSorterTest)  Time elapsed: 0 s
testSortConverters_After(org.eclipse.m2e.tests.internal.conversion.ProjectConversionParticipantSorterTest)  Time elapsed: 0.001 s
testSortConverters_Cycle_After(org.eclipse.m2e.tests.internal.conversion.ProjectConversionParticipantSorterTest)  Time elapsed: 0 s
testSortConverters_DuplicateConverters(org.eclipse.m2e.tests.internal.conversion.ProjectConversionParticipantSorterTest)  Time elapsed: 0 s
testSortConverters_Cycle_Before(org.eclipse.m2e.tests.internal.conversion.ProjectConversionParticipantSorterTest)  Time elapsed: 0 s
Running org.eclipse.m2e.tests.internal.index.NexusIndexManagerTest
Tests run: 14, Failures: 0, Errors: 0, Skipped: 0, Time elapsed: 60.298 s - in org.eclipse.m2e.tests.internal.index.NexusIndexManagerTest
testIndexedPublicArtifactGroups(org.eclipse.m2e.tests.internal.index.NexusIndexManagerTest)  Time elapsed: 5.543 s
test512006_nonProxyHost(org.eclipse.m2e.tests.internal.index.NexusIndexManagerTest)  Time elapsed: 3.493 s
testFetchIndexFromRepositoryWithAuthentication(org.eclipse.m2e.tests.internal.index.NexusIndexManagerTest)  Time elapsed: 3.331 s
testIndexedArtifactGroups(org.eclipse.m2e.tests.internal.index.NexusIndexManagerTest)  Time elapsed: 4.181 s
testWorkspaceIndex(org.eclipse.m2e.tests.internal.index.NexusIndexManagerTest)  Time elapsed: 4.245 s
testDisableIndex(org.eclipse.m2e.tests.internal.index.NexusIndexManagerTest)  Time elapsed: 2.178 s
testPublicNonMirrored(org.eclipse.m2e.tests.internal.index.NexusIndexManagerTest)  Time elapsed: 3.507 s
testMngEclipse1621(org.eclipse.m2e.tests.internal.index.NexusIndexManagerTest)  Time elapsed: 4.025 s
testMngEclipse1710(org.eclipse.m2e.tests.internal.index.NexusIndexManagerTest)  Time elapsed: 3.299 s
testMngEclipse1907(org.eclipse.m2e.tests.internal.index.NexusIndexManagerTest)  Time elapsed: 12.719 s
testProjectSpecificThenInSettings(org.eclipse.m2e.tests.internal.index.NexusIndexManagerTest)  Time elapsed: 3.834 s
testNoMirror(org.eclipse.m2e.tests.internal.index.NexusIndexManagerTest)  Time elapsed: 2.939 s
testPublicMirror(org.eclipse.m2e.tests.internal.index.NexusIndexManagerTest)  Time elapsed: 3.773 s
testProjectIndexes(org.eclipse.m2e.tests.internal.index.NexusIndexManagerTest)  Time elapsed: 3.224 s
Running org.eclipse.m2e.tests.internal.index.IndexedArtifactTest
Tests run: 3, Failures: 0, Errors: 0, Skipped: 0, Time elapsed: 0.001 s - in org.eclipse.m2e.tests.internal.index.IndexedArtifactTest
testHash(org.eclipse.m2e.tests.internal.index.IndexedArtifactTest)  Time elapsed: 0 s
testPackageName(org.eclipse.m2e.tests.internal.index.IndexedArtifactTest)  Time elapsed: 0 s
testEquals(org.eclipse.m2e.tests.internal.index.IndexedArtifactTest)  Time elapsed: 0 s
Running org.eclipse.m2e.tests.internal.index.filter.IndexFilterTest
Tests run: 3, Failures: 0, Errors: 0, Skipped: 0, Time elapsed: 0.004 s - in org.eclipse.m2e.tests.internal.index.filter.IndexFilterTest
testIndexedArtifactFileNodeAdapter(org.eclipse.m2e.tests.internal.index.filter.IndexFilterTest)  Time elapsed: 0.001 s
testFilteredIndex_nonEmptyResult(org.eclipse.m2e.tests.internal.index.filter.IndexFilterTest)  Time elapsed: 0.002 s
testFilteredIndex_emptyResult(org.eclipse.m2e.tests.internal.index.filter.IndexFilterTest)  Time elapsed: 0 s
Running org.eclipse.m2e.tests.internal.index.NexusIndexManagerSearchTest
Tests run: 9, Failures: 0, Errors: 0, Skipped: 0, Time elapsed: 33.673 s - in org.eclipse.m2e.tests.internal.index.NexusIndexManagerSearchTest
testPluginSearch(org.eclipse.m2e.tests.internal.index.NexusIndexManagerSearchTest)  Time elapsed: 3.621 s
testSearchGroups2(org.eclipse.m2e.tests.internal.index.NexusIndexManagerSearchTest)  Time elapsed: 3.748 s
testSearchGroups3(org.eclipse.m2e.tests.internal.index.NexusIndexManagerSearchTest)  Time elapsed: 3.931 s
testSha1Search(org.eclipse.m2e.tests.internal.index.NexusIndexManagerSearchTest)  Time elapsed: 3.865 s
testBogusSearchType(org.eclipse.m2e.tests.internal.index.NexusIndexManagerSearchTest)  Time elapsed: 3.564 s
testGroupSearch(org.eclipse.m2e.tests.internal.index.NexusIndexManagerSearchTest)  Time elapsed: 3.698 s
testSearchGroups(org.eclipse.m2e.tests.internal.index.NexusIndexManagerSearchTest)  Time elapsed: 3.74 s
testArtifactSearch(org.eclipse.m2e.tests.internal.index.NexusIndexManagerSearchTest)  Time elapsed: 3.814 s
testSorting(org.eclipse.m2e.tests.internal.index.NexusIndexManagerSearchTest)  Time elapsed: 3.69 s
Running org.eclipse.m2e.tests.internal.embedder.MavenEmbeddedRuntimeTest
Tests run: 1, Failures: 0, Errors: 0, Skipped: 0, Time elapsed: 0.055 s - in org.eclipse.m2e.tests.internal.embedder.MavenEmbeddedRuntimeTest
testGetVersion(org.eclipse.m2e.tests.internal.embedder.MavenEmbeddedRuntimeTest)  Time elapsed: 0.055 s
Running org.eclipse.m2e.tests.internal.lifecyclemapping.ProjectConfigurationElementSorterTest
Tests run: 6, Failures: 0, Errors: 0, Skipped: 0, Time elapsed: 0.004 s - in org.eclipse.m2e.tests.internal.lifecyclemapping.ProjectConfigurationElementSorterTest
testSortConfigurators_MissingPreviousConfigurator(org.eclipse.m2e.tests.internal.lifecyclemapping.ProjectConfigurationElementSorterTest)  Time elapsed: 0.002 s
testSortConfigurators_isRoot(org.eclipse.m2e.tests.internal.lifecyclemapping.ProjectConfigurationElementSorterTest)  Time elapsed: 0 s
testSortConfigurators_HappyPath(org.eclipse.m2e.tests.internal.lifecyclemapping.ProjectConfigurationElementSorterTest)  Time elapsed: 0.001 s
testSortConfigurators_MissingFollowingConfigurator(org.eclipse.m2e.tests.internal.lifecyclemapping.ProjectConfigurationElementSorterTest)  Time elapsed: 0 s
testSortConfigurators_CycleDetected(org.eclipse.m2e.tests.internal.lifecyclemapping.ProjectConfigurationElementSorterTest)  Time elapsed: 0 s
testSortConfigurators_471840(org.eclipse.m2e.tests.internal.lifecyclemapping.ProjectConfigurationElementSorterTest)  Time elapsed: 0 s
Running org.eclipse.m2e.tests.internal.wizard.MavenImportWizardPageTest
Tests run: 6, Failures: 0, Errors: 0, Skipped: 0, Time elapsed: 7.99 s - in org.eclipse.m2e.tests.internal.wizard.MavenImportWizardPageTest
test408042_multimoduleProject(org.eclipse.m2e.tests.internal.wizard.MavenImportWizardPageTest)  Time elapsed: 1.214 s
test408042_nestedproject(org.eclipse.m2e.tests.internal.wizard.MavenImportWizardPageTest)  Time elapsed: 1.753 s
test408042_noRootProject(org.eclipse.m2e.tests.internal.wizard.MavenImportWizardPageTest)  Time elapsed: 1.211 s
test533463_noArtifactId(org.eclipse.m2e.tests.internal.wizard.MavenImportWizardPageTest)  Time elapsed: 1.027 s
test408042_simpleProject(org.eclipse.m2e.tests.internal.wizard.MavenImportWizardPageTest)  Time elapsed: 1.027 s
test422008_preselectedWorkingSet(org.eclipse.m2e.tests.internal.wizard.MavenImportWizardPageTest)  Time elapsed: 1.753 s
Running org.eclipse.m2e.tests.internal.wizard.MappingDiscoveryJobTest
Tests run: 2, Failures: 0, Errors: 0, Skipped: 0, Time elapsed: 4.239 s - in org.eclipse.m2e.tests.internal.wizard.MappingDiscoveryJobTest
testDontOpenMappingDiscoveryWizard(org.eclipse.m2e.tests.internal.wizard.MappingDiscoveryJobTest)  Time elapsed: 1.381 s
testOpensMappingDiscoveryWizard(org.eclipse.m2e.tests.internal.wizard.MappingDiscoveryJobTest)  Time elapsed: 2.856 s
Running org.eclipse.m2e.tests.internal.wizard.MavenImportWizardTest
Tests run: 3, Failures: 0, Errors: 0, Skipped: 0, Time elapsed: 4.749 s - in org.eclipse.m2e.tests.internal.wizard.MavenImportWizardTest
testNoRenameOnMavenImport(org.eclipse.m2e.tests.internal.wizard.MavenImportWizardTest)  Time elapsed: 1.533 s
testRenameOnMavenImport(org.eclipse.m2e.tests.internal.wizard.MavenImportWizardTest)  Time elapsed: 1.512 s
testNoRenameOnMavenImportInWorkspaceRoot(org.eclipse.m2e.tests.internal.wizard.MavenImportWizardTest)  Time elapsed: 1.703 s
Running org.eclipse.m2e.tests.internal.project.MavenProjectChangedListenerExtensionTest
Tests run: 1, Failures: 0, Errors: 0, Skipped: 0, Time elapsed: 1.484 s - in org.eclipse.m2e.tests.internal.project.MavenProjectChangedListenerExtensionTest
testExtension(org.eclipse.m2e.tests.internal.project.MavenProjectChangedListenerExtensionTest)  Time elapsed: 1.483 s
Running org.eclipse.m2e.tests.internal.refactoring.ExcludeArtifactRefactoringTest
Warning: NLS missing message: MavenImpl_error_lookup in: org.eclipse.m2e.editor.internal.messages
Tests run: 12, Failures: 0, Errors: 0, Skipped: 0, Time elapsed: 24.137 s - in org.eclipse.m2e.tests.internal.refactoring.ExcludeArtifactRefactoringTest
testSingleArtifactKeyRemoteParent(org.eclipse.m2e.tests.internal.refactoring.ExcludeArtifactRefactoringTest)  Time elapsed: 3.586 s
testSingleArtifactMissing(org.eclipse.m2e.tests.internal.refactoring.ExcludeArtifactRefactoringTest)  Time elapsed: 1.466 s
testSingleArtifactKeyInWorkspaceParent(org.eclipse.m2e.tests.internal.refactoring.ExcludeArtifactRefactoringTest)  Time elapsed: 2.11 s
testStrangePomName(org.eclipse.m2e.tests.internal.refactoring.ExcludeArtifactRefactoringTest)  Time elapsed: 1.47 s
testArtifactsInMultiplePom(org.eclipse.m2e.tests.internal.refactoring.ExcludeArtifactRefactoringTest)  Time elapsed: 3.524 s
testCopyDown(org.eclipse.m2e.tests.internal.refactoring.ExcludeArtifactRefactoringTest)  Time elapsed: 2.045 s
testSingleArtifactKeyWorkspaceParent(org.eclipse.m2e.tests.internal.refactoring.ExcludeArtifactRefactoringTest)  Time elapsed: 1.903 s
testMultipleArtifactWithMissing(org.eclipse.m2e.tests.internal.refactoring.ExcludeArtifactRefactoringTest)  Time elapsed: 1.388 s
testSingleArtifactNoParentBadFormat(org.eclipse.m2e.tests.internal.refactoring.ExcludeArtifactRefactoringTest)  Time elapsed: 1.552 s
testMultipleArtifactKeySinglePom(org.eclipse.m2e.tests.internal.refactoring.ExcludeArtifactRefactoringTest)  Time elapsed: 1.603 s
testSingleArtifactNoParent(org.eclipse.m2e.tests.internal.refactoring.ExcludeArtifactRefactoringTest)  Time elapsed: 1.636 s
testPullUp(org.eclipse.m2e.tests.internal.refactoring.ExcludeArtifactRefactoringTest)  Time elapsed: 1.853 s
Running org.eclipse.m2e.tests.internal.repository.RepositoryRegistryTest
Tests run: 1, Failures: 0, Errors: 0, Skipped: 0, Time elapsed: 0.919 s - in org.eclipse.m2e.tests.internal.repository.RepositoryRegistryTest
testSettingsDecryption(org.eclipse.m2e.tests.internal.repository.RepositoryRegistryTest)  Time elapsed: 0.919 s
Running org.eclipse.m2e.tests.ui.OpenPomActionTest
Tests run: 1, Failures: 0, Errors: 0, Skipped: 0, Time elapsed: 9.515 s - in org.eclipse.m2e.tests.ui.OpenPomActionTest
test454759_openEditor(org.eclipse.m2e.tests.ui.OpenPomActionTest)  Time elapsed: 9.514 s
Running org.eclipse.m2e.tests.ui.editing.PomEditsTest
Tests run: 5, Failures: 0, Errors: 0, Skipped: 0, Time elapsed: 0.007 s - in org.eclipse.m2e.tests.ui.editing.PomEditsTest
testFindChildren(org.eclipse.m2e.tests.ui.editing.PomEditsTest)  Time elapsed: 0.002 s
testRemoveChild(org.eclipse.m2e.tests.ui.editing.PomEditsTest)  Time elapsed: 0.003 s
testMatchers(org.eclipse.m2e.tests.ui.editing.PomEditsTest)  Time elapsed: 0.001 s
testFindChild(org.eclipse.m2e.tests.ui.editing.PomEditsTest)  Time elapsed: 0 s
testRemoveIfNoChildElement(org.eclipse.m2e.tests.ui.editing.PomEditsTest)  Time elapsed: 0.001 s
Running org.eclipse.m2e.tests.ui.editing.PomHelperTest
Tests run: 7, Failures: 0, Errors: 0, Skipped: 0, Time elapsed: 0.017 s - in org.eclipse.m2e.tests.ui.editing.PomHelperTest
testCreateDependencyInEmptyList(org.eclipse.m2e.tests.ui.editing.PomHelperTest)  Time elapsed: 0.004 s
testCreatePlugin(org.eclipse.m2e.tests.ui.editing.PomHelperTest)  Time elapsed: 0.004 s
testFindDependencies(org.eclipse.m2e.tests.ui.editing.PomHelperTest)  Time elapsed: 0.001 s
testFindDependenciesMissing(org.eclipse.m2e.tests.ui.editing.PomHelperTest)  Time elapsed: 0 s
testCreatePluginInEmptyList(org.eclipse.m2e.tests.ui.editing.PomHelperTest)  Time elapsed: 0.003 s
testCreateDependency(org.eclipse.m2e.tests.ui.editing.PomHelperTest)  Time elapsed: 0.003 s
testFindDependency(org.eclipse.m2e.tests.ui.editing.PomHelperTest)  Time elapsed: 0.001 s
Running org.eclipse.m2e.tests.ui.editing.AddDependencyOperationTest
Tests run: 5, Failures: 0, Errors: 0, Skipped: 0, Time elapsed: 0.017 s - in org.eclipse.m2e.tests.ui.editing.AddDependencyOperationTest
testNoDependenciesElement(org.eclipse.m2e.tests.ui.editing.AddDependencyOperationTest)  Time elapsed: 0.004 s
testEmptyDependenciesElement(org.eclipse.m2e.tests.ui.editing.AddDependencyOperationTest)  Time elapsed: 0.003 s
testDuplicatedDependency(org.eclipse.m2e.tests.ui.editing.AddDependencyOperationTest)  Time elapsed: 0.001 s
testWithDependencies(org.eclipse.m2e.tests.ui.editing.AddDependencyOperationTest)  Time elapsed: 0.003 s
testExclusionsAdded(org.eclipse.m2e.tests.ui.editing.AddDependencyOperationTest)  Time elapsed: 0.006 s
Running org.eclipse.m2e.tests.ui.editing.AddExclusionOperationTest
Tests run: 6, Failures: 0, Errors: 0, Skipped: 0, Time elapsed: 0.007 s - in org.eclipse.m2e.tests.ui.editing.AddExclusionOperationTest
testAddExclusion(org.eclipse.m2e.tests.ui.editing.AddExclusionOperationTest)  Time elapsed: 0.003 s
testAddExclusion_existingExclusion(org.eclipse.m2e.tests.ui.editing.AddExclusionOperationTest)  Time elapsed: 0.003 s
testAddExclusion_duplicateExclusion(org.eclipse.m2e.tests.ui.editing.AddExclusionOperationTest)  Time elapsed: 0 s
testMissingDependency_withDependencies(org.eclipse.m2e.tests.ui.editing.AddExclusionOperationTest)  Time elapsed: 0 s
testMissingDependency_emptyDependenciesElement(org.eclipse.m2e.tests.ui.editing.AddExclusionOperationTest)  Time elapsed: 0.001 s
testMissingDependency_noDependenciesElement(org.eclipse.m2e.tests.ui.editing.AddExclusionOperationTest)  Time elapsed: 0 s
Running org.eclipse.m2e.tests.ui.editing.RemoveDependencyOperationTest
Tests run: 4, Failures: 0, Errors: 0, Skipped: 0, Time elapsed: 0.002 s - in org.eclipse.m2e.tests.ui.editing.RemoveDependencyOperationTest
testMissingDependency_withDependencies(org.eclipse.m2e.tests.ui.editing.RemoveDependencyOperationTest)  Time elapsed: 0.001 s
testRemoveDependency(org.eclipse.m2e.tests.ui.editing.RemoveDependencyOperationTest)  Time elapsed: 0.001 s
testMissingDependency_emptyDependenciesElement(org.eclipse.m2e.tests.ui.editing.RemoveDependencyOperationTest)  Time elapsed: 0 s
testMissingDependency_noDependenciesElement(org.eclipse.m2e.tests.ui.editing.RemoveDependencyOperationTest)  Time elapsed: 0 s
Running org.eclipse.m2e.tests.ui.MavenPropertyTesterTest
Tests run: 1, Failures: 0, Errors: 0, Skipped: 0, Time elapsed: 0.988 s - in org.eclipse.m2e.tests.ui.MavenPropertyTesterTest
testIsBuildDirectory(org.eclipse.m2e.tests.ui.MavenPropertyTesterTest)  Time elapsed: 0.987 s
Running org.eclipse.m2e.tests.ResourceChangeListenerTest
Tests run: 7, Failures: 0, Errors: 0, Skipped: 0, Time elapsed: 14.164 s - in org.eclipse.m2e.tests.ResourceChangeListenerTest
testPomChanges(org.eclipse.m2e.tests.ResourceChangeListenerTest)  Time elapsed: 3.011 s
testMarkerOnlyChange(org.eclipse.m2e.tests.ResourceChangeListenerTest)  Time elapsed: 1.669 s
testPomMove001(org.eclipse.m2e.tests.ResourceChangeListenerTest)  Time elapsed: 1.88 s
testPomMove002(org.eclipse.m2e.tests.ResourceChangeListenerTest)  Time elapsed: 2.181 s
testProjectDelete(org.eclipse.m2e.tests.ResourceChangeListenerTest)  Time elapsed: 1.742 s
testPomDelete(org.eclipse.m2e.tests.ResourceChangeListenerTest)  Time elapsed: 1.982 s
testPomRename(org.eclipse.m2e.tests.ResourceChangeListenerTest)  Time elapsed: 1.698 s
Running org.eclipse.m2e.tests.embedder.MavenRuntimeManagerTest
Tests run: 4, Failures: 0, Errors: 0, Skipped: 0, Time elapsed: 0.01 s - in org.eclipse.m2e.tests.embedder.MavenRuntimeManagerTest
testDefaultRuntime(org.eclipse.m2e.tests.embedder.MavenRuntimeManagerTest)  Time elapsed: 0.004 s
testSetDefaultRuntime(org.eclipse.m2e.tests.embedder.MavenRuntimeManagerTest)  Time elapsed: 0 s
testExternalRuntime(org.eclipse.m2e.tests.embedder.MavenRuntimeManagerTest)  Time elapsed: 0.004 s
testGetRuntime(org.eclipse.m2e.tests.embedder.MavenRuntimeManagerTest)  Time elapsed: 0.001 s
Running org.eclipse.m2e.tests.embedder.MavenModelEditTest
Tests run: 16, Failures: 0, Errors: 0, Skipped: 0, Time elapsed: 0.093 s - in org.eclipse.m2e.tests.embedder.MavenModelEditTest
testOneRemove(org.eclipse.m2e.tests.embedder.MavenModelEditTest)  Time elapsed: 0.016 s
testEncoding(org.eclipse.m2e.tests.embedder.MavenModelEditTest)  Time elapsed: 0.006 s
testAttributeChange(org.eclipse.m2e.tests.embedder.MavenModelEditTest)  Time elapsed: 0.004 s
testAttributeRoundtrip(org.eclipse.m2e.tests.embedder.MavenModelEditTest)  Time elapsed: 0.005 s
testAttributeRemove(org.eclipse.m2e.tests.embedder.MavenModelEditTest)  Time elapsed: 0.004 s
testManyRoundtrip(org.eclipse.m2e.tests.embedder.MavenModelEditTest)  Time elapsed: 0.006 s
testManybuildinRoundtrip(org.eclipse.m2e.tests.embedder.MavenModelEditTest)  Time elapsed: 0.005 s
testAttributeAdd(org.eclipse.m2e.tests.embedder.MavenModelEditTest)  Time elapsed: 0.005 s
testOneReplace(org.eclipse.m2e.tests.embedder.MavenModelEditTest)  Time elapsed: 0.004 s
testManyAdd(org.eclipse.m2e.tests.embedder.MavenModelEditTest)  Time elapsed: 0.005 s
testManybuildincommentRemove(org.eclipse.m2e.tests.embedder.MavenModelEditTest)  Time elapsed: 0.005 s
testManyChange(org.eclipse.m2e.tests.embedder.MavenModelEditTest)  Time elapsed: 0.004 s
testXpp3domRoundtrip(org.eclipse.m2e.tests.embedder.MavenModelEditTest)  Time elapsed: 0.01 s
testManyRemove(org.eclipse.m2e.tests.embedder.MavenModelEditTest)  Time elapsed: 0.005 s
testOneRoundtrip(org.eclipse.m2e.tests.embedder.MavenModelEditTest)  Time elapsed: 0.005 s
testManybuildinRemove(org.eclipse.m2e.tests.embedder.MavenModelEditTest)  Time elapsed: 0.004 s
Running org.eclipse.m2e.tests.embedder.ArtifactKeyTest
Tests run: 1, Failures: 0, Errors: 0, Skipped: 0, Time elapsed: 0 s - in org.eclipse.m2e.tests.embedder.ArtifactKeyTest
testPortableString(org.eclipse.m2e.tests.embedder.ArtifactKeyTest)  Time elapsed: 0 s
Running org.eclipse.m2e.tests.embedder.MavenModelManagerTest
Tests run: 2, Failures: 0, Errors: 0, Skipped: 0, Time elapsed: 2.364 s - in org.eclipse.m2e.tests.embedder.MavenModelManagerTest
test416882_dependencyTree(org.eclipse.m2e.tests.embedder.MavenModelManagerTest)  Time elapsed: 1.04 s
testCreateMavenModel(org.eclipse.m2e.tests.embedder.MavenModelManagerTest)  Time elapsed: 1.323 s
Running org.eclipse.m2e.tests.embedder.MavenImplTest
Tests run: 21, Failures: 0, Errors: 0, Skipped: 1, Time elapsed: 34.474 s - in org.eclipse.m2e.tests.embedder.MavenImplTest
test438454_guiceScopedComponentInjection(org.eclipse.m2e.tests.embedder.MavenImplTest)  Time elapsed: 4.855 s
testUnreadableSettings(org.eclipse.m2e.tests.embedder.MavenImplTest)  Time elapsed: 2.902 s
testGetProxy(org.eclipse.m2e.tests.embedder.MavenImplTest)  Time elapsed: 1.572 s
testMNGECLIPSE2556_settingsSystemPropertiesSubstiution(org.eclipse.m2e.tests.embedder.MavenImplTest)  Time elapsed: 1.697 s
testGetDefaultRepositories(org.eclipse.m2e.tests.embedder.MavenImplTest)  Time elapsed: 1.527 s
testGetRepositories(org.eclipse.m2e.tests.embedder.MavenImplTest)  Time elapsed: 1.68 s
testMissingArtifact(org.eclipse.m2e.tests.embedder.MavenImplTest)  Time elapsed: 0.962 s
testIsUnavailable(org.eclipse.m2e.tests.embedder.MavenImplTest)  Time elapsed: 1.194 s
testLocalRepositoryListener(org.eclipse.m2e.tests.embedder.MavenImplTest)  Time elapsed: 1.184 s
testGlobalSettings(org.eclipse.m2e.tests.embedder.MavenImplTest)  Time elapsed: 1.538 s
testReadNoParent(org.eclipse.m2e.tests.embedder.MavenImplTest)  Time elapsed: 0.941 s
test358620_reparse_changed_user_settings(org.eclipse.m2e.tests.embedder.MavenImplTest)  Time elapsed: 1.707 s
test366839_userAgent(org.eclipse.m2e.tests.embedder.MavenImplTest)  Time elapsed: 1.555 s
testReadLocalParent(org.eclipse.m2e.tests.embedder.MavenImplTest)  Time elapsed: 1.023 s
testReadProjectWithDependenciesFromMirror(org.eclipse.m2e.tests.embedder.MavenImplTest)  Time elapsed: 1.767 s
testGetMojoParameterValue(org.eclipse.m2e.tests.embedder.MavenImplTest)  Time elapsed: 1.133 s
testGetRepositoriesWithSettingsInjection(org.eclipse.m2e.tests.embedder.MavenImplTest)  Time elapsed: 1.69 s
test386196_ParallelDownloads(org.eclipse.m2e.tests.embedder.MavenImplTest)  Time elapsed: 2.051 s
testProxySupport(org.eclipse.m2e.tests.embedder.MavenImplTest)  Time elapsed: 2.548 s
DISABLED_testSslWithMutualHandshake(org.eclipse.m2e.tests.embedder.MavenImplTest) skipped
testReadRemoteParent(org.eclipse.m2e.tests.embedder.MavenImplTest)  Time elapsed: 0.945 s
Running org.eclipse.m2e.tests.embedder.MavenExecutionContextTest
Tests run: 6, Failures: 0, Errors: 0, Skipped: 0, Time elapsed: 5.976 s - in org.eclipse.m2e.tests.embedder.MavenExecutionContextTest
testBasic(org.eclipse.m2e.tests.embedder.MavenExecutionContextTest)  Time elapsed: 1.049 s
test496492_threadContextClassloaderLeak(org.eclipse.m2e.tests.embedder.MavenExecutionContextTest)  Time elapsed: 1.067 s
testExecutionRequestContainsSystemProperties(org.eclipse.m2e.tests.embedder.MavenExecutionContextTest)  Time elapsed: 0.909 s
testReenterShortcut(org.eclipse.m2e.tests.embedder.MavenExecutionContextTest)  Time elapsed: 0.921 s
testIllegalState(org.eclipse.m2e.tests.embedder.MavenExecutionContextTest)  Time elapsed: 1.025 s
testNested(org.eclipse.m2e.tests.embedder.MavenExecutionContextTest)  Time elapsed: 1.004 s
Running org.eclipse.m2e.tests.SourceLocationHelperTest
Tests run: 5, Failures: 0, Errors: 0, Skipped: 0, Time elapsed: 9.662 s - in org.eclipse.m2e.tests.SourceLocationHelperTest
testDependencyLocation(org.eclipse.m2e.tests.SourceLocationHelperTest)  Time elapsed: 2.07 s
testMojoExecutionLocationWithExecutions(org.eclipse.m2e.tests.SourceLocationHelperTest)  Time elapsed: 2.381 s
testPackagingLocation(org.eclipse.m2e.tests.SourceLocationHelperTest)  Time elapsed: 1.294 s
testMojoExecutionLocation(org.eclipse.m2e.tests.SourceLocationHelperTest)  Time elapsed: 2.639 s
testPluginAttributeLocation(org.eclipse.m2e.tests.SourceLocationHelperTest)  Time elapsed: 1.278 s
Running org.eclipse.m2e.tests.configurators.ResourcesEncodingConfiguratorTest
Tests run: 3, Failures: 0, Errors: 0, Skipped: 0, Time elapsed: 7.794 s - in org.eclipse.m2e.tests.configurators.ResourcesEncodingConfiguratorTest
test002_shouldConfigureEncodingForProjectWithSeveralResourceFolders(org.eclipse.m2e.tests.configurators.ResourcesEncodingConfiguratorTest)  Time elapsed: 2.269 s
test001_shouldConfigureEncodingForBasicProject(org.eclipse.m2e.tests.configurators.ResourcesEncodingConfiguratorTest)  Time elapsed: 2.495 s
test003_shouldResetToContainerDefinedEncoding(org.eclipse.m2e.tests.configurators.ResourcesEncodingConfiguratorTest)  Time elapsed: 3.03 s
Running org.eclipse.m2e.tests.configurators.CompilerSettingsWithEncodingConfiguratorTest
Tests run: 2, Failures: 0, Errors: 0, Skipped: 0, Time elapsed: 5.801 s - in org.eclipse.m2e.tests.configurators.CompilerSettingsWithEncodingConfiguratorTest
test002_shouldResetToContainerDefinedEncoding(org.eclipse.m2e.tests.configurators.CompilerSettingsWithEncodingConfiguratorTest)  Time elapsed: 3.438 s
test001_shouldSetEncodingForBasicProject(org.eclipse.m2e.tests.configurators.CompilerSettingsWithEncodingConfiguratorTest)  Time elapsed: 2.363 s
Running org.eclipse.m2e.tests.lifecycle.PluginExecutionMetadataPrioritiesTest
Tests run: 8, Failures: 0, Errors: 0, Skipped: 0, Time elapsed: 12.964 s - in org.eclipse.m2e.tests.lifecycle.PluginExecutionMetadataPrioritiesTest
testWorkspaceOverridesEclipseExtensions(org.eclipse.m2e.tests.lifecycle.PluginExecutionMetadataPrioritiesTest)  Time elapsed: 1.766 s
testEclipseExtension(org.eclipse.m2e.tests.lifecycle.PluginExecutionMetadataPrioritiesTest)  Time elapsed: 1.32 s
testDefaultMetadataSource(org.eclipse.m2e.tests.lifecycle.PluginExecutionMetadataPrioritiesTest)  Time elapsed: 1.578 s
testPomOverridesWorkspace(org.eclipse.m2e.tests.lifecycle.PluginExecutionMetadataPrioritiesTest)  Time elapsed: 1.738 s
testEmbeddedInPom(org.eclipse.m2e.tests.lifecycle.PluginExecutionMetadataPrioritiesTest)  Time elapsed: 1.328 s
testReferencedFromPom(org.eclipse.m2e.tests.lifecycle.PluginExecutionMetadataPrioritiesTest)  Time elapsed: 1.385 s
testParent(org.eclipse.m2e.tests.lifecycle.PluginExecutionMetadataPrioritiesTest)  Time elapsed: 2.313 s
testWorkspace(org.eclipse.m2e.tests.lifecycle.PluginExecutionMetadataPrioritiesTest)  Time elapsed: 1.536 s
Running org.eclipse.m2e.tests.lifecycle.LifecycleComparisonTest
Tests run: 3, Failures: 0, Errors: 0, Skipped: 0, Time elapsed: 3.279 s - in org.eclipse.m2e.tests.lifecycle.LifecycleComparisonTest
testPluginConfigurationChange(org.eclipse.m2e.tests.lifecycle.LifecycleComparisonTest)  Time elapsed: 1.092 s
testSameProject(org.eclipse.m2e.tests.lifecycle.LifecycleComparisonTest)  Time elapsed: 1.011 s
testPluginVersionChange(org.eclipse.m2e.tests.lifecycle.LifecycleComparisonTest)  Time elapsed: 1.175 s
Running org.eclipse.m2e.tests.lifecycle.PluginExecutionActionsTest
Tests run: 7, Failures: 0, Errors: 0, Skipped: 0, Time elapsed: 10.488 s - in org.eclipse.m2e.tests.lifecycle.PluginExecutionActionsTest
testMojoExecutionIgnore(org.eclipse.m2e.tests.lifecycle.PluginExecutionActionsTest)  Time elapsed: 1.702 s
testMojoExecutionErrorWithMessage(org.eclipse.m2e.tests.lifecycle.PluginExecutionActionsTest)  Time elapsed: 1.563 s
testMojoExecutionError(org.eclipse.m2e.tests.lifecycle.PluginExecutionActionsTest)  Time elapsed: 1.419 s
testMojoExecutionConfigurator(org.eclipse.m2e.tests.lifecycle.PluginExecutionActionsTest)  Time elapsed: 1.302 s
testMojoExecutionExecute(org.eclipse.m2e.tests.lifecycle.PluginExecutionActionsTest)  Time elapsed: 1.436 s
testMojoExecutionIgnoreWithMessage(org.eclipse.m2e.tests.lifecycle.PluginExecutionActionsTest)  Time elapsed: 1.387 s
testMojoExecutionExecuteWithMessage(org.eclipse.m2e.tests.lifecycle.PluginExecutionActionsTest)  Time elapsed: 1.678 s
Running org.eclipse.m2e.tests.lifecycle.LifecycleMappingTest
running TEST_SECONDARY3
running TEST_SECONDARY4
running TEST_SECONDARY6
running TEST_SECONDARY5
Tests run: 36, Failures: 0, Errors: 0, Skipped: 0, Time elapsed: 57.165 s - in org.eclipse.m2e.tests.lifecycle.LifecycleMappingTest
testGetLifecycleMappingMetadata(org.eclipse.m2e.tests.lifecycle.LifecycleMappingTest)  Time elapsed: 1.612 s
test387736_missingAction(org.eclipse.m2e.tests.lifecycle.LifecycleMappingTest)  Time elapsed: 1.916 s
testProfilesAndProperties(org.eclipse.m2e.tests.lifecycle.LifecycleMappingTest)  Time elapsed: 1.483 s
testConfiguratorsFollowPhaseOrder(org.eclipse.m2e.tests.lifecycle.LifecycleMappingTest)  Time elapsed: 1.373 s
testSecondaryConfiguratorsCustom(org.eclipse.m2e.tests.lifecycle.LifecycleMappingTest)  Time elapsed: 1.511 s
testDuplicatePluginExecution1(org.eclipse.m2e.tests.lifecycle.LifecycleMappingTest)  Time elapsed: 1.108 s
testDuplicatePluginExecution2(org.eclipse.m2e.tests.lifecycle.LifecycleMappingTest)  Time elapsed: 0.946 s
testNondeafaultLifecycles(org.eclipse.m2e.tests.lifecycle.LifecycleMappingTest)  Time elapsed: 1.31 s
testOrder(org.eclipse.m2e.tests.lifecycle.LifecycleMappingTest)  Time elapsed: 1.77 s
testSetNoopMappingDuringImport(org.eclipse.m2e.tests.lifecycle.LifecycleMappingTest)  Time elapsed: 1.561 s
testUseDefaultLifecycleMappingMetadataSource(org.eclipse.m2e.tests.lifecycle.LifecycleMappingTest)  Time elapsed: 1 s
testNotCoveredMojoExecutionIgnored(org.eclipse.m2e.tests.lifecycle.LifecycleMappingTest)  Time elapsed: 1.48 s
testNonresolvableExecutionPlan(org.eclipse.m2e.tests.lifecycle.LifecycleMappingTest)  Time elapsed: 1.354 s
testFailToGetPluginParameterValue(org.eclipse.m2e.tests.lifecycle.LifecycleMappingTest)  Time elapsed: 1.388 s
testSetCustomizableMappingDuringImport(org.eclipse.m2e.tests.lifecycle.LifecycleMappingTest)  Time elapsed: 1.719 s
testSameConfiguratorUsedTwice(org.eclipse.m2e.tests.lifecycle.LifecycleMappingTest)  Time elapsed: 1.726 s
testUnknownPackagingType(org.eclipse.m2e.tests.lifecycle.LifecycleMappingTest)  Time elapsed: 1.439 s
testGetLifecycleMappingMetadataMerge(org.eclipse.m2e.tests.lifecycle.LifecycleMappingTest)  Time elapsed: 1.465 s
testSecondaryConfiguratorsCustomizable(org.eclipse.m2e.tests.lifecycle.LifecycleMappingTest)  Time elapsed: 1.357 s
testIncompatibleVersion(org.eclipse.m2e.tests.lifecycle.LifecycleMappingTest)  Time elapsed: 1.541 s
testCompatibleVersion(org.eclipse.m2e.tests.lifecycle.LifecycleMappingTest)  Time elapsed: 1.672 s
testLifecycleMappingSpecifiedInMetadata(org.eclipse.m2e.tests.lifecycle.LifecycleMappingTest)  Time elapsed: 2.162 s
testPomPackagingType(org.eclipse.m2e.tests.lifecycle.LifecycleMappingTest)  Time elapsed: 1.366 s
testNotCoveredMojoExecutions(org.eclipse.m2e.tests.lifecycle.LifecycleMappingTest)  Time elapsed: 1.403 s
test494858ProcessingInstructions(org.eclipse.m2e.tests.lifecycle.LifecycleMappingTest)  Time elapsed: 5.705 s
testPackagingTypeMismatch(org.eclipse.m2e.tests.lifecycle.LifecycleMappingTest)  Time elapsed: 1.756 s
testGetLifecycleMappingMetadataOverride(org.eclipse.m2e.tests.lifecycle.LifecycleMappingTest)  Time elapsed: 1.574 s
testWorkspaceArtifacts(org.eclipse.m2e.tests.lifecycle.LifecycleMappingTest)  Time elapsed: 1.506 s
testMissingLifecycleMappingMetadata(org.eclipse.m2e.tests.lifecycle.LifecycleMappingTest)  Time elapsed: 1.391 s
testMissingMapping(org.eclipse.m2e.tests.lifecycle.LifecycleMappingTest)  Time elapsed: 1.399 s
testDefaultJarLifecycleMapping(org.eclipse.m2e.tests.lifecycle.LifecycleMappingTest)  Time elapsed: 1.72 s
testMissingVersionRangeInPluginExecutionFilter(org.eclipse.m2e.tests.lifecycle.LifecycleMappingTest)  Time elapsed: 1.124 s
testDuplicatePackagingTypeMetadata(org.eclipse.m2e.tests.lifecycle.LifecycleMappingTest)  Time elapsed: 0.963 s
test371618_NullLifecycleMappingPluginVersion(org.eclipse.m2e.tests.lifecycle.LifecycleMappingTest)  Time elapsed: 1.579 s
testNotCoveredMojoExecutionWarnings(org.eclipse.m2e.tests.lifecycle.LifecycleMappingTest)  Time elapsed: 1.445 s
testNotInterestingPhaseConfigurator(org.eclipse.m2e.tests.lifecycle.LifecycleMappingTest)  Time elapsed: 1.336 s
Running org.eclipse.m2e.tests.lifecycle.LifecycleMappingMetadataPrioritiesTest
Tests run: 5, Failures: 0, Errors: 0, Skipped: 0, Time elapsed: 8.589 s - in org.eclipse.m2e.tests.lifecycle.LifecycleMappingMetadataPrioritiesTest
testEclipseExtension(org.eclipse.m2e.tests.lifecycle.LifecycleMappingMetadataPrioritiesTest)  Time elapsed: 2.021 s
testDefaultMetadataSource(org.eclipse.m2e.tests.lifecycle.LifecycleMappingMetadataPrioritiesTest)  Time elapsed: 1.674 s
testEmbeddedInPom(org.eclipse.m2e.tests.lifecycle.LifecycleMappingMetadataPrioritiesTest)  Time elapsed: 1.345 s
testReferencedFromPom(org.eclipse.m2e.tests.lifecycle.LifecycleMappingMetadataPrioritiesTest)  Time elapsed: 1.461 s
testParent(org.eclipse.m2e.tests.lifecycle.LifecycleMappingMetadataPrioritiesTest)  Time elapsed: 2.088 s
Running org.eclipse.m2e.tests.lifecycle.MavenPluginMetadataSourceTest
Tests run: 2, Failures: 0, Errors: 0, Skipped: 0, Time elapsed: 3.746 s - in org.eclipse.m2e.tests.lifecycle.MavenPluginMetadataSourceTest
testBasic(org.eclipse.m2e.tests.lifecycle.MavenPluginMetadataSourceTest)  Time elapsed: 1.876 s
test422135_mavenPluginSourceWorkspaceResolution(org.eclipse.m2e.tests.lifecycle.MavenPluginMetadataSourceTest)  Time elapsed: 1.87 s
Running org.eclipse.m2e.tests.discovery.LifecycleMappingDiscoveryTest
Tests run: 11, Failures: 0, Errors: 0, Skipped: 0, Time elapsed: 15.763 s - in org.eclipse.m2e.tests.discovery.LifecycleMappingDiscoveryTest
testAutomaticSelectionOfSingleProposal(org.eclipse.m2e.tests.discovery.LifecycleMappingDiscoveryTest)  Time elapsed: 1.475 s
testPreselectedProposals(org.eclipse.m2e.tests.discovery.LifecycleMappingDiscoveryTest)  Time elapsed: 1.286 s
testIsMappingComplete(org.eclipse.m2e.tests.discovery.LifecycleMappingDiscoveryTest)  Time elapsed: 1.544 s
testProposalToReplaceDefaultMapping(org.eclipse.m2e.tests.discovery.LifecycleMappingDiscoveryTest)  Time elapsed: 1.345 s
testPackagingPom(org.eclipse.m2e.tests.discovery.LifecycleMappingDiscoveryTest)  Time elapsed: 1.561 s
testAutomaticSelectionWithAmbiguousProposals(org.eclipse.m2e.tests.discovery.LifecycleMappingDiscoveryTest)  Time elapsed: 1.303 s
testDiscoverProjectConfigurators(org.eclipse.m2e.tests.discovery.LifecycleMappingDiscoveryTest)  Time elapsed: 1.353 s
testNoProposals(org.eclipse.m2e.tests.discovery.LifecycleMappingDiscoveryTest)  Time elapsed: 1.795 s
testProposalMatching(org.eclipse.m2e.tests.discovery.LifecycleMappingDiscoveryTest)  Time elapsed: 1.427 s
testDiscoverLifecycleMappingStrategy(org.eclipse.m2e.tests.discovery.LifecycleMappingDiscoveryTest)  Time elapsed: 1.353 s
testDefaultNonConfiguratorMapping(org.eclipse.m2e.tests.discovery.LifecycleMappingDiscoveryTest)  Time elapsed: 1.32 s
Running org.eclipse.m2e.tests.discovery.MavenDiscoveryMarkerResolutionGeneratorTest
Tests run: 4, Failures: 0, Errors: 0, Skipped: 0, Time elapsed: 6.761 s - in org.eclipse.m2e.tests.discovery.MavenDiscoveryMarkerResolutionGeneratorTest
testCanResolveMojoExecutionMarker(org.eclipse.m2e.tests.discovery.MavenDiscoveryMarkerResolutionGeneratorTest)  Time elapsed: 1.451 s
testCanResolveConfiguratorMarker(org.eclipse.m2e.tests.discovery.MavenDiscoveryMarkerResolutionGeneratorTest)  Time elapsed: 1.411 s
testResolveMultipleMarkers(org.eclipse.m2e.tests.discovery.MavenDiscoveryMarkerResolutionGeneratorTest)  Time elapsed: 2.479 s
testCanResolveLifecycleIdMarker(org.eclipse.m2e.tests.discovery.MavenDiscoveryMarkerResolutionGeneratorTest)  Time elapsed: 1.42 s
Running org.eclipse.m2e.tests.discovery.MavenDiscoveryInstallOperationTest
Tests run: 5, Failures: 0, Errors: 0, Skipped: 0, Time elapsed: 0.553 s - in org.eclipse.m2e.tests.discovery.MavenDiscoveryInstallOperationTest
testMissingRepository(org.eclipse.m2e.tests.discovery.MavenDiscoveryInstallOperationTest)  Time elapsed: 0.195 s
testMatchNoVersion(org.eclipse.m2e.tests.discovery.MavenDiscoveryInstallOperationTest)  Time elapsed: 0.185 s
testMatchHighestVersion(org.eclipse.m2e.tests.discovery.MavenDiscoveryInstallOperationTest)  Time elapsed: 0.056 s
testMissingIU(org.eclipse.m2e.tests.discovery.MavenDiscoveryInstallOperationTest)  Time elapsed: 0.057 s
testMatchLowestVersion(org.eclipse.m2e.tests.discovery.MavenDiscoveryInstallOperationTest)  Time elapsed: 0.056 s
Running org.eclipse.m2e.tests.discovery.ConfigurationUpdateStartupTest
Tests run: 6, Failures: 0, Errors: 0, Skipped: 0, Time elapsed: 7.899 s - in org.eclipse.m2e.tests.discovery.ConfigurationUpdateStartupTest
testNoMavenProjects(org.eclipse.m2e.tests.discovery.ConfigurationUpdateStartupTest)  Time elapsed: 1.075 s
testToggleEarlyStartup(org.eclipse.m2e.tests.discovery.ConfigurationUpdateStartupTest)  Time elapsed: 1.019 s
testMavenProjectsErrors(org.eclipse.m2e.tests.discovery.ConfigurationUpdateStartupTest)  Time elapsed: 2.057 s
testConfigureSpecifiedProjects(org.eclipse.m2e.tests.discovery.ConfigurationUpdateStartupTest)  Time elapsed: 1.138 s
testMavenProjectsNoErrors(org.eclipse.m2e.tests.discovery.ConfigurationUpdateStartupTest)  Time elapsed: 1.625 s
testEmptyWorkspace(org.eclipse.m2e.tests.discovery.ConfigurationUpdateStartupTest)  Time elapsed: 0.985 s
Running org.eclipse.m2e.tests.discovery.MavenDiscoveryTest
Tests run: 9, Failures: 0, Errors: 0, Skipped: 0, Time elapsed: 0.521 s - in org.eclipse.m2e.tests.discovery.MavenDiscoveryTest
testCatalogSelectedByConfiguratorId(org.eclipse.m2e.tests.discovery.MavenDiscoveryTest)  Time elapsed: 0.084 s
testCatalogItemWithoutMappingMetadata(org.eclipse.m2e.tests.discovery.MavenDiscoveryTest)  Time elapsed: 0.002 s
testCatalogItemExtensionsMetadata(org.eclipse.m2e.tests.discovery.MavenDiscoveryTest)  Time elapsed: 0.002 s
testNotMatchPluginSelection(org.eclipse.m2e.tests.discovery.MavenDiscoveryTest)  Time elapsed: 0.062 s
testCatalogSelectedByLifecycleId(org.eclipse.m2e.tests.discovery.MavenDiscoveryTest)  Time elapsed: 0.07 s
testMultipleSelections(org.eclipse.m2e.tests.discovery.MavenDiscoveryTest)  Time elapsed: 0.09 s
testCatalogSelectedByPackaging(org.eclipse.m2e.tests.discovery.MavenDiscoveryTest)  Time elapsed: 0.081 s
testCatalogSelectedByMojoExecution(org.eclipse.m2e.tests.discovery.MavenDiscoveryTest)  Time elapsed: 0.071 s
testCatalogUnselected(org.eclipse.m2e.tests.discovery.MavenDiscoveryTest)  Time elapsed: 0.058 s
Running org.eclipse.m2e.tests.project.MavenProjectFacadeTest
Tests run: 9, Failures: 0, Errors: 0, Skipped: 0, Time elapsed: 13.918 s - in org.eclipse.m2e.tests.project.MavenProjectFacadeTest
testGetProjectConfiguratorsAfterWorkspaceRestart(org.eclipse.m2e.tests.project.MavenProjectFacadeTest)  Time elapsed: 1.436 s
testGetMojoExecutionAfterWorkspaceRestart(org.eclipse.m2e.tests.project.MavenProjectFacadeTest)  Time elapsed: 1.395 s
testGetMojoExecutionsWithoutMavenExecutionContext(org.eclipse.m2e.tests.project.MavenProjectFacadeTest)  Time elapsed: 1.385 s
testGetProjectConfigurators(org.eclipse.m2e.tests.project.MavenProjectFacadeTest)  Time elapsed: 1.529 s
test436668_EclipseProjectMetadataNotStale(org.eclipse.m2e.tests.project.MavenProjectFacadeTest)  Time elapsed: 1.402 s
testGetMojoExecution(org.eclipse.m2e.tests.project.MavenProjectFacadeTest)  Time elapsed: 1.428 s
testGetMojoExecutions(org.eclipse.m2e.tests.project.MavenProjectFacadeTest)  Time elapsed: 1.695 s
testIsStale(org.eclipse.m2e.tests.project.MavenProjectFacadeTest)  Time elapsed: 1.803 s
testGetMojoExecutionsAfterWorkspaceRestart(org.eclipse.m2e.tests.project.MavenProjectFacadeTest)  Time elapsed: 1.845 s
Running org.eclipse.m2e.tests.project.CompilerSettings18Test
Tests run: 1, Failures: 0, Errors: 0, Skipped: 0, Time elapsed: 1.458 s - in org.eclipse.m2e.tests.project.CompilerSettings18Test
testCompilerSettings18(org.eclipse.m2e.tests.project.CompilerSettings18Test)  Time elapsed: 1.458 s
Running org.eclipse.m2e.tests.project.MavenProjectInfoTest
Tests run: 1, Failures: 0, Errors: 0, Skipped: 0, Time elapsed: 0.001 s - in org.eclipse.m2e.tests.project.MavenProjectInfoTest
testTwoChildProjectInfosWithSameLabel(org.eclipse.m2e.tests.project.MavenProjectInfoTest)  Time elapsed: 0.001 s
Running org.eclipse.m2e.tests.project.CompilerSynonymTest
Tests run: 1, Failures: 0, Errors: 0, Skipped: 0, Time elapsed: 1.448 s - in org.eclipse.m2e.tests.project.CompilerSynonymTest
testSynonym(org.eclipse.m2e.tests.project.CompilerSynonymTest)  Time elapsed: 1.448 s
Running org.eclipse.m2e.tests.jdt.ProjectLayoutTest
Tests run: 1, Failures: 0, Errors: 0, Skipped: 0, Time elapsed: 2.018 s - in org.eclipse.m2e.tests.jdt.ProjectLayoutTest
test472726_basedirResources(org.eclipse.m2e.tests.jdt.ProjectLayoutTest)  Time elapsed: 2.018 s
Running org.eclipse.m2e.tests.jdt.internal.ClasspathEntryDescriptorTest
Tests run: 1, Failures: 0, Errors: 0, Skipped: 0, Time elapsed: 0.001 s - in org.eclipse.m2e.tests.jdt.internal.ClasspathEntryDescriptorTest
testArtifactKeyDeserialization(org.eclipse.m2e.tests.jdt.internal.ClasspathEntryDescriptorTest)  Time elapsed: 0 s
Running org.eclipse.m2e.tests.jdt.internal.MavenClasspathContainerSaveHelperTest
Tests run: 1, Failures: 0, Errors: 0, Skipped: 0, Time elapsed: 0.003 s - in org.eclipse.m2e.tests.jdt.internal.MavenClasspathContainerSaveHelperTest
testClasspathContainerSace(org.eclipse.m2e.tests.jdt.internal.MavenClasspathContainerSaveHelperTest)  Time elapsed: 0.003 s
Running org.eclipse.m2e.tests.jdt.JavaClasspathTest
Tests run: 22, Failures: 0, Errors: 0, Skipped: 0, Time elapsed: 46.856 s - in org.eclipse.m2e.tests.jdt.JavaClasspathTest
testStaleDerivedEntries(org.eclipse.m2e.tests.jdt.JavaClasspathTest)  Time elapsed: 2.595 s
test398121_PreserveOrderOfClasspathContainersOnUpdate(org.eclipse.m2e.tests.jdt.JavaClasspathTest)  Time elapsed: 2.62 s
test370685_PreserveResourcesOnUpdate(org.eclipse.m2e.tests.jdt.JavaClasspathTest)  Time elapsed: 2.129 s
test480137_addingResourceFoldersAreNotRemovedDuringConfigurationUpdate(org.eclipse.m2e.tests.jdt.JavaClasspathTest)  Time elapsed: 2.004 s
test537851_DisableTestClasspathFlag(org.eclipse.m2e.tests.jdt.JavaClasspathTest)  Time elapsed: 2.953 s
test526858_ProjectExportingTests(org.eclipse.m2e.tests.jdt.JavaClasspathTest)  Time elapsed: 3.131 s
test466518_classpathJREOrder(org.eclipse.m2e.tests.jdt.JavaClasspathTest)  Time elapsed: 2.06 s
test518218_configureMethodParametersGenerationWithCompilerArgs(org.eclipse.m2e.tests.jdt.JavaClasspathTest)  Time elapsed: 3.391 s
test518218_configureMethodParametersGenerationWithParameters(org.eclipse.m2e.tests.jdt.JavaClasspathTest)  Time elapsed: 1.437 s
test388541_KeepClasspathAttributes(org.eclipse.m2e.tests.jdt.JavaClasspathTest)  Time elapsed: 1.879 s
test526858_TestClasspathAttributeOnProject(org.eclipse.m2e.tests.jdt.JavaClasspathTest)  Time elapsed: 1.761 s
test526858_TestClasspathAttributeOnJar(org.eclipse.m2e.tests.jdt.JavaClasspathTest)  Time elapsed: 1.578 s
test518218_configureMethodParametersGenerationWithCompilerArgument(org.eclipse.m2e.tests.jdt.JavaClasspathTest)  Time elapsed: 1.861 s
testClasspathContainers(org.eclipse.m2e.tests.jdt.JavaClasspathTest)  Time elapsed: 2.153 s
test414645_TestClasspathAttributeOnRuntimeProjectDependencies(org.eclipse.m2e.tests.jdt.JavaClasspathTest)  Time elapsed: 1.687 s
test394042_ClasspathEntry4(org.eclipse.m2e.tests.jdt.JavaClasspathTest)  Time elapsed: 1.618 s
test414645_TestClasspathAttributeOnRuntimeJarDependencies(org.eclipse.m2e.tests.jdt.JavaClasspathTest)  Time elapsed: 1.92 s
test525880_JavaAccessRulesArePreservedOnUpdate(org.eclipse.m2e.tests.jdt.JavaClasspathTest)  Time elapsed: 2.412 s
test534049_SetReleaseFlag(org.eclipse.m2e.tests.jdt.JavaClasspathTest)  Time elapsed: 2.546 s
test549312_fallbackToLatestEE(org.eclipse.m2e.tests.jdt.JavaClasspathTest)  Time elapsed: 1.461 s
testImport(org.eclipse.m2e.tests.jdt.JavaClasspathTest)  Time elapsed: 1.41 s
test486739_PreserveExportedOnUpdate(org.eclipse.m2e.tests.jdt.JavaClasspathTest)  Time elapsed: 2.247 s
Running org.eclipse.m2e.tests.jdt.JavaCodeGenerationProjectConfiguratorTest
Tests run: 1, Failures: 0, Errors: 0, Skipped: 0, Time elapsed: 2.401 s - in org.eclipse.m2e.tests.jdt.JavaCodeGenerationProjectConfiguratorTest
test368333_generatedSourcesFoldersAreNotRemovedDuringConfigurationUpdate(org.eclipse.m2e.tests.jdt.JavaCodeGenerationProjectConfiguratorTest)  Time elapsed: 2.401 s
Running org.eclipse.m2e.tests.MutableProjectRegistryTest
Tests run: 8, Failures: 0, Errors: 0, Skipped: 0, Time elapsed: 8.577 s - in org.eclipse.m2e.tests.MutableProjectRegistryTest
testRemoveProject(org.eclipse.m2e.tests.MutableProjectRegistryTest)  Time elapsed: 1.119 s
testReplaceProject(org.eclipse.m2e.tests.MutableProjectRegistryTest)  Time elapsed: 1.11 s
testIllegalStateMerge(org.eclipse.m2e.tests.MutableProjectRegistryTest)  Time elapsed: 1.017 s
testForeignClassesInSerializedProjectRegistry(org.eclipse.m2e.tests.MutableProjectRegistryTest)  Time elapsed: 1.034 s
testDetectNoLongerExistingProjectsInWorkspaceState(org.eclipse.m2e.tests.MutableProjectRegistryTest)  Time elapsed: 1.07 s
testAddProject(org.eclipse.m2e.tests.MutableProjectRegistryTest)  Time elapsed: 1.13 s
testSaveParticipant(org.eclipse.m2e.tests.MutableProjectRegistryTest)  Time elapsed: 1.008 s
testRemoveUnknownProject(org.eclipse.m2e.tests.MutableProjectRegistryTest)  Time elapsed: 1.088 s
Running org.eclipse.m2e.tests.BuildPathManagerTest
[INFO] ----------------------------------------------------------------------------
[INFO] Using following parameters for creating project from Old (1.x) Archetype: maven-archetype-quickstart:1.1
[INFO] ----------------------------------------------------------------------------
[INFO] Parameter: basedir, Value: /home/jenkins/agent/workspace/m2e_master/m2e-core-tests/org.eclipse.m2e.tests/target/work/data
[INFO] Parameter: package, Value: jar
[INFO] Parameter: groupId, Value: archetype-project
[INFO] Parameter: artifactId, Value: archetype-project
[INFO] Parameter: packageName, Value: jar
[INFO] Parameter: version, Value: 0.0.1-SNAPSHOT
[INFO] project created from Old (1.x) Archetype in dir: /home/jenkins/agent/workspace/m2e_master/m2e-core-tests/org.eclipse.m2e.tests/target/work/data/archetype-project
[INFO] ----------------------------------------------------------------------------
[INFO] Using following parameters for creating project from Old (1.x) Archetype: maven-archetype-quickstart:1.1
[INFO] ----------------------------------------------------------------------------
[INFO] Parameter: basedir, Value: /tmp/m2eclipse5698152964579052289test/external-archetype-project-1
[INFO] Parameter: package, Value: jar
[INFO] Parameter: groupId, Value: external-archetype-project-1
[INFO] Parameter: artifactId, Value: external-archetype-project-1
[INFO] Parameter: packageName, Value: jar
[INFO] Parameter: version, Value: 0.0.1-SNAPSHOT
[INFO] project created from Old (1.x) Archetype in dir: /tmp/m2eclipse5698152964579052289test/external-archetype-project-1/external-archetype-project-1
[INFO] ----------------------------------------------------------------------------
[INFO] Using following parameters for creating project from Old (1.x) Archetype: maven-archetype-quickstart:1.1
[INFO] ----------------------------------------------------------------------------
[INFO] Parameter: basedir, Value: /tmp/m2eclipse5698152964579052289test/external-archetype-project-2
[INFO] Parameter: package, Value: jar
[INFO] Parameter: groupId, Value: external-archetype-project-2
[INFO] Parameter: artifactId, Value: external-archetype-project-2
[INFO] Parameter: packageName, Value: jar
[INFO] Parameter: version, Value: 0.0.1-SNAPSHOT
Tests run: 45, Failures: 0, Errors: 1, Skipped: 1, Time elapsed: 94.322 s <<< FAILURE! - in org.eclipse.m2e.tests.BuildPathManagerTest
testDownloadSources_001_workspaceRestart(org.eclipse.m2e.tests.BuildPathManagerTest)  Time elapsed: 3.431 s
testEnableMavenNatureWithNoWorkspace(org.eclipse.m2e.tests.BuildPathManagerTest)  Time elapsed: 2.171 s
test385391_keepCustomSourceEncoding(org.eclipse.m2e.tests.BuildPathManagerTest)  Time elapsed: 2.588 s
testProjectImportWithProfile1(org.eclipse.m2e.tests.BuildPathManagerTest)  Time elapsed: 2.172 s
testProjectImportWithProfile2(org.eclipse.m2e.tests.BuildPathManagerTest)  Time elapsed: 2.287 s
testProjectNameWithNameTemplate(org.eclipse.m2e.tests.BuildPathManagerTest)  Time elapsed: 1.528 s
testProjectImport001_useMavenOutputFolders(org.eclipse.m2e.tests.BuildPathManagerTest)  Time elapsed: 1.487 s
testArchetypeProject(org.eclipse.m2e.tests.BuildPathManagerTest)  Time elapsed: 2.337 s
testClasspathOrderWorkspace001(org.eclipse.m2e.tests.BuildPathManagerTest)  Time elapsed: 3.056 s
testClasspathOrderWorkspace003(org.eclipse.m2e.tests.BuildPathManagerTest)  Time elapsed: 2.044 s
testDownloadSources_001_sourceAttachment(org.eclipse.m2e.tests.BuildPathManagerTest)  Time elapsed: 1.525 s
testMNGECLIPSE_2367_same_sources_resources(org.eclipse.m2e.tests.BuildPathManagerTest)  Time elapsed: 1.999 s
test360962_forbiddenReferencePreference(org.eclipse.m2e.tests.BuildPathManagerTest)  Time elapsed: 2.062 s
test388596_expandedSnapshotDependency(org.eclipse.m2e.tests.BuildPathManagerTest)  Time elapsed: 2.404 s
test359725_resourcesWorkspaceRoot(org.eclipse.m2e.tests.BuildPathManagerTest)  Time elapsed: 2.396 s
testClassifiers(org.eclipse.m2e.tests.BuildPathManagerTest)  Time elapsed: 2.336 s
test486721_overlappingResourceFolders(org.eclipse.m2e.tests.BuildPathManagerTest)  Time elapsed: 1.738 s
test005_dependencyAvailableFromLocalRepoAndWorkspace(org.eclipse.m2e.tests.BuildPathManagerTest)  Time elapsed: 3.821 s
testDisableMavenNature(org.eclipse.m2e.tests.BuildPathManagerTest)  Time elapsed: 1.961 s
testDownloadSources_001_basic(org.eclipse.m2e.tests.BuildPathManagerTest)  Time elapsed: 3.384 s
testDownloadSources_003_customRemoteRepository(org.eclipse.m2e.tests.BuildPathManagerTest)  Time elapsed: 2.234 s
_testProjectImport002_useMavenOutputFolders(org.eclipse.m2e.tests.BuildPathManagerTest) skipped
testMNGECLIPSE_2367_sources_encloses_resources(org.eclipse.m2e.tests.BuildPathManagerTest)  Time elapsed: 1.536 s
testDownloadSources_006_nonMavenProject(org.eclipse.m2e.tests.BuildPathManagerTest)  Time elapsed: 2.195 s  <<< ERROR!
org.eclipse.core.runtime.CoreException: Reindexing error
	at org.eclipse.m2e.tests.BuildPathManagerTest.testDownloadSources_006_nonMavenProject(BuildPathManagerTest.java:656)
Caused by: java.nio.channels.OverlappingFileLockException
	at org.eclipse.m2e.tests.BuildPathManagerTest.testDownloadSources_006_nonMavenProject(BuildPathManagerTest.java:656)

testCompilerSettings14(org.eclipse.m2e.tests.BuildPathManagerTest)  Time elapsed: 1.528 s
testSimpleProjectInExternalLocation(org.eclipse.m2e.tests.BuildPathManagerTest)  Time elapsed: 1.761 s
testDownloadSources_007_missingTestsSources(org.eclipse.m2e.tests.BuildPathManagerTest)  Time elapsed: 2.546 s
testMNGECLIPSE_696_compiler_includes_excludes(org.eclipse.m2e.tests.BuildPathManagerTest)  Time elapsed: 1.894 s
test431080_flatDirectoryLayout(org.eclipse.m2e.tests.BuildPathManagerTest)  Time elapsed: 1.495 s
testDownloadSources_005_classifier(org.eclipse.m2e.tests.BuildPathManagerTest)  Time elapsed: 2.193 s
testDownloadSources_008_fallbackToJavadocWhenMissingSources(org.eclipse.m2e.tests.BuildPathManagerTest)  Time elapsed: 2.337 s
testArchetypeProjectInExternalLocation(org.eclipse.m2e.tests.BuildPathManagerTest)  Time elapsed: 2.237 s
testMNGECLIPSE_2367_testSources_encloses_resources(org.eclipse.m2e.tests.BuildPathManagerTest)  Time elapsed: 1.42 s
testCompilerSettingsJsr14(org.eclipse.m2e.tests.BuildPathManagerTest)  Time elapsed: 1.479 s
testProjectNameTemplateWithProperties(org.eclipse.m2e.tests.BuildPathManagerTest)  Time elapsed: 1.628 s
testDownloadSources_002_javadoconly(org.eclipse.m2e.tests.BuildPathManagerTest)  Time elapsed: 2.061 s
testMavenBuilderOrder(org.eclipse.m2e.tests.BuildPathManagerTest)  Time elapsed: 2.805 s
testDownloadSources_004_testsClassifier(org.eclipse.m2e.tests.BuildPathManagerTest)  Time elapsed: 2.28 s
testEnableMavenNature(org.eclipse.m2e.tests.BuildPathManagerTest)  Time elapsed: 2.045 s
testProjectNameTemplate(org.eclipse.m2e.tests.BuildPathManagerTest)  Time elapsed: 1.962 s
testMNGECLIPSE_1047_localRepoPath(org.eclipse.m2e.tests.BuildPathManagerTest)  Time elapsed: 1.12 s
testCreateSimpleProject(org.eclipse.m2e.tests.BuildPathManagerTest)  Time elapsed: 1.726 s
testMNGECLIPSE_2433_resourcesOutsideBasdir(org.eclipse.m2e.tests.BuildPathManagerTest)  Time elapsed: 2.496 s
testUpdateProjectConfigurationWithWorkspace(org.eclipse.m2e.tests.BuildPathManagerTest)  Time elapsed: 3.046 s
test486721_sourceAndResourceUnderSameNonDefaultFolder(org.eclipse.m2e.tests.BuildPathManagerTest)  Time elapsed: 1.569 s
Running org.eclipse.m2e.tests.ProjectConfigurationManagerTest
[INFO] ----------------------------------------------------------------------------
[INFO] Using following parameters for creating project from Archetype: mngeclipse-2110:1.0
[INFO] ----------------------------------------------------------------------------
[INFO] Parameter: groupId, Value: mngeclipse-2110
[INFO] Parameter: artifactId, Value: mngeclipse-2110
[INFO] Parameter: version, Value: 0.0.1-SNAPSHOT
[INFO] Parameter: package, Value: jar
[INFO] Parameter: packageInPathFormat, Value: jar
[INFO] project created from Archetype in dir: /home/jenkins/agent/workspace/m2e_master/m2e-core-tests/org.eclipse.m2e.tests/target/work/data/mngeclipse-2110
[INFO] ----------------------------------------------------------------------------
[INFO] Using following parameters for creating project from Old (1.x) Archetype: maven-archetype-quickstart:1.1
[INFO] ----------------------------------------------------------------------------
[INFO] Parameter: basedir, Value: /home/jenkins/agent/workspace/m2e_master/m2e-core-tests/org.eclipse.m2e.tests/target/work/data/parent002
[INFO] Parameter: package, Value: jar
[INFO] Parameter: groupId, Value: archetyped
[INFO] Parameter: artifactId, Value: archetyped
[INFO] Parameter: packageName, Value: jar
[INFO] Parameter: version, Value: 0.0.1-SNAPSHOT
[INFO] project created from Old (1.x) Archetype in dir: /home/jenkins/agent/workspace/m2e_master/m2e-core-tests/org.eclipse.m2e.tests/target/work/data/parent002/archetyped
Tests run: 23, Failures: 0, Errors: 0, Skipped: 0, Time elapsed: 56.914 s - in org.eclipse.m2e.tests.ProjectConfigurationManagerTest
testAddRemoveMavenBuilder(org.eclipse.m2e.tests.ProjectConfigurationManagerTest)  Time elapsed: 1.005 s
testImportJavaProjectWithUnknownPackaging(org.eclipse.m2e.tests.ProjectConfigurationManagerTest)  Time elapsed: 2.444 s
testHiddenFolderForSimpleModule(org.eclipse.m2e.tests.ProjectConfigurationManagerTest)  Time elapsed: 2.864 s
testConfigureProjectEncodingForBasicProject(org.eclipse.m2e.tests.ProjectConfigurationManagerTest)  Time elapsed: 2.054 s
testAddRemoveMavenBuilderDisabled(org.eclipse.m2e.tests.ProjectConfigurationManagerTest)  Time elapsed: 1.082 s
testExtractionOfCompilerSettingsDespiteErrorsInExecutionPlan(org.eclipse.m2e.tests.ProjectConfigurationManagerTest)  Time elapsed: 1.44 s
testRevertToContainerDefinedEncoding(org.eclipse.m2e.tests.ProjectConfigurationManagerTest)  Time elapsed: 1.762 s
testIgnoreStaleProjectConfiguration(org.eclipse.m2e.tests.ProjectConfigurationManagerTest)  Time elapsed: 1.703 s
test397251_forcePluginResolutionUpdate(org.eclipse.m2e.tests.ProjectConfigurationManagerTest)  Time elapsed: 11.292 s
testResolutionOfArchetypeFromRepository(org.eclipse.m2e.tests.ProjectConfigurationManagerTest)  Time elapsed: 3.59 s
testStaleProjectConfigurationMarkerAfterFixingMissingBuildExtension(org.eclipse.m2e.tests.ProjectConfigurationManagerTest)  Time elapsed: 2.638 s
test447460MultipleUpdateConfiguration(org.eclipse.m2e.tests.ProjectConfigurationManagerTest)  Time elapsed: 1.627 s
testHiddenFolderForArchetypeModule(org.eclipse.m2e.tests.ProjectConfigurationManagerTest)  Time elapsed: 2.48 s
testStaleProjectConfigurationMarkerAfterWorkspaceRestart(org.eclipse.m2e.tests.ProjectConfigurationManagerTest)  Time elapsed: 2.188 s
testStaleProjectConfigurationWarningMarker(org.eclipse.m2e.tests.ProjectConfigurationManagerTest)  Time elapsed: 2.286 s
testAutomaticUpdateProjectConfigurationMarker(org.eclipse.m2e.tests.ProjectConfigurationManagerTest)  Time elapsed: 2.063 s
test473953_ProjectCreationListener(org.eclipse.m2e.tests.ProjectConfigurationManagerTest)  Time elapsed: 2.162 s
testWorkspaceResolutionOfInterModuleDependenciesDuringImport(org.eclipse.m2e.tests.ProjectConfigurationManagerTest)  Time elapsed: 3.306 s
testBasedirRenameRequired(org.eclipse.m2e.tests.ProjectConfigurationManagerTest)  Time elapsed: 1.82 s
testStaleProjectConfigurationMarker(org.eclipse.m2e.tests.ProjectConfigurationManagerTest)  Time elapsed: 2.171 s
testKeepEncodingSetByUserForSubfoldersAndFiles(org.eclipse.m2e.tests.ProjectConfigurationManagerTest)  Time elapsed: 1.695 s
testBasedirRenameNo(org.eclipse.m2e.tests.ProjectConfigurationManagerTest)  Time elapsed: 1.569 s
testBasicUpdateConfiguration(org.eclipse.m2e.tests.ProjectConfigurationManagerTest)  Time elapsed: 1.671 s
Running org.eclipse.m2e.tests.ProjectRegistryRefreshJobTest
Tests run: 10, Failures: 0, Errors: 0, Skipped: 0, Time elapsed: 32.376 s - in org.eclipse.m2e.tests.ProjectRegistryRefreshJobTest
test436679_NoRefreshWhenImport(org.eclipse.m2e.tests.ProjectRegistryRefreshJobTest)  Time elapsed: 3.043 s
test445675_autobuild(org.eclipse.m2e.tests.ProjectRegistryRefreshJobTest)  Time elapsed: 3.207 s
testMultiProject(org.eclipse.m2e.tests.ProjectRegistryRefreshJobTest)  Time elapsed: 4.008 s
testRefreshAfterOpen(org.eclipse.m2e.tests.ProjectRegistryRefreshJobTest)  Time elapsed: 2.581 s
testUpdateForced(org.eclipse.m2e.tests.ProjectRegistryRefreshJobTest)  Time elapsed: 3.29 s
test416050_ignoreNonMavenProjectChanges(org.eclipse.m2e.tests.ProjectRegistryRefreshJobTest)  Time elapsed: 1.791 s
testDependencyAdded_NoUpdate(org.eclipse.m2e.tests.ProjectRegistryRefreshJobTest)  Time elapsed: 3.614 s
testXXXX_projectRenameRefresh(org.eclipse.m2e.tests.ProjectRegistryRefreshJobTest)  Time elapsed: 3.216 s
test437493_NoRefreshWhenInitClasspathContainer(org.eclipse.m2e.tests.ProjectRegistryRefreshJobTest)  Time elapsed: 3.666 s
testUpdateNotForced(org.eclipse.m2e.tests.ProjectRegistryRefreshJobTest)  Time elapsed: 3.958 s
Running org.eclipse.m2e.tests.conversion.ProjectConversionManagerTest
Tests run: 3, Failures: 0, Errors: 0, Skipped: 0, Time elapsed: 3.105 s - in org.eclipse.m2e.tests.conversion.ProjectConversionManagerTest
test393613_SortConversionParticipants(org.eclipse.m2e.tests.conversion.ProjectConversionManagerTest)  Time elapsed: 0.961 s
testConversionParticipantsPerProject(org.eclipse.m2e.tests.conversion.ProjectConversionManagerTest)  Time elapsed: 1.018 s
testRestrictedPackagings(org.eclipse.m2e.tests.conversion.ProjectConversionManagerTest)  Time elapsed: 1.126 s
Running org.eclipse.m2e.tests.conversion.ProjectConversionTest
Tests run: 7, Failures: 0, Errors: 0, Skipped: 0, Time elapsed: 15.712 s - in org.eclipse.m2e.tests.conversion.ProjectConversionTest
testMultipleSourcesProjectConversion(org.eclipse.m2e.tests.conversion.ProjectConversionTest)  Time elapsed: 2.498 s
testProjectConversionWithSvn(org.eclipse.m2e.tests.conversion.ProjectConversionTest)  Time elapsed: 1.894 s
testJavaMixedWithResourcesProjectConversion(org.eclipse.m2e.tests.conversion.ProjectConversionTest)  Time elapsed: 2.263 s
testInheritJavaSettingsDuringConversion(org.eclipse.m2e.tests.conversion.ProjectConversionTest)  Time elapsed: 2.153 s
testOptionalSourceProjectConversion(org.eclipse.m2e.tests.conversion.ProjectConversionTest)  Time elapsed: 2.496 s
testNoCustomizationNeededProjectConversion(org.eclipse.m2e.tests.conversion.ProjectConversionTest)  Time elapsed: 2.127 s
testMavenLayoutProjectConversion(org.eclipse.m2e.tests.conversion.ProjectConversionTest)  Time elapsed: 2.279 s
Running org.eclipse.m2e.tests.conversion.ProjectConversionEnablerTest
Tests run: 3, Failures: 0, Errors: 0, Skipped: 0, Time elapsed: 3.224 s - in org.eclipse.m2e.tests.conversion.ProjectConversionEnablerTest
testProjectCanBeConverted(org.eclipse.m2e.tests.conversion.ProjectConversionEnablerTest)  Time elapsed: 1.086 s
testProjectCannotBeConverted(org.eclipse.m2e.tests.conversion.ProjectConversionEnablerTest)  Time elapsed: 1.053 s
testEnablerNotFound(org.eclipse.m2e.tests.conversion.ProjectConversionEnablerTest)  Time elapsed: 1.085 s
Running org.eclipse.m2e.tests.launch.MavenRuntimeClasspathProviderTest
Tests run: 7, Failures: 0, Errors: 0, Skipped: 0, Time elapsed: 16.164 s - in org.eclipse.m2e.tests.launch.MavenRuntimeClasspathProviderTest
testAddJUnit5DependenciesWithEngine(org.eclipse.m2e.tests.launch.MavenRuntimeClasspathProviderTest)  Time elapsed: 3.351 s
testClasspathScopeRuntime(org.eclipse.m2e.tests.launch.MavenRuntimeClasspathProviderTest)  Time elapsed: 2.755 s
testAddJUnit5DependenciesAPIOnlyDisabled(org.eclipse.m2e.tests.launch.MavenRuntimeClasspathProviderTest)  Time elapsed: 2.169 s
testAddJUnit5DependenciesWithLauncher(org.eclipse.m2e.tests.launch.MavenRuntimeClasspathProviderTest)  Time elapsed: 1.602 s
testClasspathScopeTest(org.eclipse.m2e.tests.launch.MavenRuntimeClasspathProviderTest)  Time elapsed: 2.555 s
testAddJUnit5DependenciesAggregator(org.eclipse.m2e.tests.launch.MavenRuntimeClasspathProviderTest)  Time elapsed: 2.304 s
testAddJUnit5DependenciesAPIOnly(org.eclipse.m2e.tests.launch.MavenRuntimeClasspathProviderTest)  Time elapsed: 1.428 s
Running org.eclipse.m2e.tests.launch.MavenLaunchDelegateTest
Tests run: 6, Failures: 0, Errors: 0, Skipped: 0, Time elapsed: 0.021 s - in org.eclipse.m2e.tests.launch.MavenLaunchDelegateTest
testGetVMArguments332WithParent(org.eclipse.m2e.tests.launch.MavenLaunchDelegateTest)  Time elapsed: 0.003 s
testGetVMArgumentsSubstituteMultiModuleDir(org.eclipse.m2e.tests.launch.MavenLaunchDelegateTest)  Time elapsed: 0.002 s
testUserSettingsProgramArguments(org.eclipse.m2e.tests.launch.MavenLaunchDelegateTest)  Time elapsed: 0.01 s
testGlobalSettingsProgramArguments(org.eclipse.m2e.tests.launch.MavenLaunchDelegateTest)  Time elapsed: 0.005 s
testGetVMArguments325(org.eclipse.m2e.tests.launch.MavenLaunchDelegateTest)  Time elapsed: 0 s
testGetVMArguments331(org.eclipse.m2e.tests.launch.MavenLaunchDelegateTest)  Time elapsed: 0 s
Running org.eclipse.m2e.tests.launch.LaunchingUtilsTest
Tests run: 1, Failures: 0, Errors: 0, Skipped: 0, Time elapsed: 1.002 s - in org.eclipse.m2e.tests.launch.LaunchingUtilsTest
testGenerateProjectLocationVariableExpression(org.eclipse.m2e.tests.launch.LaunchingUtilsTest)  Time elapsed: 1.002 s
Running org.eclipse.m2e.tests.launch.MavenLauncherConfigurationHandlerTest
Tests run: 1, Failures: 0, Errors: 0, Skipped: 0, Time elapsed: 1.491 s - in org.eclipse.m2e.tests.launch.MavenLauncherConfigurationHandlerTest
test421015_workspaceProjectLibraryClasspathEntries(org.eclipse.m2e.tests.launch.MavenLauncherConfigurationHandlerTest)  Time elapsed: 1.491 s
Running org.eclipse.m2e.tests.archetype.ArchetypeManagerTest
Tests run: 12, Failures: 0, Errors: 0, Skipped: 0, Time elapsed: 1.999 s - in org.eclipse.m2e.tests.archetype.ArchetypeManagerTest
test371775_archetypeRepoAuthentication(org.eclipse.m2e.tests.archetype.ArchetypeManagerTest)  Time elapsed: 0.002 s
testEmbeddedLocalArchetypeCatalogFactory(org.eclipse.m2e.tests.archetype.ArchetypeManagerTest)  Time elapsed: 0.001 s
testArchetypeManagerSaveRestore(org.eclipse.m2e.tests.archetype.ArchetypeManagerTest)  Time elapsed: 0.695 s
testRepositoryUrlFromRemoteArchetypeCatalogs(org.eclipse.m2e.tests.archetype.ArchetypeManagerTest)  Time elapsed: 0.024 s
testArchetypeManager(org.eclipse.m2e.tests.archetype.ArchetypeManagerTest)  Time elapsed: 1.187 s
testAddRemoteCatalog(org.eclipse.m2e.tests.archetype.ArchetypeManagerTest)  Time elapsed: 0.004 s
testActiveArchetypeCatalogs(org.eclipse.m2e.tests.archetype.ArchetypeManagerTest)  Time elapsed: 0.002 s
testBadLocalArchetypeCatalogFactory(org.eclipse.m2e.tests.archetype.ArchetypeManagerTest)  Time elapsed: 0 s
testRemoteArchetypeCatalogFactory(org.eclipse.m2e.tests.archetype.ArchetypeManagerTest)  Time elapsed: 0 s
test359855_localArchetypeWithProperties(org.eclipse.m2e.tests.archetype.ArchetypeManagerTest)  Time elapsed: 0.007 s
testLocalArchetypeCatalogFactory(org.eclipse.m2e.tests.archetype.ArchetypeManagerTest)  Time elapsed: 0 s
test387784_remoteArchetypeWithProperties(org.eclipse.m2e.tests.archetype.ArchetypeManagerTest)  Time elapsed: 0.077 s
Running org.eclipse.m2e.tests.archetype.ArchetypeUtilTest
Tests run: 2, Failures: 0, Errors: 0, Skipped: 0, Time elapsed: 0.001 s - in org.eclipse.m2e.tests.archetype.ArchetypeUtilTest
testAreEqual(org.eclipse.m2e.tests.archetype.ArchetypeUtilTest)  Time elapsed: 0 s
testGetHashCode(org.eclipse.m2e.tests.archetype.ArchetypeUtilTest)  Time elapsed: 0 s
Running org.eclipse.m2e.tests.builder.BuildContextLifecycleTest
Tests run: 1, Failures: 0, Errors: 0, Skipped: 0, Time elapsed: 3.051 s - in org.eclipse.m2e.tests.builder.BuildContextLifecycleTest
testBuildContextRefreshProject(org.eclipse.m2e.tests.builder.BuildContextLifecycleTest)  Time elapsed: 3.051 s
Running org.eclipse.m2e.tests.builder.MavenBuilderTest
Tests run: 14, Failures: 0, Errors: 0, Skipped: 2, Time elapsed: 22.302 s - in org.eclipse.m2e.tests.builder.MavenBuilderTest
test005_pomChanged(org.eclipse.m2e.tests.builder.MavenBuilderTest)  Time elapsed: 2.151 s
test007_refreshChangedPom(org.eclipse.m2e.tests.builder.MavenBuilderTest)  Time elapsed: 2.095 s
_test006_testPluginProperties(org.eclipse.m2e.tests.builder.MavenBuilderTest) skipped
test397251_malformedPom(org.eclipse.m2e.tests.builder.MavenBuilderTest)  Time elapsed: 1.15 s
test422106_legacyPlexusUtils(org.eclipse.m2e.tests.builder.MavenBuilderTest)  Time elapsed: 1.864 s
test004_useMavenOutputFolders(org.eclipse.m2e.tests.builder.MavenBuilderTest)  Time elapsed: 1.552 s
test002_customResourceLocation(org.eclipse.m2e.tests.builder.MavenBuilderTest)  Time elapsed: 1.728 s
test001_standardLayout(org.eclipse.m2e.tests.builder.MavenBuilderTest)  Time elapsed: 1.662 s
test_crossproject(org.eclipse.m2e.tests.builder.MavenBuilderTest)  Time elapsed: 2.762 s
test380096_cleanProjectWithLifecycleMappingProblemsAfterWorkspaceRestart(org.eclipse.m2e.tests.builder.MavenBuilderTest)  Time elapsed: 1.812 s
test010_properties(org.eclipse.m2e.tests.builder.MavenBuilderTest)  Time elapsed: 1.951 s
_test008_classpathChange(org.eclipse.m2e.tests.builder.MavenBuilderTest) skipped
test368380_buildContextDeepRefreshFromLocal(org.eclipse.m2e.tests.builder.MavenBuilderTest)  Time elapsed: 1.845 s
test013_refreshFixedPom(org.eclipse.m2e.tests.builder.MavenBuilderTest)  Time elapsed: 1.728 s
Running org.eclipse.m2e.tests.builder.EclipseIncrementalBuildContextTest
Tests run: 1, Failures: 0, Errors: 0, Skipped: 0, Time elapsed: 1.776 s - in org.eclipse.m2e.tests.builder.EclipseIncrementalBuildContextTest
testScanner(org.eclipse.m2e.tests.builder.EclipseIncrementalBuildContextTest)  Time elapsed: 1.775 s
Running org.eclipse.m2e.tests.builder.EclipseBuildContextTest
Tests run: 2, Failures: 0, Errors: 0, Skipped: 0, Time elapsed: 3.556 s - in org.eclipse.m2e.tests.builder.EclipseBuildContextTest
testScanner(org.eclipse.m2e.tests.builder.EclipseBuildContextTest)  Time elapsed: 1.602 s
test361038_buildContext_scan_nonExistingFolder(org.eclipse.m2e.tests.builder.EclipseBuildContextTest)  Time elapsed: 1.953 s
Running org.eclipse.m2e.tests.ProfileSupportTest
Tests run: 1, Failures: 0, Errors: 0, Skipped: 0, Time elapsed: 1.543 s - in org.eclipse.m2e.tests.ProfileSupportTest
test337353_deactivateProfile(org.eclipse.m2e.tests.ProfileSupportTest)  Time elapsed: 1.543 s
Running org.eclipse.m2e.tests.ProjectRegistryManagerTest
Tests run: 50, Failures: 0, Errors: 0, Skipped: 1, Time elapsed: 49.952 s - in org.eclipse.m2e.tests.ProjectRegistryManagerTest
test020_moduleWithPomErrors(org.eclipse.m2e.tests.ProjectRegistryManagerTest)  Time elapsed: 0.988 s
test356645_redundantSnapshotResolution(org.eclipse.m2e.tests.ProjectRegistryManagerTest)  Time elapsed: 0.953 s
test000_pom_simple(org.eclipse.m2e.tests.ProjectRegistryManagerTest)  Time elapsed: 0.97 s
test008_staleMissingParent(org.eclipse.m2e.tests.ProjectRegistryManagerTest)  Time elapsed: 1.014 s
_testExtensionPluginResolution(org.eclipse.m2e.tests.ProjectRegistryManagerTest) skipped
test435692_affected_changes(org.eclipse.m2e.tests.ProjectRegistryManagerTest)  Time elapsed: 1.056 s
test007_staleDependencies(org.eclipse.m2e.tests.ProjectRegistryManagerTest)  Time elapsed: 0.953 s
test001_missingParent(org.eclipse.m2e.tests.ProjectRegistryManagerTest)  Time elapsed: 1.006 s
testWorkspaceDependencyVersionRange(org.eclipse.m2e.tests.ProjectRegistryManagerTest)  Time elapsed: 0.992 s
test000_removeClosed(org.eclipse.m2e.tests.ProjectRegistryManagerTest)  Time elapsed: 1.035 s
test013_missingDependencyMarker(org.eclipse.m2e.tests.ProjectRegistryManagerTest)  Time elapsed: 1.019 s
test436929_import_refresh(org.eclipse.m2e.tests.ProjectRegistryManagerTest)  Time elapsed: 1.039 s
testGlobalUpdatePolicyNever(org.eclipse.m2e.tests.ProjectRegistryManagerTest)  Time elapsed: 0.955 s
testRepositoryMetadataCacheUsed(org.eclipse.m2e.tests.ProjectRegistryManagerTest)  Time elapsed: 0.976 s
test008_staleMissingParent2(org.eclipse.m2e.tests.ProjectRegistryManagerTest)  Time elapsed: 1.046 s
test015_refreshOffline(org.eclipse.m2e.tests.ProjectRegistryManagerTest)  Time elapsed: 1.184 s
test017_moduleRefresh(org.eclipse.m2e.tests.ProjectRegistryManagerTest)  Time elapsed: 0.96 s
test000_simple(org.eclipse.m2e.tests.ProjectRegistryManagerTest)  Time elapsed: 0.941 s
test005_dependencyAvailableFromLocalRepoAndWorkspace(org.eclipse.m2e.tests.ProjectRegistryManagerTest)  Time elapsed: 0.963 s
test463075_extensionAndPluginRealm(org.eclipse.m2e.tests.ProjectRegistryManagerTest)  Time elapsed: 1.027 s
testPropertiesSubstitution(org.eclipse.m2e.tests.ProjectRegistryManagerTest)  Time elapsed: 1.073 s
test000_deletePom(org.eclipse.m2e.tests.ProjectRegistryManagerTest)  Time elapsed: 0.982 s
test006_parentAvailableFromLocalRepoAndWorkspace(org.eclipse.m2e.tests.ProjectRegistryManagerTest)  Time elapsed: 0.972 s
test005_snapshotAvailableFromLocalRepoAndWorkspace(org.eclipse.m2e.tests.ProjectRegistryManagerTest)  Time elapsed: 1.01 s
test007_changedVersion(org.eclipse.m2e.tests.ProjectRegistryManagerTest)  Time elapsed: 1.003 s
test000_eventMerge(org.eclipse.m2e.tests.ProjectRegistryManagerTest)  Time elapsed: 1.11 s
testWorkspaceResolutionApi(org.eclipse.m2e.tests.ProjectRegistryManagerTest)  Time elapsed: 0.97 s
testOptionalDependencies(org.eclipse.m2e.tests.ProjectRegistryManagerTest)  Time elapsed: 1.033 s
test460983_parentVersionRange(org.eclipse.m2e.tests.ProjectRegistryManagerTest)  Time elapsed: 1.02 s
test009_noworkspaceResolution(org.eclipse.m2e.tests.ProjectRegistryManagerTest)  Time elapsed: 0.976 s
test001_dependencyOnModuleWithInheritedGroupAndVersion(org.eclipse.m2e.tests.ProjectRegistryManagerTest)  Time elapsed: 1.009 s
testDependencyScopeChanged(org.eclipse.m2e.tests.ProjectRegistryManagerTest)  Time elapsed: 1.055 s
test007_newTransitiveDependency(org.eclipse.m2e.tests.ProjectRegistryManagerTest)  Time elapsed: 1.116 s
testCorrelatedMissingDependency(org.eclipse.m2e.tests.ProjectRegistryManagerTest)  Time elapsed: 0.968 s
test013_cantParsePomMarker(org.eclipse.m2e.tests.ProjectRegistryManagerTest)  Time elapsed: 1.018 s
test006_parentAvailableFromLocalRepoAndWorkspace01(org.eclipse.m2e.tests.ProjectRegistryManagerTest)  Time elapsed: 1.084 s
testPluginMainArtifactNotResolvedFromWorkspace(org.eclipse.m2e.tests.ProjectRegistryManagerTest)  Time elapsed: 1.032 s
test000_removeDeleted(org.eclipse.m2e.tests.ProjectRegistryManagerTest)  Time elapsed: 0.993 s
testEnvironmentVariablesConsidered(org.eclipse.m2e.tests.ProjectRegistryManagerTest)  Time elapsed: 0.987 s
test441257_stalePluginRealms(org.eclipse.m2e.tests.ProjectRegistryManagerTest)  Time elapsed: 1.022 s
test418674_ChecksumPolicyFail(org.eclipse.m2e.tests.ProjectRegistryManagerTest)  Time elapsed: 1.035 s
test418674_ChecksumPolicyWarn(org.eclipse.m2e.tests.ProjectRegistryManagerTest)  Time elapsed: 1.012 s
test021_dependencyVersionRange(org.eclipse.m2e.tests.ProjectRegistryManagerTest)  Time elapsed: 1.008 s
test405090_staleBuildExtensionsResolutionError(org.eclipse.m2e.tests.ProjectRegistryManagerTest)  Time elapsed: 1.015 s
test007_dependentRefreshAfterWorkspaceRestart(org.eclipse.m2e.tests.ProjectRegistryManagerTest)  Time elapsed: 1.34 s
testJdkProfileActivation(org.eclipse.m2e.tests.ProjectRegistryManagerTest)  Time elapsed: 0.991 s
test022_noChangeReloadWithUnrelatedRemoveProject(org.eclipse.m2e.tests.ProjectRegistryManagerTest)  Time elapsed: 1.006 s
test012_downloadExternalDependency(org.eclipse.m2e.tests.ProjectRegistryManagerTest)  Time elapsed: 0.973 s
test441257_stalePluginRealms_withParent(org.eclipse.m2e.tests.ProjectRegistryManagerTest)  Time elapsed: 1.051 s
test453995_dependencyManagementVersionless(org.eclipse.m2e.tests.ProjectRegistryManagerTest)  Time elapsed: 1.006 s
Running org.eclipse.m2e.tests.scm.ScmHandlerFactoryTest
Tests run: 1, Failures: 0, Errors: 0, Skipped: 0, Time elapsed: 0.003 s - in org.eclipse.m2e.tests.scm.ScmHandlerFactoryTest
testScmHandlerFactory(org.eclipse.m2e.tests.scm.ScmHandlerFactoryTest)  Time elapsed: 0.002 s
Running org.eclipse.m2e.tests.LocalProjectScannerTest
Tests run: 11, Failures: 0, Errors: 0, Skipped: 0, Time elapsed: 0.005 s - in org.eclipse.m2e.tests.LocalProjectScannerTest
testDeepNesting002(org.eclipse.m2e.tests.LocalProjectScannerTest)  Time elapsed: 0 s
testOutsideWorkspace(org.eclipse.m2e.tests.LocalProjectScannerTest)  Time elapsed: 0.001 s
testModuleCorrelationInverse(org.eclipse.m2e.tests.LocalProjectScannerTest)  Time elapsed: 0 s
testCircleRefs(org.eclipse.m2e.tests.LocalProjectScannerTest)  Time elapsed: 0.001 s
testSkipNested(org.eclipse.m2e.tests.LocalProjectScannerTest)  Time elapsed: 0 s
testNoMetadata(org.eclipse.m2e.tests.LocalProjectScannerTest)  Time elapsed: 0 s
testStackOverflow(org.eclipse.m2e.tests.LocalProjectScannerTest)  Time elapsed: 0.001 s
testMNGECLIPSE614_ImportModulesOutsideOfParent(org.eclipse.m2e.tests.LocalProjectScannerTest)  Time elapsed: 0 s
testDeepNesting(org.eclipse.m2e.tests.LocalProjectScannerTest)  Time elapsed: 0.001 s
testRenameInWorkspace(org.eclipse.m2e.tests.LocalProjectScannerTest)  Time elapsed: 0 s
testModuleReferencedByFile(org.eclipse.m2e.tests.LocalProjectScannerTest)  Time elapsed: 0 s
Running org.eclipse.m2e.tests.profiles.MavenProfileManagerTest
Tests run: 5, Failures: 0, Errors: 0, Skipped: 0, Time elapsed: 14.289 s - in org.eclipse.m2e.tests.profiles.MavenProfileManagerTest
testGetAvailableSettingsProfiles(org.eclipse.m2e.tests.profiles.MavenProfileManagerTest)  Time elapsed: 1.691 s
test441112_InheritParentActiveProfiles(org.eclipse.m2e.tests.profiles.MavenProfileManagerTest)  Time elapsed: 3.397 s
testUserSelectedProfiles(org.eclipse.m2e.tests.profiles.MavenProfileManagerTest)  Time elapsed: 3.483 s
testParentFromRemote(org.eclipse.m2e.tests.profiles.MavenProfileManagerTest)  Time elapsed: 2.757 s
testDisabledProfiles(org.eclipse.m2e.tests.profiles.MavenProfileManagerTest)  Time elapsed: 2.958 s
Running org.eclipse.m2e.tests.MarkerTest
Tests run: 10, Failures: 0, Errors: 0, Skipped: 0, Time elapsed: 20.868 s - in org.eclipse.m2e.tests.MarkerTest
testBuildContextWithTwoProjectConfigurators(org.eclipse.m2e.tests.MarkerTest)  Time elapsed: 2.1 s
test512825_missingArtifactVersion(org.eclipse.m2e.tests.MarkerTest)  Time elapsed: 1.654 s
testManagedTransitive(org.eclipse.m2e.tests.MarkerTest)  Time elapsed: 2.512 s
testBuildContextWithSameProjectConfiguratorTwice(org.eclipse.m2e.tests.MarkerTest)  Time elapsed: 1.828 s
testNoDuplicateMarker(org.eclipse.m2e.tests.MarkerTest)  Time elapsed: 1.088 s
test(org.eclipse.m2e.tests.MarkerTest)  Time elapsed: 4.765 s
testMarkerResolutions(org.eclipse.m2e.tests.MarkerTest)  Time elapsed: 1.444 s
test361445_missingArtifactMarkerAttributes(org.eclipse.m2e.tests.MarkerTest)  Time elapsed: 1.452 s
testBuildContextWithOneProjectConfigurator(org.eclipse.m2e.tests.MarkerTest)  Time elapsed: 1.578 s
testBuildCantReadPom(org.eclipse.m2e.tests.MarkerTest)  Time elapsed: 2.446 s
Running org.eclipse.m2e.tests.MavenProjectMutableStateTest
Tests run: 3, Failures: 0, Errors: 0, Skipped: 0, Time elapsed: 4.608 s - in org.eclipse.m2e.tests.MavenProjectMutableStateTest
testExecuteMojo(org.eclipse.m2e.tests.MavenProjectMutableStateTest)  Time elapsed: 1.485 s
testMavenBuilder(org.eclipse.m2e.tests.MavenProjectMutableStateTest)  Time elapsed: 1.661 s
testImport(org.eclipse.m2e.tests.MavenProjectMutableStateTest)  Time elapsed: 1.462 s
Running org.eclipse.m2e.tests.JavaUtilTest
Tests run: 1, Failures: 0, Errors: 0, Skipped: 0, Time elapsed: 0.002 s - in org.eclipse.m2e.tests.JavaUtilTest
testGetDefaultJavaPackage(org.eclipse.m2e.tests.JavaUtilTest)  Time elapsed: 0.002 s
Running org.eclipse.m2e.tests.ClasspathProviderTest
Tests run: 20, Failures: 0, Errors: 0, Skipped: 0, Time elapsed: 20.693 s - in org.eclipse.m2e.tests.ClasspathProviderTest
testTestClassesTestScopeAndTestType(org.eclipse.m2e.tests.ClasspathProviderTest)  Time elapsed: 1.007 s
testSourcePath(org.eclipse.m2e.tests.ClasspathProviderTest)  Time elapsed: 1.067 s
testCustomClasspath(org.eclipse.m2e.tests.ClasspathProviderTest)  Time elapsed: 1.011 s
test368230_unknownClassifier(org.eclipse.m2e.tests.ClasspathProviderTest)  Time elapsed: 0.992 s
testTestClassesDefaultClassifier(org.eclipse.m2e.tests.ClasspathProviderTest)  Time elapsed: 1.002 s
testJunitClasspathOrder(org.eclipse.m2e.tests.ClasspathProviderTest)  Time elapsed: 1.104 s
testProvidedScopeTestApp(org.eclipse.m2e.tests.ClasspathProviderTest)  Time elapsed: 0.991 s
testNoFilterResources(org.eclipse.m2e.tests.ClasspathProviderTest)  Time elapsed: 0.954 s
testProvidedScopeApp(org.eclipse.m2e.tests.ClasspathProviderTest)  Time elapsed: 1.011 s
testLaunchConfigListener(org.eclipse.m2e.tests.ClasspathProviderTest)  Time elapsed: 1.284 s
testProvidedScopeAppTest(org.eclipse.m2e.tests.ClasspathProviderTest)  Time elapsed: 1.009 s
testTestClassesTestsClassifier(org.eclipse.m2e.tests.ClasspathProviderTest)  Time elapsed: 0.967 s
test(org.eclipse.m2e.tests.ClasspathProviderTest)  Time elapsed: 1.021 s
testNonDefaultTestSource(org.eclipse.m2e.tests.ClasspathProviderTest)  Time elapsed: 1.072 s
testCustomProjectEntry(org.eclipse.m2e.tests.ClasspathProviderTest)  Time elapsed: 1.092 s
testCustomBuildpath(org.eclipse.m2e.tests.ClasspathProviderTest)  Time elapsed: 0.968 s
testNotMavenProject(org.eclipse.m2e.tests.ClasspathProviderTest)  Time elapsed: 1.02 s
testTestClassesDefaultAndTestsClassifier(org.eclipse.m2e.tests.ClasspathProviderTest)  Time elapsed: 1.034 s
testSystemScope(org.eclipse.m2e.tests.ClasspathProviderTest)  Time elapsed: 0.995 s
test368230_FancyClassifier(org.eclipse.m2e.tests.ClasspathProviderTest)  Time elapsed: 1.09 s
Running org.eclipse.m2e.tests.properties.MavenPropertiesTest
Tests run: 2, Failures: 0, Errors: 0, Skipped: 0, Time elapsed: 4.357 s - in org.eclipse.m2e.tests.properties.MavenPropertiesTest
testBuildingProjectWithProperties(org.eclipse.m2e.tests.properties.MavenPropertiesTest)  Time elapsed: 2.952 s
testReadResolverConfigurationProperties(org.eclipse.m2e.tests.properties.MavenPropertiesTest)  Time elapsed: 1.404 s
Running org.eclipse.m2e.tests.util.search.IndexSearchEngineTest
Tests run: 1, Failures: 0, Errors: 0, Skipped: 0, Time elapsed: 1 s - in org.eclipse.m2e.tests.util.search.IndexSearchEngineTest
testGroupIDProposal(org.eclipse.m2e.tests.util.search.IndexSearchEngineTest)  Time elapsed: 1 s

Results:

Errors: 
  BuildPathManagerTest.testDownloadSources_006_nonMavenProject:656 ? Core Reinde...

Tests run: 548, Failures: 0, Errors: 1, Skipped: 5

SWT SessionManagerDBus: Failed to connect to org.gnome.SessionManager: Failed to execute child process ?dbus-launch? (No such file or directory)
SWT SessionManagerDBus: Failed to connect to org.xfce.SessionManager: Failed to execute child process ?dbus-launch? (No such file or directory)
[ERROR] There are test failures.

Please refer to /home/jenkins/agent/workspace/m2e_master/m2e-core-tests/org.eclipse.m2e.tests/target/surefire-reports for the individual test results.
[INFO] 
[INFO] --- tycho-p2-extras-plugin:2.3.0-SNAPSHOT:compare-version-with-baselines (check-no-version-regression) @ org.eclipse.m2e.tests ---
[INFO] 
[INFO] ------------< org.eclipse.m2e:org.eclipse.m2e.editor.tests >------------
[INFO] Building Maven Integration for Eclipse POM Editor tests 1.16.0-SNAPSHOT [42/43]
[INFO] ------------------------[ eclipse-test-plugin ]-------------------------
[INFO] 
[INFO] --- maven-clean-plugin:2.4.1:clean (default-clean) @ org.eclipse.m2e.editor.tests ---
[INFO] 
[INFO] --- tycho-packaging-plugin:2.3.0-SNAPSHOT:build-qualifier (default-build-qualifier) @ org.eclipse.m2e.editor.tests ---
[INFO] The project's OSGi version is 1.16.0.20210115-0841
[INFO] 
[INFO] --- tycho-packaging-plugin:2.3.0-SNAPSHOT:validate-id (default-validate-id) @ org.eclipse.m2e.editor.tests ---
[INFO] 
[INFO] --- tycho-packaging-plugin:2.3.0-SNAPSHOT:validate-version (default-validate-version) @ org.eclipse.m2e.editor.tests ---
[INFO] 
[INFO] --- jacoco-maven-plugin:0.8.5:prepare-agent (default) @ org.eclipse.m2e.editor.tests ---
[INFO] tycho.testArgLine set to -javaagent:/home/jenkins/agent/workspace/m2e_master/.m2/repository/org/jacoco/org.jacoco.agent/0.8.5/org.jacoco.agent-0.8.5-runtime.jar=destfile=/home/jenkins/agent/workspace/m2e_master/m2e-core-tests/target/jacoco.exec,append=true,includes=org.eclipse.m2e*:org.apache.maven*:org.eclipse.aether* -Xmx800m
[INFO] 
[INFO] --- maven-resources-plugin:2.5:resources (default-resources) @ org.eclipse.m2e.editor.tests ---
[debug] execute contextualize
[INFO] Using 'UTF-8' encoding to copy filtered resources.
[INFO] skip non existing resourceDirectory /home/jenkins/agent/workspace/m2e_master/m2e-core-tests/org.eclipse.m2e.editor.tests/src/main/resources
[INFO] 
[INFO] --- tycho-compiler-plugin:2.3.0-SNAPSHOT:compile (default-compile) @ org.eclipse.m2e.editor.tests ---
[INFO] Compiling 3 source files to /home/jenkins/agent/workspace/m2e_master/m2e-core-tests/org.eclipse.m2e.editor.tests/target/classes
[INFO] 
[INFO] --- maven-resources-plugin:2.5:testResources (default-testResources) @ org.eclipse.m2e.editor.tests ---
[debug] execute contextualize
[INFO] Using 'UTF-8' encoding to copy filtered resources.
[INFO] skip non existing resourceDirectory /home/jenkins/agent/workspace/m2e_master/m2e-core-tests/org.eclipse.m2e.editor.tests/src/test/resources
[INFO] 
[INFO] --- tycho-source-plugin:2.3.0-SNAPSHOT:plugin-source (plugin-source) @ org.eclipse.m2e.editor.tests ---
[INFO] Building jar: /home/jenkins/agent/workspace/m2e_master/m2e-core-tests/org.eclipse.m2e.editor.tests/target/org.eclipse.m2e.editor.tests-1.16.0-SNAPSHOT-sources.jar
[INFO] 
[INFO] --- target-platform-configuration:2.3.0-SNAPSHOT:target-platform (default-target-platform) @ org.eclipse.m2e.editor.tests ---
[INFO] 
[INFO] --- tycho-packaging-plugin:2.3.0-SNAPSHOT:package-plugin (default-package-plugin) @ org.eclipse.m2e.editor.tests ---
[INFO] Building jar: /home/jenkins/agent/workspace/m2e_master/m2e-core-tests/org.eclipse.m2e.editor.tests/target/org.eclipse.m2e.editor.tests-1.16.0-SNAPSHOT.jar
[INFO] 
[INFO] --- tycho-p2-plugin:2.3.0-SNAPSHOT:p2-metadata-default (default-p2-metadata-default) @ org.eclipse.m2e.editor.tests ---
[INFO] 
[INFO] --- tycho-pack200a-plugin:2.3.0-SNAPSHOT:normalize (pack200-normalize) @ org.eclipse.m2e.editor.tests ---
[INFO] Pack200 normalizing jar /home/jenkins/agent/workspace/m2e_master/m2e-core-tests/org.eclipse.m2e.editor.tests/target/org.eclipse.m2e.editor.tests-1.16.0-SNAPSHOT.jar
[INFO] 
[INFO] --- eclipse-jarsigner-plugin:1.1.7:sign (sign) @ org.eclipse.m2e.editor.tests ---
[INFO] Signing of nested jars of '/home/jenkins/agent/workspace/m2e_master/m2e-core-tests/org.eclipse.m2e.editor.tests/target/org.eclipse.m2e.editor.tests-1.16.0-SNAPSHOT.jar' is disabled.
[INFO] Signing jar: /home/jenkins/agent/workspace/m2e_master/m2e-core-tests/org.eclipse.m2e.editor.tests/target/org.eclipse.m2e.editor.tests-1.16.0-SNAPSHOT.jar
[INFO] Signing of nested jars of '/home/jenkins/agent/workspace/m2e_master/m2e-core-tests/org.eclipse.m2e.editor.tests/target/org.eclipse.m2e.editor.tests-1.16.0-SNAPSHOT-sources.jar' is disabled.
[INFO] Signing jar: /home/jenkins/agent/workspace/m2e_master/m2e-core-tests/org.eclipse.m2e.editor.tests/target/org.eclipse.m2e.editor.tests-1.16.0-SNAPSHOT-sources.jar
[INFO] 
[INFO] --- tycho-pack200b-plugin:2.3.0-SNAPSHOT:pack (pack200-pack) @ org.eclipse.m2e.editor.tests ---
[INFO] Pack200 packing jar /home/jenkins/agent/workspace/m2e_master/m2e-core-tests/org.eclipse.m2e.editor.tests/target/org.eclipse.m2e.editor.tests-1.16.0-SNAPSHOT.jar
[INFO] 
[INFO] --- tycho-p2-plugin:2.3.0-SNAPSHOT:p2-metadata (p2-metadata) @ org.eclipse.m2e.editor.tests ---
[INFO] No baseline version MavenProject: org.eclipse.m2e:org.eclipse.m2e.editor.tests:1.16.0-SNAPSHOT @ /home/jenkins/agent/workspace/m2e_master/m2e-core-tests/org.eclipse.m2e.editor.tests/pom.xml
[INFO] 
[INFO] --- tycho-surefire-plugin:2.3.0-SNAPSHOT:test (default-test) @ org.eclipse.m2e.editor.tests ---
[INFO] Executing Test Runtime with timeout 7200, logs (if any) will be placed at: /home/jenkins/agent/workspace/m2e_master/m2e-core-tests/org.eclipse.m2e.editor.tests/target/work/data/.metadata/.log
[INFO] Command line:
	[/opt/tools/java/openjdk/jdk-11/11.0.2+9/bin/java, -Dosgi.noShutdown=false, -Dosgi.os=linux, -Dosgi.ws=gtk, -Dosgi.arch=x86_64, -javaagent:/home/jenkins/agent/workspace/m2e_master/.m2/repository/org/jacoco/org.jacoco.agent/0.8.5/org.jacoco.agent-0.8.5-runtime.jar=destfile=/home/jenkins/agent/workspace/m2e_master/m2e-core-tests/target/jacoco.exec,append=true,includes=org.eclipse.m2e*:org.apache.maven*:org.eclipse.aether*, -Xmx800m, -Dosgi.clean=true, -jar, /home/jenkins/agent/workspace/m2e_master/.m2/repository/p2/osgi/bundle/org.eclipse.equinox.launcher/1.6.0.v20200915-1508/org.eclipse.equinox.launcher-1.6.0.v20200915-1508.jar, -data, /home/jenkins/agent/workspace/m2e_master/m2e-core-tests/org.eclipse.m2e.editor.tests/target/work/data, -install, /home/jenkins/agent/workspace/m2e_master/m2e-core-tests/org.eclipse.m2e.editor.tests/target/work, -configuration, /home/jenkins/agent/workspace/m2e_master/m2e-core-tests/org.eclipse.m2e.editor.tests/target/work/configuration, -application, org.eclipse.tycho.surefire.osgibooter.uitest, -testproperties, /home/jenkins/agent/workspace/m2e_master/m2e-core-tests/org.eclipse.m2e.editor.tests/target/surefire.properties, -pluginCustomization, /home/jenkins/agent/workspace/m2e_master/m2e-core-tests/org.eclipse.m2e.editor.tests/plugin_customization.ini, -timeout, 7200000]

(process:4910): Gtk-WARNING **: 09:30:33.142: Locale not supported by C library.
	Using the fallback 'C' locale.
SWT SessionManagerDBus: Failed to connect to org.gnome.SessionManager: Failed to execute child process ?dbus-launch? (No such file or directory)
SWT SessionManagerDBus: Failed to connect to org.xfce.SessionManager: Failed to execute child process ?dbus-launch? (No such file or directory)
Running org.eclipse.m2e.editor.MavenPomEditorDirtyTest
SLF4J: Failed to load class "org.slf4j.impl.StaticLoggerBinder".
SLF4J: Defaulting to no-operation (NOP) logger implementation
SLF4J: See http://www.slf4j.org/codes.html#StaticLoggerBinder for further details.
SLF4J: Failed to load class "org.slf4j.impl.StaticLoggerBinder".
SLF4J: Defaulting to no-operation (NOP) logger implementation
SLF4J: See http://www.slf4j.org/codes.html#StaticLoggerBinder for further details.
Warning: NLS missing message: MavenImpl_error_lookup in: org.eclipse.m2e.editor.internal.messages
Tests run: 1, Failures: 0, Errors: 0, Skipped: 0, Time elapsed: 4.863 s - in org.eclipse.m2e.editor.MavenPomEditorDirtyTest
test358656_dirtyStateAfterFSModification(org.eclipse.m2e.editor.MavenPomEditorDirtyTest)  Time elapsed: 4.444 s
Running org.eclipse.m2e.editor.dialogs.ManageDependenciesDialogTest
Tests run: 9, Failures: 0, Errors: 0, Skipped: 0, Time elapsed: 14.578 s - in org.eclipse.m2e.editor.dialogs.ManageDependenciesDialogTest
testDepLabelProvider(org.eclipse.m2e.editor.dialogs.ManageDependenciesDialogTest)  Time elapsed: 4.653 s
testBrokenSource(org.eclipse.m2e.editor.dialogs.ManageDependenciesDialogTest)  Time elapsed: 0.684 s
testBrokenTarget(org.eclipse.m2e.editor.dialogs.ManageDependenciesDialogTest)  Time elapsed: 0.618 s
testDepExistsDiffVersionDiffPOMs(org.eclipse.m2e.editor.dialogs.ManageDependenciesDialogTest)  Time elapsed: 2.224 s
testDepExists(org.eclipse.m2e.editor.dialogs.ManageDependenciesDialogTest)  Time elapsed: 0.935 s
testMultipleDependencies(org.eclipse.m2e.editor.dialogs.ManageDependenciesDialogTest)  Time elapsed: 1.571 s
testDiffPOMs(org.eclipse.m2e.editor.dialogs.ManageDependenciesDialogTest)  Time elapsed: 1.353 s
testDepExistsDiffVersion(org.eclipse.m2e.editor.dialogs.ManageDependenciesDialogTest)  Time elapsed: 0.977 s
testSamePOM(org.eclipse.m2e.editor.dialogs.ManageDependenciesDialogTest)  Time elapsed: 1.562 s
Running org.eclipse.m2e.editor.dialogs.MavenModuleSelectionDialogTest
Tests run: 1, Failures: 0, Errors: 0, Skipped: 0, Time elapsed: 1.897 s - in org.eclipse.m2e.editor.dialogs.MavenModuleSelectionDialogTest
testModuleSelection(org.eclipse.m2e.editor.dialogs.MavenModuleSelectionDialogTest)  Time elapsed: 1.896 s

Results:

Tests run: 11, Failures: 0, Errors: 0, Skipped: 0

[INFO] All tests passed!
[INFO] 
[INFO] --- tycho-p2-extras-plugin:2.3.0-SNAPSHOT:compare-version-with-baselines (check-no-version-regression) @ org.eclipse.m2e.editor.tests ---
[INFO] 
[INFO] ----------< org.eclipse.m2e:org.eclipse.m2e.editor.xml.tests >----------
[INFO] Building Maven POM XML Editor Tests 1.16.0-SNAPSHOT              [43/43]
[INFO] ------------------------[ eclipse-test-plugin ]-------------------------
[INFO] 
[INFO] --- maven-clean-plugin:2.4.1:clean (default-clean) @ org.eclipse.m2e.editor.xml.tests ---
[INFO] 
[INFO] --- tycho-packaging-plugin:2.3.0-SNAPSHOT:build-qualifier (default-build-qualifier) @ org.eclipse.m2e.editor.xml.tests ---
[INFO] The project's OSGi version is 1.16.0.20210115-0951
[INFO] 
[INFO] --- tycho-packaging-plugin:2.3.0-SNAPSHOT:validate-id (default-validate-id) @ org.eclipse.m2e.editor.xml.tests ---
[INFO] 
[INFO] --- tycho-packaging-plugin:2.3.0-SNAPSHOT:validate-version (default-validate-version) @ org.eclipse.m2e.editor.xml.tests ---
[INFO] 
[INFO] --- jacoco-maven-plugin:0.8.5:prepare-agent (default) @ org.eclipse.m2e.editor.xml.tests ---
[INFO] tycho.testArgLine set to -javaagent:/home/jenkins/agent/workspace/m2e_master/.m2/repository/org/jacoco/org.jacoco.agent/0.8.5/org.jacoco.agent-0.8.5-runtime.jar=destfile=/home/jenkins/agent/workspace/m2e_master/m2e-core-tests/target/jacoco.exec,append=true,includes=org.eclipse.m2e*:org.apache.maven*:org.eclipse.aether* -Xmx800m
[INFO] 
[INFO] --- maven-resources-plugin:2.5:resources (default-resources) @ org.eclipse.m2e.editor.xml.tests ---
[debug] execute contextualize
[INFO] Using 'UTF-8' encoding to copy filtered resources.
[INFO] skip non existing resourceDirectory /home/jenkins/agent/workspace/m2e_master/m2e-core-tests/org.eclipse.m2e.editor.xml.tests/src/main/resources
[INFO] 
[INFO] --- tycho-compiler-plugin:2.3.0-SNAPSHOT:compile (default-compile) @ org.eclipse.m2e.editor.xml.tests ---
[WARNING] Parameter 'useProjectSettings' is set to true, but preferences file '/home/jenkins/agent/workspace/m2e_master/m2e-core-tests/org.eclipse.m2e.editor.xml.tests/.settings/org.eclipse.jdt.core.prefs' could not be found!
[INFO] Compiling 22 source files to /home/jenkins/agent/workspace/m2e_master/m2e-core-tests/org.eclipse.m2e.editor.xml.tests/target/classes
[INFO] 
[INFO] --- maven-resources-plugin:2.5:testResources (default-testResources) @ org.eclipse.m2e.editor.xml.tests ---
[debug] execute contextualize
[INFO] Using 'UTF-8' encoding to copy filtered resources.
[INFO] skip non existing resourceDirectory /home/jenkins/agent/workspace/m2e_master/m2e-core-tests/org.eclipse.m2e.editor.xml.tests/src/test/resources
[INFO] 
[INFO] --- tycho-source-plugin:2.3.0-SNAPSHOT:plugin-source (plugin-source) @ org.eclipse.m2e.editor.xml.tests ---
[INFO] Building jar: /home/jenkins/agent/workspace/m2e_master/m2e-core-tests/org.eclipse.m2e.editor.xml.tests/target/org.eclipse.m2e.editor.xml.tests-1.16.0-SNAPSHOT-sources.jar
[INFO] 
[INFO] --- target-platform-configuration:2.3.0-SNAPSHOT:target-platform (default-target-platform) @ org.eclipse.m2e.editor.xml.tests ---
[INFO] 
[INFO] --- tycho-packaging-plugin:2.3.0-SNAPSHOT:package-plugin (default-package-plugin) @ org.eclipse.m2e.editor.xml.tests ---
[INFO] Building jar: /home/jenkins/agent/workspace/m2e_master/m2e-core-tests/org.eclipse.m2e.editor.xml.tests/target/org.eclipse.m2e.editor.xml.tests-1.16.0-SNAPSHOT.jar
[INFO] 
[INFO] --- tycho-p2-plugin:2.3.0-SNAPSHOT:p2-metadata-default (default-p2-metadata-default) @ org.eclipse.m2e.editor.xml.tests ---
[INFO] 
[INFO] --- tycho-pack200a-plugin:2.3.0-SNAPSHOT:normalize (pack200-normalize) @ org.eclipse.m2e.editor.xml.tests ---
[INFO] Pack200 normalizing jar /home/jenkins/agent/workspace/m2e_master/m2e-core-tests/org.eclipse.m2e.editor.xml.tests/target/org.eclipse.m2e.editor.xml.tests-1.16.0-SNAPSHOT.jar
[INFO] 
[INFO] --- eclipse-jarsigner-plugin:1.1.7:sign (sign) @ org.eclipse.m2e.editor.xml.tests ---
[INFO] Signing of nested jars of '/home/jenkins/agent/workspace/m2e_master/m2e-core-tests/org.eclipse.m2e.editor.xml.tests/target/org.eclipse.m2e.editor.xml.tests-1.16.0-SNAPSHOT.jar' is disabled.
[INFO] Signing jar: /home/jenkins/agent/workspace/m2e_master/m2e-core-tests/org.eclipse.m2e.editor.xml.tests/target/org.eclipse.m2e.editor.xml.tests-1.16.0-SNAPSHOT.jar
[INFO] Signing of nested jars of '/home/jenkins/agent/workspace/m2e_master/m2e-core-tests/org.eclipse.m2e.editor.xml.tests/target/org.eclipse.m2e.editor.xml.tests-1.16.0-SNAPSHOT-sources.jar' is disabled.
[INFO] Signing jar: /home/jenkins/agent/workspace/m2e_master/m2e-core-tests/org.eclipse.m2e.editor.xml.tests/target/org.eclipse.m2e.editor.xml.tests-1.16.0-SNAPSHOT-sources.jar
[INFO] 
[INFO] --- tycho-pack200b-plugin:2.3.0-SNAPSHOT:pack (pack200-pack) @ org.eclipse.m2e.editor.xml.tests ---
[INFO] Pack200 packing jar /home/jenkins/agent/workspace/m2e_master/m2e-core-tests/org.eclipse.m2e.editor.xml.tests/target/org.eclipse.m2e.editor.xml.tests-1.16.0-SNAPSHOT.jar
[INFO] 
[INFO] --- tycho-p2-plugin:2.3.0-SNAPSHOT:p2-metadata (p2-metadata) @ org.eclipse.m2e.editor.xml.tests ---
[INFO] No baseline version MavenProject: org.eclipse.m2e:org.eclipse.m2e.editor.xml.tests:1.16.0-SNAPSHOT @ /home/jenkins/agent/workspace/m2e_master/m2e-core-tests/org.eclipse.m2e.editor.xml.tests/pom.xml
[INFO] 
[INFO] --- tycho-surefire-plugin:2.3.0-SNAPSHOT:test (default-test) @ org.eclipse.m2e.editor.xml.tests ---
[INFO] Executing Test Runtime with timeout 7200, logs (if any) will be placed at: /home/jenkins/agent/workspace/m2e_master/m2e-core-tests/org.eclipse.m2e.editor.xml.tests/target/work/data/.metadata/.log
[INFO] Command line:
	[/opt/tools/java/openjdk/jdk-11/11.0.2+9/bin/java, -Dosgi.noShutdown=false, -Dosgi.os=linux, -Dosgi.ws=gtk, -Dosgi.arch=x86_64, -javaagent:/home/jenkins/agent/workspace/m2e_master/.m2/repository/org/jacoco/org.jacoco.agent/0.8.5/org.jacoco.agent-0.8.5-runtime.jar=destfile=/home/jenkins/agent/workspace/m2e_master/m2e-core-tests/target/jacoco.exec,append=true,includes=org.eclipse.m2e*:org.apache.maven*:org.eclipse.aether*, -Xmx800m, -Dosgi.clean=true, -jar, /home/jenkins/agent/workspace/m2e_master/.m2/repository/p2/osgi/bundle/org.eclipse.equinox.launcher/1.6.0.v20200915-1508/org.eclipse.equinox.launcher-1.6.0.v20200915-1508.jar, -data, /home/jenkins/agent/workspace/m2e_master/m2e-core-tests/org.eclipse.m2e.editor.xml.tests/target/work/data, -install, /home/jenkins/agent/workspace/m2e_master/m2e-core-tests/org.eclipse.m2e.editor.xml.tests/target/work, -configuration, /home/jenkins/agent/workspace/m2e_master/m2e-core-tests/org.eclipse.m2e.editor.xml.tests/target/work/configuration, -application, org.eclipse.tycho.surefire.osgibooter.uitest, -testproperties, /home/jenkins/agent/workspace/m2e_master/m2e-core-tests/org.eclipse.m2e.editor.xml.tests/target/surefire.properties, -pluginCustomization, /home/jenkins/agent/workspace/m2e_master/m2e-core-tests/org.eclipse.m2e.editor.xml.tests/plugin_customization.ini, -timeout, 7200000]

(process:5036): Gtk-WARNING **: 09:31:03.581: Locale not supported by C library.
	Using the fallback 'C' locale.
SWT SessionManagerDBus: Failed to connect to org.gnome.SessionManager: Failed to execute child process ?dbus-launch? (No such file or directory)
SWT SessionManagerDBus: Failed to connect to org.xfce.SessionManager: Failed to execute child process ?dbus-launch? (No such file or directory)
SLF4J: Failed to load class "org.slf4j.impl.StaticLoggerBinder".
SLF4J: Defaulting to no-operation (NOP) logger implementation
SLF4J: See http://www.slf4j.org/codes.html#StaticLoggerBinder for further details.
Running org.eclipse.m2e.editor.xml.PomEditsTest
SLF4J: Failed to load class "org.slf4j.impl.StaticLoggerBinder".
SLF4J: Defaulting to no-operation (NOP) logger implementation
SLF4J: See http://www.slf4j.org/codes.html#StaticLoggerBinder for further details.
Tests run: 2, Failures: 0, Errors: 0, Skipped: 0, Time elapsed: 5.12 s - in org.eclipse.m2e.editor.xml.PomEditsTest
test371438_insertAt_insideEmptyElement(org.eclipse.m2e.editor.xml.PomEditsTest)  Time elapsed: 3.755 s
test467590_emptyPom(org.eclipse.m2e.editor.xml.PomEditsTest)  Time elapsed: 1.127 s
Running org.eclipse.m2e.editor.xml.MissingSchemaMarkerTest
Tests run: 1, Failures: 0, Errors: 0, Skipped: 0, Time elapsed: 9.078 s - in org.eclipse.m2e.editor.xml.MissingSchemaMarkerTest
testMissingSchemaMarker(org.eclipse.m2e.editor.xml.MissingSchemaMarkerTest)  Time elapsed: 9.077 s
Running org.eclipse.m2e.editor.xml.ExtractProject2Test
Tests run: 1, Failures: 0, Errors: 0, Skipped: 0, Time elapsed: 1.848 s - in org.eclipse.m2e.editor.xml.ExtractProject2Test
testExtractProject(org.eclipse.m2e.editor.xml.ExtractProject2Test)  Time elapsed: 1.841 s
Running org.eclipse.m2e.editor.xml.ExtractProjectTest
Tests run: 1, Failures: 0, Errors: 0, Skipped: 0, Time elapsed: 1.632 s - in org.eclipse.m2e.editor.xml.ExtractProjectTest
testExtractProject(org.eclipse.m2e.editor.xml.ExtractProjectTest)  Time elapsed: 1.632 s
Running org.eclipse.m2e.editor.xml.PluginConfigCompletionTest
Warning: NLS missing message: MavenImpl_error_lookup in: org.eclipse.m2e.editor.internal.messages
Tests run: 12, Failures: 0, Errors: 0, Skipped: 0, Time elapsed: 22.279 s - in org.eclipse.m2e.editor.xml.PluginConfigCompletionTest
testMetadataExtension(org.eclipse.m2e.editor.xml.PluginConfigCompletionTest)  Time elapsed: 6.997 s
testAllMojosCompletion(org.eclipse.m2e.editor.xml.PluginConfigCompletionTest)  Time elapsed: 2.523 s
testListItemNameCompletion(org.eclipse.m2e.editor.xml.PluginConfigCompletionTest)  Time elapsed: 1.595 s
testImplementationListItemNameCompletion(org.eclipse.m2e.editor.xml.PluginConfigCompletionTest)  Time elapsed: 1.363 s
testListItemParameterCompletion(org.eclipse.m2e.editor.xml.PluginConfigCompletionTest)  Time elapsed: 0.966 s
testM2ELifecycleMappingConfiguration(org.eclipse.m2e.editor.xml.PluginConfigCompletionTest)  Time elapsed: 1.054 s
testImplementationContentCompletion(org.eclipse.m2e.editor.xml.PluginConfigCompletionTest)  Time elapsed: 1.024 s
testSubclassListItems(org.eclipse.m2e.editor.xml.PluginConfigCompletionTest)  Time elapsed: 1.956 s
testNestedParameterCompletion(org.eclipse.m2e.editor.xml.PluginConfigCompletionTest)  Time elapsed: 1.009 s
testSingleMojoCompletion(org.eclipse.m2e.editor.xml.PluginConfigCompletionTest)  Time elapsed: 1.335 s
testAnyListItemNameParameterCompletion(org.eclipse.m2e.editor.xml.PluginConfigCompletionTest)  Time elapsed: 1.412 s
testUnknownContentCompletion(org.eclipse.m2e.editor.xml.PluginConfigCompletionTest)  Time elapsed: 1.043 s
Running org.eclipse.m2e.editor.xml.RelativePath2Test
Tests run: 1, Failures: 0, Errors: 0, Skipped: 0, Time elapsed: 1.198 s - in org.eclipse.m2e.editor.xml.RelativePath2Test
testRelativePath(org.eclipse.m2e.editor.xml.RelativePath2Test)  Time elapsed: 1.197 s
Running org.eclipse.m2e.editor.xml.ManagedArtifactMarkerTest
Tests run: 7, Failures: 0, Errors: 0, Skipped: 0, Time elapsed: 14.559 s - in org.eclipse.m2e.editor.xml.ManagedArtifactMarkerTest
test439309_errorOnManagedVersionOverride(org.eclipse.m2e.editor.xml.ManagedArtifactMarkerTest)  Time elapsed: 3.88 s
test439309_ignoreManagedVersionOverride(org.eclipse.m2e.editor.xml.ManagedArtifactMarkerTest)  Time elapsed: 1.595 s
test355882_noMarkerOnDifferentClassifier(org.eclipse.m2e.editor.xml.ManagedArtifactMarkerTest)  Time elapsed: 2.462 s
test553839_noErrorCausedByPluginVersionFromSuperPom(org.eclipse.m2e.editor.xml.ManagedArtifactMarkerTest)  Time elapsed: 2.003 s
testMNGEclipse2559Second(org.eclipse.m2e.editor.xml.ManagedArtifactMarkerTest)  Time elapsed: 1.444 s
test355882_MarkerOnClassifierVersionOverride(org.eclipse.m2e.editor.xml.ManagedArtifactMarkerTest)  Time elapsed: 1.438 s
testMNGEclipse2559(org.eclipse.m2e.editor.xml.ManagedArtifactMarkerTest)  Time elapsed: 1.736 s
Running org.eclipse.m2e.editor.xml.PomContentAssistProcessorTest
Tests run: 1, Failures: 0, Errors: 0, Skipped: 0, Time elapsed: 0.002 s - in org.eclipse.m2e.editor.xml.PomContentAssistProcessorTest
testExtractPrefix(org.eclipse.m2e.editor.xml.PomContentAssistProcessorTest)  Time elapsed: 0.001 s
Running org.eclipse.m2e.editor.xml.PropertyCompletionTest
Tests run: 1, Failures: 0, Errors: 0, Skipped: 0, Time elapsed: 1.605 s - in org.eclipse.m2e.editor.xml.PropertyCompletionTest
testCompletion(org.eclipse.m2e.editor.xml.PropertyCompletionTest)  Time elapsed: 1.604 s
Running org.eclipse.m2e.editor.xml.RelativePath3Test
Tests run: 1, Failures: 0, Errors: 0, Skipped: 0, Time elapsed: 1.651 s - in org.eclipse.m2e.editor.xml.RelativePath3Test
testRelativePath(org.eclipse.m2e.editor.xml.RelativePath3Test)  Time elapsed: 1.651 s
Running org.eclipse.m2e.editor.xml.FileCompletionTest
Tests run: 1, Failures: 0, Errors: 0, Skipped: 1, Time elapsed: 0 s - in org.eclipse.m2e.editor.xml.FileCompletionTest
org.eclipse.m2e.editor.xml.FileCompletionTest skipped
Running org.eclipse.m2e.editor.xml.HyperlinkTest
true
Tests run: 1, Failures: 0, Errors: 0, Skipped: 0, Time elapsed: 1.554 s - in org.eclipse.m2e.editor.xml.HyperlinkTest
testHasLink(org.eclipse.m2e.editor.xml.HyperlinkTest)  Time elapsed: 1.553 s
Running org.eclipse.m2e.editor.xml.PomTemplateContextTest
Tests run: 11, Failures: 0, Errors: 0, Skipped: 0, Time elapsed: 8.655 s - in org.eclipse.m2e.editor.xml.PomTemplateContextTest
testGetTemplatesArtifactId_WithGroupId(org.eclipse.m2e.editor.xml.PomTemplateContextTest)  Time elapsed: 0.731 s
testGetTemplatesDependencyScope(org.eclipse.m2e.editor.xml.PomTemplateContextTest)  Time elapsed: 0.685 s
test439251_GetTemplatesConfigurationFromMojoWithEmptyParameters(org.eclipse.m2e.editor.xml.PomTemplateContextTest)  Time elapsed: 0.952 s
testGetTemplatesPackaging(org.eclipse.m2e.editor.xml.PomTemplateContextTest)  Time elapsed: 0.685 s
testGetTemplatesVersion_WithoutGroupId(org.eclipse.m2e.editor.xml.PomTemplateContextTest)  Time elapsed: 0.668 s
testGetTemplatesArtifactId_WithoutGroupId(org.eclipse.m2e.editor.xml.PomTemplateContextTest)  Time elapsed: 0.676 s
testGetTemplatesConfiguration(org.eclipse.m2e.editor.xml.PomTemplateContextTest)  Time elapsed: 1.035 s
testGetTemplatesDependencyManagementScope(org.eclipse.m2e.editor.xml.PomTemplateContextTest)  Time elapsed: 0.651 s
testGetTemplatesVersion_WithGroupId(org.eclipse.m2e.editor.xml.PomTemplateContextTest)  Time elapsed: 0.718 s
testGetTemplatesPhase(org.eclipse.m2e.editor.xml.PomTemplateContextTest)  Time elapsed: 1.227 s
testGetTemplatesGoal(org.eclipse.m2e.editor.xml.PomTemplateContextTest)  Time elapsed: 0.626 s
Running org.eclipse.m2e.editor.xml.WarnIfGroupSameThanParentTest
Tests run: 1, Failures: 0, Errors: 0, Skipped: 0, Time elapsed: 2.861 s - in org.eclipse.m2e.editor.xml.WarnIfGroupSameThanParentTest
testMNGEclipse2552(org.eclipse.m2e.editor.xml.WarnIfGroupSameThanParentTest)  Time elapsed: 2.861 s
Running org.eclipse.m2e.editor.xml.RelativePath1Test
Tests run: 1, Failures: 0, Errors: 0, Skipped: 0, Time elapsed: 1.293 s - in org.eclipse.m2e.editor.xml.RelativePath1Test
testRelativePath(org.eclipse.m2e.editor.xml.RelativePath1Test)  Time elapsed: 1.292 s
Running org.eclipse.m2e.editor.xml.HoverTest
Tests run: 1, Failures: 0, Errors: 0, Skipped: 0, Time elapsed: 1.618 s - in org.eclipse.m2e.editor.xml.HoverTest
testHasHover(org.eclipse.m2e.editor.xml.HoverTest)  Time elapsed: 1.618 s
Running org.eclipse.m2e.editor.xml.HoverDependencyManagedTest
Tests run: 1, Failures: 0, Errors: 0, Skipped: 0, Time elapsed: 1.392 s - in org.eclipse.m2e.editor.xml.HoverDependencyManagedTest
testHasHover(org.eclipse.m2e.editor.xml.HoverDependencyManagedTest)  Time elapsed: 1.392 s

Results:

Tests run: 45, Failures: 0, Errors: 0, Skipped: 1

[INFO] All tests passed!
[INFO] 
[INFO] --- tycho-p2-extras-plugin:2.3.0-SNAPSHOT:compare-version-with-baselines (check-no-version-regression) @ org.eclipse.m2e.editor.xml.tests ---
[INFO] ------------------------------------------------------------------------
[INFO] Reactor Summary:
[INFO] 
[INFO] Maven Integration for Eclipse (parent) 1.16.0-SNAPSHOT SUCCESS [  8.715 s]
[INFO] Maven Project Model Edit Bundle 1.16.1-SNAPSHOT .... SUCCESS [ 17.334 s]
[INFO] Maven Integration for Eclipse Core Plug-in 1.17.2-SNAPSHOT SUCCESS [ 10.987 s]
[INFO] Maven Integration for Eclipse UI Plug-in 1.17.2-SNAPSHOT SUCCESS [  6.203 s]
[INFO] Maven Integration for Eclipse Launching 1.17.1-SNAPSHOT SUCCESS [  4.530 s]
[INFO] Maven Integration for Eclipse JDT 1.17.1-SNAPSHOT .. SUCCESS [  3.890 s]
[INFO] Maven Integration for Eclipse JDT UI 1.17.1-SNAPSHOT SUCCESS [  3.827 s]
[INFO] Maven POM Refactoring 1.17.0-SNAPSHOT .............. SUCCESS [  4.392 s]
[INFO] m2e Marketplace 1.17.1-SNAPSHOT .................... SUCCESS [  4.351 s]
[INFO] Maven POM Editor 1.17.1-SNAPSHOT ................... SUCCESS [  5.367 s]
[INFO] Maven POM XML Editor 1.17.1-SNAPSHOT ............... SUCCESS [  4.267 s]
[INFO] org.eclipse.m2e.lifecyclemapping.defaults 1.17.1-SNAPSHOT SUCCESS [  6.280 s]
[INFO] org.eclipse.m2e.scm 1.17.1-SNAPSHOT ................ SUCCESS [  3.580 s]
[INFO] Maven Profile Manager Core 1.17.0-SNAPSHOT ......... SUCCESS [  3.646 s]
[INFO] Maven Profile Manager UI 1.17.1-SNAPSHOT ........... SUCCESS [  3.004 s]
[INFO] Maven Integration for Eclipse Importer framework 1.17.1-SNAPSHOT SUCCESS [  4.057 s]
[INFO] org.eclipse.m2e.sourcelookup 1.17.1-SNAPSHOT ....... SUCCESS [  3.427 s]
[INFO] org.eclipse.m2e.binaryproject 1.17.1-SNAPSHOT ...... SUCCESS [  4.357 s]
[INFO] org.eclipse.m2e.binaryproject.ui 1.17.1-SNAPSHOT ... SUCCESS [  3.042 s]
[INFO] org.eclipse.m2e.sourcelookup.ui 1.17.1-SNAPSHOT .... SUCCESS [  4.682 s]
[INFO] org.eclipse.m2e.editor.lemminx 1.17.2-SNAPSHOT ..... SUCCESS [ 15.981 s]
[INFO] Maven PDE Integration 1.17.2-SNAPSHOT .............. SUCCESS [  3.848 s]
[INFO] Maven PDE UI Integration 1.17.2-SNAPSHOT ........... SUCCESS [  3.383 s]
[INFO] M2E Testing Helpers 1.17.1-SNAPSHOT ................ SUCCESS [  4.660 s]
[INFO] org.eclipse.m2e.logback.appender 1.17.0-SNAPSHOT ... SUCCESS [  3.798 s]
[INFO] org.eclipse.m2e.logback.configuration 1.16.0-SNAPSHOT SUCCESS [  3.141 s]
[INFO] org.eclipse.m2e.sse.ui.feature 1.17.1-SNAPSHOT ..... SUCCESS [  1.599 s]
[INFO] Maven Integration for Eclipse 1.17.2-SNAPSHOT ...... SUCCESS [  1.594 s]
[INFO] org.eclipse.m2e.lemminx.feature 1.17.1-SNAPSHOT .... SUCCESS [  1.636 s]
[INFO] m2e extensions development support (Optional) 1.17.2-SNAPSHOT SUCCESS [  1.600 s]
[INFO] Maven Integration for Eclipse slf4j over logback logging (Optional) 1.17.0-SNAPSHOT SUCCESS [  1.228 s]
[INFO] org.eclipse.m2e.pde.feature 1.17.2-SNAPSHOT ........ SUCCESS [  1.356 s]
[INFO] Maven Integration for Eclipse Update Site 1.16.0-SNAPSHOT SUCCESS [  4.731 s]
[INFO] org.eclipse.m2e.core.tests 1.16.0-SNAPSHOT ......... SUCCESS [ 43.300 s]
[INFO] Tests for Maven Integration for Eclipse Importer framework 1.16.0-SNAPSHOT SUCCESS [ 19.007 s]
[INFO] org.eclipse.m2e.binaryproject.tests 1.16.0-SNAPSHOT  SUCCESS [ 30.455 s]
[INFO] org.eclipse.m2e.editor.lemminx.tests 1.16.0-SNAPSHOT SUCCESS [ 15.043 s]
[INFO] org.eclipse.m2e.jdt.tests 1.16.0-SNAPSHOT .......... SUCCESS [ 26.916 s]
[INFO] org.eclipse.m2e.editor.xml.sse.tests 1.16.0-SNAPSHOT SUCCESS [ 10.458 s]
[INFO] m2e-core-tests 1.16.0-SNAPSHOT ..................... SUCCESS [  0.006 s]
[INFO] Maven Integration for Eclipse tests 1.16.0-SNAPSHOT  SUCCESS [14:52 min]
[INFO] Maven Integration for Eclipse POM Editor tests 1.16.0-SNAPSHOT SUCCESS [ 30.773 s]
[INFO] Maven POM XML Editor Tests 1.16.0-SNAPSHOT ......... SUCCESS [01:25 min]
[INFO] ------------------------------------------------------------------------
[INFO] BUILD SUCCESS
[INFO] ------------------------------------------------------------------------
[INFO] Total time:  23:29 min
[INFO] Finished at: 2021-01-26T09:32:23Z
[INFO] ------------------------------------------------------------------------
[Pipeline] }
Terminating xvnc.

Tue Jan 26 09:32:25 2021
 ComparingUpdateTracker: 0 pixels in / 0 pixels out
 ComparingUpdateTracker: (1:-nan ratio)
[Pipeline] // xvnc
Post stage
[Pipeline] archiveArtifacts
Archiving artifacts
[Pipeline] junit
Recording test results
[Checks API] No suitable checks publisher found.
[Pipeline] }
[Pipeline] // withEnv
[Pipeline] }
[Pipeline] // stage
[Pipeline] stage
[Pipeline] { (Deploy Snapshot)
[Pipeline] tool
[Pipeline] envVarsForTool
[Pipeline] tool
[Pipeline] envVarsForTool
[Pipeline] withEnv
[Pipeline] {
[Pipeline] sshagent
[ssh-agent] Using credentials genie.m2e (ssh://genie.m2e@projects-storage.eclipse.org)
[ssh-agent] Looking for ssh-agent implementation...
[ssh-agent]   Exec ssh-agent (binary ssh-agent on a remote machine)
$ ssh-agent
SSH_AUTH_SOCK=/tmp/ssh-WJNWHrdCQ4JB/agent.5515
SSH_AGENT_PID=5517
Running ssh-add (command line suppressed)
Identity added: /home/jenkins/agent/workspace/m2e_master@tmp/private_key_1888072035583144153.key (/home/jenkins/agent/workspace/m2e_master@tmp/private_key_1888072035583144153.key)
[ssh-agent] Started.
[Pipeline] {
[Pipeline] sh
++ grep '<m2e.version>.*</m2e.version>' pom.xml
++ sed -e 's/.*<m2e.version>\(.*\)<\/m2e.version>.*/\1/'
+ M2E_VERSION=1.17.2
+ DOWNLOAD_AREA=/home/data/httpd/download.eclipse.org/technology/m2e/snapshots/1.17.2/latest
+ echo M2E_VERSION=1.17.2
M2E_VERSION=1.17.2
+ echo DOWNLOAD_AREA=/home/data/httpd/download.eclipse.org/technology/m2e/snapshots/1.17.2/latest
DOWNLOAD_AREA=/home/data/httpd/download.eclipse.org/technology/m2e/snapshots/1.17.2/latest
+ ssh genie.m2e@build.eclipse.org '							rm -rf  /home/data/httpd/download.eclipse.org/technology/m2e/snapshots/1.17.2/latest/* && 							mkdir -p /home/data/httpd/download.eclipse.org/technology/m2e/snapshots/1.17.2/latest'
+ scp -r org.eclipse.m2e.site/target/repository/artifacts.jar org.eclipse.m2e.site/target/repository/artifacts.xml.xz org.eclipse.m2e.site/target/repository/content.jar org.eclipse.m2e.site/target/repository/content.xml.xz org.eclipse.m2e.site/target/repository/features org.eclipse.m2e.site/target/repository/p2.index org.eclipse.m2e.site/target/repository/plugins genie.m2e@build.eclipse.org:/home/data/httpd/download.eclipse.org/technology/m2e/snapshots/1.17.2/latest
[Pipeline] }
$ ssh-agent -k
unset SSH_AUTH_SOCK;
unset SSH_AGENT_PID;
echo Agent pid 5517 killed;
[ssh-agent] Stopped.
[Pipeline] // sshagent
[Pipeline] }
[Pipeline] // withEnv
[Pipeline] }
[Pipeline] // stage
[Pipeline] }
[Pipeline] // withEnv
[Pipeline] }
[Pipeline] // timeout
[Pipeline] }
[Pipeline] // withEnv
[Pipeline] }
[Pipeline] // node
[Pipeline] End of Pipeline

GitHub has been notified of this commit’s build result

Finished: UNSTABLE