Skip to content

Failed

com.sun.ts.tests.jsf.spec.el.elresolvers.URLClient.facesImplicitObjectResolverSetValueTest (from faces-tck)

Failing for the past 2 builds (Since Unstable #99 )
Took 1 sec.

Error Message

test result: Failed. Test case throws exception: [BaseUrlClient] facesImplicitObjectResolverSetValueTest failed! Check output for cause of failure.

Stacktrace

test result: Failed. Test case throws exception: [BaseUrlClient] facesImplicitObjectResolverSetValueTest failed! Check output for cause of failure.

Standard Output

#Test Results (version 2)
#Tue Apr 12 10:55:30 UTC 2022
#-----testdescription-----
$file=/home/jenkins/agent/workspace/jakartaee-tck_master/faces-tck/src/com/sun/ts/tests/jsf/spec/el/elresolvers/URLClient.java
$root=/home/jenkins/agent/workspace/jakartaee-tck_master/faces-tck/src
assertion_ids=
classname=com.sun.ts.tests.jsf.spec.el.elresolvers.URLClient
direction=forward
finder=cts
id=facesImplicitObjectResolverSetValueTest
keywords=all jsf javaee javaee_web_profile facesImplicitObjectResolverSetValueTest novehicle forward
service_eetest=no
testName=facesImplicitObjectResolverSetValueTest
testProps=\ webServerHost  webServerPort  ts_home
test_directory=com/sun/ts/tests/jsf/spec/el/elresolvers

#-----environment-----
JAVA_HOME=/opt/jdk-17.0.1
JAVA_OPTIONS=
LOCAL_CLASSES=/home/jenkins/agent/workspace/jakartaee-tck_master/faces-tck/bin/xml/../../lib/tsharness.jar\:/home/jenkins/agent/workspace/jakartaee-tck_master/faces-tck/bin/xml/../../lib/jsftck.jar\:/home/jenkins/agent/workspace/jakartaee-tck_master/faces-tck/bin/xml/../../lib/sigtest.jar\:/home/jenkins/agent/workspace/jakartaee-tck_master/faces-tck/bin/xml/../../lib/javatest.jar\:/home/jenkins/agent/workspace/jakartaee-tck_master/faces-tck/bin/xml/../../classes\:/home/jenkins/agent/workspace/jakartaee-tck_master/glassfish7/glassfish/modules/jakarta.enterprise.cdi-api.jar;/home/jenkins/agent/workspace/jakartaee-tck_master/glassfish7/glassfish/modules/jakarta.servlet.jsp.jstl-api.jar;/home/jenkins/agent/workspace/jakartaee-tck_master/glassfish7/glassfish/modules/jakarta.inject-api.jar;/home/jenkins/agent/workspace/jakartaee-tck_master/glassfish7/glassfish/modules/jakarta.faces.jar;/home/jenkins/agent/workspace/jakartaee-tck_master/glassfish7/glassfish/modules/jakarta.servlet.jsp-api.jar;/home/jenkins/agent/workspace/jakartaee-tck_master/glassfish7/glassfish/modules/jakarta.servlet-api.jar;/home/jenkins/agent/workspace/jakartaee-tck_master/glassfish7/glassfish/modules/jakarta.el.jar\:\:/home/jenkins/agent/workspace/jakartaee-tck_master/faces-tck/bin/xml/../../lib/commons-logging-1.1.3.jar\:/home/jenkins/agent/workspace/jakartaee-tck_master/faces-tck/bin/xml/../../lib/commons-io-2.4.jar\:/home/jenkins/agent/workspace/jakartaee-tck_master/faces-tck/bin/xml/../../lib/commons-lang3-3.3.2.jar\:/home/jenkins/agent/workspace/jakartaee-tck_master/faces-tck/bin/xml/../../lib/commons-codec-1.9.jar\:/home/jenkins/agent/workspace/jakartaee-tck_master/faces-tck/bin/xml/../../lib/commons-collections-3.2.1.jar\:/home/jenkins/agent/workspace/jakartaee-tck_master/faces-tck/bin/xml/../../lib/commons-httpclient-3.1.jar\:/home/jenkins/agent/workspace/jakartaee-tck_master/faces-tck/bin/xml/../../lib/cssparser-0.9.25.jar\:/home/jenkins/agent/workspace/jakartaee-tck_master/faces-tck/bin/xml/../../lib/htmlunit-2.15.jar\:/home/jenkins/agent/workspace/jakartaee-tck_master/faces-tck/bin/xml/../../lib/htmlunit-core-js-2.15.jar\:/home/jenkins/agent/workspace/jakartaee-tck_master/faces-tck/bin/xml/../../lib/httpcore-4.4.9.jar\:/home/jenkins/agent/workspace/jakartaee-tck_master/faces-tck/bin/xml/../../lib/httpclient-4.5.5.jar\:/home/jenkins/agent/workspace/jakartaee-tck_master/faces-tck/bin/xml/../../lib/httpmime-4.5.5.jar\:/home/jenkins/agent/workspace/jakartaee-tck_master/faces-tck/bin/xml/../../lib/nekohtml-1.9.21.jar\:/home/jenkins/agent/workspace/jakartaee-tck_master/faces-tck/bin/xml/../../lib/sac-1.3.jar\:/home/jenkins/agent/workspace/jakartaee-tck_master/faces-tck/bin/xml/../../lib/saxpath.jar\:/home/jenkins/agent/workspace/jakartaee-tck_master/faces-tck/bin/xml/../../lib/jaxen-1.1.6.jar\:/home/jenkins/agent/workspace/jakartaee-tck_master/faces-tck/bin/xml/../../lib/jaxen-core-1.0.jar\:/home/jenkins/agent/workspace/jakartaee-tck_master/faces-tck/bin/xml/../../lib/jdom-1.1.3.jar\:/home/jenkins/agent/workspace/jakartaee-tck_master/faces-tck/bin/xml/../../lib/xercesImpl-2.11.0.jar\:/home/jenkins/agent/workspace/jakartaee-tck_master/faces-tck/bin/xml/../../lib/xalan-2.7.2.jar\:/home/jenkins/agent/workspace/jakartaee-tck_master/faces-tck/bin/xml/../../lib/serializer-2.7.2.jar\:/home/jenkins/agent/workspace/jakartaee-tck_master/faces-tck/bin/xml/../../lib/xml-apis-1.4.01.jar\:
SYSTEMROOT=${env.SystemRoot}
TS_HOME=/home/jenkins/agent/workspace/jakartaee-tck_master/faces-tck/bin/xml/../..
command.testExecute=com.sun.ts.lib.harness.ExecTSTestCmd CLASSPATH\=${JAVA_HOME}/lib/rt.jar${pathsep}${LOCAL_CLASSES} HOME\="${user.home}" windir\=${windir} SYSTEMROOT\=${SYSTEMROOT} ${JAVA_HOME}/bin/java ${JAVA_OPTIONS} $testExecuteClass $testExecuteArgs
harness.executeMode=2
harness.log.delayseconds=1 
harness.log.port=2000
harness.log.traceflag=true
harness.socket.retry.count=10
harness.temp.directory=${ts.home}/tmp
jimage.dir=${ts.home}/tmp/jdk-bundles
pathsep=\:
porting.ts.url.class.1=com.sun.ts.lib.implementation.sun.common.SunRIURL
ts.home=/home/jenkins/agent/workspace/jakartaee-tck_master/faces-tck/bin/xml/../..
ts_home=${TS_HOME}
user.home=/
webServerHost=localhost
webServerPort=8080
windir=${env.windir}

#-----testresult-----
description=file\:/home/jenkins/agent/workspace/jakartaee-tck_master/faces-tck/src/com/sun/ts/tests/jsf/spec/el/elresolvers/URLClient.java\#facesImplicitObjectResolverSetValueTest
end=Tue Apr 12 10\:55\:30 UTC 2022
environment=ts_unix
execStatus=Failed. Test case throws exception\: [BaseUrlClient] facesImplicitObjectResolverSetValueTest failed\! Check output for cause of failure.
harnessLoaderMode=Classpath Loader
harnessVariety=Full Bundle
javatestOS=Linux 5.14.14-200.fc34.x86_64 (amd64)
javatestVersion=5.0
script=com.sun.ts.lib.harness.TSScript
sections=script_messages TestRun
start=Tue Apr 12 10\:55\:29 UTC 2022
test=com/sun/ts/tests/jsf/spec/el/elresolvers/URLClient.java\#facesImplicitObjectResolverSetValueTest
timeoutSeconds=1200
totalTime=1692
work=/home/jenkins/agent/workspace/jakartaee-tck_master/faces-tckwork/faces-tck/com/sun/ts/tests/jsf/spec/el/elresolvers

#section:script_messages
----------messages:(0/0)----------

#section:TestRun
----------messages:(1/3689)----------
command: com.sun.ts.lib.harness.ExecTSTestCmd CLASSPATH=:/opt/jdk-17.0.1/lib/rt.jar:/home/jenkins/agent/workspace/jakartaee-tck_master/faces-tck/bin/xml/../../lib/tsharness.jar:/home/jenkins/agent/workspace/jakartaee-tck_master/faces-tck/bin/xml/../../lib/jsftck.jar:/home/jenkins/agent/workspace/jakartaee-tck_master/faces-tck/bin/xml/../../lib/sigtest.jar:/home/jenkins/agent/workspace/jakartaee-tck_master/faces-tck/bin/xml/../../lib/javatest.jar:/home/jenkins/agent/workspace/jakartaee-tck_master/faces-tck/bin/xml/../../classes:/home/jenkins/agent/workspace/jakartaee-tck_master/glassfish7/glassfish/modules/jakarta.enterprise.cdi-api.jar;/home/jenkins/agent/workspace/jakartaee-tck_master/glassfish7/glassfish/modules/jakarta.servlet.jsp.jstl-api.jar;/home/jenkins/agent/workspace/jakartaee-tck_master/glassfish7/glassfish/modules/jakarta.inject-api.jar;/home/jenkins/agent/workspace/jakartaee-tck_master/glassfish7/glassfish/modules/jakarta.faces.jar;/home/jenkins/agent/workspace/jakartaee-tck_master/glassfish7/glassfish/modules/jakarta.servlet.jsp-api.jar;/home/jenkins/agent/workspace/jakartaee-tck_master/glassfish7/glassfish/modules/jakarta.servlet-api.jar;/home/jenkins/agent/workspace/jakartaee-tck_master/glassfish7/glassfish/modules/jakarta.el.jar::/home/jenkins/agent/workspace/jakartaee-tck_master/faces-tck/bin/xml/../../lib/commons-logging-1.1.3.jar:/home/jenkins/agent/workspace/jakartaee-tck_master/faces-tck/bin/xml/../../lib/commons-io-2.4.jar:/home/jenkins/agent/workspace/jakartaee-tck_master/faces-tck/bin/xml/../../lib/commons-lang3-3.3.2.jar:/home/jenkins/agent/workspace/jakartaee-tck_master/faces-tck/bin/xml/../../lib/commons-codec-1.9.jar:/home/jenkins/agent/workspace/jakartaee-tck_master/faces-tck/bin/xml/../../lib/commons-collections-3.2.1.jar:/home/jenkins/agent/workspace/jakartaee-tck_master/faces-tck/bin/xml/../../lib/commons-httpclient-3.1.jar:/home/jenkins/agent/workspace/jakartaee-tck_master/faces-tck/bin/xml/../../lib/cssparser-0.9.25.jar:/home/jenkins/agent/workspace/jakartaee-tck_master/faces-tck/bin/xml/../../lib/htmlunit-2.15.jar:/home/jenkins/agent/workspace/jakartaee-tck_master/faces-tck/bin/xml/../../lib/htmlunit-core-js-2.15.jar:/home/jenkins/agent/workspace/jakartaee-tck_master/faces-tck/bin/xml/../../lib/httpcore-4.4.9.jar:/home/jenkins/agent/workspace/jakartaee-tck_master/faces-tck/bin/xml/../../lib/httpclient-4.5.5.jar:/home/jenkins/agent/workspace/jakartaee-tck_master/faces-tck/bin/xml/../../lib/httpmime-4.5.5.jar:/home/jenkins/agent/workspace/jakartaee-tck_master/faces-tck/bin/xml/../../lib/nekohtml-1.9.21.jar:/home/jenkins/agent/workspace/jakartaee-tck_master/faces-tck/bin/xml/../../lib/sac-1.3.jar:/home/jenkins/agent/workspace/jakartaee-tck_master/faces-tck/bin/xml/../../lib/saxpath.jar:/home/jenkins/agent/workspace/jakartaee-tck_master/faces-tck/bin/xml/../../lib/jaxen-1.1.6.jar:/home/jenkins/agent/workspace/jakartaee-tck_master/faces-tck/bin/xml/../../lib/jaxen-core-1.0.jar:/home/jenkins/agent/workspace/jakartaee-tck_master/faces-tck/bin/xml/../../lib/jdom-1.1.3.jar:/home/jenkins/agent/workspace/jakartaee-tck_master/faces-tck/bin/xml/../../lib/xercesImpl-2.11.0.jar:/home/jenkins/agent/workspace/jakartaee-tck_master/faces-tck/bin/xml/../../lib/xalan-2.7.2.jar:/home/jenkins/agent/workspace/jakartaee-tck_master/faces-tck/bin/xml/../../lib/serializer-2.7.2.jar:/home/jenkins/agent/workspace/jakartaee-tck_master/faces-tck/bin/xml/../../lib/xml-apis-1.4.01.jar: HOME=/ windir= SYSTEMROOT= /opt/jdk-17.0.1/bin/java com.sun.ts.tests.jsf.spec.el.elresolvers.URLClient -p /home/jenkins/agent/workspace/jakartaee-tck_master/faces-tck/bin/xml/../../tmp/tstest.jte -t facesImplicitObjectResolverSetValueTest
----------log:(123/15797)*----------
************************************************************
* props file set to "/tmp/1003270000-cts-props.txt"
************************************************************
04-12-2022 10:55:29:  TRACE: #######  Value of harness.socket.retry.count is "10"
04-12-2022 10:55:29:  TRACE: #######  Value of harness.log.port is "2000"
04-12-2022 10:55:29:  TRACE: #######  Actual bind value of harness.log.port is "2000"
04-12-2022 10:55:29:  TRACE: *** in EETest.run(argv,p)
04-12-2022 10:55:29:  TRACE: TESTCLASS=com.sun.ts.tests.jsf.spec.el.elresolvers.URLClient
04-12-2022 10:55:29:  TRACE: ** IN getRunMethod: testClass=com.sun.ts.tests.jsf.spec.el.elresolvers.URLClient
04-12-2022 10:55:29:  TRACE: ** IN getRunMethod: testname=facesImplicitObjectResolverSetValueTest
04-12-2022 10:55:29:  TRACE: ** GOT RUN METHOD!
04-12-2022 10:55:29:  TRACE: **runmethod=facesImplicitObjectResolverSetValueTest
04-12-2022 10:55:29:  TRACE: ABOUT TO GET SETUP METHOD!
04-12-2022 10:55:29:  TRACE: No setupMethod annotation present
04-12-2022 10:55:29:  TRACE: getSetupMethod - checking for testcase specific setup method:  facesImplicitObjectResolverSetValueTest_setup
04-12-2022 10:55:29:  TRACE: getSetupMethod - checking for default class specific setup method
04-12-2022 10:55:29:  TRACE: GOT SETUP METHOD!
04-12-2022 10:55:29:  TRACE: No cleanupMethod annotation present
04-12-2022 10:55:29:  TRACE: getCleanupMethod - checking for testcase specific cleanup method:  facesImplicitObjectResolverSetValueTest_cleanup
04-12-2022 10:55:29:  TRACE: getCleanupMethod - checking for default class specific cleanup method
04-12-2022 10:55:29:  TRACE: GOT CLEANUP METHOD!
04-12-2022 10:55:29:  TRACE: ABOUT TO INVOKE SETUP METHOD!
04-12-2022 10:55:29:  [BaseUrlClient] Test setup OK
04-12-2022 10:55:29:  TRACE: INVOKED SETUP METHOD!
04-12-2022 10:55:29:  TRACE: ABOUT TO INVOKE EETEST RUN METHOD!
04-12-2022 10:55:29:  MAKING REQUEST FOR FACES SERVLET
04-12-2022 10:55:29:  TRACE: [BaseUrlClient] EXECUTING
04-12-2022 10:55:29:  [HttpRequest] Dispatching request: 'GET /jsf_el_resolvers_web/faces/test.xhtml HTTP/1.0' to target server at 'localhost:8080'
04-12-2022 10:55:29:  TRACE: ########## The real value set: false
04-12-2022 10:55:29:  TRACE: [WIRE] - >> "GET /jsf_el_resolvers_web/faces/test.xhtml HTTP/1.0[\\r][\\n]"
04-12-2022 10:55:29:  TRACE: [WIRE] - >> "User-Agent: Jakarta Commons-HttpClient/3.1[\\r][\\n]"
04-12-2022 10:55:29:  TRACE: [WIRE] - >> "Host: localhost:8080[\\r][\\n]"
04-12-2022 10:55:29:  TRACE: [WIRE] - >> "[\\r][\\n]"
04-12-2022 10:55:29:  TRACE: [WIRE] - << "HTTP/1.1 404 /test.xhtml Not Found in ExternalContext as a Resource[\\r][\\n]"
04-12-2022 10:55:29:  TRACE: [WIRE] - << "HTTP/1.1 404 /test.xhtml Not Found in ExternalContext as a Resource[\\r][\\n]"
04-12-2022 10:55:29:  TRACE: [WIRE] - << "Server: Eclipse GlassFish  7.0.0 [\\r][\\n]"
04-12-2022 10:55:29:  TRACE: [WIRE] - << "X-Powered-By: Servlet/6.0 JSP/3.1(Eclipse GlassFish  7.0.0  Java/Oracle Corporation/17)[\\r][\\n]"
04-12-2022 10:55:29:  TRACE: [WIRE] - << "Content-Language: [\\r][\\n]"
04-12-2022 10:55:29:  TRACE: [WIRE] - << "Content-Type: text/html[\\r][\\n]"
04-12-2022 10:55:29:  TRACE: [WIRE] - << "Connection: close[\\r][\\n]"
04-12-2022 10:55:29:  TRACE: [WIRE] - << "Content-Length: 1138[\\r][\\n]"
04-12-2022 10:55:29:  TRACE: [WIRE] - << "[\\r][\\n]"
REQUEST LINE: GET /jsf_el_resolvers_web/TestServlet?testname=facesImplicitObjectResolverSetValueTest HTTP/1.0
04-12-2022 10:55:29:  TRACE: [HttpRequest] Added request header: User-Agent: JavaServer Faces TCK/2.2

04-12-2022 10:55:29:  TRACE: [BaseUrlClient] EXECUTING
04-12-2022 10:55:29:  [HttpRequest] Dispatching request: 'GET /jsf_el_resolvers_web/TestServlet?testname=facesImplicitObjectResolverSetValueTest HTTP/1.0' to target server at 'localhost:8080'
04-12-2022 10:55:29:  TRACE: ########## The real value set: false
04-12-2022 10:55:29:  TRACE: [WIRE] - >> "GET /jsf_el_resolvers_web/TestServlet?testname=facesImplicitObjectResolverSetValueTest HTTP/1.0[\\r][\\n]"
04-12-2022 10:55:29:  TRACE: [WIRE] - >> "User-Agent: JavaServer Faces TCK/2.2[\\r][\\n]"
04-12-2022 10:55:29:  TRACE: [WIRE] - >> "Host: localhost:8080[\\r][\\n]"
04-12-2022 10:55:29:  TRACE: [WIRE] - >> "[\\r][\\n]"
04-12-2022 10:55:29:  TRACE: [WIRE] - << "HTTP/1.1 200 OK[\\r][\\n]"
04-12-2022 10:55:29:  TRACE: [WIRE] - << "HTTP/1.1 200 OK[\\r][\\n]"
04-12-2022 10:55:29:  TRACE: [WIRE] - << "Server: Eclipse GlassFish  7.0.0 [\\r][\\n]"
04-12-2022 10:55:29:  TRACE: [WIRE] - << "X-Powered-By: Servlet/6.0 JSP/3.1(Eclipse GlassFish  7.0.0  Java/Oracle Corporation/17)[\\r][\\n]"
04-12-2022 10:55:29:  TRACE: [WIRE] - << "Set-Cookie: JSESSIONID=d6a0712051d4d570f43369eccb8a; Path=/jsf_el_resolvers_web[\\r][\\n]"
04-12-2022 10:55:29:  TRACE: [WIRE] - << "Content-Type: text/plain;charset=ISO-8859-1[\\r][\\n]"
04-12-2022 10:55:29:  TRACE: [WIRE] - << "Connection: close[\\r][\\n]"
04-12-2022 10:55:29:  TRACE: [WIRE] - << "Content-Length: 3966[\\r][\\n]"
04-12-2022 10:55:29:  TRACE: [WIRE] - << "[\\r][\\n]"
04-12-2022 10:55:29:  TRACE: [WIRE] - << "Testing phase: [FACES][\\n]"
04-12-2022 10:55:29:  TRACE: [WIRE] - << "Test FAILED No exception thrown when calling setValue() with the base parameter set to null, and the property parameter set to 'application'.Test FAILED propertyResolved property on ELContext was set to true even though property was not writable.[\\n]"
04-12-2022 10:55:29:  TRACE: [WIRE] - << "Test FAILED No exception thrown when calling setValue() with the base parameter set to null, and the property parameter set to 'cookie'.Test FAILED propertyResolved property on ELContext was set to true even though property was not writable.[\\n]"
04-12-2022 10:55:29:  TRACE: [WIRE] - << "Test FAILED No exception thrown when calling setValue() with the base parameter set to null, and the property parameter set to 'header'.Test FAILED propertyResolved property on ELContext was set to true even though property was not writable.[\\n]"
04-12-2022 10:55:29:  TRACE: [WIRE] - << "Test FAILED No exception thrown when calling setValue() with the base parameter set to null, and the property parameter set to 'headerValues'.Test FAILED propertyResolved property on ELContext was set to true even though property was not writable.[\\n]"
04-12-2022 10:55:29:  TRACE: [WIRE] - << "Test FAILED No exception thrown when calling setValue() with the base parameter set to null, and the property parameter set to 'initParam'.Test FAILED propertyResolved property on ELContext was set to true even though property was not writable.[\\n]"
04-12-2022 10:55:29:  TRACE: [WIRE] - << "Test FAILED No exception thrown when calling setValue() with the base parameter set to null, and the property parameter set to 'param'.Test FAILED propertyResolved property on ELContext was set to true even though property was not writable.[\\n]"
04-12-2022 10:55:29:  TRACE: [WIRE] - << "Test FAILED No exception thrown when calling setValue() with the base parameter set to null, and the property parameter set to 'paramValues'.Test FAILED propertyResolved property on ELContext was set to true even though property was not writable.[\\n]"
04-12-2022 10:55:29:  TRACE: [WIRE] - << "Test FAILED No exception thrown when calling setValue() with the base parameter set to null, and the property parameter set to 'request'.Test FAILED propertyResolved property on ELContext was set to true even though property was not writable.[\\n]"
04-12-2022 10:55:29:  TRACE: [WIRE] - << "Test FAILED No exception thrown when calling setValue() with the base parameter set to null, and the property parameter set to 'session'.Test FAILED propertyResolved property on ELContext was set to true even though property was not writable.[\\n]"
04-12-2022 10:55:29:  TRACE: [WIRE] - << "Test FAILED No exception thrown when calling setValue() with the base parameter set to null, and the property parameter set to 'applicationScope'.Test FAILED propertyResolved property on ELContext was set to true even though property was not writable.[\\n]"
04-12-2022 10:55:29:  TRACE: [WIRE] - << "Test FAILED No exception thrown when calling setValue() with the base parameter set to null, and the property parameter set to 'sessionScope'.Test FAILED propertyResolved property on ELContext was set to true even though property was not writable.[\\n]"
04-12-2022 10:55:29:  TRACE: [WIRE] - << "Test FAILED No exception thrown when calling setValue() with the base parameter set to null, and the property parameter set to 'requestScope'.Test FAILED propertyResolved property on ELContext was set to true even though property was not writable.[\\n]"
04-12-2022 10:55:29:  TRACE: [WIRE] - << "Test FAILED No exception thrown when calling setValue() with the base parameter set to null, and the property parameter set to 'facesContext'.Test FAILED propertyResolved property on ELContext was set to true even though property was not writable.[\\n]"
04-12-2022 10:55:29:  TRACE: [WIRE] - << "Test FAILED No exception thrown when calling setValue() with the base parameter set to null, and the property parameter set to 'view'.Test FAILED propertyResolved property on ELContext was set to true even though property was not writable.[\\n]"
04-12-2022 10:55:29:  TRACE: [WIRE] - << "Testing phase: [JSP][\\n]"
04-12-2022 10:55:29:  TRACE: [WIRE] - << "Test FAILED No exception thrown when calling setValue() with the base parameter set to null, and the property parameter set to 'facesContext'.Test FAILED propertyResolved property on ELContext was set to true even though property was not writable.[\\n]"
04-12-2022 10:55:29:  TRACE: [WIRE] - << "Test FAILED No exception thrown when calling setValue() with the base parameter set to null, and the property parameter set to 'view'.Test FAILED propertyResolved property on ELContext was set to true even though property was not writable.[\\n]"
04-12-2022 10:55:29:  TRACE: [WIRE] - HttpConnectionManager is null.  Connection cannot be released.
04-12-2022 10:55:29:  TRACE: [WebValidatorBase] Scanning response for search string: 'Test PASSED' starting at index location: 0
04-12-2022 10:55:29:  ERROR: [WebValidatorBase] Unable to find the following search string in the server's response: 'Test PASSED' at index: 0
[WebValidatorBase] Server's response:
-------------------------------------------
Testing phase: [FACES]
Test FAILED No exception thrown when calling setValue() with the base parameter set to null, and the property parameter set to 'application'.Test FAILED propertyResolved property on ELContext was set to true even though property was not writable.
Test FAILED No exception thrown when calling setValue() with the base parameter set to null, and the property parameter set to 'cookie'.Test FAILED propertyResolved property on ELContext was set to true even though property was not writable.
Test FAILED No exception thrown when calling setValue() with the base parameter set to null, and the property parameter set to 'header'.Test FAILED propertyResolved property on ELContext was set to true even though property was not writable.
Test FAILED No exception thrown when calling setValue() with the base parameter set to null, and the property parameter set to 'headerValues'.Test FAILED propertyResolved property on ELContext was set to true even though property was not writable.
Test FAILED No exception thrown when calling setValue() with the base parameter set to null, and the property parameter set to 'initParam'.Test FAILED propertyResolved property on ELContext was set to true even though property was not writable.
Test FAILED No exception thrown when calling setValue() with the base parameter set to null, and the property parameter set to 'param'.Test FAILED propertyResolved property on ELContext was set to true even though property was not writable.
Test FAILED No exception thrown when calling setValue() with the base parameter set to null, and the property parameter set to 'paramValues'.Test FAILED propertyResolved property on ELContext was set to true even though property was not writable.
Test FAILED No exception thrown when calling setValue() with the base parameter set to null, and the property parameter set to 'request'.Test FAILED propertyResolved property on ELContext was set to true even though property was not writable.
Test FAILED No exception thrown when calling setValue() with the base parameter set to null, and the property parameter set to 'session'.Test FAILED propertyResolved property on ELContext was set to true even though property was not writable.
Test FAILED No exception thrown when calling setValue() with the base parameter set to null, and the property parameter set to 'applicationScope'.Test FAILED propertyResolved property on ELContext was set to true even though property was not writable.
Test FAILED No exception thrown when calling setValue() with the base parameter set to null, and the property parameter set to 'sessionScope'.Test FAILED propertyResolved property on ELContext was set to true even though property was not writable.
Test FAILED No exception thrown when calling setValue() with the base parameter set to null, and the property parameter set to 'requestScope'.Test FAILED propertyResolved property on ELContext was set to true even though property was not writable.
Test FAILED No exception thrown when calling setValue() with the base parameter set to null, and the property parameter set to 'facesContext'.Test FAILED propertyResolved property on ELContext was set to true even though property was not writable.
Test FAILED No exception thrown when calling setValue() with the base parameter set to null, and the property parameter set to 'view'.Test FAILED propertyResolved property on ELContext was set to true even though property was not writable.
Testing phase: [JSP]
Test FAILED No exception thrown when calling setValue() with the base parameter set to null, and the property parameter set to 'facesContext'.Test FAILED propertyResolved property on ELContext was set to true even though property was not writable.
Test FAILED No exception thrown when calling setValue() with the base parameter set to null, and the property parameter set to 'view'.Test FAILED propertyResolved property on ELContext was set to true even though property was not writable.

-------------------------------------------

04-12-2022 10:55:29:  ERROR: Test case throws exception: [BaseUrlClient] facesImplicitObjectResolverSetValueTest failed! Check output for cause of failure.
04-12-2022 10:55:29:  ERROR: Exception at:  
04-12-2022 10:55:29:  ERROR: com.sun.ts.tests.common.webclient.TestFailureException: Test FAILED!
	at com.sun.ts.tests.common.webclient.WebTestCase.execute(WebTestCase.java:180)
	at com.sun.ts.tests.common.webclient.BaseUrlClient.invoke(BaseUrlClient.java:456)
	at com.sun.ts.tests.jsf.spec.el.elresolvers.URLClient.facesImplicitObjectResolverSetValueTest(URLClient.java:157)
	at java.base/jdk.internal.reflect.NativeMethodAccessorImpl.invoke0(Native Method)
	at java.base/jdk.internal.reflect.NativeMethodAccessorImpl.invoke(NativeMethodAccessorImpl.java:77)
	at java.base/jdk.internal.reflect.DelegatingMethodAccessorImpl.invoke(DelegatingMethodAccessorImpl.java:43)
	at java.base/java.lang.reflect.Method.invoke(Method.java:568)
	at com.sun.ts.lib.harness.EETest.run(EETest.java:596)
	at com.sun.ts.lib.harness.EETest.getPropsReady(EETest.java:486)
	at com.sun.ts.lib.harness.EETest.run(EETest.java:337)
	at com.sun.ts.tests.jsf.spec.el.elresolvers.URLClient.run(URLClient.java:46)
	at com.sun.ts.tests.jsf.spec.el.elresolvers.URLClient.main(URLClient.java:37)

04-12-2022 10:55:29:  [BaseUrlClient] Test cleanup OK
STATUS:Failed.Test case throws exception: [BaseUrlClient] facesImplicitObjectResolverSetValueTest failed! Check output for cause of failure.
result: Failed. Test case throws exception: [BaseUrlClient] facesImplicitObjectResolverSetValueTest failed! Check output for cause of failure.


test result: Failed. Test case throws exception: [BaseUrlClient] facesImplicitObjectResolverSetValueTest failed! Check output for cause of failure.