FailedConsole Output

Skipping 25 KB.. Full Log
GzauYGBgqihikoFqS8/OK83NS9ZwhNEghAwQwghQWAACwxA+XYgAAAA==[WARNING] 
[WARNING] Some problems were encountered while building the effective model for org.eclipse.gemini.blueprint.iandt:scoped.bundle.a:jar:3.0.0.M01-SNAPSHOT
[WARNING] Reporting configuration should be done in <reporting> section, not in maven-site-plugin <configuration> as reportPlugins parameter.
[WARNING] 
[WARNING] Some problems were encountered while building the effective model for org.eclipse.gemini.blueprint.iandt:scoped.bundle.b:jar:3.0.0.M01-SNAPSHOT
[WARNING] Reporting configuration should be done in <reporting> section, not in maven-site-plugin <configuration> as reportPlugins parameter.
[WARNING] 
[WARNING] Some problems were encountered while building the effective model for org.eclipse.gemini.blueprint.iandt:scoped.bundle.common:jar:3.0.0.M01-SNAPSHOT
[WARNING] Reporting configuration should be done in <reporting> section, not in maven-site-plugin <configuration> as reportPlugins parameter.
[WARNING] 
[WARNING] Some problems were encountered while building the effective model for org.eclipse.gemini.blueprint.iandt:io.fragment.1.bundle:jar:3.0.0.M01-SNAPSHOT
[WARNING] Reporting configuration should be done in <reporting> section, not in maven-site-plugin <configuration> as reportPlugins parameter.
[WARNING] 
[WARNING] Some problems were encountered while building the effective model for org.eclipse.gemini.blueprint.iandt:io.fragment.2.bundle:jar:3.0.0.M01-SNAPSHOT
[WARNING] Reporting configuration should be done in <reporting> section, not in maven-site-plugin <configuration> as reportPlugins parameter.
[WARNING] 
[WARNING] Some problems were encountered while building the effective model for org.eclipse.gemini.blueprint.iandt:error:jar:3.0.0.M01-SNAPSHOT
[WARNING] Reporting configuration should be done in <reporting> section, not in maven-site-plugin <configuration> as reportPlugins parameter.
[WARNING] 
[WARNING] Some problems were encountered while building the effective model for org.eclipse.gemini.blueprint.iandt:deadlock:jar:3.0.0.M01-SNAPSHOT
[WARNING] Reporting configuration should be done in <reporting> section, not in maven-site-plugin <configuration> as reportPlugins parameter.
[WARNING] 
[WARNING] Some problems were encountered while building the effective model for org.eclipse.gemini.blueprint.iandt:configuration:jar:3.0.0.M01-SNAPSHOT
[WARNING] Reporting configuration should be done in <reporting> section, not in maven-site-plugin <configuration> as reportPlugins parameter.
[WARNING] 
[WARNING] Some problems were encountered while building the effective model for org.eclipse.gemini.blueprint.iandt:extender-version-bundle:jar:3.0.0.M01-SNAPSHOT
[WARNING] Reporting configuration should be done in <reporting> section, not in maven-site-plugin <configuration> as reportPlugins parameter.
[WARNING] 
[WARNING] Some problems were encountered while building the effective model for org.eclipse.gemini.blueprint.iandt:nopublish-bundle:jar:3.0.0.M01-SNAPSHOT
[WARNING] Reporting configuration should be done in <reporting> section, not in maven-site-plugin <configuration> as reportPlugins parameter.
[WARNING] 
[WARNING] Some problems were encountered while building the effective model for org.eclipse.gemini.blueprint.iandt:async-nowait-bundle:jar:3.0.0.M01-SNAPSHOT
[WARNING] Reporting configuration should be done in <reporting> section, not in maven-site-plugin <configuration> as reportPlugins parameter.
[WARNING] 
[WARNING] Some problems were encountered while building the effective model for org.eclipse.gemini.blueprint.iandt:async-wait-bundle:jar:3.0.0.M01-SNAPSHOT
[WARNING] Reporting configuration should be done in <reporting> section, not in maven-site-plugin <configuration> as reportPlugins parameter.
[WARNING] 
[WARNING] Some problems were encountered while building the effective model for org.eclipse.gemini.blueprint.iandt:sync-nowait-bundle:jar:3.0.0.M01-SNAPSHOT
[WARNING] Reporting configuration should be done in <reporting> section, not in maven-site-plugin <configuration> as reportPlugins parameter.
[WARNING] 
[WARNING] Some problems were encountered while building the effective model for org.eclipse.gemini.blueprint.iandt:sync-tail-bundle:jar:3.0.0.M01-SNAPSHOT
[WARNING] Reporting configuration should be done in <reporting> section, not in maven-site-plugin <configuration> as reportPlugins parameter.
[WARNING] 
[WARNING] Some problems were encountered while building the effective model for org.eclipse.gemini.blueprint.iandt:sync-wait-bundle:jar:3.0.0.M01-SNAPSHOT
[WARNING] Reporting configuration should be done in <reporting> section, not in maven-site-plugin <configuration> as reportPlugins parameter.
[WARNING] 
[WARNING] Some problems were encountered while building the effective model for org.eclipse.gemini.blueprint.iandt:config.bundle:pom:3.0.0.M01-SNAPSHOT
[WARNING] Reporting configuration should be done in <reporting> section, not in maven-site-plugin <configuration> as reportPlugins parameter.
[WARNING] 
[WARNING] Some problems were encountered while building the effective model for org.eclipse.gemini.blueprint.iandt:tccl.intf:jar:3.0.0.M01-SNAPSHOT
[WARNING] Reporting configuration should be done in <reporting> section, not in maven-site-plugin <configuration> as reportPlugins parameter.
[WARNING] 
[WARNING] Some problems were encountered while building the effective model for org.eclipse.gemini.blueprint.iandt:tccl:jar:3.0.0.M01-SNAPSHOT
[WARNING] Reporting configuration should be done in <reporting> section, not in maven-site-plugin <configuration> as reportPlugins parameter.
[WARNING] 
[WARNING] Some problems were encountered while building the effective model for org.eclipse.gemini.blueprint.iandt:config-with-dots.bundle:jar:3.0.0.M01-SNAPSHOT
[WARNING] Reporting configuration should be done in <reporting> section, not in maven-site-plugin <configuration> as reportPlugins parameter.
[WARNING] 
[WARNING] Some problems were encountered while building the effective model for org.eclipse.gemini.blueprint.iandt:proxy.creator:jar:3.0.0.M01-SNAPSHOT
[WARNING] Reporting configuration should be done in <reporting> section, not in maven-site-plugin <configuration> as reportPlugins parameter.
[WARNING] 
[WARNING] Some problems were encountered while building the effective model for org.eclipse.gemini.blueprint.iandt:extender-fragment-bundle:jar:3.0.0.M01-SNAPSHOT
[WARNING] Reporting configuration should be done in <reporting> section, not in maven-site-plugin <configuration> as reportPlugins parameter.
[WARNING] 
[WARNING] Some problems were encountered while building the effective model for org.eclipse.gemini.blueprint.iandt:jdk.proxy:jar:3.0.0.M01-SNAPSHOT
[WARNING] Reporting configuration should be done in <reporting> section, not in maven-site-plugin <configuration> as reportPlugins parameter.
[WARNING] 
[WARNING] Some problems were encountered while building the effective model for org.eclipse.gemini.blueprint.iandt:extender.listener.bundle:jar:3.0.0.M01-SNAPSHOT
[WARNING] Reporting configuration should be done in <reporting> section, not in maven-site-plugin <configuration> as reportPlugins parameter.
[WARNING] 
[WARNING] Some problems were encountered while building the effective model for org.eclipse.gemini.blueprint.iandt:ns.own.consumer:jar:3.0.0.M01-SNAPSHOT
[WARNING] Reporting configuration should be done in <reporting> section, not in maven-site-plugin <configuration> as reportPlugins parameter.
[WARNING] 
[WARNING] Some problems were encountered while building the effective model for org.eclipse.gemini.blueprint.iandt:proxy.listener:jar:3.0.0.M01-SNAPSHOT
[WARNING] Reporting configuration should be done in <reporting> section, not in maven-site-plugin <configuration> as reportPlugins parameter.
[WARNING] 
[WARNING] Some problems were encountered while building the effective model for org.eclipse.gemini.blueprint.iandt:export-import-dependency-bundle:jar:3.0.0.M01-SNAPSHOT
[WARNING] Reporting configuration should be done in <reporting> section, not in maven-site-plugin <configuration> as reportPlugins parameter.
[WARNING] 
[WARNING] Some problems were encountered while building the effective model for org.eclipse.gemini.blueprint.iandt:component.scan.bundle:jar:3.0.0.M01-SNAPSHOT
[WARNING] Reporting configuration should be done in <reporting> section, not in maven-site-plugin <configuration> as reportPlugins parameter.
[WARNING] 
[WARNING] Some problems were encountered while building the effective model for org.eclipse.gemini.blueprint.iandt:spring-osgi-jdk5-integration-test-bundles:pom:3.0.0.M01-SNAPSHOT
[WARNING] Reporting configuration should be done in <reporting> section, not in maven-site-plugin <configuration> as reportPlugins parameter.
[WARNING] 
[WARNING] Some problems were encountered while building the effective model for org.eclipse.gemini.blueprint.iandt:recursive:jar:3.0.0.M01-SNAPSHOT
[WARNING] Reporting configuration should be done in <reporting> section, not in maven-site-plugin <configuration> as reportPlugins parameter.
[WARNING] 
[WARNING] Some problems were encountered while building the effective model for org.eclipse.gemini.blueprint.iandt.blueprint:simple.bundle:jar:3.0.0.M01-SNAPSHOT
[WARNING] Reporting configuration should be done in <reporting> section, not in maven-site-plugin <configuration> as reportPlugins parameter.
[WARNING] 
[WARNING] Some problems were encountered while building the effective model for org.eclipse.gemini.blueprint.iandt.blueprint:error.bundle:jar:3.0.0.M01-SNAPSHOT
[WARNING] Reporting configuration should be done in <reporting> section, not in maven-site-plugin <configuration> as reportPlugins parameter.
[WARNING] 
[WARNING] Some problems were encountered while building the effective model for org.eclipse.gemini.blueprint.iandt.blueprint:waiting.bundle:jar:3.0.0.M01-SNAPSHOT
[WARNING] Reporting configuration should be done in <reporting> section, not in maven-site-plugin <configuration> as reportPlugins parameter.
[WARNING] 
[WARNING] Some problems were encountered while building the effective model for org.eclipse.gemini.blueprint.iandt.blueprint:config.bundle:jar:3.0.0.M01-SNAPSHOT
[WARNING] Reporting configuration should be done in <reporting> section, not in maven-site-plugin <configuration> as reportPlugins parameter.
[WARNING] 
[WARNING] Some problems were encountered while building the effective model for org.eclipse.gemini.blueprint.iandt.blueprint:bundles:pom:3.0.0.M01-SNAPSHOT
[WARNING] Reporting configuration should be done in <reporting> section, not in maven-site-plugin <configuration> as reportPlugins parameter.
[WARNING] 
[WARNING] Some problems were encountered while building the effective model for org.eclipse.gemini.blueprint.iandt:gemini-blueprint-integration-test-bundles:pom:3.0.0.M01-SNAPSHOT
[WARNING] Reporting configuration should be done in <reporting> section, not in maven-site-plugin <configuration> as reportPlugins parameter.
[WARNING] 
[WARNING] Some problems were encountered while building the effective model for org.eclipse.gemini.blueprint.iandt:gemini-blueprint-integration-tests:jar:3.0.0.M01-SNAPSHOT
[WARNING] Reporting configuration should be done in <reporting> section, not in maven-site-plugin <configuration> as reportPlugins parameter.
[WARNING] 
[WARNING] Some problems were encountered while building the effective model for org.eclipse.gemini.blueprint.iandt:gemini-blueprint-integration-tests-parent:pom:3.0.0.M01-SNAPSHOT
[WARNING] Reporting configuration should be done in <reporting> section, not in maven-site-plugin <configuration> as reportPlugins parameter.
[WARNING] 
[WARNING] Some problems were encountered while building the effective model for org.eclipse.gemini.blueprint:gemini-blueprint:pom:3.0.0.M01-SNAPSHOT
[WARNING] Reporting configuration should be done in <reporting> section, not in maven-site-plugin <configuration> as reportPlugins parameter. @ line 632, column 32
[WARNING] 
[WARNING] It is highly recommended to fix these problems because they threaten the stability of your build.
[WARNING] 
[WARNING] For this reason, future Maven versions might no longer support building such malformed projects.
[WARNING] 
[INFO] ------------------------------------------------------------------------
[INFO] Reactor Build Order:
[INFO] 
[INFO] Gemini Blueprint                                                   [pom]
[INFO] Gemini Blueprint Mocks                                             [jar]
[INFO] Gemini Blueprint IO                                                [jar]
[INFO] Gemini Blueprint Core                                              [jar]
[INFO] Gemini Blueprint Extender                                          [jar]
[INFO] Gemini Blueprint Extensions                                        [jar]
[INFO] Gemini Blueprint Testing Framework                                 [jar]
[INFO] Eclipse Gemini Blueprint Integration Tests Parent                  [pom]
[INFO] Eclipse Gemini Blueprint Integration Testing Bundles               [pom]
[INFO] Gemini Blueprint Test Bundle: Simple service test bundle           [jar]
[INFO] Gemini Blueprint Test Bundle: Simple service test bundle (impl differs) [jar]
[INFO] Gemini Blueprint Test Bundle: Simple service test bundle (impl differs) [jar]
[INFO] Gemini Blueprint Test Bundle: Simple service test bundle 2         [jar]
[INFO] Gemini Blueprint Test Bundle: Simple service test bundle 3         [jar]
[INFO] Gemini Blueprint Test Bundle: Simple service created by a factory which has a non trivial delay in createObject() [jar]
[INFO] Gemini Blueprint Test Bundle: Trivial OSGi bundle                  [jar]
[INFO] Gemini Blueprint Test Bundle: Simple test that uses trivial bundle [jar]
[INFO] Gemini Blueprint Test Bundle: Spring context lifecycle test bundle [jar]
[INFO] Gemini Blueprint Test Bundle: Spring context service listener test bundle [jar]
[INFO] Gemini Blueprint Test Bundle: Spring context service reference lifecycle test bundle [jar]
[INFO] Gemini Blueprint Test Bundle: Spring context service reference destruction test bundle [jar]
[INFO] Gemini Blueprint Test Bundle: Spring context dependencies test bundle [jar]
[INFO] Gemini Blueprint Test Bundle: Spring context service reference cardinality 0..1 bundle [jar]
[INFO] Gemini Blueprint Test Bundle: Bundle scoping test bundle - A       [jar]
[INFO] Gemini Blueprint Test Bundle: Bundle scoping test bundle - B       [jar]
[INFO] Gemini Blueprint Test Bundle: Bundle scoping test bundle - Common  [jar]
[INFO] Gemini Blueprint Test Bundle: IO fragment 1 bundle                 [jar]
[INFO] Gemini Blueprint Test Bundle: IO fragment 2 bundle                 [jar]
[INFO] Gemini Blueprint Test Bundle: Error bundle                         [jar]
[INFO] Gemini Blueprint Test Bundle: Deadlock bundle                      [jar]
[INFO] Gemini Blueprint Test Bundle: Configuration test bundle            [jar]
[INFO] Gemini Blueprint Test Bundle: ExtenderVersion-Test-Bundle          [jar]
[INFO] Gemini Blueprint Test Bundle: Integration testing bundles for configuration options [pom]
[INFO] Gemini Blueprint Test Bundle: NoPublish-Bundle                     [jar]
[INFO] Gemini Blueprint Test Bundle: Async-NoWait-Bundle                  [jar]
[INFO] Gemini Blueprint Test Bundle: Async-Wait-Bundle                    [jar]
[INFO] Gemini Blueprint Test Bundle: Sync-NoWait-Bundle                   [jar]
[INFO] Gemini Blueprint Test Bundle: Sync-Tail-Bundle                     [jar]
[INFO] Gemini Blueprint Test Bundle: Sync-Wait-Bundle                     [jar]
[INFO] Gemini Blueprint Test Bundle: Spring service TCCL management inteface test bundle [jar]
[INFO] Gemini Blueprint Test Bundle: Spring service TCCL management test bundle [jar]
[INFO] Gemini Blueprint Test Bundle: Config File With Dots bundle         [jar]
[INFO] Gemini Blueprint Test Bundle: Spring Proxy Creator bundle          [jar]
[INFO] Gemini Blueprint Test Bundle: Extender Configuration Fragment Bundle [jar]
[INFO] Gemini Blueprint Test Bundle: JDK proxy test                       [jar]
[INFO] Gemini Blueprint Test Bundle: Extender Event listener bundle Bundle [jar]
[INFO] Gemini Blueprint Test Bundle: namespace provider and consumer bundle [jar]
[INFO] Gemini Blueprint Test Bundle: Just a listener exported as a service [jar]
[INFO] Gemini Blueprint Test Bundle: Export Import Dependency Bundle      [jar]
[INFO] Eclipse Gemini Blueprint JDK5 Integration Testing Bundles          [pom]
[INFO] Gemini Blueprint Test Bundle: @Component beans bundle              [jar]
[INFO] Eclipse Gemini Blueprint Test Bundle: Recursive Type test bundle   [jar]
[INFO] Gemini Blueprint Integration Testing Bundles                       [pom]
[INFO] Eclipse Gemini Blueprint Test Bundle: Simple service test bundle   [jar]
[INFO] Eclipse Gemini Blueprint Test Bundle: Error bundle                 [jar]
[INFO] Eclipse Gemini Blueprint Test Bundle: Waiting bundle               [jar]
[INFO] Eclipse Gemini Blueprint Test Bundle: Configuration test bundle    [jar]
[INFO] Eclipse Gemini Blueprint Integration Tests                         [jar]
[INFO] 
[INFO] -----------< org.eclipse.gemini.blueprint:gemini-blueprint >------------
[INFO] Building Gemini Blueprint 3.0.0.M01-SNAPSHOT                      [1/58]
[INFO] --------------------------------[ pom ]---------------------------------
[INFO] 
[INFO] --- maven-clean-plugin:3.0.0:clean (default-clean) @ gemini-blueprint ---
[INFO] 
[INFO] --- git-commit-id-plugin:2.2.2:revision (default) @ gemini-blueprint ---
[INFO] 
[INFO] ---------< org.eclipse.gemini.blueprint:gemini-blueprint-mock >---------
[INFO] Building Gemini Blueprint Mocks 3.0.0.M01-SNAPSHOT                [2/58]
[INFO] --------------------------------[ jar ]---------------------------------
[INFO] 
[INFO] --- maven-clean-plugin:3.0.0:clean (default-clean) @ gemini-blueprint-mock ---
[INFO] 
[INFO] --- git-commit-id-plugin:2.2.2:revision (default) @ gemini-blueprint-mock ---
[INFO] 
[INFO] --- maven-resources-plugin:3.0.2:resources (default-resources) @ gemini-blueprint-mock ---
[INFO] Using 'UTF-8' encoding to copy filtered resources.
[INFO] Copying 0 resource
[INFO] 
[INFO] --- maven-compiler-plugin:3.6.1:compile (default-compile) @ gemini-blueprint-mock ---
[INFO] Changes detected - recompiling the module!
[INFO] Compiling 9 source files to /jobs/genie.gemini/gemini-blueprint-branch-integration/workspace/mock/target/classes
[INFO] /jobs/genie.gemini/gemini-blueprint-branch-integration/workspace/mock/src/main/java/org/eclipse/gemini/blueprint/mock/MockServiceReference.java: Some input files use unchecked or unsafe operations.
[INFO] /jobs/genie.gemini/gemini-blueprint-branch-integration/workspace/mock/src/main/java/org/eclipse/gemini/blueprint/mock/MockServiceReference.java: Recompile with -Xlint:unchecked for details.
[INFO] 
[INFO] --- bnd-maven-plugin:3.3.0:bnd-process (default) @ gemini-blueprint-mock ---
[WARNING] /jobs/genie.gemini/gemini-blueprint-branch-integration/workspace/mock/bnd.bnd [0:0]: No translation found for macro: git.commit.id.describe
[INFO] 
[INFO] --- maven-resources-plugin:3.0.2:testResources (default-testResources) @ gemini-blueprint-mock ---
[INFO] Using 'UTF-8' encoding to copy filtered resources.
[INFO] skip non existing resourceDirectory /jobs/genie.gemini/gemini-blueprint-branch-integration/workspace/mock/src/test/resources
[INFO] 
[INFO] --- maven-compiler-plugin:3.6.1:testCompile (default-testCompile) @ gemini-blueprint-mock ---
[INFO] Changes detected - recompiling the module!
[INFO] Compiling 7 source files to /jobs/genie.gemini/gemini-blueprint-branch-integration/workspace/mock/target/test-classes
[INFO] /jobs/genie.gemini/gemini-blueprint-branch-integration/workspace/mock/src/test/java/org/eclipse/gemini/blueprint/mock/MockBundleContextTest.java: Some input files use unchecked or unsafe operations.
[INFO] /jobs/genie.gemini/gemini-blueprint-branch-integration/workspace/mock/src/test/java/org/eclipse/gemini/blueprint/mock/MockBundleContextTest.java: Recompile with -Xlint:unchecked for details.
[INFO] 
[INFO] --- maven-surefire-plugin:2.19.1:test (default-test) @ gemini-blueprint-mock ---

-------------------------------------------------------
 T E S T S
-------------------------------------------------------
Picked up JAVA_TOOL_OPTIONS: -Xmx2G -Djava.io.tmpdir=/tmp/genie.gemini
Running org.eclipse.gemini.blueprint.mock.MockBundleContextTest
Tests run: 21, Failures: 0, Errors: 0, Skipped: 0, Time elapsed: 0.004 sec - in org.eclipse.gemini.blueprint.mock.MockBundleContextTest
Running org.eclipse.gemini.blueprint.mock.MockBundleTest
Tests run: 28, Failures: 0, Errors: 0, Skipped: 0, Time elapsed: 0.005 sec - in org.eclipse.gemini.blueprint.mock.MockBundleTest
Running org.eclipse.gemini.blueprint.mock.MockServiceRegistrationTest
Tests run: 11, Failures: 0, Errors: 0, Skipped: 0, Time elapsed: 0.016 sec - in org.eclipse.gemini.blueprint.mock.MockServiceRegistrationTest
Running org.eclipse.gemini.blueprint.mock.MockFilterTest
Tests run: 3, Failures: 0, Errors: 0, Skipped: 0, Time elapsed: 0 sec - in org.eclipse.gemini.blueprint.mock.MockFilterTest
Running org.eclipse.gemini.blueprint.mock.MockBundleActivatorTest
Tests run: 2, Failures: 0, Errors: 0, Skipped: 0, Time elapsed: 0 sec - in org.eclipse.gemini.blueprint.mock.MockBundleActivatorTest
Running org.eclipse.gemini.blueprint.mock.MockServiceReferenceTest
Tests run: 15, Failures: 0, Errors: 0, Skipped: 0, Time elapsed: 0.001 sec - in org.eclipse.gemini.blueprint.mock.MockServiceReferenceTest
Running org.eclipse.gemini.blueprint.mock.ArrayEnumeratorTest
Tests run: 4, Failures: 0, Errors: 0, Skipped: 0, Time elapsed: 0 sec - in org.eclipse.gemini.blueprint.mock.ArrayEnumeratorTest

Results :

Tests run: 84, Failures: 0, Errors: 0, Skipped: 0

[INFO] 
[INFO] --- maven-jar-plugin:3.0.2:jar (default-jar) @ gemini-blueprint-mock ---
[INFO] Building jar: /jobs/genie.gemini/gemini-blueprint-branch-integration/workspace/mock/target/gemini-blueprint-mock-3.0.0.M01-SNAPSHOT.jar
[INFO] 
[INFO] ----------< org.eclipse.gemini.blueprint:gemini-blueprint-io >----------
[INFO] Building Gemini Blueprint IO 3.0.0.M01-SNAPSHOT                   [3/58]
[INFO] --------------------------------[ jar ]---------------------------------
[INFO] 
[INFO] --- maven-clean-plugin:3.0.0:clean (default-clean) @ gemini-blueprint-io ---
[INFO] 
[INFO] --- git-commit-id-plugin:2.2.2:revision (default) @ gemini-blueprint-io ---
[INFO] 
[INFO] --- maven-resources-plugin:3.0.2:resources (default-resources) @ gemini-blueprint-io ---
[INFO] Using 'UTF-8' encoding to copy filtered resources.
[INFO] Copying 0 resource
[INFO] 
[INFO] --- maven-compiler-plugin:3.6.1:compile (default-compile) @ gemini-blueprint-io ---
[INFO] Changes detected - recompiling the module!
[INFO] Compiling 10 source files to /jobs/genie.gemini/gemini-blueprint-branch-integration/workspace/io/target/classes
[INFO] /jobs/genie.gemini/gemini-blueprint-branch-integration/workspace/io/src/main/java/org/eclipse/gemini/blueprint/io/internal/resolver/DependencyResolver.java: Some input files use or override a deprecated API.
[INFO] /jobs/genie.gemini/gemini-blueprint-branch-integration/workspace/io/src/main/java/org/eclipse/gemini/blueprint/io/internal/resolver/DependencyResolver.java: Recompile with -Xlint:deprecation for details.
[INFO] /jobs/genie.gemini/gemini-blueprint-branch-integration/workspace/io/src/main/java/org/eclipse/gemini/blueprint/io/internal/resolver/PackageAdminResolver.java: /jobs/genie.gemini/gemini-blueprint-branch-integration/workspace/io/src/main/java/org/eclipse/gemini/blueprint/io/internal/resolver/PackageAdminResolver.java uses unchecked or unsafe operations.
[INFO] /jobs/genie.gemini/gemini-blueprint-branch-integration/workspace/io/src/main/java/org/eclipse/gemini/blueprint/io/internal/resolver/PackageAdminResolver.java: Recompile with -Xlint:unchecked for details.
[INFO] 
[INFO] --- bnd-maven-plugin:3.3.0:bnd-process (default) @ gemini-blueprint-io ---
[WARNING] /jobs/genie.gemini/gemini-blueprint-branch-integration/workspace/io/bnd.bnd [0:0]: No translation found for macro: git.commit.id.describe
[INFO] 
[INFO] --- maven-resources-plugin:3.0.2:testResources (default-testResources) @ gemini-blueprint-io ---
[INFO] Using 'UTF-8' encoding to copy filtered resources.
[INFO] Copying 4 resources
[INFO] 
[INFO] --- maven-compiler-plugin:3.6.1:testCompile (default-testCompile) @ gemini-blueprint-io ---
[INFO] Changes detected - recompiling the module!
[INFO] Compiling 5 source files to /jobs/genie.gemini/gemini-blueprint-branch-integration/workspace/io/target/test-classes
[INFO] /jobs/genie.gemini/gemini-blueprint-branch-integration/workspace/io/src/test/java/org/eclipse/gemini/blueprint/io/internal/OsgiResourceUtilsTest.java: Some input files use unchecked or unsafe operations.
[INFO] /jobs/genie.gemini/gemini-blueprint-branch-integration/workspace/io/src/test/java/org/eclipse/gemini/blueprint/io/internal/OsgiResourceUtilsTest.java: Recompile with -Xlint:unchecked for details.
[INFO] 
[INFO] --- maven-surefire-plugin:2.19.1:test (default-test) @ gemini-blueprint-io ---

-------------------------------------------------------
 T E S T S
-------------------------------------------------------
Picked up JAVA_TOOL_OPTIONS: -Xmx2G -Djava.io.tmpdir=/tmp/genie.gemini
Running org.eclipse.gemini.blueprint.io.internal.OsgiHeaderUtilsTest
Tests run: 25, Failures: 0, Errors: 0, Skipped: 0, Time elapsed: 0.021 sec - in org.eclipse.gemini.blueprint.io.internal.OsgiHeaderUtilsTest
Running org.eclipse.gemini.blueprint.io.internal.OsgiResourceUtilsTest
Tests run: 22, Failures: 0, Errors: 0, Skipped: 0, Time elapsed: 0.013 sec - in org.eclipse.gemini.blueprint.io.internal.OsgiResourceUtilsTest
Running org.eclipse.gemini.blueprint.io.OsgiBundleResourcePatternResolverTest
Tests run: 3, Failures: 0, Errors: 0, Skipped: 0, Time elapsed: 0.424 sec - in org.eclipse.gemini.blueprint.io.OsgiBundleResourcePatternResolverTest
Running org.eclipse.gemini.blueprint.io.OsgiBundleResourceTest
Tests run: 25, Failures: 0, Errors: 0, Skipped: 0, Time elapsed: 0.063 sec - in org.eclipse.gemini.blueprint.io.OsgiBundleResourceTest
Running org.eclipse.gemini.blueprint.io.OsgiBundleResourceLoaderTest
Tests run: 5, Failures: 0, Errors: 0, Skipped: 0, Time elapsed: 0.002 sec - in org.eclipse.gemini.blueprint.io.OsgiBundleResourceLoaderTest

Results :

Tests run: 80, Failures: 0, Errors: 0, Skipped: 0

[INFO] 
[INFO] --- maven-jar-plugin:3.0.2:jar (default-jar) @ gemini-blueprint-io ---
[INFO] Building jar: /jobs/genie.gemini/gemini-blueprint-branch-integration/workspace/io/target/gemini-blueprint-io-3.0.0.M01-SNAPSHOT.jar
[INFO] 
[INFO] ---------< org.eclipse.gemini.blueprint:gemini-blueprint-core >---------
[INFO] Building Gemini Blueprint Core 3.0.0.M01-SNAPSHOT                 [4/58]
[INFO] --------------------------------[ jar ]---------------------------------
[INFO] 
[INFO] --- maven-clean-plugin:3.0.0:clean (default-clean) @ gemini-blueprint-core ---
[INFO] 
[INFO] --- git-commit-id-plugin:2.2.2:revision (default) @ gemini-blueprint-core ---
[INFO] 
[INFO] --- maven-resources-plugin:3.0.2:resources (default-resources) @ gemini-blueprint-core ---
[INFO] Using 'UTF-8' encoding to copy filtered resources.
[INFO] Copying 18 resources
[INFO] 
[INFO] --- maven-compiler-plugin:3.6.1:compile (default-compile) @ gemini-blueprint-core ---
[INFO] Changes detected - recompiling the module!
[INFO] Compiling 258 source files to /jobs/genie.gemini/gemini-blueprint-branch-integration/workspace/core/target/classes
[INFO] /jobs/genie.gemini/gemini-blueprint-branch-integration/workspace/core/src/main/java/org/eclipse/gemini/blueprint/blueprint/reflect/ValueFactory.java: Some input files use or override a deprecated API.
[INFO] /jobs/genie.gemini/gemini-blueprint-branch-integration/workspace/core/src/main/java/org/eclipse/gemini/blueprint/blueprint/reflect/ValueFactory.java: Recompile with -Xlint:deprecation for details.
[INFO] /jobs/genie.gemini/gemini-blueprint-branch-integration/workspace/core/src/main/java/org/eclipse/gemini/blueprint/service/importer/support/AbstractServiceProxyCreator.java: Some input files use unchecked or unsafe operations.
[INFO] /jobs/genie.gemini/gemini-blueprint-branch-integration/workspace/core/src/main/java/org/eclipse/gemini/blueprint/service/importer/support/AbstractServiceProxyCreator.java: Recompile with -Xlint:unchecked for details.
[INFO] 
[INFO] --- bnd-maven-plugin:3.3.0:bnd-process (default) @ gemini-blueprint-core ---
[WARNING] /jobs/genie.gemini/gemini-blueprint-branch-integration/workspace/core/bnd.bnd [0:0]: Version for package org.osgi.service.blueprint.container is set to different values in the source (1.0.0) and in the manifest (1.0.2). The version in the manifest is not picked up by an other sibling bundles in this project or projects that directly depend on this project
[WARNING] /jobs/genie.gemini/gemini-blueprint-branch-integration/workspace/core/bnd.bnd [0:0]: Version for package org.osgi.service.blueprint.reflect is set to different values in the source (1.0.0) and in the manifest (1.0.1). The version in the manifest is not picked up by an other sibling bundles in this project or projects that directly depend on this project
[WARNING] /jobs/genie.gemini/gemini-blueprint-branch-integration/workspace/core/bnd.bnd [0:0]: No translation found for macro: git.commit.id.describe
[INFO] 
[INFO] --- maven-resources-plugin:3.0.2:testResources (default-testResources) @ gemini-blueprint-core ---
[INFO] Using 'UTF-8' encoding to copy filtered resources.
[INFO] Copying 44 resources
[INFO] 
[INFO] --- maven-compiler-plugin:3.6.1:testCompile (default-testCompile) @ gemini-blueprint-core ---
[INFO] Changes detected - recompiling the module!
[INFO] Compiling 157 source files to /jobs/genie.gemini/gemini-blueprint-branch-integration/workspace/core/target/test-classes
[INFO] /jobs/genie.gemini/gemini-blueprint-branch-integration/workspace/core/src/test/java/org/eclipse/gemini/blueprint/context/support/internal/ScopeTests.java: Some input files use or override a deprecated API.
[INFO] /jobs/genie.gemini/gemini-blueprint-branch-integration/workspace/core/src/test/java/org/eclipse/gemini/blueprint/context/support/internal/ScopeTests.java: Recompile with -Xlint:deprecation for details.
[INFO] /jobs/genie.gemini/gemini-blueprint-branch-integration/workspace/core/src/test/java/org/eclipse/gemini/blueprint/blueprint/reflect/NestedDefinitionMetadataTest.java: Some input files use unchecked or unsafe operations.
[INFO] /jobs/genie.gemini/gemini-blueprint-branch-integration/workspace/core/src/test/java/org/eclipse/gemini/blueprint/blueprint/reflect/NestedDefinitionMetadataTest.java: Recompile with -Xlint:unchecked for details.
[INFO] 
[INFO] --- maven-surefire-plugin:2.19.1:test (default-test) @ gemini-blueprint-core ---

-------------------------------------------------------
 T E S T S
-------------------------------------------------------
Picked up JAVA_TOOL_OPTIONS: -Xmx2G -Djava.io.tmpdir=/tmp/genie.gemini
Running org.eclipse.gemini.blueprint.blueprint.config.SpringDmRfc124Test
[foo, list, reference, service, dm.exporter]
Tests run: 1, Failures: 0, Errors: 0, Skipped: 0, Time elapsed: 0.497 sec - in org.eclipse.gemini.blueprint.blueprint.config.SpringDmRfc124Test
Running org.eclipse.gemini.blueprint.blueprint.config.MixedRfc124BeansTest
The beans declared are: {simple-component, nested-bean, .org.eclipse.gemini.blueprint.blueprint.TestComponent#0, .org.eclipse.gemini.blueprint.blueprint.TestComponent#0#0, .org.eclipse.gemini.blueprint.blueprint.TestComponent#0#1, nan, char}
Tests run: 3, Failures: 0, Errors: 0, Skipped: 0, Time elapsed: 0.141 sec - in org.eclipse.gemini.blueprint.blueprint.config.MixedRfc124BeansTest
Running org.eclipse.gemini.blueprint.blueprint.config.SchemaWithLocationTest
Tests run: 1, Failures: 0, Errors: 0, Skipped: 0, Time elapsed: 0.016 sec - in org.eclipse.gemini.blueprint.blueprint.config.SchemaWithLocationTest
Running org.eclipse.gemini.blueprint.blueprint.config.ComponentElementTest
The beans declared are: {simple, depends-on, destroy-method, lazy-init, factory-method, thread, factory-component}
Tests run: 7, Failures: 0, Errors: 0, Skipped: 0, Time elapsed: 0.119 sec - in org.eclipse.gemini.blueprint.blueprint.config.ComponentElementTest
Running org.eclipse.gemini.blueprint.blueprint.config.TypeConverterTest
The beans declared are: {.org.eclipse.gemini.blueprint.blueprint.container.BlueprintConverterConfigurer#0, arrayConversion, asianCodeExample, converterB, conversion, booleanConversion, serviceReference, referenceFactory, objectToCollectionConversion1, objectToCollectionConversion2}
Tests run: 9, Failures: 0, Errors: 0, Skipped: 0, Time elapsed: 0.239 sec - in org.eclipse.gemini.blueprint.blueprint.config.TypeConverterTest
Running org.eclipse.gemini.blueprint.blueprint.config.SpringRootConfigTest
The beans declared are: {nested-bean}
Tests run: 1, Failures: 0, Errors: 0, Skipped: 0, Time elapsed: 0.012 sec - in org.eclipse.gemini.blueprint.blueprint.config.SpringRootConfigTest
Running org.eclipse.gemini.blueprint.blueprint.config.ComponentSubElementTest
2439 [main] WARN : o.s.b.GenericTypeAwarePropertyDescriptor - Invalid JavaBean property 'ambigousProp' being accessed! Ambiguous write methods found next to actually used [public void org.eclipse.gemini.blueprint.blueprint.AmbigousTestComponent.setAmbigousProp(java.lang.Object)]: [public void org.eclipse.gemini.blueprint.blueprint.AmbigousTestComponent.setAmbigousProp(int)]
Object setter called
2501 [main] WARN : o.s.b.GenericTypeAwarePropertyDescriptor - Invalid JavaBean property 'ambigousProp' being accessed! Ambiguous write methods found next to actually used [public void org.eclipse.gemini.blueprint.blueprint.AmbigousTestComponent.setAmbigousProp(java.lang.Object)]: [public void org.eclipse.gemini.blueprint.blueprint.AmbigousTestComponent.setAmbigousProp(int)]
Object setter called
2567 [main] WARN : o.s.b.GenericTypeAwarePropertyDescriptor - Invalid JavaBean property 'ambigousProp' being accessed! Ambiguous write methods found next to actually used [public void org.eclipse.gemini.blueprint.blueprint.AmbigousTestComponent.setAmbigousProp(java.lang.Object)]: [public void org.eclipse.gemini.blueprint.blueprint.AmbigousTestComponent.setAmbigousProp(int)]
Object setter called
2612 [main] WARN : o.s.b.GenericTypeAwarePropertyDescriptor - Invalid JavaBean property 'ambigousProp' being accessed! Ambiguous write methods found next to actually used [public void org.eclipse.gemini.blueprint.blueprint.AmbigousTestComponent.setAmbigousProp(java.lang.Object)]: [public void org.eclipse.gemini.blueprint.blueprint.AmbigousTestComponent.setAmbigousProp(int)]
Object setter called
2665 [main] WARN : o.s.b.GenericTypeAwarePropertyDescriptor - Invalid JavaBean property 'ambigousProp' being accessed! Ambiguous write methods found next to actually used [public void org.eclipse.gemini.blueprint.blueprint.AmbigousTestComponent.setAmbigousProp(java.lang.Object)]: [public void org.eclipse.gemini.blueprint.blueprint.AmbigousTestComponent.setAmbigousProp(int)]
Object setter called
2716 [main] WARN : o.s.b.GenericTypeAwarePropertyDescriptor - Invalid JavaBean property 'ambigousProp' being accessed! Ambiguous write methods found next to actually used [public void org.eclipse.gemini.blueprint.blueprint.AmbigousTestComponent.setAmbigousProp(java.lang.Object)]: [public void org.eclipse.gemini.blueprint.blueprint.AmbigousTestComponent.setAmbigousProp(int)]
Object setter called
2759 [main] WARN : o.s.b.GenericTypeAwarePropertyDescriptor - Invalid JavaBean property 'ambigousProp' being accessed! Ambiguous write methods found next to actually used [public void org.eclipse.gemini.blueprint.blueprint.AmbigousTestComponent.setAmbigousProp(java.lang.Object)]: [public void org.eclipse.gemini.blueprint.blueprint.AmbigousTestComponent.setAmbigousProp(int)]
Object setter called
2797 [main] WARN : o.s.b.GenericTypeAwarePropertyDescriptor - Invalid JavaBean property 'ambigousProp' being accessed! Ambiguous write methods found next to actually used [public void org.eclipse.gemini.blueprint.blueprint.AmbigousTestComponent.setAmbigousProp(java.lang.Object)]: [public void org.eclipse.gemini.blueprint.blueprint.AmbigousTestComponent.setAmbigousProp(int)]
Object setter called
2840 [main] WARN : o.s.b.GenericTypeAwarePropertyDescriptor - Invalid JavaBean property 'ambigousProp' being accessed! Ambiguous write methods found next to actually used [public void org.eclipse.gemini.blueprint.blueprint.AmbigousTestComponent.setAmbigousProp(java.lang.Object)]: [public void org.eclipse.gemini.blueprint.blueprint.AmbigousTestComponent.setAmbigousProp(int)]
Object setter called
2880 [main] WARN : o.s.b.GenericTypeAwarePropertyDescriptor - Invalid JavaBean property 'ambigousProp' being accessed! Ambiguous write methods found next to actually used [public void org.eclipse.gemini.blueprint.blueprint.AmbigousTestComponent.setAmbigousProp(java.lang.Object)]: [public void org.eclipse.gemini.blueprint.blueprint.AmbigousTestComponent.setAmbigousProp(int)]
Object setter called
2915 [main] WARN : o.s.b.GenericTypeAwarePropertyDescriptor - Invalid JavaBean property 'ambigousProp' being accessed! Ambiguous write methods found next to actually used [public void org.eclipse.gemini.blueprint.blueprint.AmbigousTestComponent.setAmbigousProp(java.lang.Object)]: [public void org.eclipse.gemini.blueprint.blueprint.AmbigousTestComponent.setAmbigousProp(int)]
Object setter called
2952 [main] WARN : o.s.b.GenericTypeAwarePropertyDescriptor - Invalid JavaBean property 'ambigousProp' being accessed! Ambiguous write methods found next to actually used [public void org.eclipse.gemini.blueprint.blueprint.AmbigousTestComponent.setAmbigousProp(java.lang.Object)]: [public void org.eclipse.gemini.blueprint.blueprint.AmbigousTestComponent.setAmbigousProp(int)]
Object setter called
3003 [main] WARN : o.s.b.GenericTypeAwarePropertyDescriptor - Invalid JavaBean property 'ambigousProp' being accessed! Ambiguous write methods found next to actually used [public void org.eclipse.gemini.blueprint.blueprint.AmbigousTestComponent.setAmbigousProp(java.lang.Object)]: [public void org.eclipse.gemini.blueprint.blueprint.AmbigousTestComponent.setAmbigousProp(int)]
Object setter called
3057 [main] WARN : o.s.b.GenericTypeAwarePropertyDescriptor - Invalid JavaBean property 'ambigousProp' being accessed! Ambiguous write methods found next to actually used [public void org.eclipse.gemini.blueprint.blueprint.AmbigousTestComponent.setAmbigousProp(java.lang.Object)]: [public void org.eclipse.gemini.blueprint.blueprint.AmbigousTestComponent.setAmbigousProp(int)]
Object setter called
org.eclipse.gemini.blueprint.blueprint.AmbigousTestComponent@293a5f75
Tests run: 14, Failures: 0, Errors: 0, Skipped: 0, Time elapsed: 0.694 sec - in org.eclipse.gemini.blueprint.blueprint.config.ComponentSubElementTest
Running org.eclipse.gemini.blueprint.blueprint.config.ConstructorInjectionTest
Tests run: 13, Failures: 0, Errors: 0, Skipped: 0, Time elapsed: 0.241 sec - in org.eclipse.gemini.blueprint.blueprint.config.ConstructorInjectionTest
Running org.eclipse.gemini.blueprint.blueprint.config.NestedElementsTest
The beans declared are: {classname, class, foo, bar}
Tests run: 1, Failures: 0, Errors: 0, Skipped: 0, Time elapsed: 0.021 sec - in org.eclipse.gemini.blueprint.blueprint.config.NestedElementsTest
Running org.eclipse.gemini.blueprint.blueprint.container.TestBlueprintBuiltinConvertersTest
class java.util.LinkedHashSet
class org.eclipse.gemini.blueprint.blueprint.MyCustomList
class java.util.ArrayList
[IntegerOne, customCollection, customMap, customDictionary, setToCollection, setToList, setToSet, setToSortedSet, setToStack, setToHashSet, setToLinkedHashSet, setToTreeSet, setToArrayList, setToLinkedList, setToVector, listToCollection, listToList, listToSet, listToSortedSet, listToStack, listToHashSet, listTolinkedHashSet, listToTreeSet, listToArrayList, listToLinkedList, listToVector, arrayToCollection, arrayToList, arrayToSet, arrayToSortedSet, arrayToStack, arrayToHashSet, arrayTolinkedHashSet, arrayToTreeSet, arrayToArrayList, arrayToLinkedList, arrayToVector, mapToHashMap, mapToTreeMap, mapToHashtable, mapToDictionary, mapToSortedMap, mapToConcurrentMap, mapToConcurrentHashMap, arrayToQueue, propertiesInjection]
Tests run: 4, Failures: 0, Errors: 0, Skipped: 0, Time elapsed: 0.128 sec - in org.eclipse.gemini.blueprint.blueprint.container.TestBlueprintBuiltinConvertersTest
Running org.eclipse.gemini.blueprint.blueprint.container.CycleTest
Tests run: 1, Failures: 0, Errors: 0, Skipped: 0, Time elapsed: 0.013 sec - in org.eclipse.gemini.blueprint.blueprint.container.CycleTest
Running org.eclipse.gemini.blueprint.blueprint.container.LazyExporterTest
[ServiceOne, ServiceOneService]
Tests run: 1, Failures: 0, Errors: 0, Skipped: 0, Time elapsed: 0.012 sec - in org.eclipse.gemini.blueprint.blueprint.container.LazyExporterTest
Running org.eclipse.gemini.blueprint.blueprint.container.BlueprintFieldsTest
applicationEventPublisher
availability
beanClassLoader
beanName
blueprintCompliant
bundleContext
class
eagerInit
filter
importContextClassLoader
interfaces
listeners
object
objectType
prototype
serviceBeanName
singleton
sticky
timeout
unifiedFilter
useBlueprintExceptions
type is boolean
Tests run: 1, Failures: 0, Errors: 0, Skipped: 0, Time elapsed: 0.004 sec - in org.eclipse.gemini.blueprint.blueprint.container.BlueprintFieldsTest
Running org.eclipse.gemini.blueprint.blueprint.container.TypeFactoryTest
Tests run: 22, Failures: 0, Errors: 0, Skipped: 0, Time elapsed: 0.01 sec - in org.eclipse.gemini.blueprint.blueprint.container.TypeFactoryTest
Running org.eclipse.gemini.blueprint.blueprint.container.GenericsTest
created {Finish=java.awt.Point[x=0,y=0], Start=java.awt.Point[x=123,y=456]}
created class java.util.concurrent.ConcurrentHashMap
created class java.util.concurrent.ConcurrentHashMap
[rawInjection, genericConversion, concurrentMap]
created {Finish=java.awt.Point[x=0,y=0], Start=java.awt.Point[x=123,y=456]}
created class java.util.concurrent.ConcurrentHashMap
created class java.util.concurrent.ConcurrentHashMap
Tests run: 2, Failures: 0, Errors: 0, Skipped: 0, Time elapsed: 0.021 sec - in org.eclipse.gemini.blueprint.blueprint.container.GenericsTest
Running org.eclipse.gemini.blueprint.blueprint.container.TestLazyBeansTest
5
dependsleaf1
dependsleaf2
lazyCollection
null
listener
[dependsleaf1, dependsleaf2, lazyCollection, listener]
Initialized
Initialized
Tests run: 2, Failures: 0, Errors: 0, Skipped: 0, Time elapsed: 0.032 sec - in org.eclipse.gemini.blueprint.blueprint.container.TestLazyBeansTest
Running org.eclipse.gemini.blueprint.blueprint.reflect.NestedDefinitionMetadataTest
Initialized
Initialized
Initialized
Initialized
Initialized
Initialized
null
null
null
.org.eclipse.gemini.blueprint.service.importer.support.OsgiServiceProxyFactoryBean#0#0
[dependsleaf1, dependsleaf2, first-level, deeply-nested, .org.eclipse.gemini.blueprint.service.importer.support.OsgiServiceCollectionProxyFactoryBean#0, nested-collection, nested-beans, .org.eclipse.gemini.blueprint.service.importer.support.OsgiServiceProxyFactoryBean#0, nested-references, .org.eclipse.gemini.blueprint.service.importer.support.OsgiServiceProxyFactoryBean#0#0]
Tests run: 6, Failures: 0, Errors: 0, Skipped: 0, Time elapsed: 0.154 sec - in org.eclipse.gemini.blueprint.blueprint.reflect.NestedDefinitionMetadataTest
Running org.eclipse.gemini.blueprint.blueprint.metadata.BundleContextApiTest
Tests run: 3, Failures: 0, Errors: 0, Skipped: 0, Time elapsed: 0.041 sec - in org.eclipse.gemini.blueprint.blueprint.metadata.BundleContextApiTest
Running org.eclipse.gemini.blueprint.blueprint.metadata.ImporterMetadataTest
Initialized
Initialized
org.eclipse.gemini.blueprint.blueprint.reflect.SimpleReferenceMetadata
Initialized
Initialized
Initialized
Initialized
Initialized
Initialized
Initialized
Initialized
Initialized
Initialized
Initialized
Initialized
Tests run: 7, Failures: 0, Errors: 0, Skipped: 0, Time elapsed: 0.172 sec - in org.eclipse.gemini.blueprint.blueprint.metadata.ImporterMetadataTest
Running org.eclipse.gemini.blueprint.blueprint.metadata.DefaultsTest
Initialized dependsleaf1
Initialized dependsleaf2
Initialized overridden-activation
Initialized
1
Initialized dependsleaf1
Initialized dependsleaf2
Initialized overridden-activation
Initialized dependsleaf1
Initialized dependsleaf2
Initialized overridden-activation
Initialized dependsleaf1
Initialized dependsleaf2
Initialized overridden-activation
Tests run: 4, Failures: 0, Errors: 0, Skipped: 0, Time elapsed: 0.074 sec - in org.eclipse.gemini.blueprint.blueprint.metadata.DefaultsTest
Running org.eclipse.gemini.blueprint.blueprint.metadata.ExporterMetadataTest
[org.eclipse.gemini.blueprint.blueprint.reflect.SimpleMapEntry@2b27cc70, org.eclipse.gemini.blueprint.blueprint.reflect.SimpleMapEntry@6f6a7463]
Tests run: 2, Failures: 0, Errors: 0, Skipped: 0, Time elapsed: 0.029 sec - in org.eclipse.gemini.blueprint.blueprint.metadata.ExporterMetadataTest
Running org.eclipse.gemini.blueprint.blueprint.metadata.ImporterCollectionsMetadataTest
Tests run: 2, Failures: 0, Errors: 0, Skipped: 0, Time elapsed: 0.03 sec - in org.eclipse.gemini.blueprint.blueprint.metadata.ImporterCollectionsMetadataTest
Running org.eclipse.gemini.blueprint.blueprint.metadata.BeanComponentMetadataTest
4103 [main] WARN : o.s.b.GenericTypeAwarePropertyDescriptor - Invalid JavaBean property 'ambigousProp' being accessed! Ambiguous write methods found next to actually used [public void org.eclipse.gemini.blueprint.blueprint.AmbigousTestComponent.setAmbigousProp(java.lang.Object)]: [public void org.eclipse.gemini.blueprint.blueprint.AmbigousTestComponent.setAmbigousProp(int)]
Object setter called
4232 [main] WARN : o.s.b.GenericTypeAwarePropertyDescriptor - Invalid JavaBean property 'ambigousProp' being accessed! Ambiguous write methods found next to actually used [public void org.eclipse.gemini.blueprint.blueprint.AmbigousTestComponent.setAmbigousProp(java.lang.Object)]: [public void org.eclipse.gemini.blueprint.blueprint.AmbigousTestComponent.setAmbigousProp(int)]
Object setter called
Param value is org.eclipse.gemini.blueprint.blueprint.reflect.SimpleValueMetadata@669d2b1b
4263 [main] WARN : o.s.b.GenericTypeAwarePropertyDescriptor - Invalid JavaBean property 'ambigousProp' being accessed! Ambiguous write methods found next to actually used [public void org.eclipse.gemini.blueprint.blueprint.AmbigousTestComponent.setAmbigousProp(java.lang.Object)]: [public void org.eclipse.gemini.blueprint.blueprint.AmbigousTestComponent.setAmbigousProp(int)]
Object setter called
[Ljava.util.Date;@341a8659
null
java.net.URL
class [Ljava.lang.Object;
[org.eclipse.gemini.blueprint.blueprint.reflect.SimpleValueMetadata@4943defe, org.eclipse.gemini.blueprint.blueprint.reflect.SimpleValueMetadata@5eefa415]
null
http://www.osgi.org
null
http://www.gmail.com
4289 [main] WARN : o.s.b.GenericTypeAwarePropertyDescriptor - Invalid JavaBean property 'ambigousProp' being accessed! Ambiguous write methods found next to actually used [public void org.eclipse.gemini.blueprint.blueprint.AmbigousTestComponent.setAmbigousProp(java.lang.Object)]: [public void org.eclipse.gemini.blueprint.blueprint.AmbigousTestComponent.setAmbigousProp(int)]
Object setter called
4314 [main] WARN : o.s.b.GenericTypeAwarePropertyDescriptor - Invalid JavaBean property 'ambigousProp' being accessed! Ambiguous write methods found next to actually used [public void org.eclipse.gemini.blueprint.blueprint.AmbigousTestComponent.setAmbigousProp(java.lang.Object)]: [public void org.eclipse.gemini.blueprint.blueprint.AmbigousTestComponent.setAmbigousProp(int)]
Object setter called
4340 [main] WARN : o.s.b.GenericTypeAwarePropertyDescriptor - Invalid JavaBean property 'ambigousProp' being accessed! Ambiguous write methods found next to actually used [public void org.eclipse.gemini.blueprint.blueprint.AmbigousTestComponent.setAmbigousProp(java.lang.Object)]: [public void org.eclipse.gemini.blueprint.blueprint.AmbigousTestComponent.setAmbigousProp(int)]
Object setter called
4365 [main] WARN : o.s.b.GenericTypeAwarePropertyDescriptor - Invalid JavaBean property 'ambigousProp' being accessed! Ambiguous write methods found next to actually used [public void org.eclipse.gemini.blueprint.blueprint.AmbigousTestComponent.setAmbigousProp(java.lang.Object)]: [public void org.eclipse.gemini.blueprint.blueprint.AmbigousTestComponent.setAmbigousProp(int)]
Object setter called
StaticFactory param 1
StaticFactory param 2
StaticFactory param 0
4391 [main] WARN : o.s.b.GenericTypeAwarePropertyDescriptor - Invalid JavaBean property 'ambigousProp' being accessed! Ambiguous write methods found next to actually used [public void org.eclipse.gemini.blueprint.blueprint.AmbigousTestComponent.setAmbigousProp(java.lang.Object)]: [public void org.eclipse.gemini.blueprint.blueprint.AmbigousTestComponent.setAmbigousProp(int)]
Object setter called
4417 [main] WARN : o.s.b.GenericTypeAwarePropertyDescriptor - Invalid JavaBean property 'ambigousProp' being accessed! Ambiguous write methods found next to actually used [public void org.eclipse.gemini.blueprint.blueprint.AmbigousTestComponent.setAmbigousProp(java.lang.Object)]: [public void org.eclipse.gemini.blueprint.blueprint.AmbigousTestComponent.setAmbigousProp(int)]
Object setter called
4442 [main] WARN : o.s.b.GenericTypeAwarePropertyDescriptor - Invalid JavaBean property 'ambigousProp' being accessed! Ambiguous write methods found next to actually used [public void org.eclipse.gemini.blueprint.blueprint.AmbigousTestComponent.setAmbigousProp(java.lang.Object)]: [public void org.eclipse.gemini.blueprint.blueprint.AmbigousTestComponent.setAmbigousProp(int)]
Object setter called
4469 [main] WARN : o.s.b.GenericTypeAwarePropertyDescriptor - Invalid JavaBean property 'ambigousProp' being accessed! Ambiguous write methods found next to actually used [public void org.eclipse.gemini.blueprint.blueprint.AmbigousTestComponent.setAmbigousProp(java.lang.Object)]: [public void org.eclipse.gemini.blueprint.blueprint.AmbigousTestComponent.setAmbigousProp(int)]
Object setter called
4494 [main] WARN : o.s.b.GenericTypeAwarePropertyDescriptor - Invalid JavaBean property 'ambigousProp' being accessed! Ambiguous write methods found next to actually used [public void org.eclipse.gemini.blueprint.blueprint.AmbigousTestComponent.setAmbigousProp(java.lang.Object)]: [public void org.eclipse.gemini.blueprint.blueprint.AmbigousTestComponent.setAmbigousProp(int)]
Object setter called
4525 [main] WARN : o.s.b.GenericTypeAwarePropertyDescriptor - Invalid JavaBean property 'ambigousProp' being accessed! Ambiguous write methods found next to actually used [public void org.eclipse.gemini.blueprint.blueprint.AmbigousTestComponent.setAmbigousProp(java.lang.Object)]: [public void org.eclipse.gemini.blueprint.blueprint.AmbigousTestComponent.setAmbigousProp(int)]
Object setter called
4560 [main] WARN : o.s.b.GenericTypeAwarePropertyDescriptor - Invalid JavaBean property 'ambigousProp' being accessed! Ambiguous write methods found next to actually used [public void org.eclipse.gemini.blueprint.blueprint.AmbigousTestComponent.setAmbigousProp(java.lang.Object)]: [public void org.eclipse.gemini.blueprint.blueprint.AmbigousTestComponent.setAmbigousProp(int)]
Object setter called
4583 [main] WARN : o.s.b.GenericTypeAwarePropertyDescriptor - Invalid JavaBean property 'ambigousProp' being accessed! Ambiguous write methods found next to actually used [public void org.eclipse.gemini.blueprint.blueprint.AmbigousTestComponent.setAmbigousProp(java.lang.Object)]: [public void org.eclipse.gemini.blueprint.blueprint.AmbigousTestComponent.setAmbigousProp(int)]
Object setter called
0.0
4607 [main] WARN : o.s.b.GenericTypeAwarePropertyDescriptor - Invalid JavaBean property 'ambigousProp' being accessed! Ambiguous write methods found next to actually used [public void org.eclipse.gemini.blueprint.blueprint.AmbigousTestComponent.setAmbigousProp(java.lang.Object)]: [public void org.eclipse.gemini.blueprint.blueprint.AmbigousTestComponent.setAmbigousProp(int)]
Object setter called
4630 [main] WARN : o.s.b.GenericTypeAwarePropertyDescriptor - Invalid JavaBean property 'ambigousProp' being accessed! Ambiguous write methods found next to actually used [public void org.eclipse.gemini.blueprint.blueprint.AmbigousTestComponent.setAmbigousProp(java.lang.Object)]: [public void org.eclipse.gemini.blueprint.blueprint.AmbigousTestComponent.setAmbigousProp(int)]
Object setter called
org.eclipse.gemini.blueprint.blueprint.reflect.SimplePropsMetadata@4fe875be
4662 [main] WARN : o.s.b.GenericTypeAwarePropertyDescriptor - Invalid JavaBean property 'ambigousProp' being accessed! Ambiguous write methods found next to actually used [public void org.eclipse.gemini.blueprint.blueprint.AmbigousTestComponent.setAmbigousProp(java.lang.Object)]: [public void org.eclipse.gemini.blueprint.blueprint.AmbigousTestComponent.setAmbigousProp(int)]
Object setter called
4685 [main] WARN : o.s.b.GenericTypeAwarePropertyDescriptor - Invalid JavaBean property 'ambigousProp' being accessed! Ambiguous write methods found next to actually used [public void org.eclipse.gemini.blueprint.blueprint.AmbigousTestComponent.setAmbigousProp(java.lang.Object)]: [public void org.eclipse.gemini.blueprint.blueprint.AmbigousTestComponent.setAmbigousProp(int)]
Object setter called
NaN
[org.eclipse.gemini.blueprint.blueprint.reflect.SimpleBeanProperty@7551da2a]
4707 [main] WARN : o.s.b.GenericTypeAwarePropertyDescriptor - Invalid JavaBean property 'ambigousProp' being accessed! Ambiguous write methods found next to actually used [public void org.eclipse.gemini.blueprint.blueprint.AmbigousTestComponent.setAmbigousProp(java.lang.Object)]: [public void org.eclipse.gemini.blueprint.blueprint.AmbigousTestComponent.setAmbigousProp(int)]
Object setter called
Param value is org.eclipse.gemini.blueprint.blueprint.reflect.SimpleValueMetadata@652ce654
Tests run: 20, Failures: 0, Errors: 0, Skipped: 0, Time elapsed: 0.641 sec - in org.eclipse.gemini.blueprint.blueprint.metadata.BeanComponentMetadataTest
Running org.eclipse.gemini.blueprint.blueprint.ReflectionTest
boolean
java.lang.Boolean
Boolean true
boolean true
Boolean true
Tests run: 1, Failures: 0, Errors: 0, Skipped: 0, Time elapsed: 0 sec - in org.eclipse.gemini.blueprint.blueprint.ReflectionTest
Running org.eclipse.gemini.blueprint.compendium.config.ManagedPropertiesTest
Tests run: 7, Failures: 0, Errors: 0, Skipped: 0, Time elapsed: 0.136 sec - in org.eclipse.gemini.blueprint.compendium.config.ManagedPropertiesTest
Running org.eclipse.gemini.blueprint.compendium.config.CmConfigAndCtxPropertiesConfigurationTest
Tests run: 1, Failures: 0, Errors: 0, Skipped: 0, Time elapsed: 0.049 sec - in org.eclipse.gemini.blueprint.compendium.config.CmConfigAndCtxPropertiesConfigurationTest
Running org.eclipse.gemini.blueprint.compendium.config.ManagedServiceFactoryTest
Tests run: 6, Failures: 0, Errors: 0, Skipped: 0, Time elapsed: 0.105 sec - in org.eclipse.gemini.blueprint.compendium.config.ManagedServiceFactoryTest
Running org.eclipse.gemini.blueprint.compendium.config.ConfigPropertiesHandlerTest
Tests run: 7, Failures: 0, Errors: 0, Skipped: 0, Time elapsed: 0.102 sec - in org.eclipse.gemini.blueprint.compendium.config.ConfigPropertiesHandlerTest
Running org.eclipse.gemini.blueprint.compendium.internal.cm.ConfigurationAdminManagerTest
Tests run: 4, Failures: 0, Errors: 0, Skipped: 0, Time elapsed: 0.001 sec - in org.eclipse.gemini.blueprint.compendium.internal.cm.ConfigurationAdminManagerTest
Running org.eclipse.gemini.blueprint.compendium.internal.cm.DefaultManagedServiceBeanManagerTest
Tests run: 9, Failures: 0, Errors: 0, Skipped: 0, Time elapsed: 0.001 sec - in org.eclipse.gemini.blueprint.compendium.internal.cm.DefaultManagedServiceBeanManagerTest
Running org.eclipse.gemini.blueprint.compendium.internal.cm.ManagedFactoryDisposableInvokerTest
Tests run: 5, Failures: 0, Errors: 0, Skipped: 0, Time elapsed: 0.003 sec - in org.eclipse.gemini.blueprint.compendium.internal.cm.ManagedFactoryDisposableInvokerTest
Running org.eclipse.gemini.blueprint.compendium.internal.cm.UpdateMethodAdapterTest
Tests run: 8, Failures: 0, Errors: 0, Skipped: 0, Time elapsed: 0.002 sec - in org.eclipse.gemini.blueprint.compendium.internal.cm.UpdateMethodAdapterTest
Running org.eclipse.gemini.blueprint.config.InvalidOsgiDefaultsTest
Tests run: 1, Failures: 0, Errors: 0, Skipped: 0, Time elapsed: 0.01 sec - in org.eclipse.gemini.blueprint.config.InvalidOsgiDefaultsTest
Running org.eclipse.gemini.blueprint.config.internal.OsgiServiceLifecycleListenerAdapterTest
5145 [main] WARN : o.e.g.b.c.i.a.CustomListenerAdapterUtils - Custom method [public void org.eclipse.gemini.blueprint.config.internal.OsgiServiceLifecycleListenerAdapterTest$ExceptionCustomListener.myBind(java.util.Date,java.util.Map)] threw exception when passing service [java.util.Date@41bf79da]
org.eclipse.gemini.blueprint.config.internal.OsgiServiceLifecycleListenerAdapterTest$ExceptionCustomListener$1: expected!
5148 [main] WARN : o.e.g.b.c.i.a.OsgiServiceLifecycleListenerAdapter - standard bind method on [org.eclipse.gemini.blueprint.config.internal.OsgiServiceLifecycleListenerAdapterTest$ExceptionListener] threw exception
org.eclipse.gemini.blueprint.config.internal.OsgiServiceLifecycleListenerAdapterTest$ExceptionListener$1: expected!
5148 [main] WARN : o.e.g.b.c.i.a.OsgiServiceLifecycleListenerAdapter - Standard unbind method on [org.eclipse.gemini.blueprint.config.internal.OsgiServiceLifecycleListenerAdapterTest$ExceptionListener] threw exception
org.eclipse.gemini.blueprint.config.internal.OsgiServiceLifecycleListenerAdapterTest$ExceptionListener$2: expected!
Tests run: 18, Failures: 0, Errors: 0, Skipped: 0, Time elapsed: 0.017 sec - in org.eclipse.gemini.blueprint.config.internal.OsgiServiceLifecycleListenerAdapterTest
Running org.eclipse.gemini.blueprint.config.internal.OsgiServiceRegistrationListenerAdapterTest
5159 [main] WARN : o.e.g.b.c.i.a.OsgiServiceRegistrationListenerAdapter - Standard registered method on [org.eclipse.gemini.blueprint.config.internal.OsgiServiceRegistrationListenerAdapterTest$ExceptionListener] threw exception
org.eclipse.gemini.blueprint.config.internal.OsgiServiceRegistrationListenerAdapterTest$ExceptionListener$1: expected!
5159 [main] WARN : o.e.g.b.c.i.a.OsgiServiceRegistrationListenerAdapter - Standard unregistered method on [org.eclipse.gemini.blueprint.config.internal.OsgiServiceRegistrationListenerAdapterTest$ExceptionListener] threw exception
org.eclipse.gemini.blueprint.config.internal.OsgiServiceRegistrationListenerAdapterTest$ExceptionListener$2: expected!
Tests run: 15, Failures: 0, Errors: 0, Skipped: 0, Time elapsed: 0.007 sec - in org.eclipse.gemini.blueprint.config.internal.OsgiServiceRegistrationListenerAdapterTest
Running org.eclipse.gemini.blueprint.config.OsgiSingleReferenceParserWithInvalidFilesTest
Tests run: 3, Failures: 0, Errors: 0, Skipped: 0, Time elapsed: 0.026 sec - in org.eclipse.gemini.blueprint.config.OsgiSingleReferenceParserWithInvalidFilesTest
Running org.eclipse.gemini.blueprint.config.BundleFactoryBeanParserTest
Tests run: 8, Failures: 0, Errors: 0, Skipped: 0, Time elapsed: 0.088 sec - in org.eclipse.gemini.blueprint.config.BundleFactoryBeanParserTest
Running org.eclipse.gemini.blueprint.config.OsgiReferenceNamespaceHandlerTest
Tests run: 4, Failures: 0, Errors: 0, Skipped: 0, Time elapsed: 0.072 sec - in org.eclipse.gemini.blueprint.config.OsgiReferenceNamespaceHandlerTest
Running org.eclipse.gemini.blueprint.config.NestedReferencesTest
Tests run: 5, Failures: 0, Errors: 0, Skipped: 0, Time elapsed: 0.151 sec - in org.eclipse.gemini.blueprint.config.NestedReferencesTest
Running org.eclipse.gemini.blueprint.config.OsgiServiceNamespaceHandlerTest
string bean
Tests run: 9, Failures: 0, Errors: 0, Skipped: 0, Time elapsed: 0.222 sec - in org.eclipse.gemini.blueprint.config.OsgiServiceNamespaceHandlerTest
Running org.eclipse.gemini.blueprint.config.OsgiReferenceCollectionNamespaceHandlerTest
Tests run: 10, Failures: 0, Errors: 0, Skipped: 0, Time elapsed: 0.142 sec - in org.eclipse.gemini.blueprint.config.OsgiReferenceCollectionNamespaceHandlerTest
Running org.eclipse.gemini.blueprint.context.support.ConfigLocationsTest
Tests run: 1, Failures: 0, Errors: 0, Skipped: 0, Time elapsed: 0.002 sec - in org.eclipse.gemini.blueprint.context.support.ConfigLocationsTest
Running org.eclipse.gemini.blueprint.context.support.AbstractRefreshableOsgiBundleApplicationContextTest
Tests run: 2, Failures: 0, Errors: 0, Skipped: 0, Time elapsed: 0.431 sec - in org.eclipse.gemini.blueprint.context.support.AbstractRefreshableOsgiBundleApplicationContextTest
Running org.eclipse.gemini.blueprint.context.support.AbstractBundleXmlApplicationContextTest
Tests run: 3, Failures: 0, Errors: 0, Skipped: 0, Time elapsed: 0.005 sec - in org.eclipse.gemini.blueprint.context.support.AbstractBundleXmlApplicationContextTest
Running org.eclipse.gemini.blueprint.context.OsgiBundleScopeTest
Tests run: 4, Failures: 0, Errors: 0, Skipped: 0, Time elapsed: 0 sec - in org.eclipse.gemini.blueprint.context.OsgiBundleScopeTest
Running org.eclipse.gemini.blueprint.context.internal.classloader.ChainedClassLoaderTest
Tests run: 7, Failures: 0, Errors: 0, Skipped: 0, Time elapsed: 0 sec - in org.eclipse.gemini.blueprint.context.internal.classloader.ChainedClassLoaderTest
Running org.eclipse.gemini.blueprint.internal.context.support.OsgiReferenceToServiceReferenceConversionTest
Tests run: 2, Failures: 0, Errors: 0, Skipped: 0, Time elapsed: 0.058 sec - in org.eclipse.gemini.blueprint.internal.context.support.OsgiReferenceToServiceReferenceConversionTest
Running org.eclipse.gemini.blueprint.internal.service.collection.DynamicCollectionIteratorTest
Tests run: 17, Failures: 0, Errors: 0, Skipped: 0, Time elapsed: 0.001 sec - in org.eclipse.gemini.blueprint.internal.service.collection.DynamicCollectionIteratorTest
Running org.eclipse.gemini.blueprint.internal.service.collection.WeakCollectionTest
Tests run: 2, Failures: 0, Errors: 0, Skipped: 0, Time elapsed: 0.273 sec - in org.eclipse.gemini.blueprint.internal.service.collection.WeakCollectionTest
Running org.eclipse.gemini.blueprint.internal.service.collection.DynamicCollectionTest
Tests run: 4, Failures: 0, Errors: 0, Skipped: 0, Time elapsed: 0 sec - in org.eclipse.gemini.blueprint.internal.service.collection.DynamicCollectionTest
Running org.eclipse.gemini.blueprint.internal.service.collection.OsgiServiceSetTest
given classes {interface org.eclipse.gemini.blueprint.internal.service.collection.AbstractOsgiCollectionTest$Wrapper, interface java.lang.Comparable} | resulting classes {interface org.eclipse.gemini.blueprint.internal.service.collection.AbstractOsgiCollectionTest$Wrapper, interface java.lang.Comparable, interface org.eclipse.gemini.blueprint.service.importer.ImportedOsgiServiceProxy, interface org.springframework.aop.SpringProxy}
given classes {interface org.eclipse.gemini.blueprint.internal.service.collection.AbstractOsgiCollectionTest$Wrapper, interface java.lang.Comparable} | resulting classes {interface org.eclipse.gemini.blueprint.internal.service.collection.AbstractOsgiCollectionTest$Wrapper, interface java.lang.Comparable, interface org.eclipse.gemini.blueprint.service.importer.ImportedOsgiServiceProxy, interface org.springframework.aop.SpringProxy}
given classes {interface org.eclipse.gemini.blueprint.internal.service.collection.AbstractOsgiCollectionTest$Wrapper, interface java.lang.Comparable} | resulting classes {interface org.eclipse.gemini.blueprint.internal.service.collection.AbstractOsgiCollectionTest$Wrapper, interface java.lang.Comparable, interface org.eclipse.gemini.blueprint.service.importer.ImportedOsgiServiceProxy, interface org.springframework.aop.SpringProxy}
given classes {interface org.eclipse.gemini.blueprint.internal.service.collection.AbstractOsgiCollectionTest$Wrapper, interface java.lang.Comparable} | resulting classes {interface org.eclipse.gemini.blueprint.internal.service.collection.AbstractOsgiCollectionTest$Wrapper, interface java.lang.Comparable, interface org.eclipse.gemini.blueprint.service.importer.ImportedOsgiServiceProxy, interface org.springframework.aop.SpringProxy}
Tests run: 4, Failures: 0, Errors: 0, Skipped: 0, Time elapsed: 0.005 sec - in org.eclipse.gemini.blueprint.internal.service.collection.OsgiServiceSetTest
Running org.eclipse.gemini.blueprint.internal.service.collection.threading.DynamicCollectionThreadingTest
thread Writer is waiting for time 20
thread Iter1 is waiting for time 40
thread Iter2 is waiting for time 10
thread Iter1 is in state WAITING
thread Iter2 is in state WAITING
thread Writer is in state WAITING
thread Iter1 is in state WAITING
thread Iter2 is in state WAITING
thread Writer is in state WAITING
Time is now 10
Releasing thread Iter2 at time 10
thread Iter2 is waiting for time 30
thread Iter1 is waiting for time 40
thread Writer is waiting for time 20
thread Iter1 is in state WAITING
thread Iter2 is in state WAITING
thread Writer is in state WAITING
thread Iter1 is in state WAITING
thread Iter2 is in state WAITING
thread Writer is in state WAITING
Time is now 20
Releasing thread Writer at time 20
thread Iter1 is waiting for time 40
thread Writer is waiting for time 50
thread Iter2 is waiting for time 30
thread Iter1 is in state WAITING
thread Iter2 is in state WAITING
thread Writer is in state WAITING
thread Iter1 is in state WAITING
thread Iter2 is in state WAITING
thread Writer is in state WAITING
Time is now 30
Releasing thread Iter2 at time 30
thread Writer is waiting for time 50
thread Iter1 is waiting for time 40
thread Iter2 is waiting for time 70
thread Iter1 is in state WAITING
thread Iter2 is in state WAITING
thread Writer is in state WAITING
thread Iter1 is in state WAITING
thread Iter2 is in state WAITING
thread Writer is in state WAITING
Time is now 40
thread Iter2 is waiting for time 70
Releasing thread Iter1 at time 40
thread Writer is waiting for time 50
thread Iter1 is waiting for time 60
thread Iter1 is in state WAITING
thread Iter2 is in state WAITING
thread Writer is in state WAITING
thread Iter1 is in state WAITING
thread Iter2 is in state WAITING
thread Writer is in state WAITING
Time is now 50
thread Iter1 is waiting for time 60
Releasing thread Writer at time 50
thread Iter2 is waiting for time 70
thread Iter1 is in state WAITING
thread Iter2 is in state WAITING
thread Iter1 is in state WAITING
thread Iter2 is in state WAITING
Time is now 60
thread Iter2 is waiting for time 70
Releasing thread Iter1 at time 60
thread Iter2 is in state WAITING
thread Iter2 is in state WAITING
Time is now 70
Releasing thread Iter2 at time 70
thread Writer is waiting for time 20
thread Iter1 is waiting for time 40
thread Iter2 is waiting for time 10
thread Iter1 is in state WAITING
thread Iter2 is in state WAITING
thread Writer is in state WAITING
thread Iter1 is in state WAITING
thread Iter2 is in state WAITING
thread Writer is in state WAITING
Time is now 10
Releasing thread Iter2 at time 10
thread Iter2 is waiting for time 30
thread Iter1 is waiting for time 40
thread Writer is waiting for time 20
thread Iter1 is in state WAITING
thread Iter2 is in state WAITING
thread Writer is in state WAITING
thread Iter1 is in state WAITING
thread Iter2 is in state WAITING
thread Writer is in state WAITING
Time is now 20
Releasing thread Writer at time 20
thread Writer is waiting for time 50
thread Iter1 is waiting for time 40
thread Iter2 is waiting for time 30
thread Iter1 is in state WAITING
thread Iter2 is in state WAITING
thread Writer is in state WAITING
thread Iter1 is in state WAITING
thread Iter2 is in state WAITING
thread Writer is in state WAITING
Time is now 30
Releasing thread Iter2 at time 30
thread Iter1 is waiting for time 40
thread Writer is waiting for time 50
thread Iter2 is waiting for time 70
thread Iter1 is in state WAITING
thread Iter2 is in state WAITING
thread Writer is in state WAITING
thread Iter1 is in state WAITING
thread Iter2 is in state WAITING
thread Writer is in state WAITING
Time is now 40
thread Iter2 is waiting for time 70
thread Writer is waiting for time 50
Releasing thread Iter1 at time 40
thread Iter1 is waiting for time 60
thread Iter1 is in state WAITING
thread Iter2 is in state WAITING
thread Writer is in state WAITING
thread Iter1 is in state WAITING
thread Iter2 is in state WAITING
thread Writer is in state WAITING
Time is now 50
thread Iter1 is waiting for time 60
Releasing thread Writer at time 50
thread Iter2 is waiting for time 70
thread Iter1 is in state WAITING
thread Iter2 is in state WAITING
thread Iter1 is in state WAITING
thread Iter2 is in state WAITING
Time is now 60
thread Iter2 is waiting for time 70
Releasing thread Iter1 at time 60
thread Iter2 is in state WAITING
thread Iter2 is in state WAITING
Time is now 70
Releasing thread Iter2 at time 70
thread Writer is waiting for time 20
thread Iter1 is waiting for time 40
thread Iter2 is waiting for time 10
thread Iter1 is in state WAITING
thread Iter2 is in state WAITING
thread Writer is in state WAITING
thread Iter1 is in state WAITING
thread Iter2 is in state WAITING
thread Writer is in state WAITING
Time is now 10
Releasing thread Iter2 at time 10
thread Iter2 is waiting for time 30
thread Iter1 is waiting for time 40
thread Writer is waiting for time 20
thread Iter1 is in state WAITING
thread Iter2 is in state WAITING
thread Writer is in state WAITING
thread Iter1 is in state WAITING
thread Iter2 is in state WAITING
thread Writer is in state WAITING
Time is now 20
Releasing thread Writer at time 20
thread Writer is waiting for time 50
thread Iter1 is waiting for time 40
thread Iter2 is waiting for time 30
thread Iter1 is in state WAITING
thread Iter2 is in state WAITING
thread Writer is in state WAITING
thread Iter1 is in state WAITING
thread Iter2 is in state WAITING
thread Writer is in state WAITING
Time is now 30
Releasing thread Iter2 at time 30
thread Iter2 is waiting for time 70
thread Iter1 is waiting for time 40
thread Writer is waiting for time 50
thread Iter1 is in state WAITING
thread Iter2 is in state WAITING
thread Writer is in state WAITING
thread Iter1 is in state WAITING
thread Iter2 is in state WAITING
thread Writer is in state WAITING
Time is now 40
thread Writer is waiting for time 50
Releasing thread Iter1 at time 40
thread Iter2 is waiting for time 70
thread Iter1 is waiting for time 60
thread Iter1 is in state WAITING
thread Iter2 is in state WAITING
thread Writer is in state WAITING
thread Iter1 is in state WAITING
thread Iter2 is in state WAITING
thread Writer is in state WAITING
Time is now 50
thread Iter1 is waiting for time 60
thread Iter2 is waiting for time 70
Releasing thread Writer at time 50
thread Iter1 is in state WAITING
thread Iter2 is in state WAITING
thread Iter1 is in state WAITING
thread Iter2 is in state WAITING
Time is now 60
thread Iter2 is waiting for time 70
Releasing thread Iter1 at time 60
thread Iter2 is in state WAITING
thread Iter2 is in state WAITING
Time is now 70
Releasing thread Iter2 at time 70
Tests run: 1, Failures: 0, Errors: 0, Skipped: 0, Time elapsed: 0.465 sec - in org.eclipse.gemini.blueprint.internal.service.collection.threading.DynamicCollectionThreadingTest
Running org.eclipse.gemini.blueprint.internal.service.collection.OsgiServiceListTest
given classes {interface org.eclipse.gemini.blueprint.internal.service.collection.AbstractOsgiCollectionTest$Wrapper, interface java.lang.Comparable} | resulting classes {interface org.eclipse.gemini.blueprint.internal.service.collection.AbstractOsgiCollectionTest$Wrapper, interface java.lang.Comparable, interface org.eclipse.gemini.blueprint.service.importer.ImportedOsgiServiceProxy, interface org.springframework.aop.SpringProxy}
given classes {interface org.eclipse.gemini.blueprint.internal.service.collection.AbstractOsgiCollectionTest$Wrapper, interface java.lang.Comparable} | resulting classes {interface org.eclipse.gemini.blueprint.internal.service.collection.AbstractOsgiCollectionTest$Wrapper, interface java.lang.Comparable, interface org.eclipse.gemini.blueprint.service.importer.ImportedOsgiServiceProxy, interface org.springframework.aop.SpringProxy}
given classes {interface org.eclipse.gemini.blueprint.internal.service.collection.AbstractOsgiCollectionTest$Wrapper, interface java.lang.Comparable} | resulting classes {interface org.eclipse.gemini.blueprint.internal.service.collection.AbstractOsgiCollectionTest$Wrapper, interface java.lang.Comparable, interface org.eclipse.gemini.blueprint.service.importer.ImportedOsgiServiceProxy, interface org.springframework.aop.SpringProxy}
given classes {interface org.eclipse.gemini.blueprint.internal.service.collection.AbstractOsgiCollectionTest$Wrapper, interface java.lang.Comparable} | resulting classes {interface org.eclipse.gemini.blueprint.internal.service.collection.AbstractOsgiCollectionTest$Wrapper, interface java.lang.Comparable, interface org.eclipse.gemini.blueprint.service.importer.ImportedOsgiServiceProxy, interface org.springframework.aop.SpringProxy}
Tests run: 4, Failures: 0, Errors: 0, Skipped: 0, Time elapsed: 0.004 sec - in org.eclipse.gemini.blueprint.internal.service.collection.OsgiServiceListTest
Running org.eclipse.gemini.blueprint.internal.service.collection.DynamicSetTest
Tests run: 7, Failures: 0, Errors: 0, Skipped: 0, Time elapsed: 0.001 sec - in org.eclipse.gemini.blueprint.internal.service.collection.DynamicSetTest
Running org.eclipse.gemini.blueprint.internal.service.collection.OsgiServiceCollectionTest
given classes {interface org.eclipse.gemini.blueprint.internal.service.collection.AbstractOsgiCollectionTest$Wrapper, interface java.lang.Comparable} | resulting classes {interface org.eclipse.gemini.blueprint.internal.service.collection.AbstractOsgiCollectionTest$Wrapper, interface java.lang.Comparable, interface org.eclipse.gemini.blueprint.service.importer.ImportedOsgiServiceProxy, interface org.springframework.aop.SpringProxy}
given classes {interface org.eclipse.gemini.blueprint.internal.service.collection.AbstractOsgiCollectionTest$Wrapper, interface java.lang.Comparable} | resulting classes {interface org.eclipse.gemini.blueprint.internal.service.collection.AbstractOsgiCollectionTest$Wrapper, interface java.lang.Comparable, interface org.eclipse.gemini.blueprint.service.importer.ImportedOsgiServiceProxy, interface org.springframework.aop.SpringProxy}
given classes {interface org.eclipse.gemini.blueprint.internal.service.collection.AbstractOsgiCollectionTest$Wrapper, interface java.lang.Comparable} | resulting classes {interface org.eclipse.gemini.blueprint.internal.service.collection.AbstractOsgiCollectionTest$Wrapper, interface java.lang.Comparable, interface org.eclipse.gemini.blueprint.service.importer.ImportedOsgiServiceProxy, interface org.springframework.aop.SpringProxy}
given classes {interface org.eclipse.gemini.blueprint.internal.service.collection.AbstractOsgiCollectionTest$Wrapper, interface java.lang.Comparable} | resulting classes {interface org.eclipse.gemini.blueprint.internal.service.collection.AbstractOsgiCollectionTest$Wrapper, interface java.lang.Comparable, interface org.eclipse.gemini.blueprint.service.importer.ImportedOsgiServiceProxy, interface org.springframework.aop.SpringProxy}
Tests run: 4, Failures: 0, Errors: 0, Skipped: 0, Time elapsed: 0.002 sec - in org.eclipse.gemini.blueprint.internal.service.collection.OsgiServiceCollectionTest
Running org.eclipse.gemini.blueprint.internal.service.collection.ServiceReferenceComparatorTest
Tests run: 6, Failures: 0, Errors: 0, Skipped: 0, Time elapsed: 0 sec - in org.eclipse.gemini.blueprint.internal.service.collection.ServiceReferenceComparatorTest
Running org.eclipse.gemini.blueprint.internal.service.collection.DynamicListTest
Tests run: 11, Failures: 0, Errors: 0, Skipped: 0, Time elapsed: 0 sec - in org.eclipse.gemini.blueprint.internal.service.collection.DynamicListTest
Running org.eclipse.gemini.blueprint.internal.service.collection.OsgiServiceSortedListTest
given classes {interface org.eclipse.gemini.blueprint.internal.service.collection.AbstractOsgiCollectionTest$Wrapper, interface java.lang.Comparable} | resulting classes {interface org.eclipse.gemini.blueprint.internal.service.collection.AbstractOsgiCollectionTest$Wrapper, interface java.lang.Comparable, interface org.eclipse.gemini.blueprint.service.importer.ImportedOsgiServiceProxy, interface org.springframework.aop.SpringProxy}
given classes {interface org.eclipse.gemini.blueprint.internal.service.collection.AbstractOsgiCollectionTest$Wrapper, interface java.lang.Comparable} | resulting classes {interface org.eclipse.gemini.blueprint.internal.service.collection.AbstractOsgiCollectionTest$Wrapper, interface java.lang.Comparable, interface org.eclipse.gemini.blueprint.service.importer.ImportedOsgiServiceProxy, interface org.springframework.aop.SpringProxy}
given classes {interface org.eclipse.gemini.blueprint.internal.service.collection.AbstractOsgiCollectionTest$Wrapper, interface java.lang.Comparable} | resulting classes {interface org.eclipse.gemini.blueprint.internal.service.collection.AbstractOsgiCollectionTest$Wrapper, interface java.lang.Comparable, interface org.eclipse.gemini.blueprint.service.importer.ImportedOsgiServiceProxy, interface org.springframework.aop.SpringProxy}
given classes {interface org.eclipse.gemini.blueprint.internal.service.collection.AbstractOsgiCollectionTest$Wrapper, interface java.lang.Comparable} | resulting classes {interface org.eclipse.gemini.blueprint.internal.service.collection.AbstractOsgiCollectionTest$Wrapper, interface java.lang.Comparable, interface org.eclipse.gemini.blueprint.service.importer.ImportedOsgiServiceProxy, interface org.springframework.aop.SpringProxy}
given classes {interface org.eclipse.gemini.blueprint.internal.service.collection.AbstractOsgiCollectionTest$Wrapper, interface java.lang.Comparable} | resulting classes {interface org.eclipse.gemini.blueprint.internal.service.collection.AbstractOsgiCollectionTest$Wrapper, interface java.lang.Comparable, interface org.eclipse.gemini.blueprint.service.importer.ImportedOsgiServiceProxy, interface org.springframework.aop.SpringProxy}
given classes {interface org.eclipse.gemini.blueprint.internal.service.collection.AbstractOsgiCollectionTest$Wrapper, interface java.lang.Comparable} | resulting classes {interface org.eclipse.gemini.blueprint.internal.service.collection.AbstractOsgiCollectionTest$Wrapper, interface java.lang.Comparable, interface org.eclipse.gemini.blueprint.service.importer.ImportedOsgiServiceProxy, interface org.springframework.aop.SpringProxy}
Tests run: 6, Failures: 0, Errors: 0, Skipped: 0, Time elapsed: 0.003 sec - in org.eclipse.gemini.blueprint.internal.service.collection.OsgiServiceSortedListTest
Running org.eclipse.gemini.blueprint.internal.service.collection.DynamicSortedSetIteratorTest
Tests run: 5, Failures: 0, Errors: 0, Skipped: 0, Time elapsed: 0 sec - in org.eclipse.gemini.blueprint.internal.service.collection.DynamicSortedSetIteratorTest
Running org.eclipse.gemini.blueprint.internal.service.collection.DynamicSortedSetTest
Tests run: 11, Failures: 0, Errors: 0, Skipped: 0, Time elapsed: 0.002 sec - in org.eclipse.gemini.blueprint.internal.service.collection.DynamicSortedSetTest
Running org.eclipse.gemini.blueprint.internal.service.collection.OsgiServiceSortedSetTest
given classes {interface org.eclipse.gemini.blueprint.internal.service.collection.AbstractOsgiCollectionTest$Wrapper, interface java.lang.Comparable} | resulting classes {interface org.eclipse.gemini.blueprint.internal.service.collection.AbstractOsgiCollectionTest$Wrapper, interface java.lang.Comparable, interface org.eclipse.gemini.blueprint.service.importer.ImportedOsgiServiceProxy, interface org.springframework.aop.SpringProxy}
given classes {interface org.eclipse.gemini.blueprint.internal.service.collection.AbstractOsgiCollectionTest$Wrapper, interface java.lang.Comparable} | resulting classes {interface org.eclipse.gemini.blueprint.internal.service.collection.AbstractOsgiCollectionTest$Wrapper, interface java.lang.Comparable, interface org.eclipse.gemini.blueprint.service.importer.ImportedOsgiServiceProxy, interface org.springframework.aop.SpringProxy}
given classes {interface org.eclipse.gemini.blueprint.internal.service.collection.AbstractOsgiCollectionTest$Wrapper, interface java.lang.Comparable} | resulting classes {interface org.eclipse.gemini.blueprint.internal.service.collection.AbstractOsgiCollectionTest$Wrapper, interface java.lang.Comparable, interface org.eclipse.gemini.blueprint.service.importer.ImportedOsgiServiceProxy, interface org.springframework.aop.SpringProxy}
given classes {interface org.eclipse.gemini.blueprint.internal.service.collection.AbstractOsgiCollectionTest$Wrapper, interface java.lang.Comparable} | resulting classes {interface org.eclipse.gemini.blueprint.internal.service.collection.AbstractOsgiCollectionTest$Wrapper, interface java.lang.Comparable, interface org.eclipse.gemini.blueprint.service.importer.ImportedOsgiServiceProxy, interface org.springframework.aop.SpringProxy}
Tests run: 4, Failures: 0, Errors: 0, Skipped: 0, Time elapsed: 0.003 sec - in org.eclipse.gemini.blueprint.internal.service.collection.OsgiServiceSortedSetTest
Running org.eclipse.gemini.blueprint.internal.service.collection.DynamicSetIteratorTest
Tests run: 4, Failures: 0, Errors: 0, Skipped: 0, Time elapsed: 0 sec - in org.eclipse.gemini.blueprint.internal.service.collection.DynamicSetIteratorTest
Running org.eclipse.gemini.blueprint.internal.service.interceptor.OsgiServiceDynamicInterceptorListenerTest
Tests run: 6, Failures: 0, Errors: 0, Skipped: 0, Time elapsed: 0 sec - in org.eclipse.gemini.blueprint.internal.service.interceptor.OsgiServiceDynamicInterceptorListenerTest
Running org.eclipse.gemini.blueprint.internal.service.interceptor.OsgiServiceDynamicInterceptorTest
Tests run: 8, Failures: 0, Errors: 0, Skipped: 0, Time elapsed: 3 sec - in org.eclipse.gemini.blueprint.internal.service.interceptor.OsgiServiceDynamicInterceptorTest
Running org.eclipse.gemini.blueprint.internal.service.interceptor.OsgiServiceInvokerTest
Tests run: 2, Failures: 0, Errors: 0, Skipped: 0, Time elapsed: 0 sec - in org.eclipse.gemini.blueprint.internal.service.interceptor.OsgiServiceInvokerTest
Running org.eclipse.gemini.blueprint.internal.service.interceptor.OsgiServiceStaticInterceptorTest
Tests run: 3, Failures: 0, Errors: 0, Skipped: 0, Time elapsed: 0.002 sec - in org.eclipse.gemini.blueprint.internal.service.interceptor.OsgiServiceStaticInterceptorTest
Running org.eclipse.gemini.blueprint.internal.service.interceptor.OsgiServiceDynamicInterceptorSyntheticEventsTest
Tests run: 3, Failures: 0, Errors: 0, Skipped: 0, Time elapsed: 0.001 sec - in org.eclipse.gemini.blueprint.internal.service.interceptor.OsgiServiceDynamicInterceptorSyntheticEventsTest
Running org.eclipse.gemini.blueprint.internal.service.interceptor.RetryTemplateTest
About to reset template...
Resetted template...
About to reset template...
Resetted template...
Tests run: 4, Failures: 0, Errors: 0, Skipped: 0, Time elapsed: 13.613 sec - in org.eclipse.gemini.blueprint.internal.service.interceptor.RetryTemplateTest
Running org.eclipse.gemini.blueprint.internal.util.BeanFactoryUtilsTest
Tests run: 11, Failures: 0, Errors: 0, Skipped: 0, Time elapsed: 0.008 sec - in org.eclipse.gemini.blueprint.internal.util.BeanFactoryUtilsTest
Running org.eclipse.gemini.blueprint.util.internal.ServiceReferenceBasedMapTest
Tests run: 8, Failures: 0, Errors: 0, Skipped: 0, Time elapsed: 0.044 sec - in org.eclipse.gemini.blueprint.util.internal.ServiceReferenceBasedMapTest
Running org.eclipse.gemini.blueprint.util.SimpleLoggerTest
Tests run: 18, Failures: 0, Errors: 0, Skipped: 0, Time elapsed: 0.017 sec - in org.eclipse.gemini.blueprint.util.SimpleLoggerTest
Running org.eclipse.gemini.blueprint.util.OsgiStringUtilsTest
Tests run: 13, Failures: 0, Errors: 0, Skipped: 0, Time elapsed: 0.001 sec - in org.eclipse.gemini.blueprint.util.OsgiStringUtilsTest
Running org.eclipse.gemini.blueprint.util.DebugUtilsTest
Tests run: 7, Failures: 0, Errors: 0, Skipped: 0, Time elapsed: 0.001 sec - in org.eclipse.gemini.blueprint.util.DebugUtilsTest
Running org.eclipse.gemini.blueprint.util.BundleDelegatingClassLoaderTest
Tests run: 7, Failures: 0, Errors: 0, Skipped: 0, Time elapsed: 0.005 sec - in org.eclipse.gemini.blueprint.util.BundleDelegatingClassLoaderTest
Running org.eclipse.gemini.blueprint.util.ClassUtilsTest
Tests run: 6, Failures: 0, Errors: 0, Skipped: 0, Time elapsed: 0.005 sec - in org.eclipse.gemini.blueprint.util.ClassUtilsTest
Running org.eclipse.gemini.blueprint.util.OsgiPlatformDetectorTest
Tests run: 3, Failures: 0, Errors: 0, Skipped: 0, Time elapsed: 0 sec - in org.eclipse.gemini.blueprint.util.OsgiPlatformDetectorTest
Running org.eclipse.gemini.blueprint.util.OsgiBundleUtilsTest
Tests run: 2, Failures: 0, Errors: 0, Skipped: 0, Time elapsed: 0 sec - in org.eclipse.gemini.blueprint.util.OsgiBundleUtilsTest
Running org.eclipse.gemini.blueprint.util.MapBasedDictionaryTest
Tests run: 18, Failures: 0, Errors: 0, Skipped: 0, Time elapsed: 0.001 sec - in org.eclipse.gemini.blueprint.util.MapBasedDictionaryTest
Running org.eclipse.gemini.blueprint.util.OsgiListenerUtilsTest
Tests run: 3, Failures: 0, Errors: 0, Skipped: 0, Time elapsed: 0 sec - in org.eclipse.gemini.blueprint.util.OsgiListenerUtilsTest
Running org.eclipse.gemini.blueprint.ThreadTest
Tests run: 1, Failures: 0, Errors: 0, Skipped: 0, Time elapsed: 0.992 sec - in org.eclipse.gemini.blueprint.ThreadTest
Running org.eclipse.gemini.blueprint.service.importer.OsgiServiceCollectionProxyFactoryBeanTest
Tests run: 4, Failures: 0, Errors: 0, Skipped: 0, Time elapsed: 0.004 sec - in org.eclipse.gemini.blueprint.service.importer.OsgiServiceCollectionProxyFactoryBeanTest
Running org.eclipse.gemini.blueprint.service.importer.support.internal.aop.SwappingServiceReferenceProxyTest
Tests run: 19, Failures: 0, Errors: 0, Skipped: 0, Time elapsed: 0.002 sec - in org.eclipse.gemini.blueprint.service.importer.support.internal.aop.SwappingServiceReferenceProxyTest
Running org.eclipse.gemini.blueprint.service.importer.support.InfrastructureProxyTest
Tests run: 2, Failures: 0, Errors: 0, Skipped: 0, Time elapsed: 0.001 sec - in org.eclipse.gemini.blueprint.service.importer.support.InfrastructureProxyTest
Running org.eclipse.gemini.blueprint.service.importer.support.LocalBundleContextAdviceTest
Tests run: 1, Failures: 0, Errors: 0, Skipped: 0, Time elapsed: 0 sec - in org.eclipse.gemini.blueprint.service.importer.support.LocalBundleContextAdviceTest
Running org.eclipse.gemini.blueprint.service.importer.support.GreedyProxyTest
Tests run: 7, Failures: 0, Errors: 0, Skipped: 0, Time elapsed: 0.001 sec - in org.eclipse.gemini.blueprint.service.importer.support.GreedyProxyTest
Running org.eclipse.gemini.blueprint.service.importer.support.OsgiServiceProxyEqualityTest
Tests run: 10, Failures: 0, Errors: 0, Skipped: 0, Time elapsed: 0.007 sec - in org.eclipse.gemini.blueprint.service.importer.support.OsgiServiceProxyEqualityTest
Running org.eclipse.gemini.blueprint.service.importer.support.OsgiServiceCollectionProxiesTest
Tests run: 8, Failures: 0, Errors: 0, Skipped: 0, Time elapsed: 0.003 sec - in org.eclipse.gemini.blueprint.service.importer.support.OsgiServiceCollectionProxiesTest
Running org.eclipse.gemini.blueprint.service.importer.ServiceProxyDestroyedExceptionTest
Tests run: 4, Failures: 0, Errors: 0, Skipped: 0, Time elapsed: 0.001 sec - in org.eclipse.gemini.blueprint.service.importer.ServiceProxyDestroyedExceptionTest
Running org.eclipse.gemini.blueprint.service.importer.OsgiSingleServiceProxyFactoryBeanTest
24895 [main] WARN : o.e.g.b.s.i.s.AbstractOsgiServiceImportFactoryBean - OSGi importer [] definition contains no interfaces: all invocations will be executed on the proxy and not on the backing service
Tests run: 8, Failures: 0, Errors: 0, Skipped: 0, Time elapsed: 0.005 sec - in org.eclipse.gemini.blueprint.service.importer.OsgiSingleServiceProxyFactoryBeanTest
Running org.eclipse.gemini.blueprint.service.ServiceUnavailableExceptionTest
Tests run: 6, Failures: 0, Errors: 0, Skipped: 0, Time elapsed: 0 sec - in org.eclipse.gemini.blueprint.service.ServiceUnavailableExceptionTest
Running org.eclipse.gemini.blueprint.service.exporter.support.internal.support.ServiceRegistrationWrapperTest
Tests run: 5, Failures: 0, Errors: 0, Skipped: 0, Time elapsed: 0.001 sec - in org.eclipse.gemini.blueprint.service.exporter.support.internal.support.ServiceRegistrationWrapperTest
Running org.eclipse.gemini.blueprint.service.exporter.support.OsgiServiceFactoryBeanTest
Tests run: 24, Failures: 0, Errors: 0, Skipped: 0, Time elapsed: 0.011 sec - in org.eclipse.gemini.blueprint.service.exporter.support.OsgiServiceFactoryBeanTest
Running org.eclipse.gemini.blueprint.service.exporter.support.AbstractListenerAwareExporterTest
Tests run: 2, Failures: 0, Errors: 0, Skipped: 0, Time elapsed: 0 sec - in org.eclipse.gemini.blueprint.service.exporter.support.AbstractListenerAwareExporterTest
Running org.eclipse.gemini.blueprint.service.exporter.BeanNameServicePropertiesResolverTest
Tests run: 2, Failures: 0, Errors: 0, Skipped: 0, Time elapsed: 0 sec - in org.eclipse.gemini.blueprint.service.exporter.BeanNameServicePropertiesResolverTest
Running org.eclipse.gemini.blueprint.service.ServiceExceptionTest
Tests run: 4, Failures: 0, Errors: 0, Skipped: 0, Time elapsed: 0 sec - in org.eclipse.gemini.blueprint.service.ServiceExceptionTest
Running org.eclipse.gemini.blueprint.service.OsgiServiceUtilsTest
Tests run: 3, Failures: 0, Errors: 0, Skipped: 0, Time elapsed: 0.001 sec - in org.eclipse.gemini.blueprint.service.OsgiServiceUtilsTest
Running org.eclipse.gemini.blueprint.service.OsgiServiceReferenceUtilsTest
Tests run: 8, Failures: 0, Errors: 0, Skipped: 0, Time elapsed: 0 sec - in org.eclipse.gemini.blueprint.service.OsgiServiceReferenceUtilsTest
Running org.eclipse.gemini.blueprint.service.OsgiFilterUtilsTest
Tests run: 16, Failures: 0, Errors: 0, Skipped: 0, Time elapsed: 0.003 sec - in org.eclipse.gemini.blueprint.service.OsgiFilterUtilsTest
Running org.eclipse.gemini.blueprint.OsgiExceptionTest
Tests run: 4, Failures: 0, Errors: 0, Skipped: 0, Time elapsed: 0.043 sec - in org.eclipse.gemini.blueprint.OsgiExceptionTest
Running org.eclipse.gemini.blueprint.DictionaryEditorTest
Tests run: 2, Failures: 0, Errors: 0, Skipped: 0, Time elapsed: 0 sec - in org.eclipse.gemini.blueprint.DictionaryEditorTest

Results :

Tests run: 619, Failures: 0, Errors: 0, Skipped: 0

[INFO] 
[INFO] --- maven-jar-plugin:3.0.2:jar (default-jar) @ gemini-blueprint-core ---
[INFO] Building jar: /jobs/genie.gemini/gemini-blueprint-branch-integration/workspace/core/target/gemini-blueprint-core-3.0.0.M01-SNAPSHOT.jar
[INFO] 
[INFO] -------< org.eclipse.gemini.blueprint:gemini-blueprint-extender >-------
[INFO] Building Gemini Blueprint Extender 3.0.0.M01-SNAPSHOT             [5/58]
[INFO] --------------------------------[ jar ]---------------------------------
[INFO] 
[INFO] --- maven-clean-plugin:3.0.0:clean (default-clean) @ gemini-blueprint-extender ---
[INFO] 
[INFO] --- git-commit-id-plugin:2.2.2:revision (default) @ gemini-blueprint-extender ---
[INFO] 
[INFO] --- maven-resources-plugin:3.0.2:resources (default-resources) @ gemini-blueprint-extender ---
[INFO] Using 'UTF-8' encoding to copy filtered resources.
[INFO] Copying 1 resource
[INFO] 
[INFO] --- maven-compiler-plugin:3.6.1:compile (default-compile) @ gemini-blueprint-extender ---
[INFO] Changes detected - recompiling the module!
[INFO] Compiling 58 source files to /jobs/genie.gemini/gemini-blueprint-branch-integration/workspace/extender/target/classes
[INFO] /jobs/genie.gemini/gemini-blueprint-branch-integration/workspace/extender/src/main/java/org/eclipse/gemini/blueprint/extender/event/BootstrappingDependencyEvent.java: Some input files use or override a deprecated API.
[INFO] /jobs/genie.gemini/gemini-blueprint-branch-integration/workspace/extender/src/main/java/org/eclipse/gemini/blueprint/extender/event/BootstrappingDependencyEvent.java: Recompile with -Xlint:deprecation for details.
[INFO] /jobs/genie.gemini/gemini-blueprint-branch-integration/workspace/extender/src/main/java/org/eclipse/gemini/blueprint/extender/internal/blueprint/activator/BlueprintListenerManager.java: Some input files use unchecked or unsafe operations.
[INFO] /jobs/genie.gemini/gemini-blueprint-branch-integration/workspace/extender/src/main/java/org/eclipse/gemini/blueprint/extender/internal/blueprint/activator/BlueprintListenerManager.java: Recompile with -Xlint:unchecked for details.
[INFO] 
[INFO] --- bnd-maven-plugin:3.3.0:bnd-process (default) @ gemini-blueprint-extender ---
[WARNING] /jobs/genie.gemini/gemini-blueprint-branch-integration/workspace/extender/bnd.bnd [0:0]: Unused Import-Package instructions: [org.aopalliance.*, org.eclipse.gemini.blueprint.blueprint.*] 
[WARNING] /jobs/genie.gemini/gemini-blueprint-branch-integration/workspace/extender/bnd.bnd [0:0]: No translation found for macro: git.commit.id.describe
[INFO] 
[INFO] --- maven-resources-plugin:3.0.2:testResources (default-testResources) @ gemini-blueprint-extender ---
[INFO] Using 'UTF-8' encoding to copy filtered resources.
[INFO] Copying 11 resources
[INFO] 
[INFO] --- maven-compiler-plugin:3.6.1:testCompile (default-testCompile) @ gemini-blueprint-extender ---
[INFO] Changes detected - recompiling the module!
[INFO] Compiling 24 source files to /jobs/genie.gemini/gemini-blueprint-branch-integration/workspace/extender/target/test-classes
[INFO] /jobs/genie.gemini/gemini-blueprint-branch-integration/workspace/extender/src/test/java/org/eclipse/gemini/blueprint/extender/internal/activator/ListListenerAdapterTest.java: /jobs/genie.gemini/gemini-blueprint-branch-integration/workspace/extender/src/test/java/org/eclipse/gemini/blueprint/extender/internal/activator/ListListenerAdapterTest.java uses or overrides a deprecated API.
[INFO] /jobs/genie.gemini/gemini-blueprint-branch-integration/workspace/extender/src/test/java/org/eclipse/gemini/blueprint/extender/internal/activator/ListListenerAdapterTest.java: Recompile with -Xlint:deprecation for details.
[INFO] /jobs/genie.gemini/gemini-blueprint-branch-integration/workspace/extender/src/test/java/org/eclipse/gemini/blueprint/extender/internal/util/ConfigUtilsVersioningTest.java: Some input files use unchecked or unsafe operations.
[INFO] /jobs/genie.gemini/gemini-blueprint-branch-integration/workspace/extender/src/test/java/org/eclipse/gemini/blueprint/extender/internal/util/ConfigUtilsVersioningTest.java: Recompile with -Xlint:unchecked for details.
[INFO] 
[INFO] --- maven-surefire-plugin:2.19.1:test (default-test) @ gemini-blueprint-extender ---

-------------------------------------------------------
 T E S T S
-------------------------------------------------------
Picked up JAVA_TOOL_OPTIONS: -Xmx2G -Djava.io.tmpdir=/tmp/genie.gemini
Running org.eclipse.gemini.blueprint.extender.internal.support.ApplicationContextConfigurationTest
Tests run: 11, Failures: 3, Errors: 0, Skipped: 0, Time elapsed: 1.004 sec <<< FAILURE! - in org.eclipse.gemini.blueprint.extender.internal.support.ApplicationContextConfigurationTest
testBundleWithWaitForEver(org.eclipse.gemini.blueprint.extender.internal.support.ApplicationContextConfigurationTest)  Time elapsed: 0.337 sec  <<< FAILURE!
junit.framework.AssertionFailedError: bundle should timeout -2 (indicates forever) expected:<-2> but was:<300000>
	at org.eclipse.gemini.blueprint.extender.internal.support.ApplicationContextConfigurationTest.testBundleWithWaitForEver(ApplicationContextConfigurationTest.java:104)

testBundleWithWaitFiveSecondWaitForTimeout(org.eclipse.gemini.blueprint.extender.internal.support.ApplicationContextConfigurationTest)  Time elapsed: 0.002 sec  <<< FAILURE!
junit.framework.AssertionFailedError: bundle should timeout in 5 s expected:<5000> but was:<300000>
	at org.eclipse.gemini.blueprint.extender.internal.support.ApplicationContextConfigurationTest.testBundleWithWaitFiveSecondWaitForTimeout(ApplicationContextConfigurationTest.java:92)

testSetCreateAsynchronouslyFalse(org.eclipse.gemini.blueprint.extender.internal.support.ApplicationContextConfigurationTest)  Time elapsed: 0.002 sec  <<< FAILURE!
junit.framework.AssertionFailedError: bundle should have create-asynchronously = false
	at org.eclipse.gemini.blueprint.extender.internal.support.ApplicationContextConfigurationTest.testSetCreateAsynchronouslyFalse(ApplicationContextConfigurationTest.java:242)

Running org.eclipse.gemini.blueprint.extender.internal.support.NamespacePluginsTest
Tests run: 5, Failures: 0, Errors: 0, Skipped: 0, Time elapsed: 0.015 sec - in org.eclipse.gemini.blueprint.extender.internal.support.NamespacePluginsTest
Running org.eclipse.gemini.blueprint.extender.internal.support.ExtenderConfigurationCustomSettingsTest
WARN [org.eclipse.gemini.blueprint.extender.internal.support.ExtenderConfiguration] - Gemini Blueprint extensions bundle not present, annotation processing disabled.
WARN [org.eclipse.gemini.blueprint.extender.internal.support.ExtenderConfiguration] - Gemini Blueprint extensions bundle not present, annotation processing disabled.
WARN [org.eclipse.gemini.blueprint.extender.internal.support.ExtenderConfiguration] - Gemini Blueprint extensions bundle not present, annotation processing disabled.
WARN [org.eclipse.gemini.blueprint.extender.internal.support.ExtenderConfiguration] - Gemini Blueprint extensions bundle not present, annotation processing disabled.
WARN [org.eclipse.gemini.blueprint.extender.internal.support.ExtenderConfiguration] - Gemini Blueprint extensions bundle not present, annotation processing disabled.
WARN [org.eclipse.gemini.blueprint.extender.internal.support.ExtenderConfiguration] - Gemini Blueprint extensions bundle not present, annotation processing disabled.
WARN [org.eclipse.gemini.blueprint.extender.internal.support.ExtenderConfiguration] - Gemini Blueprint extensions bundle not present, annotation processing disabled.
WARN [org.eclipse.gemini.blueprint.extender.internal.support.ExtenderConfiguration] - Gemini Blueprint extensions bundle not present, annotation processing disabled.
WARN [org.eclipse.gemini.blueprint.extender.internal.support.ExtenderConfiguration] - Gemini Blueprint extensions bundle not present, annotation processing disabled.
WARN [org.eclipse.gemini.blueprint.extender.internal.support.ExtenderConfiguration] - Gemini Blueprint extensions bundle not present, annotation processing disabled.
Tests run: 10, Failures: 0, Errors: 0, Skipped: 0, Time elapsed: 0.739 sec - in org.eclipse.gemini.blueprint.extender.internal.support.ExtenderConfigurationCustomSettingsTest
Running org.eclipse.gemini.blueprint.extender.internal.support.ExtenderConfigurationDefaultSettingsTest
WARN [org.eclipse.gemini.blueprint.extender.internal.support.ExtenderConfiguration] - Gemini Blueprint extensions bundle not present, annotation processing disabled.
WARN [org.eclipse.gemini.blueprint.extender.internal.support.ExtenderConfiguration] - Gemini Blueprint extensions bundle not present, annotation processing disabled.
WARN [org.eclipse.gemini.blueprint.extender.internal.support.ExtenderConfiguration] - Gemini Blueprint extensions bundle not present, annotation processing disabled.
WARN [org.eclipse.gemini.blueprint.extender.internal.support.ExtenderConfiguration] - Gemini Blueprint extensions bundle not present, annotation processing disabled.
WARN [org.eclipse.gemini.blueprint.extender.internal.support.ExtenderConfiguration] - Gemini Blueprint extensions bundle not present, annotation processing disabled.
WARN [org.eclipse.gemini.blueprint.extender.internal.support.ExtenderConfiguration] - Gemini Blueprint extensions bundle not present, annotation processing disabled.
WARN [org.eclipse.gemini.blueprint.extender.internal.support.ExtenderConfiguration] - Gemini Blueprint extensions bundle not present, annotation processing disabled.
WARN [org.eclipse.gemini.blueprint.extender.internal.support.ExtenderConfiguration] - Gemini Blueprint extensions bundle not present, annotation processing disabled.
WARN [org.eclipse.gemini.blueprint.extender.internal.support.ExtenderConfiguration] - Gemini Blueprint extensions bundle not present, annotation processing disabled.
WARN [org.eclipse.gemini.blueprint.extender.internal.support.ExtenderConfiguration] - Gemini Blueprint extensions bundle not present, annotation processing disabled.
WARN [org.eclipse.gemini.blueprint.extender.internal.support.ExtenderConfiguration] - Gemini Blueprint extensions bundle not present, annotation processing disabled.
WARN [org.eclipse.gemini.blueprint.extender.internal.support.ExtenderConfiguration] - Gemini Blueprint extensions bundle not present, annotation processing disabled.
WARN [org.eclipse.gemini.blueprint.extender.internal.support.ExtenderConfiguration] - Gemini Blueprint extensions bundle not present, annotation processing disabled.
WARN [org.eclipse.gemini.blueprint.extender.internal.support.ExtenderConfiguration] - Gemini Blueprint extensions bundle not present, annotation processing disabled.
WARN [org.eclipse.gemini.blueprint.extender.internal.support.ExtenderConfiguration] - Gemini Blueprint extensions bundle not present, annotation processing disabled.
WARN [org.eclipse.gemini.blueprint.extender.internal.support.ExtenderConfiguration] - Gemini Blueprint extensions bundle not present, annotation processing disabled.
WARN [org.eclipse.gemini.blueprint.extender.internal.support.ExtenderConfiguration] - Gemini Blueprint extensions bundle not present, annotation processing disabled.
WARN [org.eclipse.gemini.blueprint.extender.internal.support.ExtenderConfiguration] - Gemini Blueprint extensions bundle not present, annotation processing disabled.
WARN [org.eclipse.gemini.blueprint.extender.internal.support.ExtenderConfiguration] - Gemini Blueprint extensions bundle not present, annotation processing disabled.
WARN [org.eclipse.gemini.blueprint.extender.internal.support.ExtenderConfiguration] - Gemini Blueprint extensions bundle not present, annotation processing disabled.
Tests run: 10, Failures: 0, Errors: 0, Skipped: 0, Time elapsed: 0.078 sec - in org.eclipse.gemini.blueprint.extender.internal.support.ExtenderConfigurationDefaultSettingsTest
Running org.eclipse.gemini.blueprint.extender.internal.activator.GenericsTest
Tests run: 4, Failures: 0, Errors: 0, Skipped: 0, Time elapsed: 0.045 sec - in org.eclipse.gemini.blueprint.extender.internal.activator.GenericsTest
Running org.eclipse.gemini.blueprint.extender.internal.activator.LifecycleManagerTest
ERROR [org.eclipse.gemini.blueprint.extender.internal.activator.LifecycleManager] - JUnit test context context shutdown failed.
java.lang.RuntimeException: THIS IS AN EXPECTED TEST EXCEPTION
	at org.eclipse.gemini.blueprint.extender.internal.activator.LifecycleManager.closeApplicationContext(LifecycleManager.java:331) ~[classes/:na]
	at org.eclipse.gemini.blueprint.extender.internal.activator.LifecycleManager.access$200(LifecycleManager.java:50) ~[classes/:na]
	at org.eclipse.gemini.blueprint.extender.internal.activator.LifecycleManager$2.run(LifecycleManager.java:296) ~[classes/:na]
	at org.eclipse.gemini.blueprint.extender.internal.activator.LifecycleManager.maybeClose(LifecycleManager.java:309) ~[classes/:na]
	at org.eclipse.gemini.blueprint.extender.internal.activator.LifecycleManagerTest.shutdownContext(LifecycleManagerTest.java:179) [test-classes/:na]
	at org.eclipse.gemini.blueprint.extender.internal.activator.LifecycleManagerTest.testFailingSynchronousShutdown(LifecycleManagerTest.java:110) [test-classes/:na]
	at sun.reflect.NativeMethodAccessorImpl.invoke0(Native Method) ~[na:1.8.0_162]
	at sun.reflect.NativeMethodAccessorImpl.invoke(NativeMethodAccessorImpl.java:62) ~[na:1.8.0_162]
	at sun.reflect.DelegatingMethodAccessorImpl.invoke(DelegatingMethodAccessorImpl.java:43) ~[na:1.8.0_162]
	at java.lang.reflect.Method.invoke(Method.java:498) ~[na:1.8.0_162]
	at org.junit.runners.model.FrameworkMethod$1.runReflectiveCall(FrameworkMethod.java:50) [org.apache.servicemix.bundles.junit-4.12_1.jar:na]
	at org.junit.internal.runners.model.ReflectiveCallable.run(ReflectiveCallable.java:12) [org.apache.servicemix.bundles.junit-4.12_1.jar:na]
	at org.junit.runners.model.FrameworkMethod.invokeExplosively(FrameworkMethod.java:47) [org.apache.servicemix.bundles.junit-4.12_1.jar:na]
	at org.junit.internal.runners.statements.InvokeMethod.evaluate(InvokeMethod.java:17) [org.apache.servicemix.bundles.junit-4.12_1.jar:na]
	at org.junit.internal.runners.statements.RunBefores.evaluate(RunBefores.java:26) [org.apache.servicemix.bundles.junit-4.12_1.jar:na]
	at org.junit.runners.ParentRunner.runLeaf(ParentRunner.java:325) [org.apache.servicemix.bundles.junit-4.12_1.jar:na]
	at org.junit.runners.BlockJUnit4ClassRunner.runChild(BlockJUnit4ClassRunner.java:78) [org.apache.servicemix.bundles.junit-4.12_1.jar:na]
	at org.junit.runners.BlockJUnit4ClassRunner.runChild(BlockJUnit4ClassRunner.java:57) [org.apache.servicemix.bundles.junit-4.12_1.jar:na]
	at org.junit.runners.ParentRunner$3.run(ParentRunner.java:290) [org.apache.servicemix.bundles.junit-4.12_1.jar:na]
	at org.junit.runners.ParentRunner$1.schedule(ParentRunner.java:71) [org.apache.servicemix.bundles.junit-4.12_1.jar:na]
	at org.junit.runners.ParentRunner.runChildren(ParentRunner.java:288) [org.apache.servicemix.bundles.junit-4.12_1.jar:na]
	at org.junit.runners.ParentRunner.access$000(ParentRunner.java:58) [org.apache.servicemix.bundles.junit-4.12_1.jar:na]
	at org.junit.runners.ParentRunner$2.evaluate(ParentRunner.java:268) [org.apache.servicemix.bundles.junit-4.12_1.jar:na]
	at org.junit.runners.ParentRunner.run(ParentRunner.java:363) [org.apache.servicemix.bundles.junit-4.12_1.jar:na]
	at org.mockito.internal.runners.JUnit45AndHigherRunnerImpl.run(JUnit45AndHigherRunnerImpl.java:37) [mockito-all-1.9.5.jar:na]
	at org.mockito.runners.MockitoJUnitRunner.run(MockitoJUnitRunner.java:62) [mockito-all-1.9.5.jar:na]
	at org.junit.runners.Suite.runChild(Suite.java:128) [org.apache.servicemix.bundles.junit-4.12_1.jar:na]
	at org.junit.runners.Suite.runChild(Suite.java:27) [org.apache.servicemix.bundles.junit-4.12_1.jar:na]
	at org.junit.runners.ParentRunner$3.run(ParentRunner.java:290) [org.apache.servicemix.bundles.junit-4.12_1.jar:na]
	at org.junit.runners.ParentRunner$1.schedule(ParentRunner.java:71) [org.apache.servicemix.bundles.junit-4.12_1.jar:na]
	at org.junit.runners.ParentRunner.runChildren(ParentRunner.java:288) [org.apache.servicemix.bundles.junit-4.12_1.jar:na]
	at org.junit.runners.ParentRunner.access$000(ParentRunner.java:58) [org.apache.servicemix.bundles.junit-4.12_1.jar:na]
	at org.junit.runners.ParentRunner$2.evaluate(ParentRunner.java:268) [org.apache.servicemix.bundles.junit-4.12_1.jar:na]
	at org.junit.runners.ParentRunner.run(ParentRunner.java:363) [org.apache.servicemix.bundles.junit-4.12_1.jar:na]
	at org.apache.maven.surefire.junitcore.JUnitCore.run(JUnitCore.java:55) [surefire-junit47-2.19.1.jar:2.19.1]
	at org.apache.maven.surefire.junitcore.JUnitCoreWrapper.createRequestAndRun(JUnitCoreWrapper.java:137) [surefire-junit47-2.19.1.jar:2.19.1]
	at org.apache.maven.surefire.junitcore.JUnitCoreWrapper.executeEager(JUnitCoreWrapper.java:107) [surefire-junit47-2.19.1.jar:2.19.1]
	at org.apache.maven.surefire.junitcore.JUnitCoreWrapper.execute(JUnitCoreWrapper.java:83) [surefire-junit47-2.19.1.jar:2.19.1]
	at org.apache.maven.surefire.junitcore.JUnitCoreWrapper.execute(JUnitCoreWrapper.java:75) [surefire-junit47-2.19.1.jar:2.19.1]
	at org.apache.maven.surefire.junitcore.JUnitCoreProvider.invoke(JUnitCoreProvider.java:161) [surefire-junit47-2.19.1.jar:2.19.1]
	at org.apache.maven.surefire.booter.ForkedBooter.invokeProviderInSameClassLoader(ForkedBooter.java:290) [surefire-booter-2.19.1.jar:2.19.1]
	at org.apache.maven.surefire.booter.ForkedBooter.runSuitesInProcess(ForkedBooter.java:242) [surefire-booter-2.19.1.jar:2.19.1]
	at org.apache.maven.surefire.booter.ForkedBooter.main(ForkedBooter.java:121) [surefire-booter-2.19.1.jar:2.19.1]
Exception in thread "Thread for runnable [org.eclipse.gemini.blueprint.extender.internal.util.concurrent.RunnableTimedExecution$MonitoredRunnable@4ae9cfc1]" Tests run: 7, Failures: 0, Errors: 0, Skipped: 0, Time elapsed: 0.039 sec - in org.eclipse.gemini.blueprint.extender.internal.activator.LifecycleManagerTest
Running org.eclipse.gemini.blueprint.extender.internal.activator.support.BlueprintConfigUtilsTest
java.lang.RuntimeException: THIS IS AN EXPECTED TEST EXCEPTION
	at org.eclipse.gemini.blueprint.extender.internal.activator.LifecycleManager.closeApplicationContext(LifecycleManager.java:331)
	at org.eclipse.gemini.blueprint.extender.internal.activator.LifecycleManager.access$200(LifecycleManager.java:50)
	at org.eclipse.gemini.blueprint.extender.internal.activator.LifecycleManager$2.run(LifecycleManager.java:296)
	at org.eclipse.gemini.blueprint.extender.internal.util.concurrent.RunnableTimedExecution$MonitoredRunnable.run(RunnableTimedExecution.java:55)Tests run: 3, Failures: 0, Errors: 0, Skipped: 0, Time elapsed: 0.001 sec - in org.eclipse.gemini.blueprint.extender.internal.activator.support.BlueprintConfigUtilsTest

Running org.eclipse.gemini.blueprint.extender.internal.activator.ListListenerAdapterTest
	at java.lang.Thread.run(Thread.java:748)
Tests run: 2, Failures: 0, Errors: 0, Skipped: 0, Time elapsed: 0.004 sec - in org.eclipse.gemini.blueprint.extender.internal.activator.ListListenerAdapterTest
Running org.eclipse.gemini.blueprint.extender.internal.util.ConfigUtilsVersioningTest
Tests run: 10, Failures: 0, Errors: 0, Skipped: 0, Time elapsed: 0.002 sec - in org.eclipse.gemini.blueprint.extender.internal.util.ConfigUtilsVersioningTest
Running org.eclipse.gemini.blueprint.extender.internal.util.HeaderConstantsTest
Tests run: 5, Failures: 0, Errors: 0, Skipped: 0, Time elapsed: 0 sec - in org.eclipse.gemini.blueprint.extender.internal.util.HeaderConstantsTest
Running org.eclipse.gemini.blueprint.extender.internal.util.concurrent.RunnableTimedExecutionTest
ERROR [org.eclipse.gemini.blueprint.extender.internal.util.concurrent.RunnableTimedExecution] - org.eclipse.gemini.blueprint.extender.internal.util.concurrent.RunnableTimedExecutionTest$2@265adfad did not finish in 10ms; consider taking a snapshot and then shutdown the VM in case the thread still hangs
Tests run: 2, Failures: 0, Errors: 0, Skipped: 0, Time elapsed: 0.011 sec - in org.eclipse.gemini.blueprint.extender.internal.util.concurrent.RunnableTimedExecutionTest
Running org.eclipse.gemini.blueprint.extender.internal.util.ConfigUtilsTest
Tests run: 6, Failures: 0, Errors: 1, Skipped: 0, Time elapsed: 0.001 sec <<< FAILURE! - in org.eclipse.gemini.blueprint.extender.internal.util.ConfigUtilsTest
testGetCompletelyEmptySpringContextHeader(org.eclipse.gemini.blueprint.extender.internal.util.ConfigUtilsTest)  Time elapsed: 0 sec  <<< ERROR!
java.lang.NullPointerException
	at org.eclipse.gemini.blueprint.extender.internal.util.ConfigUtilsTest.testGetCompletelyEmptySpringContextHeader(ConfigUtilsTest.java:43)

Running org.eclipse.gemini.blueprint.extender.internal.dependencies.BlueprintShutdownSorterTest
Tests run: 4, Failures: 0, Errors: 0, Skipped: 0, Time elapsed: 0.062 sec - in org.eclipse.gemini.blueprint.extender.internal.dependencies.BlueprintShutdownSorterTest
Running org.eclipse.gemini.blueprint.extender.internal.BlueprintLoaderListenerTest
Tests run: 1, Failures: 0, Errors: 0, Skipped: 0, Time elapsed: 0.087 sec - in org.eclipse.gemini.blueprint.extender.internal.BlueprintLoaderListenerTest
Running org.eclipse.gemini.blueprint.extender.internal.blueprint.support.BlueprintConfigUtilsTest
™
Tests run: 7, Failures: 0, Errors: 0, Skipped: 0, Time elapsed: 0.002 sec - in org.eclipse.gemini.blueprint.extender.internal.blueprint.support.BlueprintConfigUtilsTest

Results :

Failed tests: 
  ApplicationContextConfigurationTest.testBundleWithWaitFiveSecondWaitForTimeout:92 bundle should timeout in 5 s expected:<5000> but was:<300000>
  ApplicationContextConfigurationTest.testBundleWithWaitForEver:104 bundle should timeout -2 (indicates forever) expected:<-2> but was:<300000>
  ApplicationContextConfigurationTest.testSetCreateAsynchronouslyFalse:242 bundle should have create-asynchronously = false
Tests in error: 
  ConfigUtilsTest.testGetCompletelyEmptySpringContextHeader:43 NullPointer

Tests run: 87, Failures: 3, Errors: 1, Skipped: 0

[INFO] ------------------------------------------------------------------------
[INFO] Reactor Summary:
[INFO] 
[INFO] Gemini Blueprint 3.0.0.M01-SNAPSHOT ................ SUCCESS [  0.988 s]
[INFO] Gemini Blueprint Mocks ............................. SUCCESS [  5.848 s]
[INFO] Gemini Blueprint IO ................................ SUCCESS [  2.616 s]
[INFO] Gemini Blueprint Core .............................. SUCCESS [ 32.437 s]
[INFO] Gemini Blueprint Extender .......................... FAILURE [  4.616 s]
[INFO] Gemini Blueprint Extensions ........................ SKIPPED
[INFO] Gemini Blueprint Testing Framework ................. SKIPPED
[INFO] Eclipse Gemini Blueprint Integration Tests Parent .. SKIPPED
[INFO] Eclipse Gemini Blueprint Integration Testing Bundles SKIPPED
[INFO] Gemini Blueprint Test Bundle: Simple service test bundle SKIPPED
[INFO] Gemini Blueprint Test Bundle: Simple service test bundle (impl differs) SKIPPED
[INFO] Gemini Blueprint Test Bundle: Simple service test bundle (impl differs) SKIPPED
[INFO] Gemini Blueprint Test Bundle: Simple service test bundle 2 SKIPPED
[INFO] Gemini Blueprint Test Bundle: Simple service test bundle 3 SKIPPED
[INFO] Gemini Blueprint Test Bundle: Simple service created by a factory which has a non trivial delay in createObject() SKIPPED
[INFO] Gemini Blueprint Test Bundle: Trivial OSGi bundle .. SKIPPED
[INFO] Gemini Blueprint Test Bundle: Simple test that uses trivial bundle SKIPPED
[INFO] Gemini Blueprint Test Bundle: Spring context lifecycle test bundle SKIPPED
[INFO] Gemini Blueprint Test Bundle: Spring context service listener test bundle SKIPPED
[INFO] Gemini Blueprint Test Bundle: Spring context service reference lifecycle test bundle SKIPPED
[INFO] Gemini Blueprint Test Bundle: Spring context service reference destruction test bundle SKIPPED
[INFO] Gemini Blueprint Test Bundle: Spring context dependencies test bundle SKIPPED
[INFO] Gemini Blueprint Test Bundle: Spring context service reference cardinality 0..1 bundle SKIPPED
[INFO] Gemini Blueprint Test Bundle: Bundle scoping test bundle - A SKIPPED
[INFO] Gemini Blueprint Test Bundle: Bundle scoping test bundle - B SKIPPED
[INFO] Gemini Blueprint Test Bundle: Bundle scoping test bundle - Common SKIPPED
[INFO] Gemini Blueprint Test Bundle: IO fragment 1 bundle . SKIPPED
[INFO] Gemini Blueprint Test Bundle: IO fragment 2 bundle . SKIPPED
[INFO] Gemini Blueprint Test Bundle: Error bundle ......... SKIPPED
[INFO] Gemini Blueprint Test Bundle: Deadlock bundle ...... SKIPPED
[INFO] Gemini Blueprint Test Bundle: Configuration test bundle SKIPPED
[INFO] Gemini Blueprint Test Bundle: ExtenderVersion-Test-Bundle SKIPPED
[INFO] Gemini Blueprint Test Bundle: Integration testing bundles for configuration options SKIPPED
[INFO] Gemini Blueprint Test Bundle: NoPublish-Bundle ..... SKIPPED
[INFO] Gemini Blueprint Test Bundle: Async-NoWait-Bundle .. SKIPPED
[INFO] Gemini Blueprint Test Bundle: Async-Wait-Bundle .... SKIPPED
[INFO] Gemini Blueprint Test Bundle: Sync-NoWait-Bundle ... SKIPPED
[INFO] Gemini Blueprint Test Bundle: Sync-Tail-Bundle ..... SKIPPED
[INFO] Gemini Blueprint Test Bundle: Sync-Wait-Bundle ..... SKIPPED
[INFO] Gemini Blueprint Test Bundle: Spring service TCCL management inteface test bundle SKIPPED
[INFO] Gemini Blueprint Test Bundle: Spring service TCCL management test bundle SKIPPED
[INFO] Gemini Blueprint Test Bundle: Config File With Dots bundle SKIPPED
[INFO] Gemini Blueprint Test Bundle: Spring Proxy Creator bundle SKIPPED
[INFO] Gemini Blueprint Test Bundle: Extender Configuration Fragment Bundle SKIPPED
[INFO] Gemini Blueprint Test Bundle: JDK proxy test ....... SKIPPED
[INFO] Gemini Blueprint Test Bundle: Extender Event listener bundle Bundle SKIPPED
[INFO] Gemini Blueprint Test Bundle: namespace provider and consumer bundle SKIPPED
[INFO] Gemini Blueprint Test Bundle: Just a listener exported as a service SKIPPED
[INFO] Gemini Blueprint Test Bundle: Export Import Dependency Bundle SKIPPED
[INFO] Eclipse Gemini Blueprint JDK5 Integration Testing Bundles SKIPPED
[INFO] Gemini Blueprint Test Bundle: @Component beans bundle SKIPPED
[INFO] Eclipse Gemini Blueprint Test Bundle: Recursive Type test bundle SKIPPED
[INFO] Gemini Blueprint Integration Testing Bundles ....... SKIPPED
[INFO] Eclipse Gemini Blueprint Test Bundle: Simple service test bundle SKIPPED
[INFO] Eclipse Gemini Blueprint Test Bundle: Error bundle . SKIPPED
[INFO] Eclipse Gemini Blueprint Test Bundle: Waiting bundle SKIPPED
[INFO] Eclipse Gemini Blueprint Test Bundle: Configuration test bundle SKIPPED
[INFO] Eclipse Gemini Blueprint Integration Tests 3.0.0.M01-SNAPSHOT SKIPPED
[INFO] ------------------------------------------------------------------------
[INFO] BUILD FAILURE
[INFO] ------------------------------------------------------------------------
[INFO] Total time: 47.584 s
[INFO] Finished at: 2018-09-05T12:19:05-04:00
[INFO] ------------------------------------------------------------------------
[ERROR] Failed to execute goal org.apache.maven.plugins:maven-surefire-plugin:2.19.1:test (default-test) on project gemini-blueprint-extender: There are test failures.
[ERROR] 
[ERROR] Please refer to /jobs/genie.gemini/gemini-blueprint-branch-integration/workspace/extender/target/surefire-reports for the individual test results.
[ERROR] -> [Help 1]
[ERROR] 
[ERROR] To see the full stack trace of the errors, re-run Maven with the -e switch.
[ERROR] Re-run Maven using the -X switch to enable full debug logging.
[ERROR] 
[ERROR] For more information about the errors and possible solutions, please read the following articles:
[ERROR] [Help 1] http://cwiki.apache.org/confluence/display/MAVEN/MojoFailureException
[ERROR] 
[ERROR] After correcting the problems, you can resume the build with the command
[ERROR]   mvn <goals> -rf :gemini-blueprint-extender
Build step 'Invoke top-level Maven targets' marked build as failure
Sending e-mails to: olaf@x100.de
Recording test results
Started calculate disk usage of build
Finished Calculation of disk usage of build in  15 second
Started calculate disk usage of workspace
Finished Calculation of disk usage of workspace in 0 seconds
Finished: FAILURE