Console Output

Skipping 1,380 KB.. Full Log
Total time for commit: 1
Total time for commit: 1
Exception on execution: No branch info available.
Exception on execution: No branch info available.
Exception on execution: No branch info available.
Exception on execution: No branch info available.
Exception on execution: No branch info available.
Exception on execution: No branch info available.
Exception on execution: No branch info available.
Exception on execution: No branch info available.
Total time for commit: 1
Total time for commit: 1
Total time for commit: 1
Total time for commit: 1
Exception on execution: No branch info available.
Exception on execution: No branch info available.
Exception on execution: No branch info available.
Exception on execution: No branch info available.
Exception on execution: No branch info available.
Exception on execution: No branch info available.
Exception on execution: No branch info available.
Exception on execution: No branch info available.
Total time for commit: 1
Total time for commit: 1
Total time for commit: 1
Total time for commit: 1
Total time for commit: 2
Total time for commit: 2
Total time for commit: 2
Total time for commit: 2
Total time for commit: 1
Total time for commit: 1
Total time for commit: 1
Total time for commit: 1
Exception on execution: No branch info available.
Exception on execution: No branch info available.
Exception on execution: No branch info available.
Exception on execution: No branch info available.
Exception on execution: No branch info available.
Exception on execution: No branch info available.
Exception on execution: No branch info available.
Exception on execution: No branch info available.
Total time for commit: 2
Total time for commit: 2
Total time for commit: 2
Total time for commit: 2
Total time for commit: 1
Total time for commit: 1
Total time for commit: 1
Total time for commit: 1
Exception on execution: org.eclipse.emf.emfstore.internal.server.exceptions.InvalidVersionSpecException: Primary version could not be resolved
	at org.eclipse.emf.emfstore.internal.server.core.subinterfaces.VersionSubInterfaceImpl.resolvePrimaryVersionSpec(VersionSubInterfaceImpl.java:201)
	at org.eclipse.emf.emfstore.internal.server.core.subinterfaces.VersionSubInterfaceImpl.resolveVersionSpec(VersionSubInterfaceImpl.java:116)
	at sun.reflect.GeneratedMethodAccessor21.invoke(Unknown Source)
	at sun.reflect.DelegatingMethodAccessorImpl.invoke(DelegatingMethodAccessorImpl.java:43)
	at java.lang.reflect.Method.invoke(Method.java:498)
	at org.eclipse.emf.emfstore.internal.server.core.AbstractSubEmfstoreInterface.execute(AbstractSubEmfstoreInterface.java:142)
	at org.eclipse.emf.emfstore.internal.server.core.EMFStoreImpl.invoke(EMFStoreImpl.java:181)
	at com.sun.proxy.$Proxy22.resolveVersionSpec(Unknown Source)
	at org.eclipse.emf.emfstore.client.test.common.mocks.ConnectionMock.resolveVersionSpec(ConnectionMock.java:137)
	at org.eclipse.emf.emfstore.internal.client.model.impl.ProjectSpaceBase$6.run(ProjectSpaceBase.java:1233)
	at org.eclipse.emf.emfstore.internal.client.model.impl.ProjectSpaceBase$6.run(ProjectSpaceBase.java:1)
	at org.eclipse.emf.emfstore.internal.client.model.connectionmanager.ServerCall.run(ServerCall.java:250)
	at org.eclipse.emf.emfstore.internal.client.model.connectionmanager.SessionManager.executeCall(SessionManager.java:149)
	at org.eclipse.emf.emfstore.internal.client.model.connectionmanager.SessionManager.execute(SessionManager.java:68)
	at org.eclipse.emf.emfstore.internal.client.model.connectionmanager.ServerCall.execute(ServerCall.java:270)
	at org.eclipse.emf.emfstore.internal.client.model.impl.ProjectSpaceBase.resolveVersionSpec(ProjectSpaceBase.java:1238)
	at org.eclipse.emf.emfstore.server.test.VersionSpecTests.resolvePrimaryInvalid(VersionSpecTests.java:204)
	at sun.reflect.NativeMethodAccessorImpl.invoke0(Native Method)
	at sun.reflect.NativeMethodAccessorImpl.invoke(NativeMethodAccessorImpl.java:62)
	at sun.reflect.DelegatingMethodAccessorImpl.invoke(DelegatingMethodAccessorImpl.java:43)
	at java.lang.reflect.Method.invoke(Method.java:498)
	at org.junit.runners.model.FrameworkMethod$1.runReflectiveCall(FrameworkMethod.java:47)
	at org.junit.internal.runners.model.ReflectiveCallable.run(ReflectiveCallable.java:12)
	at org.junit.runners.model.FrameworkMethod.invokeExplosively(FrameworkMethod.java:44)
	at org.junit.internal.runners.statements.InvokeMethod.evaluate(InvokeMethod.java:17)
	at org.junit.internal.runners.statements.ExpectException.evaluate(ExpectException.java:19)
	at org.junit.internal.runners.statements.RunBefores.evaluate(RunBefores.java:26)
	at org.junit.internal.runners.statements.RunAfters.evaluate(RunAfters.java:27)
	at org.junit.runners.ParentRunner.runLeaf(ParentRunner.java:271)
	at org.junit.runners.BlockJUnit4ClassRunner.runChild(BlockJUnit4ClassRunner.java:70)
	at org.junit.runners.BlockJUnit4ClassRunner.runChild(BlockJUnit4ClassRunner.java:50)
	at org.junit.runners.ParentRunner$3.run(ParentRunner.java:238)
	at org.junit.runners.ParentRunner$1.schedule(ParentRunner.java:63)
	at org.junit.runners.ParentRunner.runChildren(ParentRunner.java:236)
	at org.junit.runners.ParentRunner.access$000(ParentRunner.java:53)
	at org.junit.runners.ParentRunner$2.evaluate(ParentRunner.java:229)
	at org.junit.internal.runners.statements.RunBefores.evaluate(RunBefores.java:26)
	at org.junit.internal.runners.statements.RunAfters.evaluate(RunAfters.java:27)
	at org.junit.runners.ParentRunner.run(ParentRunner.java:309)
	at org.junit.runners.Suite.runChild(Suite.java:127)
	at org.junit.runners.Suite.runChild(Suite.java:26)
	at org.junit.runners.ParentRunner$3.run(ParentRunner.java:238)
	at org.junit.runners.ParentRunner$1.schedule(ParentRunner.java:63)
	at org.junit.runners.ParentRunner.runChildren(ParentRunner.java:236)
	at org.junit.runners.ParentRunner.access$000(ParentRunner.java:53)
	at org.junit.runners.ParentRunner$2.evaluate(ParentRunner.java:229)
	at org.junit.runners.ParentRunner.run(ParentRunner.java:309)
	at org.apache.maven.surefire.junit4.JUnit4Provider.execute(JUnit4Provider.java:264)
	at org.apache.maven.surefire.junit4.JUnit4Provider.executeTestSet(JUnit4Provider.java:153)
	at org.apache.maven.surefire.junit4.JUnit4Provider.invoke(JUnit4Provider.java:124)
	at sun.reflect.NativeMethodAccessorImpl.invoke0(Native Method)
	at sun.reflect.NativeMethodAccessorImpl.invoke(NativeMethodAccessorImpl.java:62)
	at sun.reflect.DelegatingMethodAccessorImpl.invoke(DelegatingMethodAccessorImpl.java:43)
	at java.lang.reflect.Method.invoke(Method.java:498)
	at org.apache.maven.surefire.util.ReflectionUtils.invokeMethodWithArray2(ReflectionUtils.java:208)
	at org.apache.maven.surefire.booter.ProviderFactory$ProviderProxy.invoke(ProviderFactory.java:156)
	at org.apache.maven.surefire.booter.ProviderFactory.invokeProvider(ProviderFactory.java:82)
	at org.eclipse.tycho.surefire.osgibooter.OsgiSurefireBooter.run(OsgiSurefireBooter.java:95)
	at org.eclipse.tycho.surefire.osgibooter.AbstractUITestApplication.runTests(AbstractUITestApplication.java:44)
	at org.eclipse.ui.internal.testing.WorkbenchTestable$1.run(WorkbenchTestable.java:71)
	at java.lang.Thread.run(Thread.java:745)

Exception on execution: org.eclipse.emf.emfstore.internal.server.exceptions.InvalidVersionSpecException: Primary version could not be resolved
	at org.eclipse.emf.emfstore.internal.server.core.subinterfaces.VersionSubInterfaceImpl.resolvePrimaryVersionSpec(VersionSubInterfaceImpl.java:201)
	at org.eclipse.emf.emfstore.internal.server.core.subinterfaces.VersionSubInterfaceImpl.resolveVersionSpec(VersionSubInterfaceImpl.java:116)
	at sun.reflect.GeneratedMethodAccessor21.invoke(Unknown Source)
	at sun.reflect.DelegatingMethodAccessorImpl.invoke(DelegatingMethodAccessorImpl.java:43)
	at java.lang.reflect.Method.invoke(Method.java:498)
	at org.eclipse.emf.emfstore.internal.server.core.AbstractSubEmfstoreInterface.execute(AbstractSubEmfstoreInterface.java:142)
	at org.eclipse.emf.emfstore.internal.server.core.EMFStoreImpl.invoke(EMFStoreImpl.java:181)
	at com.sun.proxy.$Proxy22.resolveVersionSpec(Unknown Source)
	at org.eclipse.emf.emfstore.client.test.common.mocks.ConnectionMock.resolveVersionSpec(ConnectionMock.java:137)
	at org.eclipse.emf.emfstore.internal.client.model.impl.ProjectSpaceBase$6.run(ProjectSpaceBase.java:1233)
	at org.eclipse.emf.emfstore.internal.client.model.impl.ProjectSpaceBase$6.run(ProjectSpaceBase.java:1)
	at org.eclipse.emf.emfstore.internal.client.model.connectionmanager.ServerCall.run(ServerCall.java:250)
	at org.eclipse.emf.emfstore.internal.client.model.connectionmanager.SessionManager.executeCall(SessionManager.java:149)
	at org.eclipse.emf.emfstore.internal.client.model.connectionmanager.SessionManager.execute(SessionManager.java:68)
	at org.eclipse.emf.emfstore.internal.client.model.connectionmanager.ServerCall.execute(ServerCall.java:270)
	at org.eclipse.emf.emfstore.internal.client.model.impl.ProjectSpaceBase.resolveVersionSpec(ProjectSpaceBase.java:1238)
	at org.eclipse.emf.emfstore.server.test.VersionSpecTests.resolvePrimaryInvalid(VersionSpecTests.java:204)
	at sun.reflect.NativeMethodAccessorImpl.invoke0(Native Method)
	at sun.reflect.NativeMethodAccessorImpl.invoke(NativeMethodAccessorImpl.java:62)
	at sun.reflect.DelegatingMethodAccessorImpl.invoke(DelegatingMethodAccessorImpl.java:43)
	at java.lang.reflect.Method.invoke(Method.java:498)
	at org.junit.runners.model.FrameworkMethod$1.runReflectiveCall(FrameworkMethod.java:47)
	at org.junit.internal.runners.model.ReflectiveCallable.run(ReflectiveCallable.java:12)
	at org.junit.runners.model.FrameworkMethod.invokeExplosively(FrameworkMethod.java:44)
	at org.junit.internal.runners.statements.InvokeMethod.evaluate(InvokeMethod.java:17)
	at org.junit.internal.runners.statements.ExpectException.evaluate(ExpectException.java:19)
	at org.junit.internal.runners.statements.RunBefores.evaluate(RunBefores.java:26)
	at org.junit.internal.runners.statements.RunAfters.evaluate(RunAfters.java:27)
	at org.junit.runners.ParentRunner.runLeaf(ParentRunner.java:271)
	at org.junit.runners.BlockJUnit4ClassRunner.runChild(BlockJUnit4ClassRunner.java:70)
	at org.junit.runners.BlockJUnit4ClassRunner.runChild(BlockJUnit4ClassRunner.java:50)
	at org.junit.runners.ParentRunner$3.run(ParentRunner.java:238)
	at org.junit.runners.ParentRunner$1.schedule(ParentRunner.java:63)
	at org.junit.runners.ParentRunner.runChildren(ParentRunner.java:236)
	at org.junit.runners.ParentRunner.access$000(ParentRunner.java:53)
	at org.junit.runners.ParentRunner$2.evaluate(ParentRunner.java:229)
	at org.junit.internal.runners.statements.RunBefores.evaluate(RunBefores.java:26)
	at org.junit.internal.runners.statements.RunAfters.evaluate(RunAfters.java:27)
	at org.junit.runners.ParentRunner.run(ParentRunner.java:309)
	at org.junit.runners.Suite.runChild(Suite.java:127)
	at org.junit.runners.Suite.runChild(Suite.java:26)
	at org.junit.runners.ParentRunner$3.run(ParentRunner.java:238)
	at org.junit.runners.ParentRunner$1.schedule(ParentRunner.java:63)
	at org.junit.runners.ParentRunner.runChildren(ParentRunner.java:236)
	at org.junit.runners.ParentRunner.access$000(ParentRunner.java:53)
	at org.junit.runners.ParentRunner$2.evaluate(ParentRunner.java:229)
	at org.junit.runners.ParentRunner.run(ParentRunner.java:309)
	at org.apache.maven.surefire.junit4.JUnit4Provider.execute(JUnit4Provider.java:264)
	at org.apache.maven.surefire.junit4.JUnit4Provider.executeTestSet(JUnit4Provider.java:153)
	at org.apache.maven.surefire.junit4.JUnit4Provider.invoke(JUnit4Provider.java:124)
	at sun.reflect.NativeMethodAccessorImpl.invoke0(Native Method)
	at sun.reflect.NativeMethodAccessorImpl.invoke(NativeMethodAccessorImpl.java:62)
	at sun.reflect.DelegatingMethodAccessorImpl.invoke(DelegatingMethodAccessorImpl.java:43)
	at java.lang.reflect.Method.invoke(Method.java:498)
	at org.apache.maven.surefire.util.ReflectionUtils.invokeMethodWithArray2(ReflectionUtils.java:208)
	at org.apache.maven.surefire.booter.ProviderFactory$ProviderProxy.invoke(ProviderFactory.java:156)
	at org.apache.maven.surefire.booter.ProviderFactory.invokeProvider(ProviderFactory.java:82)
	at org.eclipse.tycho.surefire.osgibooter.OsgiSurefireBooter.run(OsgiSurefireBooter.java:95)
	at org.eclipse.tycho.surefire.osgibooter.AbstractUITestApplication.runTests(AbstractUITestApplication.java:44)
	at org.eclipse.ui.internal.testing.WorkbenchTestable$1.run(WorkbenchTestable.java:71)
	at java.lang.Thread.run(Thread.java:745)

Exception on execution: org.eclipse.emf.emfstore.internal.server.exceptions.InvalidVersionSpecException: Primary version could not be resolved
	at org.eclipse.emf.emfstore.internal.server.core.subinterfaces.VersionSubInterfaceImpl.resolvePrimaryVersionSpec(VersionSubInterfaceImpl.java:201)
	at org.eclipse.emf.emfstore.internal.server.core.subinterfaces.VersionSubInterfaceImpl.resolveVersionSpec(VersionSubInterfaceImpl.java:116)
	at sun.reflect.GeneratedMethodAccessor21.invoke(Unknown Source)
	at sun.reflect.DelegatingMethodAccessorImpl.invoke(DelegatingMethodAccessorImpl.java:43)
	at java.lang.reflect.Method.invoke(Method.java:498)
	at org.eclipse.emf.emfstore.internal.server.core.AbstractSubEmfstoreInterface.execute(AbstractSubEmfstoreInterface.java:142)
	at org.eclipse.emf.emfstore.internal.server.core.EMFStoreImpl.invoke(EMFStoreImpl.java:181)
	at com.sun.proxy.$Proxy22.resolveVersionSpec(Unknown Source)
	at org.eclipse.emf.emfstore.client.test.common.mocks.ConnectionMock.resolveVersionSpec(ConnectionMock.java:137)
	at org.eclipse.emf.emfstore.internal.client.model.impl.ProjectSpaceBase$6.run(ProjectSpaceBase.java:1233)
	at org.eclipse.emf.emfstore.internal.client.model.impl.ProjectSpaceBase$6.run(ProjectSpaceBase.java:1)
	at org.eclipse.emf.emfstore.internal.client.model.connectionmanager.ServerCall.run(ServerCall.java:250)
	at org.eclipse.emf.emfstore.internal.client.model.connectionmanager.SessionManager.executeCall(SessionManager.java:149)
	at org.eclipse.emf.emfstore.internal.client.model.connectionmanager.SessionManager.execute(SessionManager.java:68)
	at org.eclipse.emf.emfstore.internal.client.model.connectionmanager.ServerCall.execute(ServerCall.java:270)
	at org.eclipse.emf.emfstore.internal.client.model.impl.ProjectSpaceBase.resolveVersionSpec(ProjectSpaceBase.java:1238)
	at org.eclipse.emf.emfstore.server.test.VersionSpecTests.resolvePrimaryInvalid(VersionSpecTests.java:204)
	at sun.reflect.NativeMethodAccessorImpl.invoke0(Native Method)
	at sun.reflect.NativeMethodAccessorImpl.invoke(NativeMethodAccessorImpl.java:62)
	at sun.reflect.DelegatingMethodAccessorImpl.invoke(DelegatingMethodAccessorImpl.java:43)
	at java.lang.reflect.Method.invoke(Method.java:498)
	at org.junit.runners.model.FrameworkMethod$1.runReflectiveCall(FrameworkMethod.java:47)
	at org.junit.internal.runners.model.ReflectiveCallable.run(ReflectiveCallable.java:12)
	at org.junit.runners.model.FrameworkMethod.invokeExplosively(FrameworkMethod.java:44)
	at org.junit.internal.runners.statements.InvokeMethod.evaluate(InvokeMethod.java:17)
	at org.junit.internal.runners.statements.ExpectException.evaluate(ExpectException.java:19)
	at org.junit.internal.runners.statements.RunBefores.evaluate(RunBefores.java:26)
	at org.junit.internal.runners.statements.RunAfters.evaluate(RunAfters.java:27)
	at org.junit.runners.ParentRunner.runLeaf(ParentRunner.java:271)
	at org.junit.runners.BlockJUnit4ClassRunner.runChild(BlockJUnit4ClassRunner.java:70)
	at org.junit.runners.BlockJUnit4ClassRunner.runChild(BlockJUnit4ClassRunner.java:50)
	at org.junit.runners.ParentRunner$3.run(ParentRunner.java:238)
	at org.junit.runners.ParentRunner$1.schedule(ParentRunner.java:63)
	at org.junit.runners.ParentRunner.runChildren(ParentRunner.java:236)
	at org.junit.runners.ParentRunner.access$000(ParentRunner.java:53)
	at org.junit.runners.ParentRunner$2.evaluate(ParentRunner.java:229)
	at org.junit.internal.runners.statements.RunBefores.evaluate(RunBefores.java:26)
	at org.junit.internal.runners.statements.RunAfters.evaluate(RunAfters.java:27)
	at org.junit.runners.ParentRunner.run(ParentRunner.java:309)
	at org.junit.runners.Suite.runChild(Suite.java:127)
	at org.junit.runners.Suite.runChild(Suite.java:26)
	at org.junit.runners.ParentRunner$3.run(ParentRunner.java:238)
	at org.junit.runners.ParentRunner$1.schedule(ParentRunner.java:63)
	at org.junit.runners.ParentRunner.runChildren(ParentRunner.java:236)
	at org.junit.runners.ParentRunner.access$000(ParentRunner.java:53)
	at org.junit.runners.ParentRunner$2.evaluate(ParentRunner.java:229)
	at org.junit.runners.ParentRunner.run(ParentRunner.java:309)
	at org.apache.maven.surefire.junit4.JUnit4Provider.execute(JUnit4Provider.java:264)
	at org.apache.maven.surefire.junit4.JUnit4Provider.executeTestSet(JUnit4Provider.java:153)
	at org.apache.maven.surefire.junit4.JUnit4Provider.invoke(JUnit4Provider.java:124)
	at sun.reflect.NativeMethodAccessorImpl.invoke0(Native Method)
	at sun.reflect.NativeMethodAccessorImpl.invoke(NativeMethodAccessorImpl.java:62)
	at sun.reflect.DelegatingMethodAccessorImpl.invoke(DelegatingMethodAccessorImpl.java:43)
	at java.lang.reflect.Method.invoke(Method.java:498)
	at org.apache.maven.surefire.util.ReflectionUtils.invokeMethodWithArray2(ReflectionUtils.java:208)
	at org.apache.maven.surefire.booter.ProviderFactory$ProviderProxy.invoke(ProviderFactory.java:156)
	at org.apache.maven.surefire.booter.ProviderFactory.invokeProvider(ProviderFactory.java:82)
	at org.eclipse.tycho.surefire.osgibooter.OsgiSurefireBooter.run(OsgiSurefireBooter.java:95)
	at org.eclipse.tycho.surefire.osgibooter.AbstractUITestApplication.runTests(AbstractUITestApplication.java:44)
	at org.eclipse.ui.internal.testing.WorkbenchTestable$1.run(WorkbenchTestable.java:71)
	at java.lang.Thread.run(Thread.java:745)

Exception on execution: org.eclipse.emf.emfstore.internal.server.exceptions.InvalidVersionSpecException: Primary version could not be resolved
	at org.eclipse.emf.emfstore.internal.server.core.subinterfaces.VersionSubInterfaceImpl.resolvePrimaryVersionSpec(VersionSubInterfaceImpl.java:201)
	at org.eclipse.emf.emfstore.internal.server.core.subinterfaces.VersionSubInterfaceImpl.resolveVersionSpec(VersionSubInterfaceImpl.java:116)
	at sun.reflect.GeneratedMethodAccessor21.invoke(Unknown Source)
	at sun.reflect.DelegatingMethodAccessorImpl.invoke(DelegatingMethodAccessorImpl.java:43)
	at java.lang.reflect.Method.invoke(Method.java:498)
	at org.eclipse.emf.emfstore.internal.server.core.AbstractSubEmfstoreInterface.execute(AbstractSubEmfstoreInterface.java:142)
	at org.eclipse.emf.emfstore.internal.server.core.EMFStoreImpl.invoke(EMFStoreImpl.java:181)
	at com.sun.proxy.$Proxy22.resolveVersionSpec(Unknown Source)
	at org.eclipse.emf.emfstore.client.test.common.mocks.ConnectionMock.resolveVersionSpec(ConnectionMock.java:137)
	at org.eclipse.emf.emfstore.internal.client.model.impl.ProjectSpaceBase$6.run(ProjectSpaceBase.java:1233)
	at org.eclipse.emf.emfstore.internal.client.model.impl.ProjectSpaceBase$6.run(ProjectSpaceBase.java:1)
	at org.eclipse.emf.emfstore.internal.client.model.connectionmanager.ServerCall.run(ServerCall.java:250)
	at org.eclipse.emf.emfstore.internal.client.model.connectionmanager.SessionManager.executeCall(SessionManager.java:149)
	at org.eclipse.emf.emfstore.internal.client.model.connectionmanager.SessionManager.execute(SessionManager.java:68)
	at org.eclipse.emf.emfstore.internal.client.model.connectionmanager.ServerCall.execute(ServerCall.java:270)
	at org.eclipse.emf.emfstore.internal.client.model.impl.ProjectSpaceBase.resolveVersionSpec(ProjectSpaceBase.java:1238)
	at org.eclipse.emf.emfstore.server.test.VersionSpecTests.resolvePrimaryInvalid(VersionSpecTests.java:204)
	at sun.reflect.NativeMethodAccessorImpl.invoke0(Native Method)
	at sun.reflect.NativeMethodAccessorImpl.invoke(NativeMethodAccessorImpl.java:62)
	at sun.reflect.DelegatingMethodAccessorImpl.invoke(DelegatingMethodAccessorImpl.java:43)
	at java.lang.reflect.Method.invoke(Method.java:498)
	at org.junit.runners.model.FrameworkMethod$1.runReflectiveCall(FrameworkMethod.java:47)
	at org.junit.internal.runners.model.ReflectiveCallable.run(ReflectiveCallable.java:12)
	at org.junit.runners.model.FrameworkMethod.invokeExplosively(FrameworkMethod.java:44)
	at org.junit.internal.runners.statements.InvokeMethod.evaluate(InvokeMethod.java:17)
	at org.junit.internal.runners.statements.ExpectException.evaluate(ExpectException.java:19)
	at org.junit.internal.runners.statements.RunBefores.evaluate(RunBefores.java:26)
	at org.junit.internal.runners.statements.RunAfters.evaluate(RunAfters.java:27)
	at org.junit.runners.ParentRunner.runLeaf(ParentRunner.java:271)
	at org.junit.runners.BlockJUnit4ClassRunner.runChild(BlockJUnit4ClassRunner.java:70)
	at org.junit.runners.BlockJUnit4ClassRunner.runChild(BlockJUnit4ClassRunner.java:50)
	at org.junit.runners.ParentRunner$3.run(ParentRunner.java:238)
	at org.junit.runners.ParentRunner$1.schedule(ParentRunner.java:63)
	at org.junit.runners.ParentRunner.runChildren(ParentRunner.java:236)
	at org.junit.runners.ParentRunner.access$000(ParentRunner.java:53)
	at org.junit.runners.ParentRunner$2.evaluate(ParentRunner.java:229)
	at org.junit.internal.runners.statements.RunBefores.evaluate(RunBefores.java:26)
	at org.junit.internal.runners.statements.RunAfters.evaluate(RunAfters.java:27)
	at org.junit.runners.ParentRunner.run(ParentRunner.java:309)
	at org.junit.runners.Suite.runChild(Suite.java:127)
	at org.junit.runners.Suite.runChild(Suite.java:26)
	at org.junit.runners.ParentRunner$3.run(ParentRunner.java:238)
	at org.junit.runners.ParentRunner$1.schedule(ParentRunner.java:63)
	at org.junit.runners.ParentRunner.runChildren(ParentRunner.java:236)
	at org.junit.runners.ParentRunner.access$000(ParentRunner.java:53)
	at org.junit.runners.ParentRunner$2.evaluate(ParentRunner.java:229)
	at org.junit.runners.ParentRunner.run(ParentRunner.java:309)
	at org.apache.maven.surefire.junit4.JUnit4Provider.execute(JUnit4Provider.java:264)
	at org.apache.maven.surefire.junit4.JUnit4Provider.executeTestSet(JUnit4Provider.java:153)
	at org.apache.maven.surefire.junit4.JUnit4Provider.invoke(JUnit4Provider.java:124)
	at sun.reflect.NativeMethodAccessorImpl.invoke0(Native Method)
	at sun.reflect.NativeMethodAccessorImpl.invoke(NativeMethodAccessorImpl.java:62)
	at sun.reflect.DelegatingMethodAccessorImpl.invoke(DelegatingMethodAccessorImpl.java:43)
	at java.lang.reflect.Method.invoke(Method.java:498)
	at org.apache.maven.surefire.util.ReflectionUtils.invokeMethodWithArray2(ReflectionUtils.java:208)
	at org.apache.maven.surefire.booter.ProviderFactory$ProviderProxy.invoke(ProviderFactory.java:156)
	at org.apache.maven.surefire.booter.ProviderFactory.invokeProvider(ProviderFactory.java:82)
	at org.eclipse.tycho.surefire.osgibooter.OsgiSurefireBooter.run(OsgiSurefireBooter.java:95)
	at org.eclipse.tycho.surefire.osgibooter.AbstractUITestApplication.runTests(AbstractUITestApplication.java:44)
	at org.eclipse.ui.internal.testing.WorkbenchTestable$1.run(WorkbenchTestable.java:71)
	at java.lang.Thread.run(Thread.java:745)

Total time for commit: 1
Total time for commit: 1
Total time for commit: 1
Total time for commit: 1
Exception on execution: No branch info available.
Exception on execution: No branch info available.
Exception on execution: No branch info available.
Exception on execution: No branch info available.
Exception on execution: No branch info available.
Exception on execution: No branch info available.
Exception on execution: No branch info available.
Exception on execution: No branch info available.
Total time for commit: 1
Total time for commit: 1
Total time for commit: 1
Total time for commit: 1
Exception on execution: No branch info available.
Exception on execution: No branch info available.
Exception on execution: No branch info available.
Exception on execution: No branch info available.
Exception on execution: No branch info available.
Exception on execution: No branch info available.
Exception on execution: No branch info available.
Exception on execution: No branch info available.
Total time for commit: 1
Total time for commit: 1
Total time for commit: 1
Total time for commit: 1
Total time for commit: 1
Total time for commit: 1
Total time for commit: 1
Total time for commit: 1
Total time for commit: 1
Total time for commit: 1
Total time for commit: 1
Total time for commit: 1
Exception on execution: No branch info available.
Exception on execution: No branch info available.
Exception on execution: No branch info available.
Exception on execution: No branch info available.
Exception on execution: No branch info available.
Exception on execution: No branch info available.
Exception on execution: No branch info available.
Exception on execution: No branch info available.
Total time for commit: 1
Total time for commit: 1
Total time for commit: 1
Total time for commit: 1
Total time for commit: 1
Total time for commit: 1
Total time for commit: 1
Total time for commit: 1
Total time for commit: 1
Total time for commit: 1
Total time for commit: 1
Total time for commit: 1
Exception on execution: No branch info available.
Exception on execution: No branch info available.
Exception on execution: No branch info available.
Exception on execution: No branch info available.
Exception on execution: No branch info available.
Exception on execution: No branch info available.
Exception on execution: No branch info available.
Exception on execution: No branch info available.
Total time for commit: 0
Total time for commit: 0
Total time for commit: 0
Total time for commit: 0
Exception on execution: No branch info available.
Exception on execution: No branch info available.
Exception on execution: No branch info available.
Exception on execution: No branch info available.
Exception on execution: No branch info available.
Exception on execution: No branch info available.
Exception on execution: No branch info available.
Exception on execution: No branch info available.
Total time for commit: 1
Total time for commit: 1
Total time for commit: 1
Total time for commit: 1
Total time for commit: 4
Total time for commit: 4
Total time for commit: 4
Total time for commit: 4
Total time for commit: 2
Total time for commit: 2
Total time for commit: 2
Total time for commit: 2
Exception on execution: No branch info available.
Exception on execution: No branch info available.
Exception on execution: No branch info available.
Exception on execution: No branch info available.
Exception on execution: No branch info available.
Exception on execution: No branch info available.
Exception on execution: No branch info available.
Exception on execution: No branch info available.
Total time for commit: 1
Total time for commit: 1
Total time for commit: 1
Total time for commit: 1
Total time for commit: 1
Total time for commit: 1
Total time for commit: 1
Total time for commit: 1
Total time for commit: 1
Total time for commit: 1
Total time for commit: 1
Total time for commit: 1
Exception on execution: No branch info available.
Exception on execution: No branch info available.
Exception on execution: No branch info available.
Exception on execution: No branch info available.
Exception on execution: No branch info available.
Exception on execution: No branch info available.
Exception on execution: No branch info available.
Exception on execution: No branch info available.
Total time for commit: 2
Total time for commit: 2
Total time for commit: 2
Total time for commit: 2
Exception on execution: No branch info available.
Exception on execution: No branch info available.
Exception on execution: No branch info available.
Exception on execution: No branch info available.
Exception on execution: No branch info available.
Exception on execution: No branch info available.
Exception on execution: No branch info available.
Exception on execution: No branch info available.
Total time for commit: 0
Total time for commit: 0
Total time for commit: 0
Total time for commit: 0
Total time for commit: 2
Total time for commit: 2
Total time for commit: 2
Total time for commit: 2
Total time for commit: 1
Total time for commit: 1
Total time for commit: 1
Total time for commit: 1
Exception on execution: No branch info available.
Exception on execution: No branch info available.
Exception on execution: No branch info available.
Exception on execution: No branch info available.
Exception on execution: No branch info available.
Exception on execution: No branch info available.
Exception on execution: No branch info available.
Exception on execution: No branch info available.
Total time for commit: 1
Total time for commit: 1
Total time for commit: 1
Total time for commit: 1
Total time for commit: 1
Total time for commit: 1
Total time for commit: 1
Total time for commit: 1
Total time for commit: 1
Total time for commit: 1
Total time for commit: 1
Total time for commit: 1
Exception on execution: No branch info available.
Exception on execution: No branch info available.
Exception on execution: No branch info available.
Exception on execution: No branch info available.
Exception on execution: No branch info available.
Exception on execution: No branch info available.
Exception on execution: No branch info available.
Exception on execution: No branch info available.
Total time for commit: 1
Total time for commit: 1
Total time for commit: 1
Total time for commit: 1
Exception on execution: No branch info available.
Exception on execution: No branch info available.
Exception on execution: No branch info available.
Exception on execution: No branch info available.
Exception on execution: No branch info available.
Exception on execution: No branch info available.
Exception on execution: No branch info available.
Exception on execution: No branch info available.
Total time for commit: 1
Total time for commit: 1
Total time for commit: 1
Total time for commit: 1
Total time for commit: 1
Total time for commit: 1
Total time for commit: 1
Total time for commit: 1
Total time for commit: 2
Total time for commit: 2
Total time for commit: 2
Total time for commit: 2
Exception on execution: No branch info available.
Exception on execution: No branch info available.
Exception on execution: No branch info available.
Exception on execution: No branch info available.
Exception on execution: No branch info available.
Exception on execution: No branch info available.
Exception on execution: No branch info available.
Exception on execution: No branch info available.
Total time for commit: 1
Total time for commit: 1
Total time for commit: 1
Total time for commit: 1
Total time for commit: 1
Total time for commit: 1
Total time for commit: 1
Total time for commit: 1
No server versions supplied
org.eclipse.emf.emfstore.internal.server.exceptions.ClientVersionOutOfDateException: No server versions supplied
	at org.eclipse.emf.emfstore.internal.server.accesscontrol.authentication.verifiers.VersionVerifier.verify(VersionVerifier.java:66)
	at org.eclipse.emf.emfstore.server.test.VersionVerifierTest.testSupplyNoVersions(VersionVerifierTest.java:51)
	at sun.reflect.NativeMethodAccessorImpl.invoke0(Native Method)
	at sun.reflect.NativeMethodAccessorImpl.invoke(NativeMethodAccessorImpl.java:62)
	at sun.reflect.DelegatingMethodAccessorImpl.invoke(DelegatingMethodAccessorImpl.java:43)
	at java.lang.reflect.Method.invoke(Method.java:498)
	at org.junit.runners.model.FrameworkMethod$1.runReflectiveCall(FrameworkMethod.java:47)
	at org.junit.internal.runners.model.ReflectiveCallable.run(ReflectiveCallable.java:12)
	at org.junit.runners.model.FrameworkMethod.invokeExplosively(FrameworkMethod.java:44)
	at org.junit.internal.runners.statements.InvokeMethod.evaluate(InvokeMethod.java:17)
	at org.junit.runners.ParentRunner.runLeaf(ParentRunner.java:271)
	at org.junit.runners.BlockJUnit4ClassRunner.runChild(BlockJUnit4ClassRunner.java:70)
	at org.junit.runners.BlockJUnit4ClassRunner.runChild(BlockJUnit4ClassRunner.java:50)
	at org.junit.runners.ParentRunner$3.run(ParentRunner.java:238)
	at org.junit.runners.ParentRunner$1.schedule(ParentRunner.java:63)
	at org.junit.runners.ParentRunner.runChildren(ParentRunner.java:236)
	at org.junit.runners.ParentRunner.access$000(ParentRunner.java:53)
	at org.junit.runners.ParentRunner$2.evaluate(ParentRunner.java:229)
	at org.junit.runners.ParentRunner.run(ParentRunner.java:309)
	at org.junit.runners.Suite.runChild(Suite.java:127)
	at org.junit.runners.Suite.runChild(Suite.java:26)
	at org.junit.runners.ParentRunner$3.run(ParentRunner.java:238)
	at org.junit.runners.ParentRunner$1.schedule(ParentRunner.java:63)
	at org.junit.runners.ParentRunner.runChildren(ParentRunner.java:236)
	at org.junit.runners.ParentRunner.access$000(ParentRunner.java:53)
	at org.junit.runners.ParentRunner$2.evaluate(ParentRunner.java:229)
	at org.junit.runners.ParentRunner.run(ParentRunner.java:309)
	at org.apache.maven.surefire.junit4.JUnit4Provider.execute(JUnit4Provider.java:264)
	at org.apache.maven.surefire.junit4.JUnit4Provider.executeTestSet(JUnit4Provider.java:153)
	at org.apache.maven.surefire.junit4.JUnit4Provider.invoke(JUnit4Provider.java:124)
	at sun.reflect.NativeMethodAccessorImpl.invoke0(Native Method)
	at sun.reflect.NativeMethodAccessorImpl.invoke(NativeMethodAccessorImpl.java:62)
	at sun.reflect.DelegatingMethodAccessorImpl.invoke(DelegatingMethodAccessorImpl.java:43)
	at java.lang.reflect.Method.invoke(Method.java:498)
	at org.apache.maven.surefire.util.ReflectionUtils.invokeMethodWithArray2(ReflectionUtils.java:208)
	at org.apache.maven.surefire.booter.ProviderFactory$ProviderProxy.invoke(ProviderFactory.java:156)
	at org.apache.maven.surefire.booter.ProviderFactory.invokeProvider(ProviderFactory.java:82)
	at org.eclipse.tycho.surefire.osgibooter.OsgiSurefireBooter.run(OsgiSurefireBooter.java:95)
	at org.eclipse.tycho.surefire.osgibooter.AbstractUITestApplication.runTests(AbstractUITestApplication.java:44)
	at org.eclipse.ui.internal.testing.WorkbenchTestable$1.run(WorkbenchTestable.java:71)
	at java.lang.Thread.run(Thread.java:745)
No server versions supplied
org.eclipse.emf.emfstore.internal.server.exceptions.ClientVersionOutOfDateException: No server versions supplied
	at org.eclipse.emf.emfstore.internal.server.accesscontrol.authentication.verifiers.VersionVerifier.verify(VersionVerifier.java:66)
	at org.eclipse.emf.emfstore.server.test.VersionVerifierTest.testSupplyNoVersions(VersionVerifierTest.java:51)
	at sun.reflect.NativeMethodAccessorImpl.invoke0(Native Method)
	at sun.reflect.NativeMethodAccessorImpl.invoke(NativeMethodAccessorImpl.java:62)
	at sun.reflect.DelegatingMethodAccessorImpl.invoke(DelegatingMethodAccessorImpl.java:43)
	at java.lang.reflect.Method.invoke(Method.java:498)
	at org.junit.runners.model.FrameworkMethod$1.runReflectiveCall(FrameworkMethod.java:47)
	at org.junit.internal.runners.model.ReflectiveCallable.run(ReflectiveCallable.java:12)
	at org.junit.runners.model.FrameworkMethod.invokeExplosively(FrameworkMethod.java:44)
	at org.junit.internal.runners.statements.InvokeMethod.evaluate(InvokeMethod.java:17)
	at org.junit.runners.ParentRunner.runLeaf(ParentRunner.java:271)
	at org.junit.runners.BlockJUnit4ClassRunner.runChild(BlockJUnit4ClassRunner.java:70)
	at org.junit.runners.BlockJUnit4ClassRunner.runChild(BlockJUnit4ClassRunner.java:50)
	at org.junit.runners.ParentRunner$3.run(ParentRunner.java:238)
	at org.junit.runners.ParentRunner$1.schedule(ParentRunner.java:63)
	at org.junit.runners.ParentRunner.runChildren(ParentRunner.java:236)
	at org.junit.runners.ParentRunner.access$000(ParentRunner.java:53)
	at org.junit.runners.ParentRunner$2.evaluate(ParentRunner.java:229)
	at org.junit.runners.ParentRunner.run(ParentRunner.java:309)
	at org.junit.runners.Suite.runChild(Suite.java:127)
	at org.junit.runners.Suite.runChild(Suite.java:26)
	at org.junit.runners.ParentRunner$3.run(ParentRunner.java:238)
	at org.junit.runners.ParentRunner$1.schedule(ParentRunner.java:63)
	at org.junit.runners.ParentRunner.runChildren(ParentRunner.java:236)
	at org.junit.runners.ParentRunner.access$000(ParentRunner.java:53)
	at org.junit.runners.ParentRunner$2.evaluate(ParentRunner.java:229)
	at org.junit.runners.ParentRunner.run(ParentRunner.java:309)
	at org.apache.maven.surefire.junit4.JUnit4Provider.execute(JUnit4Provider.java:264)
	at org.apache.maven.surefire.junit4.JUnit4Provider.executeTestSet(JUnit4Provider.java:153)
	at org.apache.maven.surefire.junit4.JUnit4Provider.invoke(JUnit4Provider.java:124)
	at sun.reflect.NativeMethodAccessorImpl.invoke0(Native Method)
	at sun.reflect.NativeMethodAccessorImpl.invoke(NativeMethodAccessorImpl.java:62)
	at sun.reflect.DelegatingMethodAccessorImpl.invoke(DelegatingMethodAccessorImpl.java:43)
	at java.lang.reflect.Method.invoke(Method.java:498)
	at org.apache.maven.surefire.util.ReflectionUtils.invokeMethodWithArray2(ReflectionUtils.java:208)
	at org.apache.maven.surefire.booter.ProviderFactory$ProviderProxy.invoke(ProviderFactory.java:156)
	at org.apache.maven.surefire.booter.ProviderFactory.invokeProvider(ProviderFactory.java:82)
	at org.eclipse.tycho.surefire.osgibooter.OsgiSurefireBooter.run(OsgiSurefireBooter.java:95)
	at org.eclipse.tycho.surefire.osgibooter.AbstractUITestApplication.runTests(AbstractUITestApplication.java:44)
	at org.eclipse.ui.internal.testing.WorkbenchTestable$1.run(WorkbenchTestable.java:71)
	at java.lang.Thread.run(Thread.java:745)
No server versions supplied
org.eclipse.emf.emfstore.internal.server.exceptions.ClientVersionOutOfDateException: No server versions supplied
	at org.eclipse.emf.emfstore.internal.server.accesscontrol.authentication.verifiers.VersionVerifier.verify(VersionVerifier.java:66)
	at org.eclipse.emf.emfstore.server.test.VersionVerifierTest.testSupplyNoVersions(VersionVerifierTest.java:51)
	at sun.reflect.NativeMethodAccessorImpl.invoke0(Native Method)
	at sun.reflect.NativeMethodAccessorImpl.invoke(NativeMethodAccessorImpl.java:62)
	at sun.reflect.DelegatingMethodAccessorImpl.invoke(DelegatingMethodAccessorImpl.java:43)
	at java.lang.reflect.Method.invoke(Method.java:498)
	at org.junit.runners.model.FrameworkMethod$1.runReflectiveCall(FrameworkMethod.java:47)
	at org.junit.internal.runners.model.ReflectiveCallable.run(ReflectiveCallable.java:12)
	at org.junit.runners.model.FrameworkMethod.invokeExplosively(FrameworkMethod.java:44)
	at org.junit.internal.runners.statements.InvokeMethod.evaluate(InvokeMethod.java:17)
	at org.junit.runners.ParentRunner.runLeaf(ParentRunner.java:271)
	at org.junit.runners.BlockJUnit4ClassRunner.runChild(BlockJUnit4ClassRunner.java:70)
	at org.junit.runners.BlockJUnit4ClassRunner.runChild(BlockJUnit4ClassRunner.java:50)
	at org.junit.runners.ParentRunner$3.run(ParentRunner.java:238)
	at org.junit.runners.ParentRunner$1.schedule(ParentRunner.java:63)
	at org.junit.runners.ParentRunner.runChildren(ParentRunner.java:236)
	at org.junit.runners.ParentRunner.access$000(ParentRunner.java:53)
	at org.junit.runners.ParentRunner$2.evaluate(ParentRunner.java:229)
	at org.junit.runners.ParentRunner.run(ParentRunner.java:309)
	at org.junit.runners.Suite.runChild(Suite.java:127)
	at org.junit.runners.Suite.runChild(Suite.java:26)
	at org.junit.runners.ParentRunner$3.run(ParentRunner.java:238)
	at org.junit.runners.ParentRunner$1.schedule(ParentRunner.java:63)
	at org.junit.runners.ParentRunner.runChildren(ParentRunner.java:236)
	at org.junit.runners.ParentRunner.access$000(ParentRunner.java:53)
	at org.junit.runners.ParentRunner$2.evaluate(ParentRunner.java:229)
	at org.junit.runners.ParentRunner.run(ParentRunner.java:309)
	at org.apache.maven.surefire.junit4.JUnit4Provider.execute(JUnit4Provider.java:264)
	at org.apache.maven.surefire.junit4.JUnit4Provider.executeTestSet(JUnit4Provider.java:153)
	at org.apache.maven.surefire.junit4.JUnit4Provider.invoke(JUnit4Provider.java:124)
	at sun.reflect.NativeMethodAccessorImpl.invoke0(Native Method)
	at sun.reflect.NativeMethodAccessorImpl.invoke(NativeMethodAccessorImpl.java:62)
	at sun.reflect.DelegatingMethodAccessorImpl.invoke(DelegatingMethodAccessorImpl.java:43)
	at java.lang.reflect.Method.invoke(Method.java:498)
	at org.apache.maven.surefire.util.ReflectionUtils.invokeMethodWithArray2(ReflectionUtils.java:208)
	at org.apache.maven.surefire.booter.ProviderFactory$ProviderProxy.invoke(ProviderFactory.java:156)
	at org.apache.maven.surefire.booter.ProviderFactory.invokeProvider(ProviderFactory.java:82)
	at org.eclipse.tycho.surefire.osgibooter.OsgiSurefireBooter.run(OsgiSurefireBooter.java:95)
	at org.eclipse.tycho.surefire.osgibooter.AbstractUITestApplication.runTests(AbstractUITestApplication.java:44)
	at org.eclipse.ui.internal.testing.WorkbenchTestable$1.run(WorkbenchTestable.java:71)
	at java.lang.Thread.run(Thread.java:745)
No server versions supplied
org.eclipse.emf.emfstore.internal.server.exceptions.ClientVersionOutOfDateException: No server versions supplied
	at org.eclipse.emf.emfstore.internal.server.accesscontrol.authentication.verifiers.VersionVerifier.verify(VersionVerifier.java:66)
	at org.eclipse.emf.emfstore.server.test.VersionVerifierTest.testSupplyNoVersions(VersionVerifierTest.java:51)
	at sun.reflect.NativeMethodAccessorImpl.invoke0(Native Method)
	at sun.reflect.NativeMethodAccessorImpl.invoke(NativeMethodAccessorImpl.java:62)
	at sun.reflect.DelegatingMethodAccessorImpl.invoke(DelegatingMethodAccessorImpl.java:43)
	at java.lang.reflect.Method.invoke(Method.java:498)
	at org.junit.runners.model.FrameworkMethod$1.runReflectiveCall(FrameworkMethod.java:47)
	at org.junit.internal.runners.model.ReflectiveCallable.run(ReflectiveCallable.java:12)
	at org.junit.runners.model.FrameworkMethod.invokeExplosively(FrameworkMethod.java:44)
	at org.junit.internal.runners.statements.InvokeMethod.evaluate(InvokeMethod.java:17)
	at org.junit.runners.ParentRunner.runLeaf(ParentRunner.java:271)
	at org.junit.runners.BlockJUnit4ClassRunner.runChild(BlockJUnit4ClassRunner.java:70)
	at org.junit.runners.BlockJUnit4ClassRunner.runChild(BlockJUnit4ClassRunner.java:50)
	at org.junit.runners.ParentRunner$3.run(ParentRunner.java:238)
	at org.junit.runners.ParentRunner$1.schedule(ParentRunner.java:63)
	at org.junit.runners.ParentRunner.runChildren(ParentRunner.java:236)
	at org.junit.runners.ParentRunner.access$000(ParentRunner.java:53)
	at org.junit.runners.ParentRunner$2.evaluate(ParentRunner.java:229)
	at org.junit.runners.ParentRunner.run(ParentRunner.java:309)
	at org.junit.runners.Suite.runChild(Suite.java:127)
	at org.junit.runners.Suite.runChild(Suite.java:26)
	at org.junit.runners.ParentRunner$3.run(ParentRunner.java:238)
	at org.junit.runners.ParentRunner$1.schedule(ParentRunner.java:63)
	at org.junit.runners.ParentRunner.runChildren(ParentRunner.java:236)
	at org.junit.runners.ParentRunner.access$000(ParentRunner.java:53)
	at org.junit.runners.ParentRunner$2.evaluate(ParentRunner.java:229)
	at org.junit.runners.ParentRunner.run(ParentRunner.java:309)
	at org.apache.maven.surefire.junit4.JUnit4Provider.execute(JUnit4Provider.java:264)
	at org.apache.maven.surefire.junit4.JUnit4Provider.executeTestSet(JUnit4Provider.java:153)
	at org.apache.maven.surefire.junit4.JUnit4Provider.invoke(JUnit4Provider.java:124)
	at sun.reflect.NativeMethodAccessorImpl.invoke0(Native Method)
	at sun.reflect.NativeMethodAccessorImpl.invoke(NativeMethodAccessorImpl.java:62)
	at sun.reflect.DelegatingMethodAccessorImpl.invoke(DelegatingMethodAccessorImpl.java:43)
	at java.lang.reflect.Method.invoke(Method.java:498)
	at org.apache.maven.surefire.util.ReflectionUtils.invokeMethodWithArray2(ReflectionUtils.java:208)
	at org.apache.maven.surefire.booter.ProviderFactory$ProviderProxy.invoke(ProviderFactory.java:156)
	at org.apache.maven.surefire.booter.ProviderFactory.invokeProvider(ProviderFactory.java:82)
	at org.eclipse.tycho.surefire.osgibooter.OsgiSurefireBooter.run(OsgiSurefireBooter.java:95)
	at org.eclipse.tycho.surefire.osgibooter.AbstractUITestApplication.runTests(AbstractUITestApplication.java:44)
	at org.eclipse.ui.internal.testing.WorkbenchTestable$1.run(WorkbenchTestable.java:71)
	at java.lang.Thread.run(Thread.java:745)
Tests run: 263, Failures: 0, Errors: 0, Skipped: 9, Time elapsed: 30.39 sec - in org.eclipse.emf.emfstore.server.test.AllServerTests
test(org.eclipse.emf.emfstore.server.test.IntegrationTest)  Time elapsed: 1.322 sec
testLoginOfCreatedUserWithNoPasswordSet(org.eclipse.emf.emfstore.server.test.AdminBrokerTests)  Time elapsed: 0.036 sec
testDeleteGroup(org.eclipse.emf.emfstore.server.test.AdminBrokerTests)  Time elapsed: 0.03 sec
testCreateGroup(org.eclipse.emf.emfstore.server.test.AdminBrokerTests)  Time elapsed: 0.027 sec
testCreateUser(org.eclipse.emf.emfstore.server.test.AdminBrokerTests)  Time elapsed: 0.025 sec
testCreateGroupWithAlreadyExistingName(org.eclipse.emf.emfstore.server.test.AdminBrokerTests)  Time elapsed: 0.025 sec
testDeleteUser(org.eclipse.emf.emfstore.server.test.AdminBrokerTests)  Time elapsed: 0.025 sec
getGroupsPA(org.eclipse.emf.emfstore.server.accesscontrol.test.AdminEMFStoreTests)  Time elapsed: 0.042 sec
getOrgUnitsNotPA(org.eclipse.emf.emfstore.server.accesscontrol.test.AdminEMFStoreTests)  Time elapsed: 0.041 sec
removeMember(org.eclipse.emf.emfstore.server.accesscontrol.test.AdminEMFStoreTests)  Time elapsed: 0.052 sec
removeGroup(org.eclipse.emf.emfstore.server.accesscontrol.test.AdminEMFStoreTests)  Time elapsed: 0.041 sec
addMember(org.eclipse.emf.emfstore.server.accesscontrol.test.AdminEMFStoreTests)  Time elapsed: 0.041 sec
getOrgUnitsPA(org.eclipse.emf.emfstore.server.accesscontrol.test.AdminEMFStoreTests)  Time elapsed: 0.043 sec
getGroupsForOrgUnit(org.eclipse.emf.emfstore.server.accesscontrol.test.AdminEMFStoreTests)  Time elapsed: 0.054 sec
getRoleNotPA(org.eclipse.emf.emfstore.server.accesscontrol.test.AdminEMFStoreTests)  Time elapsed: 0.044 sec
removeGroupAsSA(org.eclipse.emf.emfstore.server.accesscontrol.test.AdminEMFStoreTests)  Time elapsed: 0.042 sec
getGroupsNotPA(org.eclipse.emf.emfstore.server.accesscontrol.test.AdminEMFStoreTests)  Time elapsed: 0.04 sec
getProjectsPA(org.eclipse.emf.emfstore.server.accesscontrol.test.AdminEMFStoreTests)  Time elapsed: 0.073 sec
assignReaderRoleNotPA(org.eclipse.emf.emfstore.server.accesscontrol.test.AssignRoleToOrgUnitTests)  Time elapsed: 0.046 sec
removeParticipantAsPAWithParticipantBeingPAToo(org.eclipse.emf.emfstore.server.accesscontrol.test.AssignRoleToOrgUnitTests)  Time elapsed: 0.053 sec
changeRoleToProjectAdminPA(org.eclipse.emf.emfstore.server.accesscontrol.test.AssignRoleToOrgUnitTests)  Time elapsed: 0.076 sec
changeRoleToWriterAndThenToPAAsPA(org.eclipse.emf.emfstore.server.accesscontrol.test.AssignRoleToOrgUnitTests)  Time elapsed: 0.049 sec
assignWriterRoleNotPA(org.eclipse.emf.emfstore.server.accesscontrol.test.AssignRoleToOrgUnitTests)  Time elapsed: 0.033 sec
changeRoleAsPAWithGroupBeingMemberOfOtherProject(org.eclipse.emf.emfstore.server.accesscontrol.test.AssignRoleToOrgUnitTests)  Time elapsed: 0.055 sec
assignProjectAdminRoleNotPA(org.eclipse.emf.emfstore.server.accesscontrol.test.AssignRoleToOrgUnitTests)  Time elapsed: 0.038 sec
changeRoleToProjectAdminNotPA(org.eclipse.emf.emfstore.server.accesscontrol.test.AssignRoleToOrgUnitTests)  Time elapsed: 0.038 sec
changeRoleAsPAWithUserBeingMemberOfOtherProject(org.eclipse.emf.emfstore.server.accesscontrol.test.AssignRoleToOrgUnitTests)  Time elapsed: 0.057 sec
changeRoleToSAAsPA(org.eclipse.emf.emfstore.server.accesscontrol.test.AssignRoleToOrgUnitTests)  Time elapsed: 0.044 sec
changeRoleToSAAsSA(org.eclipse.emf.emfstore.server.accesscontrol.test.AssignRoleToOrgUnitTests)  Time elapsed: 0.042 sec
assignReaderRolePA(org.eclipse.emf.emfstore.server.accesscontrol.test.AssignRoleToOrgUnitTests)  Time elapsed: 0.033 sec
changeRoleToSAViaGroupAsSA(org.eclipse.emf.emfstore.server.accesscontrol.test.AssignRoleToOrgUnitTests)  Time elapsed: 0.039 sec
getRolePA(org.eclipse.emf.emfstore.server.accesscontrol.test.AssignRoleToOrgUnitTests)  Time elapsed: 0.043 sec
changeRoleAsPAWithUserBeingPAToo(org.eclipse.emf.emfstore.server.accesscontrol.test.AssignRoleToOrgUnitTests)  Time elapsed: 0.042 sec
changeRoleToWriterAsPA(org.eclipse.emf.emfstore.server.accesscontrol.test.AssignRoleToOrgUnitTests)  Time elapsed: 0.044 sec
assignRoleServerAdminPA(org.eclipse.emf.emfstore.server.accesscontrol.test.AssignRoleToOrgUnitTests)  Time elapsed: 0.033 sec
changeRoleToWriterPA(org.eclipse.emf.emfstore.server.accesscontrol.test.AssignRoleToOrgUnitTests)  Time elapsed: 0.037 sec
changeRoleToWriterOnDifferentProjectsAsPA(org.eclipse.emf.emfstore.server.accesscontrol.test.AssignRoleToOrgUnitTests)  Time elapsed: 0.062 sec
assignReaderRoleTwicePA(org.eclipse.emf.emfstore.server.accesscontrol.test.AssignRoleToOrgUnitTests)  Time elapsed: 0.037 sec
assignPAAsPA(org.eclipse.emf.emfstore.server.accesscontrol.test.AssignRoleToOrgUnitTests)  Time elapsed: 0.028 sec
changeRoleToReaderPA(org.eclipse.emf.emfstore.server.accesscontrol.test.AssignRoleToOrgUnitTests)  Time elapsed: 0.038 sec
changeRoleToProjectAdminPA(org.eclipse.emf.emfstore.server.accesscontrol.test.AssignRoleToOrgUnitMissingPrivilegTests)  Time elapsed: 0.052 sec
assignReaderRolePA(org.eclipse.emf.emfstore.server.accesscontrol.test.AssignRoleToOrgUnitMissingPrivilegTests)  Time elapsed: 0.034 sec
assignRoleProjectAdminPA(org.eclipse.emf.emfstore.server.accesscontrol.test.AssignRoleToOrgUnitMissingPrivilegTests)  Time elapsed: 0.028 sec
changeRoleToWriterPA(org.eclipse.emf.emfstore.server.accesscontrol.test.AssignRoleToOrgUnitMissingPrivilegTests)  Time elapsed: 0.039 sec
assignRoleWriterPA(org.eclipse.emf.emfstore.server.accesscontrol.test.AssignRoleToOrgUnitMissingPrivilegTests)  Time elapsed: 0.048 sec
changeRoleToReaderPA(org.eclipse.emf.emfstore.server.accesscontrol.test.AssignRoleToOrgUnitMissingPrivilegTests)  Time elapsed: 0.045 sec
removeMemberFromGroupWhichBelongsToOtherProject(org.eclipse.emf.emfstore.server.accesscontrol.test.AssignOrgUnitToGroupTests)  Time elapsed: 0.065 sec
removeMemberFromGroupWithProject(org.eclipse.emf.emfstore.server.accesscontrol.test.AssignOrgUnitToGroupTests)  Time elapsed: 0.047 sec
removeParticipantPA(org.eclipse.emf.emfstore.server.accesscontrol.test.AssignOrgUnitToGroupTests)  Time elapsed: 0.038 sec
addMemberToGroupWhichBelongsToOtherProject(org.eclipse.emf.emfstore.server.accesscontrol.test.AssignOrgUnitToGroupTests)  Time elapsed: 0.061 sec
removeParticipantNotPA(org.eclipse.emf.emfstore.server.accesscontrol.test.AssignOrgUnitToGroupTests)  Time elapsed: 0.046 sec
addParticipantSAasPA(org.eclipse.emf.emfstore.server.accesscontrol.test.AssignOrgUnitToGroupTests)  Time elapsed: 0.039 sec
addParticipantAsPA(org.eclipse.emf.emfstore.server.accesscontrol.test.AssignOrgUnitToGroupTests)  Time elapsed: 0.04 sec
addParticipantNotPA(org.eclipse.emf.emfstore.server.accesscontrol.test.AssignOrgUnitToGroupTests)  Time elapsed: 0.036 sec
addParticipantTwiceAsPA(org.eclipse.emf.emfstore.server.accesscontrol.test.AssignOrgUnitToGroupTests)  Time elapsed: 0.037 sec
addMemberToGroup(org.eclipse.emf.emfstore.server.accesscontrol.test.AssignOrgUnitToGroupTests)  Time elapsed: 0.03 sec
addReaderToDifferentProjectsAsPA(org.eclipse.emf.emfstore.server.accesscontrol.test.AssignOrgUnitToGroupTests)  Time elapsed: 0.053 sec
removeMemberFromGroupWithProject(org.eclipse.emf.emfstore.server.accesscontrol.test.AssignOrgUnitToGroupMissingPrivilegeTests)  Time elapsed: 0.039 sec
addMemberToGroup(org.eclipse.emf.emfstore.server.accesscontrol.test.AssignOrgUnitToGroupMissingPrivilegeTests)  Time elapsed: 0.03 sec
deleteUserWithExPARoleSucceeds(org.eclipse.emf.emfstore.server.accesscontrol.test.DeleteOrgUnitTest)  Time elapsed: 0.037 sec
deleteGroup(org.eclipse.emf.emfstore.server.accesscontrol.test.DeleteOrgUnitTest)  Time elapsed: 0.057 sec
createGroup(org.eclipse.emf.emfstore.server.accesscontrol.test.DeleteOrgUnitTest)  Time elapsed: 0.031 sec
deleteUserFailsUserIsInTransitiveGroup(org.eclipse.emf.emfstore.server.accesscontrol.test.DeleteOrgUnitTest)  Time elapsed: 0.051 sec
deleteUserFailsIsPartOfNonProjectGroup(org.eclipse.emf.emfstore.server.accesscontrol.test.DeleteOrgUnitTest)  Time elapsed: 0.059 sec
deleteUserAsPAWithUserBeingMemberOfOtherProject(org.eclipse.emf.emfstore.server.accesscontrol.test.DeleteOrgUnitTest)  Time elapsed: 0.055 sec
deleteUserWithPAFails(org.eclipse.emf.emfstore.server.accesscontrol.test.DeleteOrgUnitTest)  Time elapsed: 0.041 sec
deleteCleanupOfOrphanProject(org.eclipse.emf.emfstore.server.accesscontrol.test.DeleteOrgUnitTest)  Time elapsed: 0.039 sec
deleteGroupFailsIsInTransitiveGroup(org.eclipse.emf.emfstore.server.accesscontrol.test.DeleteOrgUnitTest)  Time elapsed: 0.05 sec
deleteGroupSucceedsIsInTransitiveGroup(org.eclipse.emf.emfstore.server.accesscontrol.test.DeleteOrgUnitTest)  Time elapsed: 0.055 sec
deleteGroupBothGroupArePartOfProject(org.eclipse.emf.emfstore.server.accesscontrol.test.DeleteOrgUnitTest)  Time elapsed: 0.069 sec
deleteUserSucceedsUserIsInTransitiveGroup(org.eclipse.emf.emfstore.server.accesscontrol.test.DeleteOrgUnitTest)  Time elapsed: 0.06 sec
deleteUserWithPAFailsSinceStillHasProject(org.eclipse.emf.emfstore.server.accesscontrol.test.DeleteOrgUnitTest)  Time elapsed: 0.052 sec
deleteUser(org.eclipse.emf.emfstore.server.accesscontrol.test.DeleteOrgUnitTest)  Time elapsed: 0.059 sec
deleteGroup(org.eclipse.emf.emfstore.server.accesscontrol.test.DeleteOrgUnitMissingPrivilegeTest)  Time elapsed: 0.052 sec
deleteGroupBothGroupArePartOfProject(org.eclipse.emf.emfstore.server.accesscontrol.test.DeleteOrgUnitMissingPrivilegeTest)  Time elapsed: 0.058 sec
deleteUser(org.eclipse.emf.emfstore.server.accesscontrol.test.DeleteOrgUnitMissingPrivilegeTest)  Time elapsed: 0.056 sec
delteProjectSA(org.eclipse.emf.emfstore.server.accesscontrol.test.DeleteProjectTest)  Time elapsed: 0.042 sec
deleteProjectNotPA(org.eclipse.emf.emfstore.server.accesscontrol.test.DeleteProjectTest)  Time elapsed: 0.028 sec
deleteProjectPA(org.eclipse.emf.emfstore.server.accesscontrol.test.DeleteProjectTest)  Time elapsed: 0.039 sec
delteProjectNotPA(org.eclipse.emf.emfstore.server.accesscontrol.test.DeleteProjectTest)  Time elapsed: 0.031 sec
createGroupNotPA(org.eclipse.emf.emfstore.server.accesscontrol.test.CreateGroupTest)  Time elapsed: 0.026 sec
createGroup(org.eclipse.emf.emfstore.server.accesscontrol.test.CreateGroupTest)  Time elapsed: 0.026 sec
createGroupAlreadyExists(org.eclipse.emf.emfstore.server.accesscontrol.test.CreateGroupTest)  Time elapsed: 0.027 sec
createGroupNotPA(org.eclipse.emf.emfstore.server.accesscontrol.test.CreateGroupMissingPrivilegeTest)  Time elapsed: 0.027 sec
createGroup(org.eclipse.emf.emfstore.server.accesscontrol.test.CreateGroupMissingPrivilegeTest)  Time elapsed: 0.025 sec
letUserNotChangePasswordOfOtherUser(org.eclipse.emf.emfstore.server.accesscontrol.test.ChangePasswordTests)  Time elapsed: 0.033 sec
changePasswordOfOtherPADifferentProjects(org.eclipse.emf.emfstore.server.accesscontrol.test.ChangePasswordTests)  Time elapsed: 0.045 sec
changePasswordGroupOfGroupHasNoProject(org.eclipse.emf.emfstore.server.accesscontrol.test.ChangePasswordTests)  Time elapsed: 0.042 sec
changePasswordOfUser(org.eclipse.emf.emfstore.server.accesscontrol.test.ChangePasswordTests)  Time elapsed: 0.039 sec
changePasswordUserHasNoProject(org.eclipse.emf.emfstore.server.accesscontrol.test.ChangePasswordTests)  Time elapsed: 0.038 sec
changePasswordGroupOfGroupHasMissingProject(org.eclipse.emf.emfstore.server.accesscontrol.test.ChangePasswordTests)  Time elapsed: 0.057 sec
letUserChangeHisPassword(org.eclipse.emf.emfstore.server.accesscontrol.test.ChangePasswordTests)  Time elapsed: 0.042 sec
changePasswordOfOtherPASameProject(org.eclipse.emf.emfstore.server.accesscontrol.test.ChangePasswordTests)  Time elapsed: 0.034 sec
changePasswordUserIsPartOfGroupOfGroup(org.eclipse.emf.emfstore.server.accesscontrol.test.ChangePasswordTests)  Time elapsed: 0.036 sec
shareProjectNotPA(org.eclipse.emf.emfstore.server.accesscontrol.test.CreateProjectTest)  Time elapsed: 0.032 sec
shareProjectPA(org.eclipse.emf.emfstore.server.accesscontrol.test.CreateProjectTest)  Time elapsed: 0.034 sec
shareProjectPA(org.eclipse.emf.emfstore.server.accesscontrol.test.CreateProjectMissingPrivilegTest)  Time elapsed: 0.033 sec
createUserNotPA(org.eclipse.emf.emfstore.server.accesscontrol.test.CreateUserTests)  Time elapsed: 0.028 sec
createUserTwice(org.eclipse.emf.emfstore.server.accesscontrol.test.CreateUserTests)  Time elapsed: 0.028 sec
createUser(org.eclipse.emf.emfstore.server.accesscontrol.test.CreateUserTests)  Time elapsed: 0.028 sec
createUser(org.eclipse.emf.emfstore.server.accesscontrol.test.CreateUserMissingPrivilegTests)  Time elapsed: 0.038 sec
createUserWithPasswordNotPA(org.eclipse.emf.emfstore.server.accesscontrol.test.CreateUserWithPasswordTests)  Time elapsed: 0.031 sec
createUserWithPasswordNotAtomic(org.eclipse.emf.emfstore.server.accesscontrol.test.CreateUserWithPasswordTests)  Time elapsed: 0.042 sec
createUserWithPassword(org.eclipse.emf.emfstore.server.accesscontrol.test.CreateUserWithPasswordTests)  Time elapsed: 0.034 sec
createUserWithPassword(org.eclipse.emf.emfstore.server.accesscontrol.test.CreateUserWithPasswordMissingPrivilegTests)  Time elapsed: 0.028 sec
getGroupsPA(org.eclipse.emf.emfstore.server.accesscontrol.test.AdminEMFStoreTests)  Time elapsed: 0.029 sec
getOrgUnitsNotPA(org.eclipse.emf.emfstore.server.accesscontrol.test.AdminEMFStoreTests)  Time elapsed: 0.028 sec
removeMember(org.eclipse.emf.emfstore.server.accesscontrol.test.AdminEMFStoreTests)  Time elapsed: 0.029 sec
removeGroup(org.eclipse.emf.emfstore.server.accesscontrol.test.AdminEMFStoreTests)  Time elapsed: 0.04 sec
addMember(org.eclipse.emf.emfstore.server.accesscontrol.test.AdminEMFStoreTests)  Time elapsed: 0.029 sec
getOrgUnitsPA(org.eclipse.emf.emfstore.server.accesscontrol.test.AdminEMFStoreTests)  Time elapsed: 0.029 sec
getGroupsForOrgUnit(org.eclipse.emf.emfstore.server.accesscontrol.test.AdminEMFStoreTests)  Time elapsed: 0.029 sec
getRoleNotPA(org.eclipse.emf.emfstore.server.accesscontrol.test.AdminEMFStoreTests)  Time elapsed: 0.029 sec
removeGroupAsSA(org.eclipse.emf.emfstore.server.accesscontrol.test.AdminEMFStoreTests)  Time elapsed: 0.028 sec
getGroupsNotPA(org.eclipse.emf.emfstore.server.accesscontrol.test.AdminEMFStoreTests)  Time elapsed: 0.029 sec
getProjectsPA(org.eclipse.emf.emfstore.server.accesscontrol.test.AdminEMFStoreTests)  Time elapsed: 0.038 sec
shouldSucceedIfAllPrerequisitesAreMet(org.eclipse.emf.emfstore.server.accesscontrol.test.AddInitialParticipantTest)  Time elapsed: 0.044 sec
shouldThrowESExceptionIfRequestingUserDidShareButHasNoProjectAdminRoleAnymore(org.eclipse.emf.emfstore.server.accesscontrol.test.AddInitialParticipantTest)  Time elapsed: 0.043 sec
shouldThrowESExceptionIfRequestingUserDiffersFromUserTheRoleShouldBeAssignedTo(org.eclipse.emf.emfstore.server.accesscontrol.test.AddInitialParticipantTest)  Time elapsed: 0.047 sec
shouldThrowESExceptionIfRequestingUserDidShareAnotherProjectBefore(org.eclipse.emf.emfstore.server.accesscontrol.test.AddInitialParticipantTest)  Time elapsed: 0.066 sec
shouldThrowESExceptionWhenRequestingUserHasNoProjectAdminRole(org.eclipse.emf.emfstore.server.accesscontrol.test.AddInitialParticipantTest)  Time elapsed: 0.043 sec
shouldThrowESExceptionWhenRequestingUserTriesToAssignAServerAdminRole(org.eclipse.emf.emfstore.server.accesscontrol.test.AddInitialParticipantTest)  Time elapsed: 0.039 sec
shouldThrowExceptionIfTryingToCallMethodExplicitely(org.eclipse.emf.emfstore.server.accesscontrol.test.AddInitialParticipantTest)  Time elapsed: 0.041 sec
shouldThrowESExceptionIfRequestingUserDidNotShareProjectBefore(org.eclipse.emf.emfstore.server.accesscontrol.test.AddInitialParticipantTest)  Time elapsed: 0.04 sec
testAutoCreateACUser(org.eclipse.emf.emfstore.server.accesscontrol.test.AutoCreateACUserTestTest)  Time elapsed: 0.028 sec
testHashPasswordSamePasswordDifferentSalts(org.eclipse.emf.emfstore.server.accesscontrol.test.DefaultESPasswordHashGeneratorTests)  Time elapsed: 0.001 sec
testVerifyPasswordNotMatching(org.eclipse.emf.emfstore.server.accesscontrol.test.DefaultESPasswordHashGeneratorTests)  Time elapsed: 0.001 sec
testVerifyPasswordMatching(org.eclipse.emf.emfstore.server.accesscontrol.test.DefaultESPasswordHashGeneratorTests)  Time elapsed: 0.001 sec
testVerifyPasswordInvalidInput(org.eclipse.emf.emfstore.server.accesscontrol.test.DefaultESPasswordHashGeneratorTests)  Time elapsed: 0 sec
testCheckProjectAdminAccessInvalidPrivileg(org.eclipse.emf.emfstore.server.accesscontrol.test.DefaultESAuthorizationServiceTests)  Time elapsed: 0.002 sec
testCheckProjectAdminAccessCannotAdministrate(org.eclipse.emf.emfstore.server.accesscontrol.test.DefaultESAuthorizationServiceTests)  Time elapsed: 0 sec
testCheckProjectAdminAccessCanAdministrateByUser(org.eclipse.emf.emfstore.server.accesscontrol.test.DefaultESAuthorizationServiceTests)  Time elapsed: 0 sec
testCheckProjectAdminAccessInvalidUserSession(org.eclipse.emf.emfstore.server.accesscontrol.test.DefaultESAuthorizationServiceTests)  Time elapsed: 0.001 sec
testCheckProjectAdminAccessServerAdminViaGroup(org.eclipse.emf.emfstore.server.accesscontrol.test.DefaultESAuthorizationServiceTests)  Time elapsed: 0 sec
testCheckProjectAdminAccessServerAdminDirect(org.eclipse.emf.emfstore.server.accesscontrol.test.DefaultESAuthorizationServiceTests)  Time elapsed: 0 sec
testCheckProjectAdminAccessCanAdministrateByGroup(org.eclipse.emf.emfstore.server.accesscontrol.test.DefaultESAuthorizationServiceTests)  Time elapsed: 0 sec
testCheckProjectAdminAccessNotProjectAdmin(org.eclipse.emf.emfstore.server.accesscontrol.test.DefaultESAuthorizationServiceTests)  Time elapsed: 0 sec
testCheckProjectAdminAccessNoProjectId(org.eclipse.emf.emfstore.server.accesscontrol.test.DefaultESAuthorizationServiceTests)  Time elapsed: 0.001 sec
createBranchFromTrunkWithChanges(org.eclipse.emf.emfstore.server.test.BranchTests)  Time elapsed: 0.1 sec
backmergeBranchToBranch(org.eclipse.emf.emfstore.server.test.BranchTests)  Time elapsed: 0.277 sec
backmergeMultipleCP(org.eclipse.emf.emfstore.server.test.BranchTests)  Time elapsed: 0.134 sec
createBranchFromTrunk(org.eclipse.emf.emfstore.server.test.BranchTests)  Time elapsed: 0.055 sec
updateFromBranch(org.eclipse.emf.emfstore.server.test.BranchTests)  Time elapsed: 0.112 sec
backmergeWithShortCut(org.eclipse.emf.emfstore.server.test.BranchTests)  Time elapsed: 0.164 sec
checkoutBranch(org.eclipse.emf.emfstore.server.test.BranchTests)  Time elapsed: 0.079 sec
tagBranch(org.eclipse.emf.emfstore.server.test.BranchTests)  Time elapsed: 0.057 sec
commitToBranch(org.eclipse.emf.emfstore.server.test.BranchTests)  Time elapsed: 0.069 sec
untagBranch(org.eclipse.emf.emfstore.server.test.BranchTests)  Time elapsed: 0.049 sec
backmerge(org.eclipse.emf.emfstore.server.test.BranchTests)  Time elapsed: 0.085 sec
createBranchFromBranch(org.eclipse.emf.emfstore.server.test.BranchTests)  Time elapsed: 0.074 sec
testResolveBranchVersionSpec(org.eclipse.emf.emfstore.server.test.ServerInterfaceTest)  Time elapsed: 0.099 sec
testResolveAncestorVersionSpec(org.eclipse.emf.emfstore.server.test.ServerInterfaceTest)  Time elapsed: 0.078 sec
testCreateEmptyProject(org.eclipse.emf.emfstore.server.test.ServerInterfaceTest)  Time elapsed: 0.025 sec
testGetProjectWithNullProjectId(org.eclipse.emf.emfstore.server.test.ServerInterfaceTest)  Time elapsed: 0.025 sec
testCreateVersion(org.eclipse.emf.emfstore.server.test.ServerInterfaceTest)  Time elapsed: 0.03 sec
testGetVersion(org.eclipse.emf.emfstore.server.test.ServerInterfaceTest)  Time elapsed: 0.021 sec
testResolvePagedUpdateVersionSpec(org.eclipse.emf.emfstore.server.test.ServerInterfaceTest)  Time elapsed: 0.089 sec
testERegisterEPackage(org.eclipse.emf.emfstore.server.test.ServerInterfaceTest) skipped
testResolveTagVersionSpec(org.eclipse.emf.emfstore.server.test.ServerInterfaceTest)  Time elapsed: 0.099 sec
testGetChanges(org.eclipse.emf.emfstore.server.test.ServerInterfaceTest)  Time elapsed: 0.061 sec
testAddTag(org.eclipse.emf.emfstore.server.test.ServerInterfaceTest)  Time elapsed: 0.099 sec
testResolveDateVersionSpec(org.eclipse.emf.emfstore.server.test.ServerInterfaceTest)  Time elapsed: 0.086 sec
testDeleteProject(org.eclipse.emf.emfstore.server.test.ServerInterfaceTest)  Time elapsed: 0.064 sec
testGetProjectWithInvalidProjectId(org.eclipse.emf.emfstore.server.test.ServerInterfaceTest)  Time elapsed: 0.023 sec
rangequeryIncludeCp(org.eclipse.emf.emfstore.server.test.HistoryAPITests)  Time elapsed: 0.015 sec
rangeQuery(org.eclipse.emf.emfstore.server.test.HistoryAPITests)  Time elapsed: 0.003 sec
rangequeryOutgoing(org.eclipse.emf.emfstore.server.test.HistoryAPITests)  Time elapsed: 0.002 sec
rangequeryIncoming(org.eclipse.emf.emfstore.server.test.HistoryAPITests)  Time elapsed: 0.003 sec
invalidPathQuery(org.eclipse.emf.emfstore.server.test.HistoryAPITests)  Time elapsed: 0.006 sec
rangequeryNoLower(org.eclipse.emf.emfstore.server.test.HistoryAPITests)  Time elapsed: 0.003 sec
rangequeryNoUpper(org.eclipse.emf.emfstore.server.test.HistoryAPITests)  Time elapsed: 0.002 sec
pathQueryInverse(org.eclipse.emf.emfstore.server.test.HistoryAPITests)  Time elapsed: 0.003 sec
modelElementQueryWithIncludingChangePackages(org.eclipse.emf.emfstore.server.test.HistoryAPITests)  Time elapsed: 0.976 sec
pathQuery(org.eclipse.emf.emfstore.server.test.HistoryAPITests)  Time elapsed: 0.002 sec
meQueryDifferentBranchIncludeAll(org.eclipse.emf.emfstore.server.test.HistoryAPITests)  Time elapsed: 0.003 sec
meQuery(org.eclipse.emf.emfstore.server.test.HistoryAPITests)  Time elapsed: 0.003 sec
rangequeryAllVersions(org.eclipse.emf.emfstore.server.test.HistoryAPITests)  Time elapsed: 0.003 sec
modelElementQueryWithoutIncludingChangePackages(org.eclipse.emf.emfstore.server.test.HistoryAPITests)  Time elapsed: 0.288 sec
getSingleVersionViaRangeQuery(org.eclipse.emf.emfstore.server.test.HistoryAPITests)  Time elapsed: 0.084 sec
rangequeryLimitZero(org.eclipse.emf.emfstore.server.test.HistoryAPITests)  Time elapsed: 0.003 sec
meQueryDifferentBranch(org.eclipse.emf.emfstore.server.test.HistoryAPITests)  Time elapsed: 0.003 sec
meQueryLimit(org.eclipse.emf.emfstore.server.test.HistoryAPITests)  Time elapsed: 0.003 sec
pathQueryAllVersions(org.eclipse.emf.emfstore.server.test.HistoryAPITests)  Time elapsed: 0.002 sec
verifyUser(org.eclipse.emf.emfstore.server.test.LoginServiceTest)  Time elapsed: 0.039 sec
setCertificateAliasOnServerAndLogin(org.eclipse.emf.emfstore.server.test.ChangeCertificationTest)  Time elapsed: 0.038 sec
setDefaultCertificateAndLogin(org.eclipse.emf.emfstore.server.test.ChangeCertificationTest)  Time elapsed: 5.054 sec
testChangeTrackingAfterAutocorrectErrorHandler(org.eclipse.emf.emfstore.server.test.ChecksumTest) skipped
testCorruptChecksumsAtUpdateWithLocalOperation(org.eclipse.emf.emfstore.server.test.ChecksumTest) skipped
testCancelErrorHandlerAtCommit(org.eclipse.emf.emfstore.server.test.ChecksumTest) skipped
testAutocorrectErrorHandlerAtCommit(org.eclipse.emf.emfstore.server.test.ChecksumTest) skipped
testOrderOfRootElementsInvariance(org.eclipse.emf.emfstore.server.test.ChecksumTest) skipped
testCancelErrorHandlerAtUpdateAfterOneCommit(org.eclipse.emf.emfstore.server.test.ChecksumTest) skipped
testCorrectChecksumsAtUpdate(org.eclipse.emf.emfstore.server.test.ChecksumTest) skipped
testRevert(org.eclipse.emf.emfstore.server.test.ChecksumTest) skipped
testTransferWithBlocking(org.eclipse.emf.emfstore.server.test.FileManagerTest)  Time elapsed: 0.143 sec
testTransfer(org.eclipse.emf.emfstore.server.test.FileManagerTest)  Time elapsed: 0.627 sec
getProjectTest(org.eclipse.emf.emfstore.server.test.InvalidArgumentsTest)  Time elapsed: 0.033 sec
createProject2Test(org.eclipse.emf.emfstore.server.test.InvalidArgumentsTest)  Time elapsed: 0.013 sec
deleteProjectTest(org.eclipse.emf.emfstore.server.test.InvalidArgumentsTest)  Time elapsed: 0.014 sec
removeTagTest(org.eclipse.emf.emfstore.server.test.InvalidArgumentsTest)  Time elapsed: 0.01 sec
createProjectTest(org.eclipse.emf.emfstore.server.test.InvalidArgumentsTest)  Time elapsed: 0.01 sec
addTagTest(org.eclipse.emf.emfstore.server.test.InvalidArgumentsTest)  Time elapsed: 0.009 sec
getHistoryInfoTest(org.eclipse.emf.emfstore.server.test.InvalidArgumentsTest)  Time elapsed: 0.008 sec
createVersionTest(org.eclipse.emf.emfstore.server.test.InvalidArgumentsTest)  Time elapsed: 0.011 sec
getChangesTest(org.eclipse.emf.emfstore.server.test.InvalidArgumentsTest)  Time elapsed: 0.01 sec
testSharedProperties(org.eclipse.emf.emfstore.server.test.PropertiesTest)  Time elapsed: 0.107 sec
testLocalProperties(org.eclipse.emf.emfstore.server.test.PropertiesTest)  Time elapsed: 0.096 sec
testVersionedProperty(org.eclipse.emf.emfstore.server.test.PropertiesTest)  Time elapsed: 0.094 sec
createBranchFromTrunkWithChanges(org.eclipse.emf.emfstore.server.test.BranchTests)  Time elapsed: 0.061 sec
backmergeBranchToBranch(org.eclipse.emf.emfstore.server.test.BranchTests)  Time elapsed: 0.119 sec
backmergeMultipleCP(org.eclipse.emf.emfstore.server.test.BranchTests)  Time elapsed: 0.13 sec
createBranchFromTrunk(org.eclipse.emf.emfstore.server.test.BranchTests)  Time elapsed: 0.053 sec
updateFromBranch(org.eclipse.emf.emfstore.server.test.BranchTests)  Time elapsed: 0.093 sec
backmergeWithShortCut(org.eclipse.emf.emfstore.server.test.BranchTests)  Time elapsed: 0.173 sec
checkoutBranch(org.eclipse.emf.emfstore.server.test.BranchTests)  Time elapsed: 0.08 sec
tagBranch(org.eclipse.emf.emfstore.server.test.BranchTests)  Time elapsed: 0.056 sec
commitToBranch(org.eclipse.emf.emfstore.server.test.BranchTests)  Time elapsed: 0.069 sec
untagBranch(org.eclipse.emf.emfstore.server.test.BranchTests)  Time elapsed: 0.053 sec
backmerge(org.eclipse.emf.emfstore.server.test.BranchTests)  Time elapsed: 0.086 sec
createBranchFromBranch(org.eclipse.emf.emfstore.server.test.BranchTests)  Time elapsed: 0.065 sec
rangequeryIncludeCp(org.eclipse.emf.emfstore.server.test.HistoryAPITests)  Time elapsed: 0.004 sec
rangeQuery(org.eclipse.emf.emfstore.server.test.HistoryAPITests)  Time elapsed: 0.003 sec
rangequeryOutgoing(org.eclipse.emf.emfstore.server.test.HistoryAPITests)  Time elapsed: 0.002 sec
rangequeryIncoming(org.eclipse.emf.emfstore.server.test.HistoryAPITests)  Time elapsed: 0.003 sec
invalidPathQuery(org.eclipse.emf.emfstore.server.test.HistoryAPITests)  Time elapsed: 0.003 sec
rangequeryNoLower(org.eclipse.emf.emfstore.server.test.HistoryAPITests)  Time elapsed: 0.002 sec
rangequeryNoUpper(org.eclipse.emf.emfstore.server.test.HistoryAPITests)  Time elapsed: 0.002 sec
pathQueryInverse(org.eclipse.emf.emfstore.server.test.HistoryAPITests)  Time elapsed: 0.002 sec
modelElementQueryWithIncludingChangePackages(org.eclipse.emf.emfstore.server.test.HistoryAPITests)  Time elapsed: 0.1 sec
pathQuery(org.eclipse.emf.emfstore.server.test.HistoryAPITests)  Time elapsed: 0.004 sec
meQueryDifferentBranchIncludeAll(org.eclipse.emf.emfstore.server.test.HistoryAPITests)  Time elapsed: 0.003 sec
meQuery(org.eclipse.emf.emfstore.server.test.HistoryAPITests)  Time elapsed: 0.002 sec
rangequeryAllVersions(org.eclipse.emf.emfstore.server.test.HistoryAPITests)  Time elapsed: 0.003 sec
modelElementQueryWithoutIncludingChangePackages(org.eclipse.emf.emfstore.server.test.HistoryAPITests)  Time elapsed: 0.104 sec
getSingleVersionViaRangeQuery(org.eclipse.emf.emfstore.server.test.HistoryAPITests)  Time elapsed: 0.107 sec
rangequeryLimitZero(org.eclipse.emf.emfstore.server.test.HistoryAPITests)  Time elapsed: 0.002 sec
meQueryDifferentBranch(org.eclipse.emf.emfstore.server.test.HistoryAPITests)  Time elapsed: 0.003 sec
meQueryLimit(org.eclipse.emf.emfstore.server.test.HistoryAPITests)  Time elapsed: 0.003 sec
pathQueryAllVersions(org.eclipse.emf.emfstore.server.test.HistoryAPITests)  Time elapsed: 0.002 sec
resolveNearestPrimary(org.eclipse.emf.emfstore.server.test.VersionSpecTests)  Time elapsed: 0.233 sec
resolveBranch(org.eclipse.emf.emfstore.server.test.VersionSpecTests)  Time elapsed: 0.211 sec
resolvePagedUpdateVersionSpec(org.eclipse.emf.emfstore.server.test.VersionSpecTests)  Time elapsed: 0.262 sec
resolveIllegalHead(org.eclipse.emf.emfstore.server.test.VersionSpecTests)  Time elapsed: 0.229 sec
resolvePrimaryInvalid(org.eclipse.emf.emfstore.server.test.VersionSpecTests)  Time elapsed: 0.257 sec
resolveLocalHead(org.eclipse.emf.emfstore.server.test.VersionSpecTests)  Time elapsed: 0.248 sec
resolvePrimaryGlobal(org.eclipse.emf.emfstore.server.test.VersionSpecTests)  Time elapsed: 0.271 sec
resolveGlobalHead(org.eclipse.emf.emfstore.server.test.VersionSpecTests)  Time elapsed: 0.213 sec
resolvePrimary(org.eclipse.emf.emfstore.server.test.VersionSpecTests)  Time elapsed: 0.202 sec
testInspectClientVersionOutOfDateMessage(org.eclipse.emf.emfstore.server.test.VersionVerifierTest)  Time elapsed: 0.001 sec
testMatchesWildcardWithSuffix(org.eclipse.emf.emfstore.server.test.VersionVerifierTest)  Time elapsed: 0 sec
testInspectClientVersionOutOfDateMessages(org.eclipse.emf.emfstore.server.test.VersionVerifierTest)  Time elapsed: 0 sec
testVerifyNull(org.eclipse.emf.emfstore.server.test.VersionVerifierTest)  Time elapsed: 0 sec
testMatchesNotWildcard1(org.eclipse.emf.emfstore.server.test.VersionVerifierTest)  Time elapsed: 0.001 sec
testMatchesNotWildcard2(org.eclipse.emf.emfstore.server.test.VersionVerifierTest)  Time elapsed: 0 sec
testMatchesNotWildcard3(org.eclipse.emf.emfstore.server.test.VersionVerifierTest)  Time elapsed: 0 sec
testMatchesNotWildcardWithSuffix1(org.eclipse.emf.emfstore.server.test.VersionVerifierTest)  Time elapsed: 0 sec
testMatchesNotWildcardWithSuffix2(org.eclipse.emf.emfstore.server.test.VersionVerifierTest)  Time elapsed: 0 sec
testMatchesNotWildcardWithSuffix3(org.eclipse.emf.emfstore.server.test.VersionVerifierTest)  Time elapsed: 0 sec
testMatchesWildcard(org.eclipse.emf.emfstore.server.test.VersionVerifierTest)  Time elapsed: 0 sec
testSupplyNoVersions(org.eclipse.emf.emfstore.server.test.VersionVerifierTest)  Time elapsed: 0.004 sec
testMatchesAny(org.eclipse.emf.emfstore.server.test.VersionVerifierTest)  Time elapsed: 0 sec
testMathesOneOfMany(org.eclipse.emf.emfstore.server.test.VersionVerifierTest)  Time elapsed: 0 sec
testMathesOne(org.eclipse.emf.emfstore.server.test.VersionVerifierTest)  Time elapsed: 0 sec

Results :

Tests run: 263, Failures: 0, Errors: 0, Skipped: 9

[INFO] All tests passed!
[INFO]                                                                         
[INFO] ------------------------------------------------------------------------
[INFO] Building org.eclipse.emf.emfstore.test.feature 1.9.0-SNAPSHOT
[INFO] ------------------------------------------------------------------------
[INFO] 
[INFO] --- maven-clean-plugin:2.5:clean (default-clean) @ org.eclipse.emf.emfstore.test.feature ---
[INFO] Deleting /jobs/genie.emfstore/gerrit-transactional/workspace/features/org.eclipse.emf.emfstore.test.feature/target
[INFO] 
[INFO] --- tycho-packaging-plugin:1.0.0:build-qualifier-aggregator (default-build-qualifier-aggregator) @ org.eclipse.emf.emfstore.test.feature ---
[INFO] The project's OSGi version is 1.9.0.v20170530-1358
[INFO] 
[INFO] --- tycho-packaging-plugin:1.0.0:validate-id (default-validate-id) @ org.eclipse.emf.emfstore.test.feature ---
[INFO] 
[INFO] --- tycho-packaging-plugin:1.0.0:validate-version (default-validate-version) @ org.eclipse.emf.emfstore.test.feature ---
[INFO] 
[INFO] --- jacoco-maven-plugin:0.7.4.201502262128:prepare-agent (jacoco-initialize) @ org.eclipse.emf.emfstore.test.feature ---
[INFO] argLine set to -javaagent:/home/hudson/genie.emfstore/.hudson/jobs/gerrit-transactional/workspace/.maven/repo/org/jacoco/org.jacoco.agent/0.7.4.201502262128/org.jacoco.agent-0.7.4.201502262128-runtime.jar=destfile=/jobs/genie.emfstore/gerrit-transactional/workspace/tests/coverage/jacoco.exec,append=true
[INFO] 
[INFO] --- maven-checkstyle-plugin:2.10:check (checkstyle) @ org.eclipse.emf.emfstore.test.feature ---
[INFO] 
[INFO] 
[INFO] --- tycho-source-plugin:1.0.0:plugin-source (plugin-source) @ org.eclipse.emf.emfstore.test.feature ---
[INFO] 
[INFO] --- target-platform-configuration:1.0.0:target-platform (default-target-platform) @ org.eclipse.emf.emfstore.test.feature ---
[INFO] 
[INFO] --- tycho-packaging-plugin:1.0.0:package-feature (default-package-feature) @ org.eclipse.emf.emfstore.test.feature ---
[INFO] Building jar: /jobs/genie.emfstore/gerrit-transactional/workspace/features/org.eclipse.emf.emfstore.test.feature/target/org.eclipse.emf.emfstore.test.feature-1.9.0-SNAPSHOT.jar
[INFO] 
[INFO] --- tycho-p2-plugin:1.0.0:p2-metadata-default (default-p2-metadata-default) @ org.eclipse.emf.emfstore.test.feature ---
[INFO] 
[INFO] --- tycho-p2-plugin:1.0.0:feature-p2-metadata (default-feature-p2-metadata) @ org.eclipse.emf.emfstore.test.feature ---
[INFO] 
[INFO] --- tycho-source-feature-plugin:1.0.0:source-feature (source-feature) @ org.eclipse.emf.emfstore.test.feature ---
[INFO] Building jar: /jobs/genie.emfstore/gerrit-transactional/workspace/features/org.eclipse.emf.emfstore.test.feature/target/org.eclipse.emf.emfstore.test.feature-1.9.0-SNAPSHOT-sources-feature.jar
[INFO] 
[INFO] --- tycho-p2-plugin:1.0.0:p2-metadata (attach-p2-metadata) @ org.eclipse.emf.emfstore.test.feature ---
[INFO] 
[INFO] --- tycho-p2-plugin:1.0.0:p2-metadata (attached-p2-metadata) @ org.eclipse.emf.emfstore.test.feature ---
[INFO]                                                                         
[INFO] ------------------------------------------------------------------------
[INFO] Building org.eclipse.emf.emfstore.client.example.test 1.9.0-SNAPSHOT
[INFO] ------------------------------------------------------------------------
[INFO] 
[INFO] --- maven-clean-plugin:2.5:clean (default-clean) @ org.eclipse.emf.emfstore.client.example.test ---
[INFO] 
[INFO] --- tycho-packaging-plugin:1.0.0:build-qualifier (default-build-qualifier) @ org.eclipse.emf.emfstore.client.example.test ---
[INFO] The project's OSGi version is 1.9.0.v20170530-1358
[INFO] 
[INFO] --- tycho-packaging-plugin:1.0.0:validate-id (default-validate-id) @ org.eclipse.emf.emfstore.client.example.test ---
[INFO] 
[INFO] --- tycho-packaging-plugin:1.0.0:validate-version (default-validate-version) @ org.eclipse.emf.emfstore.client.example.test ---
[INFO] 
[INFO] --- jacoco-maven-plugin:0.7.4.201502262128:prepare-agent (jacoco-initialize) @ org.eclipse.emf.emfstore.client.example.test ---
[INFO] tycho.testArgLine set to -javaagent:/home/hudson/genie.emfstore/.hudson/jobs/gerrit-transactional/workspace/.maven/repo/org/jacoco/org.jacoco.agent/0.7.4.201502262128/org.jacoco.agent-0.7.4.201502262128-runtime.jar=destfile=/jobs/genie.emfstore/gerrit-transactional/workspace/tests/coverage/jacoco.exec,append=true
[INFO] 
[INFO] --- maven-resources-plugin:2.4.3:resources (default-resources) @ org.eclipse.emf.emfstore.client.example.test ---
[INFO] Using 'UTF-8' encoding to copy filtered resources.
[INFO] skip non existing resourceDirectory /jobs/genie.emfstore/gerrit-transactional/workspace/tests/org.eclipse.emf.emfstore.client.example.test/src/main/resources
[INFO] 
[INFO] --- tycho-compiler-plugin:1.0.0:compile (default-compile) @ org.eclipse.emf.emfstore.client.example.test ---
[INFO] Compiling 1 source file to /jobs/genie.emfstore/gerrit-transactional/workspace/tests/org.eclipse.emf.emfstore.client.example.test/bin
[INFO] 
[INFO] --- maven-checkstyle-plugin:2.10:check (checkstyle) @ org.eclipse.emf.emfstore.client.example.test ---
[INFO] 
[INFO] 
[INFO] --- maven-resources-plugin:2.4.3:testResources (default-testResources) @ org.eclipse.emf.emfstore.client.example.test ---
[INFO] Using 'UTF-8' encoding to copy filtered resources.
[INFO] skip non existing resourceDirectory /jobs/genie.emfstore/gerrit-transactional/workspace/tests/org.eclipse.emf.emfstore.client.example.test/src/test/resources
[INFO] 
[INFO] --- tycho-source-plugin:1.0.0:plugin-source (plugin-source) @ org.eclipse.emf.emfstore.client.example.test ---
[WARNING] bundle localization file /jobs/genie.emfstore/gerrit-transactional/workspace/tests/org.eclipse.emf.emfstore.client.example.test/plugin.properties not found
[WARNING] Bundle-Vendor header not found in /jobs/genie.emfstore/gerrit-transactional/workspace/tests/org.eclipse.emf.emfstore.client.example.test/META-INF/MANIFEST.MF, fallback to 'unknown' for source bundle
[INFO] Building jar: /jobs/genie.emfstore/gerrit-transactional/workspace/tests/org.eclipse.emf.emfstore.client.example.test/target/org.eclipse.emf.emfstore.client.example.test-1.9.0-SNAPSHOT-sources.jar
[INFO] 
[INFO] --- target-platform-configuration:1.0.0:target-platform (default-target-platform) @ org.eclipse.emf.emfstore.client.example.test ---
[INFO] 
[INFO] --- tycho-packaging-plugin:1.0.0:package-plugin (default-package-plugin) @ org.eclipse.emf.emfstore.client.example.test ---
[INFO] Building jar: /jobs/genie.emfstore/gerrit-transactional/workspace/tests/org.eclipse.emf.emfstore.client.example.test/target/org.eclipse.emf.emfstore.client.example.test-1.9.0-SNAPSHOT.jar
[INFO] 
[INFO] --- tycho-p2-plugin:1.0.0:p2-metadata-default (default-p2-metadata-default) @ org.eclipse.emf.emfstore.client.example.test ---
[INFO] 
[INFO] --- tycho-surefire-plugin:1.0.0:test (default-test) @ org.eclipse.emf.emfstore.client.example.test ---
[INFO] Expected eclipse log file: /jobs/genie.emfstore/gerrit-transactional/workspace/tests/org.eclipse.emf.emfstore.client.example.test/target/work/data/.metadata/.log
[INFO] Command line:
	[/opt/public/common/jdk1.8.0_121.x64/jre/bin/java, -Dosgi.noShutdown=false, -Dosgi.os=linux, -Dosgi.ws=gtk, -Dosgi.arch=x86_64, -javaagent:/home/hudson/genie.emfstore/.hudson/jobs/gerrit-transactional/workspace/.maven/repo/org/jacoco/org.jacoco.agent/0.7.4.201502262128/org.jacoco.agent-0.7.4.201502262128-runtime.jar=destfile=/jobs/genie.emfstore/gerrit-transactional/workspace/tests/coverage/jacoco.exec,append=true, -Dosgi.requiredJavaVersion=1.5, -Demfstore.inMemoryChangePackage=true, -Demfstore.server.fileBasedChangePackage=false, -Xms40m, -Xmx512m, -Dosgi.clean=true, -jar, /jobs/genie.emfstore/gerrit-transactional/workspace/.maven/repo/p2/osgi/bundle/org.eclipse.equinox.launcher/1.3.0.v20120522-1813/org.eclipse.equinox.launcher-1.3.0.v20120522-1813.jar, -data, /jobs/genie.emfstore/gerrit-transactional/workspace/tests/org.eclipse.emf.emfstore.client.example.test/target/work/data, -install, /jobs/genie.emfstore/gerrit-transactional/workspace/tests/org.eclipse.emf.emfstore.client.example.test/target/work, -configuration, /jobs/genie.emfstore/gerrit-transactional/workspace/tests/org.eclipse.emf.emfstore.client.example.test/target/work/configuration, -application, org.eclipse.tycho.surefire.osgibooter.uitest, -testproperties, /jobs/genie.emfstore/gerrit-transactional/workspace/tests/org.eclipse.emf.emfstore.client.example.test/target/surefire.properties, -nouithread]

-------------------------------------------------------
 T E S T S
-------------------------------------------------------
Running org.eclipse.emf.emfstore.client.example.test.APIUsedInExampleTest
Transactional Command Stack created
Client starting...
Sharing Project:..........DONE
Fetch:.Commiting changes:......Updating Project...:.....Leagues names and player count are equal.
Commiting changes:.Updating Project...:.Leagues names and player count are still equal.
Client starting...
Commiting changes:......Commiting changes:.
Commit of demoProjectCopy failed.

Update of demoProjectCopy with conflict resolver...
Updating Project...:.....
Commit of merge result of demoProjectCopy
Commiting changes:......
Update of demoProject

League name in demoProject  is now: EU-League

League name in demoProjectCopy  is now: EU-League

Player name in demoProject is now: Johannes

Player name in demoProjectCopy is now: Johannes
Client starting...
Sharing Project:..........DONE
Fetch:.Commiting changes:......Updating Project...:.....Leagues names and player count are equal.
Commiting changes:.Updating Project...:.Leagues names and player count are still equal.
Tests run: 2, Failures: 0, Errors: 0, Skipped: 0, Time elapsed: 2.307 sec - in org.eclipse.emf.emfstore.client.example.test.APIUsedInExampleTest
testMergeExample(org.eclipse.emf.emfstore.client.example.test.APIUsedInExampleTest)  Time elapsed: 0.995 sec
testHelloWorldExample(org.eclipse.emf.emfstore.client.example.test.APIUsedInExampleTest)  Time elapsed: 0.195 sec

Results :

Tests run: 2, Failures: 0, Errors: 0, Skipped: 0

[INFO] All tests passed!
[INFO] 
[INFO] --- tycho-surefire-plugin:1.0.0:test (ClientFileServerMemory) @ org.eclipse.emf.emfstore.client.example.test ---
[INFO] Expected eclipse log file: /jobs/genie.emfstore/gerrit-transactional/workspace/tests/org.eclipse.emf.emfstore.client.example.test/target/work/data/.metadata/.log
[INFO] Command line:
	[/opt/public/common/jdk1.8.0_121.x64/jre/bin/java, -Dosgi.noShutdown=false, -Dosgi.os=linux, -Dosgi.ws=gtk, -Dosgi.arch=x86_64, -javaagent:/home/hudson/genie.emfstore/.hudson/jobs/gerrit-transactional/workspace/.maven/repo/org/jacoco/org.jacoco.agent/0.7.4.201502262128/org.jacoco.agent-0.7.4.201502262128-runtime.jar=destfile=/jobs/genie.emfstore/gerrit-transactional/workspace/tests/coverage/jacoco.exec,append=true, -Dosgi.requiredJavaVersion=1.5, -Demfstore.inMemoryChangePackage=false, -Demfstore.server.fileBasedChangePackage=false, -Xms40m, -Xmx512m, -Dosgi.clean=true, -jar, /jobs/genie.emfstore/gerrit-transactional/workspace/.maven/repo/p2/osgi/bundle/org.eclipse.equinox.launcher/1.3.0.v20120522-1813/org.eclipse.equinox.launcher-1.3.0.v20120522-1813.jar, -data, /jobs/genie.emfstore/gerrit-transactional/workspace/tests/org.eclipse.emf.emfstore.client.example.test/target/work/data, -install, /jobs/genie.emfstore/gerrit-transactional/workspace/tests/org.eclipse.emf.emfstore.client.example.test/target/work, -configuration, /jobs/genie.emfstore/gerrit-transactional/workspace/tests/org.eclipse.emf.emfstore.client.example.test/target/work/configuration, -application, org.eclipse.tycho.surefire.osgibooter.uitest, -testproperties, /jobs/genie.emfstore/gerrit-transactional/workspace/tests/org.eclipse.emf.emfstore.client.example.test/target/surefire.properties, -nouithread]

-------------------------------------------------------
 T E S T S
-------------------------------------------------------
Running org.eclipse.emf.emfstore.client.example.test.APIUsedInExampleTest
Transactional Command Stack created
Client starting...
Sharing Project:..........DONE
Fetch:.Commiting changes:......Updating Project...:.....Leagues names and player count are equal.
Commiting changes:.Updating Project...:.Leagues names and player count are still equal.
Client starting...
Commiting changes:......Commiting changes:.
Commit of demoProjectCopy failed.

Update of demoProjectCopy with conflict resolver...
Updating Project...:.....
Commit of merge result of demoProjectCopy
Commiting changes:......
Update of demoProject

League name in demoProject  is now: EU-League

League name in demoProjectCopy  is now: EU-League

Player name in demoProject is now: Johannes

Player name in demoProjectCopy is now: Johannes
Client starting...
Sharing Project:..........DONE
Fetch:.Commiting changes:......Updating Project...:.....Leagues names and player count are equal.
Commiting changes:.Updating Project...:.Leagues names and player count are still equal.
Tests run: 2, Failures: 0, Errors: 0, Skipped: 0, Time elapsed: 1.952 sec - in org.eclipse.emf.emfstore.client.example.test.APIUsedInExampleTest
testMergeExample(org.eclipse.emf.emfstore.client.example.test.APIUsedInExampleTest)  Time elapsed: 0.975 sec
testHelloWorldExample(org.eclipse.emf.emfstore.client.example.test.APIUsedInExampleTest)  Time elapsed: 0.205 sec

Results :

Tests run: 2, Failures: 0, Errors: 0, Skipped: 0

[INFO] All tests passed!
[INFO]                                                                         
[INFO] ------------------------------------------------------------------------
[INFO] Building org.eclipse.emf.emfstore.client.test.ui 1.9.0-SNAPSHOT
[INFO] ------------------------------------------------------------------------
[INFO] 
[INFO] --- maven-clean-plugin:2.5:clean (default-clean) @ org.eclipse.emf.emfstore.client.test.ui ---
[INFO] 
[INFO] --- tycho-packaging-plugin:1.0.0:build-qualifier (default-build-qualifier) @ org.eclipse.emf.emfstore.client.test.ui ---
[INFO] The project's OSGi version is 1.9.0.v20170530-1358
[INFO] 
[INFO] --- tycho-packaging-plugin:1.0.0:validate-id (default-validate-id) @ org.eclipse.emf.emfstore.client.test.ui ---
[INFO] 
[INFO] --- tycho-packaging-plugin:1.0.0:validate-version (default-validate-version) @ org.eclipse.emf.emfstore.client.test.ui ---
[INFO] 
[INFO] --- jacoco-maven-plugin:0.7.4.201502262128:prepare-agent (jacoco-initialize) @ org.eclipse.emf.emfstore.client.test.ui ---
[INFO] tycho.testArgLine set to -javaagent:/home/hudson/genie.emfstore/.hudson/jobs/gerrit-transactional/workspace/.maven/repo/org/jacoco/org.jacoco.agent/0.7.4.201502262128/org.jacoco.agent-0.7.4.201502262128-runtime.jar=destfile=/jobs/genie.emfstore/gerrit-transactional/workspace/tests/coverage/jacoco.exec,append=true
[INFO] 
[INFO] --- maven-resources-plugin:2.4.3:resources (default-resources) @ org.eclipse.emf.emfstore.client.test.ui ---
[INFO] Using 'UTF-8' encoding to copy filtered resources.
[INFO] skip non existing resourceDirectory /jobs/genie.emfstore/gerrit-transactional/workspace/tests/org.eclipse.emf.emfstore.client.test.ui/src/main/resources
[INFO] 
[INFO] --- tycho-compiler-plugin:1.0.0:compile (default-compile) @ org.eclipse.emf.emfstore.client.test.ui ---
[INFO] Compiling 30 source files to /jobs/genie.emfstore/gerrit-transactional/workspace/tests/org.eclipse.emf.emfstore.client.test.ui/bin
[WARNING] /jobs/genie.emfstore/gerrit-transactional/workspace/tests/org.eclipse.emf.emfstore.client.test.ui/src/org/eclipse/emf/emfstore/client/test/ui/AllUITestsWithMock.java:[19] 
	import org.eclipse.emf.emfstore.internal.server.ServerConfiguration;
	       ^^^^^^^^^^^^^^^^^^^^^^^^^^^^^^^^^^^^^^^^^^^^^^^^^^^^^^^^^^^^
Discouraged access: The type 'ServerConfiguration' is not API (restriction on classpath entry '/jobs/genie.emfstore/gerrit-transactional/workspace/bundles/org.eclipse.emf.emfstore.server/bin')
[WARNING] /jobs/genie.emfstore/gerrit-transactional/workspace/tests/org.eclipse.emf.emfstore.client.test.ui/src/org/eclipse/emf/emfstore/client/test/ui/AllUITestsWithMock.java:[47] 
	serverFragmentSize = ServerConfiguration.getChangePackageFragmentSize();
	                     ^^^^^^^^^^^^^^^^^^^
Discouraged access: The type 'ServerConfiguration' is not API (restriction on classpath entry '/jobs/genie.emfstore/gerrit-transactional/workspace/bundles/org.eclipse.emf.emfstore.server/bin')
[WARNING] /jobs/genie.emfstore/gerrit-transactional/workspace/tests/org.eclipse.emf.emfstore.client.test.ui/src/org/eclipse/emf/emfstore/client/test/ui/AllUITestsWithMock.java:[47] 
	serverFragmentSize = ServerConfiguration.getChangePackageFragmentSize();
	                     ^^^^^^^^^^^^^^^^^^^^^^^^^^^^^^^^^^^^^^^^^^^^^^^^^^
Discouraged access: The method 'ServerConfiguration.getChangePackageFragmentSize()' is not API (restriction on classpath entry '/jobs/genie.emfstore/gerrit-transactional/workspace/bundles/org.eclipse.emf.emfstore.server/bin')
[WARNING] /jobs/genie.emfstore/gerrit-transactional/workspace/tests/org.eclipse.emf.emfstore.client.test.ui/src/org/eclipse/emf/emfstore/client/test/ui/AllUITestsWithMock.java:[51] 
	ServerConfiguration.setChangePackageFragmentSize(
	^^^^^^^^^^^^^^^^^^^
Discouraged access: The type 'ServerConfiguration' is not API (restriction on classpath entry '/jobs/genie.emfstore/gerrit-transactional/workspace/bundles/org.eclipse.emf.emfstore.server/bin')
[WARNING] /jobs/genie.emfstore/gerrit-transactional/workspace/tests/org.eclipse.emf.emfstore.client.test.ui/src/org/eclipse/emf/emfstore/client/test/ui/AllUITestsWithMock.java:[51] 
	ServerConfiguration.setChangePackageFragmentSize(
			Optional.<Integer> absent());
	^^^^^^^^^^^^^^^^^^^^^^^^^^^^^^^^^^^^^^^^^^^^^^^^^^^^^^^^^^^^^^^^^^^^^^^^^^^^^^^^^
Discouraged access: The method 'ServerConfiguration.setChangePackageFragmentSize(Optional<Integer>)' is not API (restriction on classpath entry '/jobs/genie.emfstore/gerrit-transactional/workspace/bundles/org.eclipse.emf.emfstore.server/bin')
[WARNING] /jobs/genie.emfstore/gerrit-transactional/workspace/tests/org.eclipse.emf.emfstore.client.test.ui/src/org/eclipse/emf/emfstore/client/test/ui/AllUITestsWithMock.java:[60] 
	ServerConfiguration.setChangePackageFragmentSize(serverFragmentSize);
	^^^^^^^^^^^^^^^^^^^
Discouraged access: The type 'ServerConfiguration' is not API (restriction on classpath entry '/jobs/genie.emfstore/gerrit-transactional/workspace/bundles/org.eclipse.emf.emfstore.server/bin')
[WARNING] /jobs/genie.emfstore/gerrit-transactional/workspace/tests/org.eclipse.emf.emfstore.client.test.ui/src/org/eclipse/emf/emfstore/client/test/ui/AllUITestsWithMock.java:[60] 
	ServerConfiguration.setChangePackageFragmentSize(serverFragmentSize);
	^^^^^^^^^^^^^^^^^^^^^^^^^^^^^^^^^^^^^^^^^^^^^^^^^^^^^^^^^^^^^^^^^^^^
Discouraged access: The method 'ServerConfiguration.setChangePackageFragmentSize(Optional<Integer>)' is not API (restriction on classpath entry '/jobs/genie.emfstore/gerrit-transactional/workspace/bundles/org.eclipse.emf.emfstore.server/bin')
[WARNING] /jobs/genie.emfstore/gerrit-transactional/workspace/tests/org.eclipse.emf.emfstore.client.test.ui/src/org/eclipse/emf/emfstore/client/test/ui/conflictdetection/BidirectionalConflictMergeTest.java:[58] 
	ESOperationModifier.ID,
	                    ^^
The field ESOperationModifier.ID is deprecated
8 problems (8 warnings)
[INFO] 
[INFO] --- maven-checkstyle-plugin:2.10:check (checkstyle) @ org.eclipse.emf.emfstore.client.test.ui ---
[INFO] 
[INFO] 
[INFO] --- maven-resources-plugin:2.4.3:testResources (default-testResources) @ org.eclipse.emf.emfstore.client.test.ui ---
[INFO] Using 'UTF-8' encoding to copy filtered resources.
[INFO] skip non existing resourceDirectory /jobs/genie.emfstore/gerrit-transactional/workspace/tests/org.eclipse.emf.emfstore.client.test.ui/src/test/resources
[INFO] 
[INFO] --- tycho-source-plugin:1.0.0:plugin-source (plugin-source) @ org.eclipse.emf.emfstore.client.test.ui ---
[INFO] Building jar: /jobs/genie.emfstore/gerrit-transactional/workspace/tests/org.eclipse.emf.emfstore.client.test.ui/target/org.eclipse.emf.emfstore.client.test.ui-1.9.0-SNAPSHOT-sources.jar
[INFO] 
[INFO] --- target-platform-configuration:1.0.0:target-platform (default-target-platform) @ org.eclipse.emf.emfstore.client.test.ui ---
[INFO] 
[INFO] --- tycho-packaging-plugin:1.0.0:package-plugin (default-package-plugin) @ org.eclipse.emf.emfstore.client.test.ui ---
[INFO] Building jar: /jobs/genie.emfstore/gerrit-transactional/workspace/tests/org.eclipse.emf.emfstore.client.test.ui/target/org.eclipse.emf.emfstore.client.test.ui-1.9.0-SNAPSHOT.jar
[INFO] 
[INFO] --- tycho-p2-plugin:1.0.0:p2-metadata-default (default-p2-metadata-default) @ org.eclipse.emf.emfstore.client.test.ui ---
[INFO] 
[INFO] --- tycho-surefire-plugin:1.0.0:test (default-test) @ org.eclipse.emf.emfstore.client.test.ui ---
[INFO] Expected eclipse log file: /jobs/genie.emfstore/gerrit-transactional/workspace/tests/org.eclipse.emf.emfstore.client.test.ui/target/work/data/.metadata/.log
[INFO] Command line:
	[/opt/public/common/jdk1.8.0_121.x64/jre/bin/java, -Dosgi.noShutdown=false, -Dosgi.os=linux, -Dosgi.ws=gtk, -Dosgi.arch=x86_64, -javaagent:/home/hudson/genie.emfstore/.hudson/jobs/gerrit-transactional/workspace/.maven/repo/org/jacoco/org.jacoco.agent/0.7.4.201502262128/org.jacoco.agent-0.7.4.201502262128-runtime.jar=destfile=/jobs/genie.emfstore/gerrit-transactional/workspace/tests/coverage/jacoco.exec,append=true, -Dorg.eclipse.swtbot.search.timeout=30000, -Dosgi.requiredJavaVersion=1.5, -Demfstore.inMemoryChangePackage=true, -Xms40m, -Xmx512m, -Dosgi.clean=true, -jar, /jobs/genie.emfstore/gerrit-transactional/workspace/.maven/repo/p2/osgi/bundle/org.eclipse.equinox.launcher/1.3.0.v20120522-1813/org.eclipse.equinox.launcher-1.3.0.v20120522-1813.jar, -data, /jobs/genie.emfstore/gerrit-transactional/workspace/tests/org.eclipse.emf.emfstore.client.test.ui/target/work/data, -install, /jobs/genie.emfstore/gerrit-transactional/workspace/tests/org.eclipse.emf.emfstore.client.test.ui/target/work, -configuration, /jobs/genie.emfstore/gerrit-transactional/workspace/tests/org.eclipse.emf.emfstore.client.test.ui/target/work/configuration, -application, org.eclipse.tycho.surefire.osgibooter.uitest, -testproperties, /jobs/genie.emfstore/gerrit-transactional/workspace/tests/org.eclipse.emf.emfstore.client.test.ui/target/surefire.properties, -nouithread]

-------------------------------------------------------
 T E S T S
-------------------------------------------------------
Running org.eclipse.emf.emfstore.client.test.ui.AllUITestsWithMock
Transactional Command Stack created
log4j:WARN No appenders could be found for logger (org.eclipse.swtbot.swt.finder.matchers.AbstractMatcher).
log4j:WARN Please initialize the log4j system properly.
Tests run: 22, Failures: 0, Errors: 2, Skipped: 0, Time elapsed: 97.356 sec <<< FAILURE! - in org.eclipse.emf.emfstore.client.test.ui.AllUITestsWithMock
testController(org.eclipse.emf.emfstore.client.test.ui.controllers.NoLocalChangesCommitControllerTest)  Time elapsed: 0.725 sec
testController(org.eclipse.emf.emfstore.client.test.ui.controllers.LocalProjectNeedsToBeUpdatedCommitControllerTest)  Time elapsed: 1.157 sec
testController(org.eclipse.emf.emfstore.client.test.ui.controllers.UIAddTagControllerTest)  Time elapsed: 0.43 sec
testController(org.eclipse.emf.emfstore.client.test.ui.controllers.UIAskForBranchCheckoutControllerTest)  Time elapsed: 0.79 sec
testController(org.eclipse.emf.emfstore.client.test.ui.controllers.UIBranchControllersTest)  Time elapsed: 1.375 sec
testController(org.eclipse.emf.emfstore.client.test.ui.controllers.UICheckoutControllerTest)  Time elapsed: 0.543 sec
testController(org.eclipse.emf.emfstore.client.test.ui.controllers.UICreateRemoteProjectControllerTest)  Time elapsed: 0.145 sec
testController(org.eclipse.emf.emfstore.client.test.ui.controllers.UIDeleteRemoteProjectControllerTest)  Time elapsed: 0.135 sec
testController(org.eclipse.emf.emfstore.client.test.ui.controllers.UIMergeControllerTest)  Time elapsed: 0.531 sec
testController(org.eclipse.emf.emfstore.client.test.ui.controllers.UIRevertCommitControllerTest)  Time elapsed: 0.287 sec
testController(org.eclipse.emf.emfstore.client.test.ui.controllers.UIRemoveServerControllerTest)  Time elapsed: 0.145 sec
testController(org.eclipse.emf.emfstore.client.test.ui.controllers.UIRevertCommitControllerTest2)  Time elapsed: 0.789 sec
testController(org.eclipse.emf.emfstore.client.test.ui.controllers.UIServerControllerTest)  Time elapsed: 0.275 sec
testController(org.eclipse.emf.emfstore.client.test.ui.controllers.UISessionControllerTest)  Time elapsed: 30.313 sec  <<< ERROR!
org.eclipse.swtbot.swt.finder.exceptions.WidgetNotFoundException: Could not find widget matching: (of type 'Button' and with mnemonic 'OK' and with style 'SWT.PUSH')
	at org.eclipse.swtbot.swt.finder.SWTBotFactory.waitUntil(SWTBotFactory.java:437)
	at org.eclipse.swtbot.swt.finder.SWTBotFactory.waitUntil(SWTBotFactory.java:411)
	at org.eclipse.swtbot.swt.finder.SWTBotFactory.waitUntil(SWTBotFactory.java:399)
	at org.eclipse.swtbot.swt.finder.SWTBotFactory.waitUntilWidgetAppears(SWTBotFactory.java:381)
	at org.eclipse.swtbot.swt.finder.SWTBotFactory.widget(SWTBotFactory.java:334)
	at org.eclipse.swtbot.swt.finder.SWTBot.button(SWTBot.java:184)
	at org.eclipse.swtbot.swt.finder.SWTBot.button(SWTBot.java:172)
	at org.eclipse.emf.emfstore.client.test.ui.controllers.UISessionControllerTest.login(UISessionControllerTest.java:54)
	at org.eclipse.emf.emfstore.client.test.ui.controllers.UISessionControllerTest.testController(UISessionControllerTest.java:37)

testController(org.eclipse.emf.emfstore.client.test.ui.controllers.UIShareProjectControllerTest)  Time elapsed: 0.654 sec
testController(org.eclipse.emf.emfstore.client.test.ui.controllers.UIUpdateProjectControllerTest)  Time elapsed: 2.004 sec
testController(org.eclipse.emf.emfstore.client.test.ui.controllers.UIUpdateProjectToVersionControllerTest)  Time elapsed: 7.308 sec
testController(org.eclipse.emf.emfstore.client.test.ui.controllers.UIPagedUpdateProjectControllerTest)  Time elapsed: 8.149 sec
testController(org.eclipse.emf.emfstore.client.test.ui.controllers.UIShowHistoryControllerTest)  Time elapsed: 1.535 sec
testController(org.eclipse.emf.emfstore.client.test.ui.controllers.UIShowHistoryControllerForElementTest)  Time elapsed: 1.469 sec
testController(org.eclipse.emf.emfstore.client.test.ui.controllers.UIUndoLastOperationControllerTest)  Time elapsed: 0.576 sec
testController(org.eclipse.emf.emfstore.client.test.ui.conflictdetection.BidirectionalConflictMergeTest)  Time elapsed: 36.458 sec  <<< ERROR!
org.eclipse.swtbot.swt.finder.widgets.TimeoutException: Timeout after: 30000 ms.: Merge wizard did not appear
	at org.eclipse.swtbot.swt.finder.SWTBotFactory.waitUntil(SWTBotFactory.java:437)
	at org.eclipse.swtbot.swt.finder.SWTBotFactory.waitUntil(SWTBotFactory.java:411)
	at org.eclipse.swtbot.swt.finder.SWTBotFactory.waitUntil(SWTBotFactory.java:399)
	at org.eclipse.emf.emfstore.client.test.ui.conflictdetection.BidirectionalConflictMergeTest.testController(BidirectionalConflictMergeTest.java:97)


Results :

Tests in error: 
  UISessionControllerTest.testController:37->login:54 » WidgetNotFound Could not...
  BidirectionalConflictMergeTest.testController:97 » Timeout Timeout after: 3000...

Tests run: 22, Failures: 0, Errors: 2, Skipped: 0

[ERROR] There are test failures.

Please refer to /jobs/genie.emfstore/gerrit-transactional/workspace/tests/org.eclipse.emf.emfstore.client.test.ui/target/surefire-reports for the individual test results.
[INFO] 
[INFO] --- tycho-surefire-plugin:1.0.0:test (MockClientFile) @ org.eclipse.emf.emfstore.client.test.ui ---
[INFO] Expected eclipse log file: /jobs/genie.emfstore/gerrit-transactional/workspace/tests/org.eclipse.emf.emfstore.client.test.ui/target/work/data/.metadata/.log
[INFO] Command line:
	[/opt/public/common/jdk1.8.0_121.x64/jre/bin/java, -Dosgi.noShutdown=false, -Dosgi.os=linux, -Dosgi.ws=gtk, -Dosgi.arch=x86_64, -javaagent:/home/hudson/genie.emfstore/.hudson/jobs/gerrit-transactional/workspace/.maven/repo/org/jacoco/org.jacoco.agent/0.7.4.201502262128/org.jacoco.agent-0.7.4.201502262128-runtime.jar=destfile=/jobs/genie.emfstore/gerrit-transactional/workspace/tests/coverage/jacoco.exec,append=true, -Dorg.eclipse.swtbot.search.timeout=30000, -Dosgi.requiredJavaVersion=1.5, -Xms40m, -Xmx512m, -Demfstore.inMemoryChangePackage=false, -Dosgi.clean=true, -jar, /jobs/genie.emfstore/gerrit-transactional/workspace/.maven/repo/p2/osgi/bundle/org.eclipse.equinox.launcher/1.3.0.v20120522-1813/org.eclipse.equinox.launcher-1.3.0.v20120522-1813.jar, -data, /jobs/genie.emfstore/gerrit-transactional/workspace/tests/org.eclipse.emf.emfstore.client.test.ui/target/work/data, -install, /jobs/genie.emfstore/gerrit-transactional/workspace/tests/org.eclipse.emf.emfstore.client.test.ui/target/work, -configuration, /jobs/genie.emfstore/gerrit-transactional/workspace/tests/org.eclipse.emf.emfstore.client.test.ui/target/work/configuration, -application, org.eclipse.tycho.surefire.osgibooter.uitest, -testproperties, /jobs/genie.emfstore/gerrit-transactional/workspace/tests/org.eclipse.emf.emfstore.client.test.ui/target/surefire.properties, -nouithread]

-------------------------------------------------------
 T E S T S
-------------------------------------------------------
Running org.eclipse.emf.emfstore.client.test.ui.AllUITestsWithMock
Transactional Command Stack created
log4j:WARN No appenders could be found for logger (org.eclipse.swtbot.swt.finder.matchers.AbstractMatcher).
log4j:WARN Please initialize the log4j system properly.
Tests run: 22, Failures: 0, Errors: 2, Skipped: 0, Time elapsed: 97.96 sec <<< FAILURE! - in org.eclipse.emf.emfstore.client.test.ui.AllUITestsWithMock
testController(org.eclipse.emf.emfstore.client.test.ui.controllers.NoLocalChangesCommitControllerTest)  Time elapsed: 0.754 sec
testController(org.eclipse.emf.emfstore.client.test.ui.controllers.LocalProjectNeedsToBeUpdatedCommitControllerTest)  Time elapsed: 1.274 sec
testController(org.eclipse.emf.emfstore.client.test.ui.controllers.UIAddTagControllerTest)  Time elapsed: 0.472 sec
testController(org.eclipse.emf.emfstore.client.test.ui.controllers.UIAskForBranchCheckoutControllerTest)  Time elapsed: 0.71 sec
testController(org.eclipse.emf.emfstore.client.test.ui.controllers.UIBranchControllersTest)  Time elapsed: 1.31 sec
testController(org.eclipse.emf.emfstore.client.test.ui.controllers.UICheckoutControllerTest)  Time elapsed: 0.534 sec
testController(org.eclipse.emf.emfstore.client.test.ui.controllers.UICreateRemoteProjectControllerTest)  Time elapsed: 0.151 sec
testController(org.eclipse.emf.emfstore.client.test.ui.controllers.UIDeleteRemoteProjectControllerTest)  Time elapsed: 0.138 sec
testController(org.eclipse.emf.emfstore.client.test.ui.controllers.UIMergeControllerTest)  Time elapsed: 0.577 sec
testController(org.eclipse.emf.emfstore.client.test.ui.controllers.UIRevertCommitControllerTest)  Time elapsed: 0.286 sec
testController(org.eclipse.emf.emfstore.client.test.ui.controllers.UIRemoveServerControllerTest)  Time elapsed: 0.14 sec
testController(org.eclipse.emf.emfstore.client.test.ui.controllers.UIRevertCommitControllerTest2)  Time elapsed: 0.795 sec
testController(org.eclipse.emf.emfstore.client.test.ui.controllers.UIServerControllerTest)  Time elapsed: 0.248 sec
testController(org.eclipse.emf.emfstore.client.test.ui.controllers.UISessionControllerTest)  Time elapsed: 30.36 sec  <<< ERROR!
org.eclipse.swtbot.swt.finder.exceptions.WidgetNotFoundException: Could not find widget matching: (of type 'Button' and with mnemonic 'OK' and with style 'SWT.PUSH')
	at org.eclipse.swtbot.swt.finder.SWTBotFactory.waitUntil(SWTBotFactory.java:437)
	at org.eclipse.swtbot.swt.finder.SWTBotFactory.waitUntil(SWTBotFactory.java:411)
	at org.eclipse.swtbot.swt.finder.SWTBotFactory.waitUntil(SWTBotFactory.java:399)
	at org.eclipse.swtbot.swt.finder.SWTBotFactory.waitUntilWidgetAppears(SWTBotFactory.java:381)
	at org.eclipse.swtbot.swt.finder.SWTBotFactory.widget(SWTBotFactory.java:334)
	at org.eclipse.swtbot.swt.finder.SWTBot.button(SWTBot.java:184)
	at org.eclipse.swtbot.swt.finder.SWTBot.button(SWTBot.java:172)
	at org.eclipse.emf.emfstore.client.test.ui.controllers.UISessionControllerTest.login(UISessionControllerTest.java:54)
	at org.eclipse.emf.emfstore.client.test.ui.controllers.UISessionControllerTest.testController(UISessionControllerTest.java:37)

testController(org.eclipse.emf.emfstore.client.test.ui.controllers.UIShareProjectControllerTest)  Time elapsed: 0.649 sec
testController(org.eclipse.emf.emfstore.client.test.ui.controllers.UIUpdateProjectControllerTest)  Time elapsed: 2.045 sec
testController(org.eclipse.emf.emfstore.client.test.ui.controllers.UIUpdateProjectToVersionControllerTest)  Time elapsed: 7.36 sec
testController(org.eclipse.emf.emfstore.client.test.ui.controllers.UIPagedUpdateProjectControllerTest)  Time elapsed: 8.17 sec
testController(org.eclipse.emf.emfstore.client.test.ui.controllers.UIShowHistoryControllerTest)  Time elapsed: 1.529 sec
testController(org.eclipse.emf.emfstore.client.test.ui.controllers.UIShowHistoryControllerForElementTest)  Time elapsed: 1.465 sec
testController(org.eclipse.emf.emfstore.client.test.ui.controllers.UIUndoLastOperationControllerTest)  Time elapsed: 0.567 sec
testController(org.eclipse.emf.emfstore.client.test.ui.conflictdetection.BidirectionalConflictMergeTest)  Time elapsed: 37.075 sec  <<< ERROR!
org.eclipse.swtbot.swt.finder.widgets.TimeoutException: Timeout after: 30000 ms.: Merge wizard did not appear
	at org.eclipse.swtbot.swt.finder.SWTBotFactory.waitUntil(SWTBotFactory.java:437)
	at org.eclipse.swtbot.swt.finder.SWTBotFactory.waitUntil(SWTBotFactory.java:411)
	at org.eclipse.swtbot.swt.finder.SWTBotFactory.waitUntil(SWTBotFactory.java:399)
	at org.eclipse.emf.emfstore.client.test.ui.conflictdetection.BidirectionalConflictMergeTest.testController(BidirectionalConflictMergeTest.java:97)


Results :

Tests in error: 
  UISessionControllerTest.testController:37->login:54 » WidgetNotFound Could not...
  BidirectionalConflictMergeTest.testController:97 » Timeout Timeout after: 3000...

Tests run: 22, Failures: 0, Errors: 2, Skipped: 0

[ERROR] There are test failures.

Please refer to /jobs/genie.emfstore/gerrit-transactional/workspace/tests/org.eclipse.emf.emfstore.client.test.ui/target/surefire-reports/MockClientFile for the individual test results.
[INFO] 
[INFO] --- tycho-surefire-plugin:1.0.0:test (IntegrationClientMemoryServerMemory) @ org.eclipse.emf.emfstore.client.test.ui ---
[INFO] Expected eclipse log file: /jobs/genie.emfstore/gerrit-transactional/workspace/tests/org.eclipse.emf.emfstore.client.test.ui/target/work/data/.metadata/.log
[INFO] Command line:
	[/opt/public/common/jdk1.8.0_121.x64/jre/bin/java, -Dosgi.noShutdown=false, -Dosgi.os=linux, -Dosgi.ws=gtk, -Dosgi.arch=x86_64, -javaagent:/home/hudson/genie.emfstore/.hudson/jobs/gerrit-transactional/workspace/.maven/repo/org/jacoco/org.jacoco.agent/0.7.4.201502262128/org.jacoco.agent-0.7.4.201502262128-runtime.jar=destfile=/jobs/genie.emfstore/gerrit-transactional/workspace/tests/coverage/jacoco.exec,append=true, -Dorg.eclipse.swtbot.search.timeout=30000, -Dosgi.requiredJavaVersion=1.5, -Demfstore.inMemoryChangePackage=true, -Demfstore.server.fileBasedChangePackage=false, -Xms40m, -Xmx512m, -Dosgi.clean=true, -jar, /jobs/genie.emfstore/gerrit-transactional/workspace/.maven/repo/p2/osgi/bundle/org.eclipse.equinox.launcher/1.3.0.v20120522-1813/org.eclipse.equinox.launcher-1.3.0.v20120522-1813.jar, -data, /jobs/genie.emfstore/gerrit-transactional/workspace/tests/org.eclipse.emf.emfstore.client.test.ui/target/work/data, -install, /jobs/genie.emfstore/gerrit-transactional/workspace/tests/org.eclipse.emf.emfstore.client.test.ui/target/work, -configuration, /jobs/genie.emfstore/gerrit-transactional/workspace/tests/org.eclipse.emf.emfstore.client.test.ui/target/work/configuration, -application, org.eclipse.tycho.surefire.osgibooter.uitest, -testproperties, /jobs/genie.emfstore/gerrit-transactional/workspace/tests/org.eclipse.emf.emfstore.client.test.ui/target/surefire.properties, -nouithread]

-------------------------------------------------------
 T E S T S
-------------------------------------------------------
Running org.eclipse.emf.emfstore.client.test.ui.AllUITests
.................................................#HHHHHHHHB.................................................
...............................................AGA&h9999hhhh9...............................................
..............................................hG393XX22XXXX39GH.............................................
.............................................hG93X25SSiS522X93&M............................................
.............................................A9hX2SisrrsiS523hhG............................................
............................................AAG9X2Ssr;;;si523hGAG...........................................
.........................................3h&AAAh325isrrrsS2X3GAA&GhG........................................
......................................3h&&GGHBA&h3X255S552X9G&AHAhG&GhA.....................................
...................................3hG&GGAHAHMHAA&hh933399h&AHH#HAA&hG&GGG..................................
................................hhG&GGAAHA....BBBAA&&&&&&&AABBB...BAAAGhG&Ghh...............................
.............................9hG&GGAAAA......AHBBMBBHBBBBBBBHHAA.....AAAAGh&&Gh.............................
..........................3hG&GGAHHA........&AAHB#..MMMMM...AAA&&.......&AAAGhGGGh..........................
.......................3hG&GGAHHA2.........hAAAH#....HHHH....A&A&A.........AAA&hh&&hG.......................
......AGAhGG&.......3hG&GGAHHHA...........hAAAH#....HAHAA....HAAA&&...........AAA&hG&GGA.......M&Gh&&G......
...Ahhhh939hhhGG.hGG&GGAHHAA.............GAAAH#.....HAHA&.....#AAA&&............MAAA&hGGGG&..9hGh933hhhh&...
..hh33XXXXXXXX3GAA&GAHHAh...............hAAAH#......HAHAA......AAAA&&..............BAAA&hG&&G9XXXX2XXXXX9h&.
.h993X25SS552239GABBA..................hAAHH........MAHAA.......BHAA&h................&AAAAG93X225SS522X33hH
HGh3X2SisssiS523GABHHAAAA&GGGhhhhhhhhh&AAHHBH3G9HHHHAHHAA;GhhG&H.BHAA&G..................AA&9X25isssii52X9hH
HGh325irr;;riS2XhAAAAA&&&&&G&&&&&&&&AAAHHHHHAAAA&&AAHHHHAAAAAAAAAHHHAAA&GhGGGGGGGGGG&&AAHHAG9X5isr;;rsS5X9GA
H&h325irr;;ri523h&HHHAAAAAAAHAHHHHAHHHHHBHHHHHAAAAHHHHHHHHHHAHAAAAHHAAA&&&&GGGGGhhhhGGGG&AA&9X2Ssr;;rsS2X9&A
H&&h322SiiiS52X9&AHM........922222.HHHAHAMHBM........MMM#...###BBBMHHHAAHHAAAAAAAAAAAAAABBB&h9X2SiiiiS2X9h&H
MH&&G99XXXXX33hGAAHAA&H...........AAHHB......MHHAAAAAMBBHHHHBM##.....#BHHHM.............&BBHAGh93XXXXX39G&AH
.MHAA&&GGhGGG&AHBBHAGGA&G9.......AAHM#.BG93X9hhG&AAAAHBHHAHHAAAHAAAHB###MHHB.........&AAHAHBMAA&GGGGhG&&AHH.
...HHHAAHAHAAHBBM.MHAA&hG&&G&...AAM#AsiS2X9&&G35isrr;;;rrsi5XhAHBBHAA&AHM#MHA.....9GGA&&AHHM#MBBAAHHHAHBHB..
.....HBMMMMMMMHHAA...BAAA&hG&&G&AB9ssS2X2s;,                 ..,:riX&A&&GhAHAB.hGG&GGAHHA...HBMMMMMMMMM#....
.......HBBMM..AAAAA.....&AAA&GAAH#2i399Gs          ...,,,,,...   .,;2HHAAA&#HAA&GGAAAH2....AAHHB.HHBMB......
.......AAHBA...A&A&&.......&AHHHB#XX9hHB#.#Bh5r;:,,...,,,::;ri2hH##.###BHAH.MHAAHAH.......&&HAH..AAHHH......
.......&AHH&....A&A&G.......HHHHM#2Xh5.rG#.........######..........M&2r9MAH.#BHBM........h&AAH...AAHHA......
.......AAHH&.....A&AGG.....&AHAB..S2&S    .;i9H#............#MA3Sr;,.. X#AH.#MBHHM......h&AAH....AAHAA......
.......AAHH&......A&AGG...GAAAHH..sXAX          .,:;;;;;;;:,,.....,,::,9#AA##MBAA&h....G&AAA.....AAHAA......
.......&AHH&.......A&A&G.&AAAHBA..iXHh                    ...,,::;;;;;:h#AA###BAA&&...G&AAA......AAHAA......
.......AAHHG........A&AAAAAAHA.M..iXHG    ..........,,,,,::::;;;;;;;;;:h#AA###.AAAGG.G&AAA.......AAHAA......
.......AAAHM.........AAAAHHHh..H..iXHG   .....,,,,,,::::::;;;;;;;;;;;;:h#AA####.AAA&AAAAA........AAHAA......
.......AAAA#..........AAHHH....A..iXHG   ....,,,,,::::::::;;;;;;;;;;;;:h#AA#####.HAAAHHH.........AAHAA......
.......AAAA#.........AAHHHHA...A#.iXHG   ....,,,,,,:::::::;;;;;;;;;;;;:h#AA####...AAHHH..........AAHAA......
.......AAAA.........GAAHHAA&&..A#.iXHG   ....,,,,,,:::::::;;;;;;;;;;;;:h#AA#####.AAHHHAG.........&AHAA......
.......AAAA........hAAAH#HAA&&.A..iXHG   ....,,,,,,:::::::;;;;;;;;;;;;:h#AA###M.AAAHHAAGG........AAHAA......
.......&AAA.......GAAAB2.9HAAAA.#.iXHG   ....,,,,,,:::::::;;;;;;;;;;;;:h#AA####AAAAHBA&AGG.......AAHAA......
.......AAAA......hAAAB2...9AAAAH..sXHG   ....,,,,,,:::::::;;;;;;;;;;;;:h#AA###HAAAH#..A&AGG......&AHAA......
.......AAAA.....hAAAB......9AAAA#.iXHG   ....,,,,,,:::::::;;;;;;;;;;;;:h#AA##MHAAHA....A&AGG.....&AHAA......
.......AAAA....hAAABr........HAAM.2XHG   ....,,,,,,:::::::;;;;;;;;;;;;:h#AH.#BHHHB......A&AGG....&AHAA......
.......AAAA...hAAAH........&AAHHM#2XHh    ...,,,,,,:::::::;;;;;;;;;;;;,3#AH.#BHB#........A&A&&...AAHH&......
.......AAAA..hAAAHr.....&GGAAAAHB#23AH:     ...,,,,,::::::;;;;;;;;:::;sAMAH.#BHHA&G&......AAA&G..AAHHG......
.......AAAA.GAAAH....G9G&&GAHHABM#ii9M.#9r,    ...,,,:::::::::,:;rihM..MA&h#MMBA&h&&GG;...5AAA&&.AAHHH......
......MHHHAHAHHH..AGG&&GAHHAA...###AhhAM...#GSr;,,,..,,,::;;s59H#....#BAB##MB#.AAAAGh&A&h...HAAAHHHHHA......
...B9GAA&&G&AHBBHAA&GAHAAH.....i.B#...#AAHM#......#MBBBM#.......#######..#MB#.A...&AAAGGAAAA#HAA&&A&&GGhh...
..hh3333XXX39G&AAAAHHHA...........#BB#.....###M####......#########....##BHBA.G.......AAAAGAHAAG93XXXXXXX9Gh.
.G993X255S522X3hAHBM................HHBB#..........................#.BHAAH#.............AHHAh3X255SS522X33GH
HGh3X2SisssiS523GABHAAA&GGGGGGGG&&AAAHHAAHHBBB###############MMBHHHHHHAHHAAA&&GGGGG&AAAAHBHG9X2Sisssii52X3hH
HGh325isr;;riS2XhAA&GhhhhhhhhhhhhhG&&AAAAAAA&AAAAAAAAABHAAAAA&&&&GAAAAHAAAGGhhhhhhhhGGG&AAAG925isr;;rsS2X9GA
H&h3X5irr;;ri523h&HBHAAAAAAAAAAAAAAHHAAHAHAHHHAAAAAAAAAAHAAAAAAAAAHHHHBHAAAAAAAAAAAAAAAHHHA&9X2Ssr;;rsS2X9&A
H&&h322SiiiS52X9GABM...................AAAHHH........AAAH........MHHHHA..................BH&G9X25SiiiS2X9G&H
MH&&G99XXXXXX3hGAAAAAAAA................AAAHAH.......AAAA.......AAAHHH................&AAHHAAGh933XXXX9hG&AH
.AHA&&&GGhGGG&&AHHAAGG&&&GH..............HAAAAA......AAAA......&AAHHA..............9h&AG&ABBBA&&GGGGGG&&AHH.
...HHBAAAAAAAHBH...AAAAGhG&GGh............HAAA&G.....AAAA2....HAAHHH............9hGAGGAHAHB.BHBHAAAAAAHHH#..
.....BBBBBBHMB........&AAAGhG&GhA..........AAAA&G....AAAA3...AAAHHA..........G9G&&GAHHA#.......BBBBBBBB.....
.........................&AAA&hGGG&h........BAAA&G...AAHH...BAAAHH........XhG&GGAHHA&.......................
............................AAAAGhG&G&9......MAAA&AAAHHHHAHAAAHHA......9hGAGGAHAHA..........................
...............................HAAA&hG&Gh9....MHAAA&hGGGh9&AHHHB....9hG&&GAHHAA.............................
..................................GAAA&hG&&G&..HA&9XXXX2XX3hAAB..&hGAGGAHHAA................................
.....................................AAAA&hGAAAAG3X25SSS522X9GAAA&GGAAHAB...................................
........................................MAAA&&&G9X2Sisrssi52X9h&&AHHAB......................................
...........................................9AHAG925isr;;rsi5X3GABHA.........................................
.............................................H&G9X2Sir;;riS2X9&AB...........................................
.............................................AA&G9X225SSS52X9G&HB...........................................
..............................................HA&&h9933XX39hG&AH............................................
...............................................AAAA&&GGGGG&&AAH.............................................
................................................#HHAA&&&&AAHH...............................................

                  8888888888 888b     d888 8888888888 .d8888b.  888                            
                  888        8888b   d8888 888       d88P  Y88b 888                            
                  888        88888b.d88888 888       Y88b.      888                            
                  8888888    888Y88888P888 8888888    "Y888b.   888888 .d88b.  888d888 .d88b.  
                  888        888 Y888P 888 888           "Y88b. 888   d88""88b 888P"  d8P  Y8b 
                  888        888  Y8P  888 888             "888 888   888  888 888    88888888 
                  888        888   "   888 888       Y88b  d88P Y88b. Y88..88P 888    Y8b.     
                  8888888888 888       888 888        "Y8888P"   "Y888 "Y88P"  888     "Y8888 
                  
                  
                  
                  
Property file read. (/jobs/genie.emfstore/gerrit-transactional/workspace/tests/org.eclipse.emf.emfstore.client.test.ui/target/work/data/profiles/default_test/./conf/es.properties)
Server data home location: /jobs/genie.emfstore/gerrit-transactional/workspace/tests/org.eclipse.emf.emfstore.client.test.ui/target/work/data/profiles/default_test/
JVM Max Memory: 477 MByte
Resource save options initialized:
	USE_ENCODED_ATTRIBUTE_STYLE: true
	ENCODING: UTF-8
	FLUSH_THRESHOLD: 100000
	USE_FILE_BUFFER: true
	CONFIGURATION_CACHE: true
added superuser super
Using WebServerProvider class org.eclipse.emf.emfstore.internal.server.connection.xmlrpc.XmlRpcBuiltinWebServer at port 8080
Started XML RPC Webserver on port: 8080
Notifying post startup listener
Couldn't load password file from path: /jobs/genie.emfstore/gerrit-transactional/workspace/tests/org.eclipse.emf.emfstore.client.test.ui/target/work/data/profiles/default_test/./conf/user.properties
Initialitation COMPLETE.
Server is RUNNING...Time to relax...
Transactional Command Stack created
log4j:WARN No appenders could be found for logger (org.eclipse.swtbot.swt.finder.matchers.AbstractMatcher).
log4j:WARN Please initialize the log4j system properly.
Can not determine whether to compute checksums on commit, default is true.
Total time for commit: 11
Total time for commit: 9
Total time for commit: 8
Total time for commit: 6
Total time for commit: 5
Total time for commit: 6
Exception on execution: No branch info available.
Exception on execution: No branch info available.
Total time for commit: 5
Exception on execution: No branch info available.
Exception on execution: No branch info available.
Total time for commit: 4
Total time for commit: 5
Total time for commit: 5
Exception on execution: No branch info available.
Exception on execution: No branch info available.
Total time for commit: 4
Total time for commit: 5
Total time for commit: 5
Total time for commit: 5
Total time for commit: 6
Total time for commit: 6
Total time for commit: 6
Total time for commit: 6
Total time for commit: 4
Total time for commit: 4
Total time for commit: 7
Total time for commit: 11
Total time for commit: 5
Total time for commit: 3
Total time for commit: 5
Total time for commit: 5
Property file read. (/jobs/genie.emfstore/gerrit-transactional/workspace/tests/org.eclipse.emf.emfstore.client.test.ui/target/work/data/profiles/default_test/./conf/es.properties)
Server was stopped.
Property file read. (/jobs/genie.emfstore/gerrit-transactional/workspace/tests/org.eclipse.emf.emfstore.client.test.ui/target/work/data/profiles/default_test/./conf/es.properties)
.................................................#HHHHHHHHB.................................................
...............................................AGA&h9999hhhh9...............................................
..............................................hG393XX22XXXX39GH.............................................
.............................................hG93X25SSiS522X93&M............................................
.............................................A9hX2SisrrsiS523hhG............................................
............................................AAG9X2Ssr;;;si523hGAG...........................................
.........................................3h&AAAh325isrrrsS2X3GAA&GhG........................................
......................................3h&&GGHBA&h3X255S552X9G&AHAhG&GhA.....................................
...................................3hG&GGAHAHMHAA&hh933399h&AHH#HAA&hG&GGG..................................
................................hhG&GGAAHA....BBBAA&&&&&&&AABBB...BAAAGhG&Ghh...............................
.............................9hG&GGAAAA......AHBBMBBHBBBBBBBHHAA.....AAAAGh&&Gh.............................
..........................3hG&GGAHHA........&AAHB#..MMMMM...AAA&&.......&AAAGhGGGh..........................
.......................3hG&GGAHHA2.........hAAAH#....HHHH....A&A&A.........AAA&hh&&hG.......................
......AGAhGG&.......3hG&GGAHHHA...........hAAAH#....HAHAA....HAAA&&...........AAA&hG&GGA.......M&Gh&&G......
...Ahhhh939hhhGG.hGG&GGAHHAA.............GAAAH#.....HAHA&.....#AAA&&............MAAA&hGGGG&..9hGh933hhhh&...
..hh33XXXXXXXX3GAA&GAHHAh...............hAAAH#......HAHAA......AAAA&&..............BAAA&hG&&G9XXXX2XXXXX9h&.
.h993X25SS552239GABBA..................hAAHH........MAHAA.......BHAA&h................&AAAAG93X225SS522X33hH
HGh3X2SisssiS523GABHHAAAA&GGGhhhhhhhhh&AAHHBH3G9HHHHAHHAA;GhhG&H.BHAA&G..................AA&9X25isssii52X9hH
HGh325irr;;riS2XhAAAAA&&&&&G&&&&&&&&AAAHHHHHAAAA&&AAHHHHAAAAAAAAAHHHAAA&GhGGGGGGGGGG&&AAHHAG9X5isr;;rsS5X9GA
H&h325irr;;ri523h&HHHAAAAAAAHAHHHHAHHHHHBHHHHHAAAAHHHHHHHHHHAHAAAAHHAAA&&&&GGGGGhhhhGGGG&AA&9X2Ssr;;rsS2X9&A
H&&h322SiiiS52X9&AHM........922222.HHHAHAMHBM........MMM#...###BBBMHHHAAHHAAAAAAAAAAAAAABBB&h9X2SiiiiS2X9h&H
MH&&G99XXXXX33hGAAHAA&H...........AAHHB......MHHAAAAAMBBHHHHBM##.....#BHHHM.............&BBHAGh93XXXXX39G&AH
.MHAA&&GGhGGG&AHBBHAGGA&G9.......AAHM#.BG93X9hhG&AAAAHBHHAHHAAAHAAAHB###MHHB.........&AAHAHBMAA&GGGGhG&&AHH.
...HHHAAHAHAAHBBM.MHAA&hG&&G&...AAM#AsiS2X9&&G35isrr;;;rrsi5XhAHBBHAA&AHM#MHA.....9GGA&&AHHM#MBBAAHHHAHBHB..
.....HBMMMMMMMHHAA...BAAA&hG&&G&AB9ssS2X2s;,                 ..,:riX&A&&GhAHAB.hGG&GGAHHA...HBMMMMMMMMM#....
.......HBBMM..AAAAA.....&AAA&GAAH#2i399Gs          ...,,,,,...   .,;2HHAAA&#HAA&GGAAAH2....AAHHB.HHBMB......
.......AAHBA...A&A&&.......&AHHHB#XX9hHB#.#Bh5r;:,,...,,,::;ri2hH##.###BHAH.MHAAHAH.......&&HAH..AAHHH......
.......&AHH&....A&A&G.......HHHHM#2Xh5.rG#.........######..........M&2r9MAH.#BHBM........h&AAH...AAHHA......
.......AAHH&.....A&AGG.....&AHAB..S2&S    .;i9H#............#MA3Sr;,.. X#AH.#MBHHM......h&AAH....AAHAA......
.......AAHH&......A&AGG...GAAAHH..sXAX          .,:;;;;;;;:,,.....,,::,9#AA##MBAA&h....G&AAA.....AAHAA......
.......&AHH&.......A&A&G.&AAAHBA..iXHh                    ...,,::;;;;;:h#AA###BAA&&...G&AAA......AAHAA......
.......AAHHG........A&AAAAAAHA.M..iXHG    ..........,,,,,::::;;;;;;;;;:h#AA###.AAAGG.G&AAA.......AAHAA......
.......AAAHM.........AAAAHHHh..H..iXHG   .....,,,,,,::::::;;;;;;;;;;;;:h#AA####.AAA&AAAAA........AAHAA......
.......AAAA#..........AAHHH....A..iXHG   ....,,,,,::::::::;;;;;;;;;;;;:h#AA#####.HAAAHHH.........AAHAA......
.......AAAA#.........AAHHHHA...A#.iXHG   ....,,,,,,:::::::;;;;;;;;;;;;:h#AA####...AAHHH..........AAHAA......
.......AAAA.........GAAHHAA&&..A#.iXHG   ....,,,,,,:::::::;;;;;;;;;;;;:h#AA#####.AAHHHAG.........&AHAA......
.......AAAA........hAAAH#HAA&&.A..iXHG   ....,,,,,,:::::::;;;;;;;;;;;;:h#AA###M.AAAHHAAGG........AAHAA......
.......&AAA.......GAAAB2.9HAAAA.#.iXHG   ....,,,,,,:::::::;;;;;;;;;;;;:h#AA####AAAAHBA&AGG.......AAHAA......
.......AAAA......hAAAB2...9AAAAH..sXHG   ....,,,,,,:::::::;;;;;;;;;;;;:h#AA###HAAAH#..A&AGG......&AHAA......
.......AAAA.....hAAAB......9AAAA#.iXHG   ....,,,,,,:::::::;;;;;;;;;;;;:h#AA##MHAAHA....A&AGG.....&AHAA......
.......AAAA....hAAABr........HAAM.2XHG   ....,,,,,,:::::::;;;;;;;;;;;;:h#AH.#BHHHB......A&AGG....&AHAA......
.......AAAA...hAAAH........&AAHHM#2XHh    ...,,,,,,:::::::;;;;;;;;;;;;,3#AH.#BHB#........A&A&&...AAHH&......
.......AAAA..hAAAHr.....&GGAAAAHB#23AH:     ...,,,,,::::::;;;;;;;;:::;sAMAH.#BHHA&G&......AAA&G..AAHHG......
.......AAAA.GAAAH....G9G&&GAHHABM#ii9M.#9r,    ...,,,:::::::::,:;rihM..MA&h#MMBA&h&&GG;...5AAA&&.AAHHH......
......MHHHAHAHHH..AGG&&GAHHAA...###AhhAM...#GSr;,,,..,,,::;;s59H#....#BAB##MB#.AAAAGh&A&h...HAAAHHHHHA......
...B9GAA&&G&AHBBHAA&GAHAAH.....i.B#...#AAHM#......#MBBBM#.......#######..#MB#.A...&AAAGGAAAA#HAA&&A&&GGhh...
..hh3333XXX39G&AAAAHHHA...........#BB#.....###M####......#########....##BHBA.G.......AAAAGAHAAG93XXXXXXX9Gh.
.G993X255S522X3hAHBM................HHBB#..........................#.BHAAH#.............AHHAh3X255SS522X33GH
HGh3X2SisssiS523GABHAAA&GGGGGGGG&&AAAHHAAHHBBB###############MMBHHHHHHAHHAAA&&GGGGG&AAAAHBHG9X2Sisssii52X3hH
HGh325isr;;riS2XhAA&GhhhhhhhhhhhhhG&&AAAAAAA&AAAAAAAAABHAAAAA&&&&GAAAAHAAAGGhhhhhhhhGGG&AAAG925isr;;rsS2X9GA
H&h3X5irr;;ri523h&HBHAAAAAAAAAAAAAAHHAAHAHAHHHAAAAAAAAAAHAAAAAAAAAHHHHBHAAAAAAAAAAAAAAAHHHA&9X2Ssr;;rsS2X9&A
H&&h322SiiiS52X9GABM...................AAAHHH........AAAH........MHHHHA..................BH&G9X25SiiiS2X9G&H
MH&&G99XXXXXX3hGAAAAAAAA................AAAHAH.......AAAA.......AAAHHH................&AAHHAAGh933XXXX9hG&AH
.AHA&&&GGhGGG&&AHHAAGG&&&GH..............HAAAAA......AAAA......&AAHHA..............9h&AG&ABBBA&&GGGGGG&&AHH.
...HHBAAAAAAAHBH...AAAAGhG&GGh............HAAA&G.....AAAA2....HAAHHH............9hGAGGAHAHB.BHBHAAAAAAHHH#..
.....BBBBBBHMB........&AAAGhG&GhA..........AAAA&G....AAAA3...AAAHHA..........G9G&&GAHHA#.......BBBBBBBB.....
.........................&AAA&hGGG&h........BAAA&G...AAHH...BAAAHH........XhG&GGAHHA&.......................
............................AAAAGhG&G&9......MAAA&AAAHHHHAHAAAHHA......9hGAGGAHAHA..........................
...............................HAAA&hG&Gh9....MHAAA&hGGGh9&AHHHB....9hG&&GAHHAA.............................
..................................GAAA&hG&&G&..HA&9XXXX2XX3hAAB..&hGAGGAHHAA................................
.....................................AAAA&hGAAAAG3X25SSS522X9GAAA&GGAAHAB...................................
........................................MAAA&&&G9X2Sisrssi52X9h&&AHHAB......................................
...........................................9AHAG925isr;;rsi5X3GABHA.........................................
.............................................H&G9X2Sir;;riS2X9&AB...........................................
.............................................AA&G9X225SSS52X9G&HB...........................................
..............................................HA&&h9933XX39hG&AH............................................
...............................................AAAA&&GGGGG&&AAH.............................................
................................................#HHAA&&&&AAHH...............................................

                  8888888888 888b     d888 8888888888 .d8888b.  888                            
                  888        8888b   d8888 888       d88P  Y88b 888                            
                  888        88888b.d88888 888       Y88b.      888                            
                  8888888    888Y88888P888 8888888    "Y888b.   888888 .d88b.  888d888 .d88b.  
                  888        888 Y888P 888 888           "Y88b. 888   d88""88b 888P"  d8P  Y8b 
                  888        888  Y8P  888 888             "888 888   888  888 888    88888888 
                  888        888   "   888 888       Y88b  d88P Y88b. Y88..88P 888    Y8b.     
                  8888888888 888       888 888        "Y8888P"   "Y888 "Y88P"  888     "Y8888 
                  
                  
                  
                  
Property file read. (/jobs/genie.emfstore/gerrit-transactional/workspace/tests/org.eclipse.emf.emfstore.client.test.ui/target/work/data/profiles/default_test/./conf/es.properties)
Property file read. (/jobs/genie.emfstore/gerrit-transactional/workspace/tests/org.eclipse.emf.emfstore.client.test.ui/target/work/data/profiles/default_test/./conf/es.properties)
Server data home location: /jobs/genie.emfstore/gerrit-transactional/workspace/tests/org.eclipse.emf.emfstore.client.test.ui/target/work/data/profiles/default_test/
Server data home location: /jobs/genie.emfstore/gerrit-transactional/workspace/tests/org.eclipse.emf.emfstore.client.test.ui/target/work/data/profiles/default_test/
JVM Max Memory: 477 MByte
JVM Max Memory: 477 MByte
Started XML RPC Webserver on port: 8080
Started XML RPC Webserver on port: 8080
Notifying post startup listener
Notifying post startup listener
Couldn't load password file from path: /jobs/genie.emfstore/gerrit-transactional/workspace/tests/org.eclipse.emf.emfstore.client.test.ui/target/work/data/profiles/default_test/./conf/user.properties
Couldn't load password file from path: /jobs/genie.emfstore/gerrit-transactional/workspace/tests/org.eclipse.emf.emfstore.client.test.ui/target/work/data/profiles/default_test/./conf/user.properties
Initialitation COMPLETE.
Initialitation COMPLETE.
Server is RUNNING...Time to relax...
Server is RUNNING...Time to relax...
Property file read. (/jobs/genie.emfstore/gerrit-transactional/workspace/tests/org.eclipse.emf.emfstore.client.test.ui/target/work/data/profiles/default_test/./conf/es.properties)
Property file read. (/jobs/genie.emfstore/gerrit-transactional/workspace/tests/org.eclipse.emf.emfstore.client.test.ui/target/work/data/profiles/default_test/./conf/es.properties)
Server was stopped.
Server was stopped.
Tests run: 24, Failures: 0, Errors: 2, Skipped: 0, Time elapsed: 115.121 sec <<< FAILURE! - in org.eclipse.emf.emfstore.client.test.ui.AllUITests
testController(org.eclipse.emf.emfstore.client.test.ui.controllers.NoLocalChangesCommitControllerTest)  Time elapsed: 0.662 sec
testController(org.eclipse.emf.emfstore.client.test.ui.controllers.LocalProjectNeedsToBeUpdatedCommitControllerTest)  Time elapsed: 1.728 sec
testController(org.eclipse.emf.emfstore.client.test.ui.controllers.UIAddTagControllerTest)  Time elapsed: 0.755 sec
testController(org.eclipse.emf.emfstore.client.test.ui.controllers.UIAskForBranchCheckoutControllerTest)  Time elapsed: 1.313 sec
testController(org.eclipse.emf.emfstore.client.test.ui.controllers.UIBranchControllersTest)  Time elapsed: 1.518 sec
testController(org.eclipse.emf.emfstore.client.test.ui.controllers.UICheckoutControllerTest)  Time elapsed: 0.797 sec
testController(org.eclipse.emf.emfstore.client.test.ui.controllers.UICreateRemoteProjectControllerTest)  Time elapsed: 0.334 sec
testController(org.eclipse.emf.emfstore.client.test.ui.controllers.UIDeleteRemoteProjectControllerTest)  Time elapsed: 0.301 sec
testController(org.eclipse.emf.emfstore.client.test.ui.controllers.UIMergeControllerTest)  Time elapsed: 0.932 sec
testController(org.eclipse.emf.emfstore.client.test.ui.controllers.UIRevertCommitControllerTest)  Time elapsed: 0.524 sec
testController(org.eclipse.emf.emfstore.client.test.ui.controllers.UIRemoveServerControllerTest)  Time elapsed: 0.267 sec
testController(org.eclipse.emf.emfstore.client.test.ui.controllers.UIRevertCommitControllerTest2)  Time elapsed: 1.431 sec
testController(org.eclipse.emf.emfstore.client.test.ui.controllers.UIServerControllerTest)  Time elapsed: 0.333 sec
testController(org.eclipse.emf.emfstore.client.test.ui.controllers.UISessionControllerTest)  Time elapsed: 30.398 sec  <<< ERROR!
org.eclipse.swtbot.swt.finder.exceptions.WidgetNotFoundException: Could not find widget matching: (of type 'Button' and with mnemonic 'OK' and with style 'SWT.PUSH')
	at org.eclipse.swtbot.swt.finder.SWTBotFactory.waitUntil(SWTBotFactory.java:437)
	at org.eclipse.swtbot.swt.finder.SWTBotFactory.waitUntil(SWTBotFactory.java:411)
	at org.eclipse.swtbot.swt.finder.SWTBotFactory.waitUntil(SWTBotFactory.java:399)
	at org.eclipse.swtbot.swt.finder.SWTBotFactory.waitUntilWidgetAppears(SWTBotFactory.java:381)
	at org.eclipse.swtbot.swt.finder.SWTBotFactory.widget(SWTBotFactory.java:334)
	at org.eclipse.swtbot.swt.finder.SWTBot.button(SWTBot.java:184)
	at org.eclipse.swtbot.swt.finder.SWTBot.button(SWTBot.java:172)
	at org.eclipse.emf.emfstore.client.test.ui.controllers.UISessionControllerTest.login(UISessionControllerTest.java:54)
	at org.eclipse.emf.emfstore.client.test.ui.controllers.UISessionControllerTest.testController(UISessionControllerTest.java:37)

testController(org.eclipse.emf.emfstore.client.test.ui.controllers.UIShareProjectControllerTest)  Time elapsed: 0.761 sec
testController(org.eclipse.emf.emfstore.client.test.ui.controllers.UIUpdateProjectControllerTest)  Time elapsed: 2.266 sec
testController(org.eclipse.emf.emfstore.client.test.ui.controllers.UIUpdateProjectToVersionControllerTest)  Time elapsed: 7.779 sec
testController(org.eclipse.emf.emfstore.client.test.ui.controllers.UIPagedUpdateProjectControllerTest)  Time elapsed: 10.112 sec
testController(org.eclipse.emf.emfstore.client.test.ui.controllers.UIShowHistoryControllerTest)  Time elapsed: 1.81 sec
testController(org.eclipse.emf.emfstore.client.test.ui.controllers.UIShowHistoryControllerForElementTest)  Time elapsed: 1.609 sec
testController(org.eclipse.emf.emfstore.client.test.ui.controllers.UIUndoLastOperationControllerTest)  Time elapsed: 0.634 sec
testController(org.eclipse.emf.emfstore.client.test.ui.conflictdetection.BidirectionalConflictMergeTest)  Time elapsed: 36.701 sec  <<< ERROR!
org.eclipse.swtbot.swt.finder.widgets.TimeoutException: Timeout after: 30000 ms.: Merge wizard did not appear
	at org.eclipse.swtbot.swt.finder.SWTBotFactory.waitUntil(SWTBotFactory.java:437)
	at org.eclipse.swtbot.swt.finder.SWTBotFactory.waitUntil(SWTBotFactory.java:411)
	at org.eclipse.swtbot.swt.finder.SWTBotFactory.waitUntil(SWTBotFactory.java:399)
	at org.eclipse.emf.emfstore.client.test.ui.conflictdetection.BidirectionalConflictMergeTest.testController(BidirectionalConflictMergeTest.java:97)

isNotLoggedIn(org.eclipse.emf.emfstore.client.test.ui.testers.ServerInfoIsLoggedInTesterTest)  Time elapsed: 5.44 sec
isLoggedIn(org.eclipse.emf.emfstore.client.test.ui.testers.ServerInfoIsLoggedInTesterTest)  Time elapsed: 0.162 sec

Results :

Tests in error: 
  UISessionControllerTest.testController:37->login:54 » WidgetNotFound Could not...
  BidirectionalConflictMergeTest.testController:97 » Timeout Timeout after: 3000...

Tests run: 24, Failures: 0, Errors: 2, Skipped: 0

[ERROR] There are test failures.

Please refer to /jobs/genie.emfstore/gerrit-transactional/workspace/tests/org.eclipse.emf.emfstore.client.test.ui/target/surefire-reports/IntegrationClientMemoryServerMemory for the individual test results.
[INFO] 
[INFO] --- tycho-surefire-plugin:1.0.0:test (IntegrationClientFileServerMemory) @ org.eclipse.emf.emfstore.client.test.ui ---
[INFO] Expected eclipse log file: /jobs/genie.emfstore/gerrit-transactional/workspace/tests/org.eclipse.emf.emfstore.client.test.ui/target/work/data/.metadata/.log
[INFO] Command line:
	[/opt/public/common/jdk1.8.0_121.x64/jre/bin/java, -Dosgi.noShutdown=false, -Dosgi.os=linux, -Dosgi.ws=gtk, -Dosgi.arch=x86_64, -javaagent:/home/hudson/genie.emfstore/.hudson/jobs/gerrit-transactional/workspace/.maven/repo/org/jacoco/org.jacoco.agent/0.7.4.201502262128/org.jacoco.agent-0.7.4.201502262128-runtime.jar=destfile=/jobs/genie.emfstore/gerrit-transactional/workspace/tests/coverage/jacoco.exec,append=true, -Dorg.eclipse.swtbot.search.timeout=30000, -Dosgi.requiredJavaVersion=1.5, -Xms40m, -Xmx512m, -Demfstore.inMemoryChangePackage=false, -Demfstore.server.fileBasedChangePackage=false, -Dosgi.clean=true, -jar, /jobs/genie.emfstore/gerrit-transactional/workspace/.maven/repo/p2/osgi/bundle/org.eclipse.equinox.launcher/1.3.0.v20120522-1813/org.eclipse.equinox.launcher-1.3.0.v20120522-1813.jar, -data, /jobs/genie.emfstore/gerrit-transactional/workspace/tests/org.eclipse.emf.emfstore.client.test.ui/target/work/data, -install, /jobs/genie.emfstore/gerrit-transactional/workspace/tests/org.eclipse.emf.emfstore.client.test.ui/target/work, -configuration, /jobs/genie.emfstore/gerrit-transactional/workspace/tests/org.eclipse.emf.emfstore.client.test.ui/target/work/configuration, -application, org.eclipse.tycho.surefire.osgibooter.uitest, -testproperties, /jobs/genie.emfstore/gerrit-transactional/workspace/tests/org.eclipse.emf.emfstore.client.test.ui/target/surefire.properties, -nouithread]

-------------------------------------------------------
 T E S T S
-------------------------------------------------------
Running org.eclipse.emf.emfstore.client.test.ui.AllUITests
.................................................#HHHHHHHHB.................................................
...............................................AGA&h9999hhhh9...............................................
..............................................hG393XX22XXXX39GH.............................................
.............................................hG93X25SSiS522X93&M............................................
.............................................A9hX2SisrrsiS523hhG............................................
............................................AAG9X2Ssr;;;si523hGAG...........................................
.........................................3h&AAAh325isrrrsS2X3GAA&GhG........................................
......................................3h&&GGHBA&h3X255S552X9G&AHAhG&GhA.....................................
...................................3hG&GGAHAHMHAA&hh933399h&AHH#HAA&hG&GGG..................................
................................hhG&GGAAHA....BBBAA&&&&&&&AABBB...BAAAGhG&Ghh...............................
.............................9hG&GGAAAA......AHBBMBBHBBBBBBBHHAA.....AAAAGh&&Gh.............................
..........................3hG&GGAHHA........&AAHB#..MMMMM...AAA&&.......&AAAGhGGGh..........................
.......................3hG&GGAHHA2.........hAAAH#....HHHH....A&A&A.........AAA&hh&&hG.......................
......AGAhGG&.......3hG&GGAHHHA...........hAAAH#....HAHAA....HAAA&&...........AAA&hG&GGA.......M&Gh&&G......
...Ahhhh939hhhGG.hGG&GGAHHAA.............GAAAH#.....HAHA&.....#AAA&&............MAAA&hGGGG&..9hGh933hhhh&...
..hh33XXXXXXXX3GAA&GAHHAh...............hAAAH#......HAHAA......AAAA&&..............BAAA&hG&&G9XXXX2XXXXX9h&.
.h993X25SS552239GABBA..................hAAHH........MAHAA.......BHAA&h................&AAAAG93X225SS522X33hH
HGh3X2SisssiS523GABHHAAAA&GGGhhhhhhhhh&AAHHBH3G9HHHHAHHAA;GhhG&H.BHAA&G..................AA&9X25isssii52X9hH
HGh325irr;;riS2XhAAAAA&&&&&G&&&&&&&&AAAHHHHHAAAA&&AAHHHHAAAAAAAAAHHHAAA&GhGGGGGGGGGG&&AAHHAG9X5isr;;rsS5X9GA
H&h325irr;;ri523h&HHHAAAAAAAHAHHHHAHHHHHBHHHHHAAAAHHHHHHHHHHAHAAAAHHAAA&&&&GGGGGhhhhGGGG&AA&9X2Ssr;;rsS2X9&A
H&&h322SiiiS52X9&AHM........922222.HHHAHAMHBM........MMM#...###BBBMHHHAAHHAAAAAAAAAAAAAABBB&h9X2SiiiiS2X9h&H
MH&&G99XXXXX33hGAAHAA&H...........AAHHB......MHHAAAAAMBBHHHHBM##.....#BHHHM.............&BBHAGh93XXXXX39G&AH
.MHAA&&GGhGGG&AHBBHAGGA&G9.......AAHM#.BG93X9hhG&AAAAHBHHAHHAAAHAAAHB###MHHB.........&AAHAHBMAA&GGGGhG&&AHH.
...HHHAAHAHAAHBBM.MHAA&hG&&G&...AAM#AsiS2X9&&G35isrr;;;rrsi5XhAHBBHAA&AHM#MHA.....9GGA&&AHHM#MBBAAHHHAHBHB..
.....HBMMMMMMMHHAA...BAAA&hG&&G&AB9ssS2X2s;,                 ..,:riX&A&&GhAHAB.hGG&GGAHHA...HBMMMMMMMMM#....
.......HBBMM..AAAAA.....&AAA&GAAH#2i399Gs          ...,,,,,...   .,;2HHAAA&#HAA&GGAAAH2....AAHHB.HHBMB......
.......AAHBA...A&A&&.......&AHHHB#XX9hHB#.#Bh5r;:,,...,,,::;ri2hH##.###BHAH.MHAAHAH.......&&HAH..AAHHH......
.......&AHH&....A&A&G.......HHHHM#2Xh5.rG#.........######..........M&2r9MAH.#BHBM........h&AAH...AAHHA......
.......AAHH&.....A&AGG.....&AHAB..S2&S    .;i9H#............#MA3Sr;,.. X#AH.#MBHHM......h&AAH....AAHAA......
.......AAHH&......A&AGG...GAAAHH..sXAX          .,:;;;;;;;:,,.....,,::,9#AA##MBAA&h....G&AAA.....AAHAA......
.......&AHH&.......A&A&G.&AAAHBA..iXHh                    ...,,::;;;;;:h#AA###BAA&&...G&AAA......AAHAA......
.......AAHHG........A&AAAAAAHA.M..iXHG    ..........,,,,,::::;;;;;;;;;:h#AA###.AAAGG.G&AAA.......AAHAA......
.......AAAHM.........AAAAHHHh..H..iXHG   .....,,,,,,::::::;;;;;;;;;;;;:h#AA####.AAA&AAAAA........AAHAA......
.......AAAA#..........AAHHH....A..iXHG   ....,,,,,::::::::;;;;;;;;;;;;:h#AA#####.HAAAHHH.........AAHAA......
.......AAAA#.........AAHHHHA...A#.iXHG   ....,,,,,,:::::::;;;;;;;;;;;;:h#AA####...AAHHH..........AAHAA......
.......AAAA.........GAAHHAA&&..A#.iXHG   ....,,,,,,:::::::;;;;;;;;;;;;:h#AA#####.AAHHHAG.........&AHAA......
.......AAAA........hAAAH#HAA&&.A..iXHG   ....,,,,,,:::::::;;;;;;;;;;;;:h#AA###M.AAAHHAAGG........AAHAA......
.......&AAA.......GAAAB2.9HAAAA.#.iXHG   ....,,,,,,:::::::;;;;;;;;;;;;:h#AA####AAAAHBA&AGG.......AAHAA......
.......AAAA......hAAAB2...9AAAAH..sXHG   ....,,,,,,:::::::;;;;;;;;;;;;:h#AA###HAAAH#..A&AGG......&AHAA......
.......AAAA.....hAAAB......9AAAA#.iXHG   ....,,,,,,:::::::;;;;;;;;;;;;:h#AA##MHAAHA....A&AGG.....&AHAA......
.......AAAA....hAAABr........HAAM.2XHG   ....,,,,,,:::::::;;;;;;;;;;;;:h#AH.#BHHHB......A&AGG....&AHAA......
.......AAAA...hAAAH........&AAHHM#2XHh    ...,,,,,,:::::::;;;;;;;;;;;;,3#AH.#BHB#........A&A&&...AAHH&......
.......AAAA..hAAAHr.....&GGAAAAHB#23AH:     ...,,,,,::::::;;;;;;;;:::;sAMAH.#BHHA&G&......AAA&G..AAHHG......
.......AAAA.GAAAH....G9G&&GAHHABM#ii9M.#9r,    ...,,,:::::::::,:;rihM..MA&h#MMBA&h&&GG;...5AAA&&.AAHHH......
......MHHHAHAHHH..AGG&&GAHHAA...###AhhAM...#GSr;,,,..,,,::;;s59H#....#BAB##MB#.AAAAGh&A&h...HAAAHHHHHA......
...B9GAA&&G&AHBBHAA&GAHAAH.....i.B#...#AAHM#......#MBBBM#.......#######..#MB#.A...&AAAGGAAAA#HAA&&A&&GGhh...
..hh3333XXX39G&AAAAHHHA...........#BB#.....###M####......#########....##BHBA.G.......AAAAGAHAAG93XXXXXXX9Gh.
.G993X255S522X3hAHBM................HHBB#..........................#.BHAAH#.............AHHAh3X255SS522X33GH
HGh3X2SisssiS523GABHAAA&GGGGGGGG&&AAAHHAAHHBBB###############MMBHHHHHHAHHAAA&&GGGGG&AAAAHBHG9X2Sisssii52X3hH
HGh325isr;;riS2XhAA&GhhhhhhhhhhhhhG&&AAAAAAA&AAAAAAAAABHAAAAA&&&&GAAAAHAAAGGhhhhhhhhGGG&AAAG925isr;;rsS2X9GA
H&h3X5irr;;ri523h&HBHAAAAAAAAAAAAAAHHAAHAHAHHHAAAAAAAAAAHAAAAAAAAAHHHHBHAAAAAAAAAAAAAAAHHHA&9X2Ssr;;rsS2X9&A
H&&h322SiiiS52X9GABM...................AAAHHH........AAAH........MHHHHA..................BH&G9X25SiiiS2X9G&H
MH&&G99XXXXXX3hGAAAAAAAA................AAAHAH.......AAAA.......AAAHHH................&AAHHAAGh933XXXX9hG&AH
.AHA&&&GGhGGG&&AHHAAGG&&&GH..............HAAAAA......AAAA......&AAHHA..............9h&AG&ABBBA&&GGGGGG&&AHH.
...HHBAAAAAAAHBH...AAAAGhG&GGh............HAAA&G.....AAAA2....HAAHHH............9hGAGGAHAHB.BHBHAAAAAAHHH#..
.....BBBBBBHMB........&AAAGhG&GhA..........AAAA&G....AAAA3...AAAHHA..........G9G&&GAHHA#.......BBBBBBBB.....
.........................&AAA&hGGG&h........BAAA&G...AAHH...BAAAHH........XhG&GGAHHA&.......................
............................AAAAGhG&G&9......MAAA&AAAHHHHAHAAAHHA......9hGAGGAHAHA..........................
...............................HAAA&hG&Gh9....MHAAA&hGGGh9&AHHHB....9hG&&GAHHAA.............................
..................................GAAA&hG&&G&..HA&9XXXX2XX3hAAB..&hGAGGAHHAA................................
.....................................AAAA&hGAAAAG3X25SSS522X9GAAA&GGAAHAB...................................
........................................MAAA&&&G9X2Sisrssi52X9h&&AHHAB......................................
...........................................9AHAG925isr;;rsi5X3GABHA.........................................
.............................................H&G9X2Sir;;riS2X9&AB...........................................
.............................................AA&G9X225SSS52X9G&HB...........................................
..............................................HA&&h9933XX39hG&AH............................................
...............................................AAAA&&GGGGG&&AAH.............................................
................................................#HHAA&&&&AAHH...............................................

                  8888888888 888b     d888 8888888888 .d8888b.  888                            
                  888        8888b   d8888 888       d88P  Y88b 888                            
                  888        88888b.d88888 888       Y88b.      888                            
                  8888888    888Y88888P888 8888888    "Y888b.   888888 .d88b.  888d888 .d88b.  
                  888        888 Y888P 888 888           "Y88b. 888   d88""88b 888P"  d8P  Y8b 
                  888        888  Y8P  888 888             "888 888   888  888 888    88888888 
                  888        888   "   888 888       Y88b  d88P Y88b. Y88..88P 888    Y8b.     
                  8888888888 888       888 888        "Y8888P"   "Y888 "Y88P"  888     "Y8888 
                  
                  
                  
                  
Property file read. (/jobs/genie.emfstore/gerrit-transactional/workspace/tests/org.eclipse.emf.emfstore.client.test.ui/target/work/data/profiles/default_test/./conf/es.properties)
Server data home location: /jobs/genie.emfstore/gerrit-transactional/workspace/tests/org.eclipse.emf.emfstore.client.test.ui/target/work/data/profiles/default_test/
JVM Max Memory: 477 MByte
Resource save options initialized:
	USE_ENCODED_ATTRIBUTE_STYLE: true
	ENCODING: UTF-8
	FLUSH_THRESHOLD: 100000
	USE_FILE_BUFFER: true
	CONFIGURATION_CACHE: true
added superuser super
Using WebServerProvider class org.eclipse.emf.emfstore.internal.server.connection.xmlrpc.XmlRpcBuiltinWebServer at port 8080
Started XML RPC Webserver on port: 8080
Notifying post startup listener
Couldn't load password file from path: /jobs/genie.emfstore/gerrit-transactional/workspace/tests/org.eclipse.emf.emfstore.client.test.ui/target/work/data/profiles/default_test/./conf/user.properties
Initialitation COMPLETE.
Server is RUNNING...Time to relax...
Transactional Command Stack created
log4j:WARN No appenders could be found for logger (org.eclipse.swtbot.swt.finder.matchers.AbstractMatcher).
log4j:WARN Please initialize the log4j system properly.
Can not determine whether to compute checksums on commit, default is true.
Total time for commit: 13
Total time for commit: 8
Total time for commit: 7
Total time for commit: 6
Total time for commit: 6
Total time for commit: 8
Exception on execution: No branch info available.
Exception on execution: No branch info available.
Total time for commit: 5
Exception on execution: No branch info available.
Exception on execution: No branch info available.
Total time for commit: 6
Total time for commit: 4
Total time for commit: 5
Exception on execution: No branch info available.
Exception on execution: No branch info available.
Total time for commit: 4
Total time for commit: 4
Total time for commit: 5
Total time for commit: 5
Total time for commit: 43
Total time for commit: 45
[ERROR] Failure: java.lang.InterruptedException
Terminating xvnc.
Build was aborted
[ERROR] o.h.m.e.EventSpyProcessor - Processing failure; aborting Maven
java.lang.IllegalStateException: Unable to call invoke. Invalid object ID 3
	at hudson.remoting.RemoteInvocationHandler$RPCRequest.perform(RemoteInvocationHandler.java:264) ~[hudson-remoting-3.0.0.jar:na]
	at hudson.remoting.RemoteInvocationHandler$RPCRequest.call(RemoteInvocationHandler.java:251) ~[hudson-remoting-3.0.0.jar:na]
	at hudson.remoting.RemoteInvocationHandler$RPCRequest.call(RemoteInvocationHandler.java:211) ~[hudson-remoting-3.0.0.jar:na]
	at hudson.remoting.UserRequest.perform(UserRequest.java:107) ~[hudson-remoting-3.0.0.jar:na]
	at hudson.remoting.UserRequest.perform(UserRequest.java:41) ~[hudson-remoting-3.0.0.jar:na]
	at hudson.remoting.Request$2.run(Request.java:276) ~[hudson-remoting-3.0.0.jar:na]
	at java.util.concurrent.Executors$RunnableAdapter.call(Executors.java:471) ~[na:1.8.0_121]
	at java.util.concurrent.FutureTask.run(FutureTask.java:262) ~[na:1.8.0_121]
	at java.util.concurrent.ThreadPoolExecutor.runWorker(ThreadPoolExecutor.java:1145) ~[na:1.8.0_121]
	at java.util.concurrent.ThreadPoolExecutor$Worker.run(ThreadPoolExecutor.java:615) ~[na:1.8.0_121]
	at java.lang.Thread.run(Thread.java:745) ~[na:1.8.0_121]
[ERROR] ABORTED
org.apache.maven.BuildAbort: Error occurred while processing events; aborting
	at org.hudsonci.maven.eventspy_31.EventSpyProcessor.onFailure(EventSpyProcessor.java:67)
	at org.hudsonci.utils.event.EventProcessorSupport.process(EventProcessorSupport.java:124)
	at org.hudsonci.maven.eventspy_31.EventSpyProcessor.process(EventSpyProcessor.java:54)
	at org.hudsonci.maven.eventspy_31.RemotingEventSpy.onEvent(RemotingEventSpy.java:163)
	at org.hudsonci.maven.eventspy_31.DelegatingEventSpy.onEvent(DelegatingEventSpy.java:192)
	at org.apache.maven.eventspy.internal.EventSpyDispatcher.onEvent(EventSpyDispatcher.java:108)
	at org.apache.maven.eventspy.internal.EventSpyExecutionListener.projectFailed(EventSpyExecutionListener.java:89)
	at org.apache.maven.lifecycle.internal.DefaultExecutionEventCatapult.fire(DefaultExecutionEventCatapult.java:77)
	at org.apache.maven.lifecycle.internal.BuilderCommon.handleBuildError(BuilderCommon.java:151)
	at org.apache.maven.lifecycle.internal.LifecycleModuleBuilder.buildProject(LifecycleModuleBuilder.java:95)
	at org.apache.maven.lifecycle.internal.LifecycleModuleBuilder.buildProject(LifecycleModuleBuilder.java:59)
	at org.apache.maven.lifecycle.internal.LifecycleStarter.singleThreadedBuild(LifecycleStarter.java:183)
	at org.apache.maven.lifecycle.internal.LifecycleStarter.execute(LifecycleStarter.java:161)
	at org.apache.maven.DefaultMaven.doExecute(DefaultMaven.java:317)
	at org.apache.maven.DefaultMaven.execute(DefaultMaven.java:152)
	at org.apache.maven.cli.MavenCli.execute(MavenCli.java:555)
	at org.apache.maven.cli.MavenCli.doMain(MavenCli.java:214)
	at org.apache.maven.cli.MavenCli.main(MavenCli.java:158)
	at sun.reflect.NativeMethodAccessorImpl.invoke0(Native Method)
	at sun.reflect.NativeMethodAccessorImpl.invoke(NativeMethodAccessorImpl.java:62)
	at sun.reflect.DelegatingMethodAccessorImpl.invoke(DelegatingMethodAccessorImpl.java:43)
	at java.lang.reflect.Method.invoke(Method.java:498)
	at org.codehaus.plexus.classworlds.launcher.Launcher.launchEnhanced(Launcher.java:289)
	at org.codehaus.plexus.classworlds.launcher.Launcher.launch(Launcher.java:229)
	at org.codehaus.plexus.classworlds.launcher.Launcher.mainWithExitCode(Launcher.java:415)
	at org.codehaus.plexus.classworlds.launcher.Launcher.main(Launcher.java:356)
Caused by: java.lang.IllegalStateException: Unable to call invoke. Invalid object ID 3
	at hudson.remoting.RemoteInvocationHandler$RPCRequest.perform(RemoteInvocationHandler.java:264)
	at hudson.remoting.RemoteInvocationHandler$RPCRequest.call(RemoteInvocationHandler.java:251)
	at hudson.remoting.RemoteInvocationHandler$RPCRequest.call(RemoteInvocationHandler.java:211)
	at hudson.remoting.UserRequest.perform(UserRequest.java:107)
	at hudson.remoting.UserRequest.perform(UserRequest.java:41)
	at hudson.remoting.Request$2.run(Request.java:276)
	at java.util.concurrent.Executors$RunnableAdapter.call(Executors.java:471)
	at java.util.concurrent.FutureTask.run(FutureTask.java:262)
	at java.util.concurrent.ThreadPoolExecutor.runWorker(ThreadPoolExecutor.java:1145)
	at java.util.concurrent.ThreadPoolExecutor$Worker.run(ThreadPoolExecutor.java:615)
	at java.lang.Thread.run(Thread.java:745)
Finished: ABORTED