UnstableConsole Output

Skipping 28,069 KB.. Full Log
store.internal.server.core.subinterfaces.VersionSubInterfaceImpl.resolveVersionSpec(VersionSubInterfaceImpl.java:106)
	... 17 more

Exception on execution: java.lang.reflect.InvocationTargetException
	at sun.reflect.GeneratedMethodAccessor11.invoke(Unknown Source)
	at sun.reflect.DelegatingMethodAccessorImpl.invoke(DelegatingMethodAccessorImpl.java:25)
	at java.lang.reflect.Method.invoke(Method.java:597)
	at org.eclipse.emf.emfstore.internal.server.core.AbstractSubEmfstoreInterface.execute(AbstractSubEmfstoreInterface.java:140)
	at org.eclipse.emf.emfstore.internal.server.core.EMFStoreImpl.invoke(EMFStoreImpl.java:158)
	at com.sun.proxy.$Proxy22.resolveVersionSpec(Unknown Source)
	at org.eclipse.emf.emfstore.internal.server.connection.xmlrpc.XmlRpcEmfStoreImpl.resolveVersionSpec(XmlRpcEmfStoreImpl.java:216)
	at sun.reflect.GeneratedMethodAccessor10.invoke(Unknown Source)
	at sun.reflect.DelegatingMethodAccessorImpl.invoke(DelegatingMethodAccessorImpl.java:25)
	at java.lang.reflect.Method.invoke(Method.java:597)
	at org.apache.xmlrpc.server.ReflectiveXmlRpcHandler.invoke(ReflectiveXmlRpcHandler.java:115)
	at org.apache.xmlrpc.server.ReflectiveXmlRpcHandler.execute(ReflectiveXmlRpcHandler.java:106)
	at org.apache.xmlrpc.server.XmlRpcServerWorker.execute(XmlRpcServerWorker.java:46)
	at org.apache.xmlrpc.server.XmlRpcServer.execute(XmlRpcServer.java:86)
	at org.apache.xmlrpc.server.XmlRpcStreamServer.execute(XmlRpcStreamServer.java:200)
	at org.apache.xmlrpc.webserver.Connection.run(Connection.java:208)
	at org.apache.xmlrpc.util.ThreadPool$Poolable$1.run(ThreadPool.java:68)
Caused by: org.eclipse.emf.emfstore.internal.server.exceptions.InvalidVersionSpecException: 
	at org.eclipse.emf.emfstore.internal.server.core.subinterfaces.VersionSubInterfaceImpl.resolveBranchVersionSpec(VersionSubInterfaceImpl.java:229)
	at org.eclipse.emf.emfstore.internal.server.core.subinterfaces.VersionSubInterfaceImpl.resolveVersionSpec(VersionSubInterfaceImpl.java:106)
	... 17 more

Exception on execution: java.lang.reflect.InvocationTargetException
	at sun.reflect.GeneratedMethodAccessor11.invoke(Unknown Source)
	at sun.reflect.DelegatingMethodAccessorImpl.invoke(DelegatingMethodAccessorImpl.java:25)
	at java.lang.reflect.Method.invoke(Method.java:597)
	at org.eclipse.emf.emfstore.internal.server.core.AbstractSubEmfstoreInterface.execute(AbstractSubEmfstoreInterface.java:140)
	at org.eclipse.emf.emfstore.internal.server.core.EMFStoreImpl.invoke(EMFStoreImpl.java:158)
	at com.sun.proxy.$Proxy22.resolveVersionSpec(Unknown Source)
	at org.eclipse.emf.emfstore.internal.server.connection.xmlrpc.XmlRpcEmfStoreImpl.resolveVersionSpec(XmlRpcEmfStoreImpl.java:216)
	at sun.reflect.GeneratedMethodAccessor10.invoke(Unknown Source)
	at sun.reflect.DelegatingMethodAccessorImpl.invoke(DelegatingMethodAccessorImpl.java:25)
	at java.lang.reflect.Method.invoke(Method.java:597)
	at org.apache.xmlrpc.server.ReflectiveXmlRpcHandler.invoke(ReflectiveXmlRpcHandler.java:115)
	at org.apache.xmlrpc.server.ReflectiveXmlRpcHandler.execute(ReflectiveXmlRpcHandler.java:106)
	at org.apache.xmlrpc.server.XmlRpcServerWorker.execute(XmlRpcServerWorker.java:46)
	at org.apache.xmlrpc.server.XmlRpcServer.execute(XmlRpcServer.java:86)
	at org.apache.xmlrpc.server.XmlRpcStreamServer.execute(XmlRpcStreamServer.java:200)
	at org.apache.xmlrpc.webserver.Connection.run(Connection.java:208)
	at org.apache.xmlrpc.util.ThreadPool$Poolable$1.run(ThreadPool.java:68)
Caused by: org.eclipse.emf.emfstore.internal.server.exceptions.InvalidVersionSpecException: 
	at org.eclipse.emf.emfstore.internal.server.core.subinterfaces.VersionSubInterfaceImpl.resolveBranchVersionSpec(VersionSubInterfaceImpl.java:229)
	at org.eclipse.emf.emfstore.internal.server.core.subinterfaces.VersionSubInterfaceImpl.resolveVersionSpec(VersionSubInterfaceImpl.java:106)
	... 17 more

Exception on execution: java.lang.reflect.InvocationTargetException
	at sun.reflect.GeneratedMethodAccessor11.invoke(Unknown Source)
	at sun.reflect.DelegatingMethodAccessorImpl.invoke(DelegatingMethodAccessorImpl.java:25)
	at java.lang.reflect.Method.invoke(Method.java:597)
	at org.eclipse.emf.emfstore.internal.server.core.AbstractSubEmfstoreInterface.execute(AbstractSubEmfstoreInterface.java:140)
	at org.eclipse.emf.emfstore.internal.server.core.EMFStoreImpl.invoke(EMFStoreImpl.java:158)
	at com.sun.proxy.$Proxy22.resolveVersionSpec(Unknown Source)
	at org.eclipse.emf.emfstore.internal.server.connection.xmlrpc.XmlRpcEmfStoreImpl.resolveVersionSpec(XmlRpcEmfStoreImpl.java:216)
	at sun.reflect.GeneratedMethodAccessor10.invoke(Unknown Source)
	at sun.reflect.DelegatingMethodAccessorImpl.invoke(DelegatingMethodAccessorImpl.java:25)
	at java.lang.reflect.Method.invoke(Method.java:597)
	at org.apache.xmlrpc.server.ReflectiveXmlRpcHandler.invoke(ReflectiveXmlRpcHandler.java:115)
	at org.apache.xmlrpc.server.ReflectiveXmlRpcHandler.execute(ReflectiveXmlRpcHandler.java:106)
	at org.apache.xmlrpc.server.XmlRpcServerWorker.execute(XmlRpcServerWorker.java:46)
	at org.apache.xmlrpc.server.XmlRpcServer.execute(XmlRpcServer.java:86)
	at org.apache.xmlrpc.server.XmlRpcStreamServer.execute(XmlRpcStreamServer.java:200)
	at org.apache.xmlrpc.webserver.Connection.run(Connection.java:208)
	at org.apache.xmlrpc.util.ThreadPool$Poolable$1.run(ThreadPool.java:68)
Caused by: org.eclipse.emf.emfstore.internal.server.exceptions.InvalidVersionSpecException: 
	at org.eclipse.emf.emfstore.internal.server.core.subinterfaces.VersionSubInterfaceImpl.resolveBranchVersionSpec(VersionSubInterfaceImpl.java:229)
	at org.eclipse.emf.emfstore.internal.server.core.subinterfaces.VersionSubInterfaceImpl.resolveVersionSpec(VersionSubInterfaceImpl.java:106)
	... 17 more

Exception on execution: java.lang.reflect.InvocationTargetException
	at sun.reflect.GeneratedMethodAccessor11.invoke(Unknown Source)
	at sun.reflect.DelegatingMethodAccessorImpl.invoke(DelegatingMethodAccessorImpl.java:25)
	at java.lang.reflect.Method.invoke(Method.java:597)
	at org.eclipse.emf.emfstore.internal.server.core.AbstractSubEmfstoreInterface.execute(AbstractSubEmfstoreInterface.java:140)
	at org.eclipse.emf.emfstore.internal.server.core.EMFStoreImpl.invoke(EMFStoreImpl.java:158)
	at com.sun.proxy.$Proxy22.resolveVersionSpec(Unknown Source)
	at org.eclipse.emf.emfstore.internal.server.connection.xmlrpc.XmlRpcEmfStoreImpl.resolveVersionSpec(XmlRpcEmfStoreImpl.java:216)
	at sun.reflect.GeneratedMethodAccessor10.invoke(Unknown Source)
	at sun.reflect.DelegatingMethodAccessorImpl.invoke(DelegatingMethodAccessorImpl.java:25)
	at java.lang.reflect.Method.invoke(Method.java:597)
	at org.apache.xmlrpc.server.ReflectiveXmlRpcHandler.invoke(ReflectiveXmlRpcHandler.java:115)
	at org.apache.xmlrpc.server.ReflectiveXmlRpcHandler.execute(ReflectiveXmlRpcHandler.java:106)
	at org.apache.xmlrpc.server.XmlRpcServerWorker.execute(XmlRpcServerWorker.java:46)
	at org.apache.xmlrpc.server.XmlRpcServer.execute(XmlRpcServer.java:86)
	at org.apache.xmlrpc.server.XmlRpcStreamServer.execute(XmlRpcStreamServer.java:200)
	at org.apache.xmlrpc.webserver.Connection.run(Connection.java:208)
	at org.apache.xmlrpc.util.ThreadPool$Poolable$1.run(ThreadPool.java:68)
Caused by: org.eclipse.emf.emfstore.internal.server.exceptions.InvalidVersionSpecException: 
	at org.eclipse.emf.emfstore.internal.server.core.subinterfaces.VersionSubInterfaceImpl.resolveBranchVersionSpec(VersionSubInterfaceImpl.java:229)
	at org.eclipse.emf.emfstore.internal.server.core.subinterfaces.VersionSubInterfaceImpl.resolveVersionSpec(VersionSubInterfaceImpl.java:106)
	... 17 more

Exception on execution: java.lang.reflect.InvocationTargetException
	at sun.reflect.GeneratedMethodAccessor11.invoke(Unknown Source)
	at sun.reflect.DelegatingMethodAccessorImpl.invoke(DelegatingMethodAccessorImpl.java:25)
	at java.lang.reflect.Method.invoke(Method.java:597)
	at org.eclipse.emf.emfstore.internal.server.core.AbstractSubEmfstoreInterface.execute(AbstractSubEmfstoreInterface.java:140)
	at org.eclipse.emf.emfstore.internal.server.core.EMFStoreImpl.invoke(EMFStoreImpl.java:158)
	at com.sun.proxy.$Proxy22.resolveVersionSpec(Unknown Source)
	at org.eclipse.emf.emfstore.internal.server.connection.xmlrpc.XmlRpcEmfStoreImpl.resolveVersionSpec(XmlRpcEmfStoreImpl.java:216)
	at sun.reflect.GeneratedMethodAccessor10.invoke(Unknown Source)
	at sun.reflect.DelegatingMethodAccessorImpl.invoke(DelegatingMethodAccessorImpl.java:25)
	at java.lang.reflect.Method.invoke(Method.java:597)
	at org.apache.xmlrpc.server.ReflectiveXmlRpcHandler.invoke(ReflectiveXmlRpcHandler.java:115)
	at org.apache.xmlrpc.server.ReflectiveXmlRpcHandler.execute(ReflectiveXmlRpcHandler.java:106)
	at org.apache.xmlrpc.server.XmlRpcServerWorker.execute(XmlRpcServerWorker.java:46)
	at org.apache.xmlrpc.server.XmlRpcServer.execute(XmlRpcServer.java:86)
	at org.apache.xmlrpc.server.XmlRpcStreamServer.execute(XmlRpcStreamServer.java:200)
	at org.apache.xmlrpc.webserver.Connection.run(Connection.java:208)
	at org.apache.xmlrpc.util.ThreadPool$Poolable$1.run(ThreadPool.java:68)
Caused by: org.eclipse.emf.emfstore.internal.server.exceptions.InvalidVersionSpecException: 
	at org.eclipse.emf.emfstore.internal.server.core.subinterfaces.VersionSubInterfaceImpl.resolveBranchVersionSpec(VersionSubInterfaceImpl.java:229)
	at org.eclipse.emf.emfstore.internal.server.core.subinterfaces.VersionSubInterfaceImpl.resolveVersionSpec(VersionSubInterfaceImpl.java:106)
	... 17 more

Exception on execution: java.lang.reflect.InvocationTargetException
	at sun.reflect.GeneratedMethodAccessor11.invoke(Unknown Source)
	at sun.reflect.DelegatingMethodAccessorImpl.invoke(DelegatingMethodAccessorImpl.java:25)
	at java.lang.reflect.Method.invoke(Method.java:597)
	at org.eclipse.emf.emfstore.internal.server.core.AbstractSubEmfstoreInterface.execute(AbstractSubEmfstoreInterface.java:140)
	at org.eclipse.emf.emfstore.internal.server.core.EMFStoreImpl.invoke(EMFStoreImpl.java:158)
	at com.sun.proxy.$Proxy22.resolveVersionSpec(Unknown Source)
	at org.eclipse.emf.emfstore.internal.server.connection.xmlrpc.XmlRpcEmfStoreImpl.resolveVersionSpec(XmlRpcEmfStoreImpl.java:216)
	at sun.reflect.GeneratedMethodAccessor10.invoke(Unknown Source)
	at sun.reflect.DelegatingMethodAccessorImpl.invoke(DelegatingMethodAccessorImpl.java:25)
	at java.lang.reflect.Method.invoke(Method.java:597)
	at org.apache.xmlrpc.server.ReflectiveXmlRpcHandler.invoke(ReflectiveXmlRpcHandler.java:115)
	at org.apache.xmlrpc.server.ReflectiveXmlRpcHandler.execute(ReflectiveXmlRpcHandler.java:106)
	at org.apache.xmlrpc.server.XmlRpcServerWorker.execute(XmlRpcServerWorker.java:46)
	at org.apache.xmlrpc.server.XmlRpcServer.execute(XmlRpcServer.java:86)
	at org.apache.xmlrpc.server.XmlRpcStreamServer.execute(XmlRpcStreamServer.java:200)
	at org.apache.xmlrpc.webserver.Connection.run(Connection.java:208)
	at org.apache.xmlrpc.util.ThreadPool$Poolable$1.run(ThreadPool.java:68)
Caused by: org.eclipse.emf.emfstore.internal.server.exceptions.InvalidVersionSpecException: 
	at org.eclipse.emf.emfstore.internal.server.core.subinterfaces.VersionSubInterfaceImpl.resolveBranchVersionSpec(VersionSubInterfaceImpl.java:229)
	at org.eclipse.emf.emfstore.internal.server.core.subinterfaces.VersionSubInterfaceImpl.resolveVersionSpec(VersionSubInterfaceImpl.java:106)
	... 17 more

Exception on execution: java.lang.reflect.InvocationTargetException
	at sun.reflect.GeneratedMethodAccessor11.invoke(Unknown Source)
	at sun.reflect.DelegatingMethodAccessorImpl.invoke(DelegatingMethodAccessorImpl.java:25)
	at java.lang.reflect.Method.invoke(Method.java:597)
	at org.eclipse.emf.emfstore.internal.server.core.AbstractSubEmfstoreInterface.execute(AbstractSubEmfstoreInterface.java:140)
	at org.eclipse.emf.emfstore.internal.server.core.EMFStoreImpl.invoke(EMFStoreImpl.java:158)
	at com.sun.proxy.$Proxy22.resolveVersionSpec(Unknown Source)
	at org.eclipse.emf.emfstore.internal.server.connection.xmlrpc.XmlRpcEmfStoreImpl.resolveVersionSpec(XmlRpcEmfStoreImpl.java:216)
	at sun.reflect.GeneratedMethodAccessor10.invoke(Unknown Source)
	at sun.reflect.DelegatingMethodAccessorImpl.invoke(DelegatingMethodAccessorImpl.java:25)
	at java.lang.reflect.Method.invoke(Method.java:597)
	at org.apache.xmlrpc.server.ReflectiveXmlRpcHandler.invoke(ReflectiveXmlRpcHandler.java:115)
	at org.apache.xmlrpc.server.ReflectiveXmlRpcHandler.execute(ReflectiveXmlRpcHandler.java:106)
	at org.apache.xmlrpc.server.XmlRpcServerWorker.execute(XmlRpcServerWorker.java:46)
	at org.apache.xmlrpc.server.XmlRpcServer.execute(XmlRpcServer.java:86)
	at org.apache.xmlrpc.server.XmlRpcStreamServer.execute(XmlRpcStreamServer.java:200)
	at org.apache.xmlrpc.webserver.Connection.run(Connection.java:208)
	at org.apache.xmlrpc.util.ThreadPool$Poolable$1.run(ThreadPool.java:68)
Caused by: org.eclipse.emf.emfstore.internal.server.exceptions.InvalidVersionSpecException: 
	at org.eclipse.emf.emfstore.internal.server.core.subinterfaces.VersionSubInterfaceImpl.resolveBranchVersionSpec(VersionSubInterfaceImpl.java:229)
	at org.eclipse.emf.emfstore.internal.server.core.subinterfaces.VersionSubInterfaceImpl.resolveVersionSpec(VersionSubInterfaceImpl.java:106)
	... 17 more

Exception on execution: java.lang.reflect.InvocationTargetException
	at sun.reflect.GeneratedMethodAccessor11.invoke(Unknown Source)
	at sun.reflect.DelegatingMethodAccessorImpl.invoke(DelegatingMethodAccessorImpl.java:25)
	at java.lang.reflect.Method.invoke(Method.java:597)
	at org.eclipse.emf.emfstore.internal.server.core.AbstractSubEmfstoreInterface.execute(AbstractSubEmfstoreInterface.java:140)
	at org.eclipse.emf.emfstore.internal.server.core.EMFStoreImpl.invoke(EMFStoreImpl.java:158)
	at com.sun.proxy.$Proxy22.resolveVersionSpec(Unknown Source)
	at org.eclipse.emf.emfstore.internal.server.connection.xmlrpc.XmlRpcEmfStoreImpl.resolveVersionSpec(XmlRpcEmfStoreImpl.java:216)
	at sun.reflect.GeneratedMethodAccessor10.invoke(Unknown Source)
	at sun.reflect.DelegatingMethodAccessorImpl.invoke(DelegatingMethodAccessorImpl.java:25)
	at java.lang.reflect.Method.invoke(Method.java:597)
	at org.apache.xmlrpc.server.ReflectiveXmlRpcHandler.invoke(ReflectiveXmlRpcHandler.java:115)
	at org.apache.xmlrpc.server.ReflectiveXmlRpcHandler.execute(ReflectiveXmlRpcHandler.java:106)
	at org.apache.xmlrpc.server.XmlRpcServerWorker.execute(XmlRpcServerWorker.java:46)
	at org.apache.xmlrpc.server.XmlRpcServer.execute(XmlRpcServer.java:86)
	at org.apache.xmlrpc.server.XmlRpcStreamServer.execute(XmlRpcStreamServer.java:200)
	at org.apache.xmlrpc.webserver.Connection.run(Connection.java:208)
	at org.apache.xmlrpc.util.ThreadPool$Poolable$1.run(ThreadPool.java:68)
Caused by: org.eclipse.emf.emfstore.internal.server.exceptions.InvalidVersionSpecException: 
	at org.eclipse.emf.emfstore.internal.server.core.subinterfaces.VersionSubInterfaceImpl.resolveBranchVersionSpec(VersionSubInterfaceImpl.java:229)
	at org.eclipse.emf.emfstore.internal.server.core.subinterfaces.VersionSubInterfaceImpl.resolveVersionSpec(VersionSubInterfaceImpl.java:106)
	... 17 more

Exception on execution: java.lang.reflect.InvocationTargetException
	at sun.reflect.GeneratedMethodAccessor11.invoke(Unknown Source)
	at sun.reflect.DelegatingMethodAccessorImpl.invoke(DelegatingMethodAccessorImpl.java:25)
	at java.lang.reflect.Method.invoke(Method.java:597)
	at org.eclipse.emf.emfstore.internal.server.core.AbstractSubEmfstoreInterface.execute(AbstractSubEmfstoreInterface.java:140)
	at org.eclipse.emf.emfstore.internal.server.core.EMFStoreImpl.invoke(EMFStoreImpl.java:158)
	at com.sun.proxy.$Proxy22.resolveVersionSpec(Unknown Source)
	at org.eclipse.emf.emfstore.internal.server.connection.xmlrpc.XmlRpcEmfStoreImpl.resolveVersionSpec(XmlRpcEmfStoreImpl.java:216)
	at sun.reflect.GeneratedMethodAccessor10.invoke(Unknown Source)
	at sun.reflect.DelegatingMethodAccessorImpl.invoke(DelegatingMethodAccessorImpl.java:25)
	at java.lang.reflect.Method.invoke(Method.java:597)
	at org.apache.xmlrpc.server.ReflectiveXmlRpcHandler.invoke(ReflectiveXmlRpcHandler.java:115)
	at org.apache.xmlrpc.server.ReflectiveXmlRpcHandler.execute(ReflectiveXmlRpcHandler.java:106)
	at org.apache.xmlrpc.server.XmlRpcServerWorker.execute(XmlRpcServerWorker.java:46)
	at org.apache.xmlrpc.server.XmlRpcServer.execute(XmlRpcServer.java:86)
	at org.apache.xmlrpc.server.XmlRpcStreamServer.execute(XmlRpcStreamServer.java:200)
	at org.apache.xmlrpc.webserver.Connection.run(Connection.java:208)
	at org.apache.xmlrpc.util.ThreadPool$Poolable$1.run(ThreadPool.java:68)
Caused by: org.eclipse.emf.emfstore.internal.server.exceptions.InvalidVersionSpecException: 
	at org.eclipse.emf.emfstore.internal.server.core.subinterfaces.VersionSubInterfaceImpl.resolveBranchVersionSpec(VersionSubInterfaceImpl.java:229)
	at org.eclipse.emf.emfstore.internal.server.core.subinterfaces.VersionSubInterfaceImpl.resolveVersionSpec(VersionSubInterfaceImpl.java:106)
	... 17 more

Exception on execution: java.lang.reflect.InvocationTargetException
	at sun.reflect.GeneratedMethodAccessor11.invoke(Unknown Source)
	at sun.reflect.DelegatingMethodAccessorImpl.invoke(DelegatingMethodAccessorImpl.java:25)
	at java.lang.reflect.Method.invoke(Method.java:597)
	at org.eclipse.emf.emfstore.internal.server.core.AbstractSubEmfstoreInterface.execute(AbstractSubEmfstoreInterface.java:140)
	at org.eclipse.emf.emfstore.internal.server.core.EMFStoreImpl.invoke(EMFStoreImpl.java:158)
	at com.sun.proxy.$Proxy22.resolveVersionSpec(Unknown Source)
	at org.eclipse.emf.emfstore.internal.server.connection.xmlrpc.XmlRpcEmfStoreImpl.resolveVersionSpec(XmlRpcEmfStoreImpl.java:216)
	at sun.reflect.GeneratedMethodAccessor10.invoke(Unknown Source)
	at sun.reflect.DelegatingMethodAccessorImpl.invoke(DelegatingMethodAccessorImpl.java:25)
	at java.lang.reflect.Method.invoke(Method.java:597)
	at org.apache.xmlrpc.server.ReflectiveXmlRpcHandler.invoke(ReflectiveXmlRpcHandler.java:115)
	at org.apache.xmlrpc.server.ReflectiveXmlRpcHandler.execute(ReflectiveXmlRpcHandler.java:106)
	at org.apache.xmlrpc.server.XmlRpcServerWorker.execute(XmlRpcServerWorker.java:46)
	at org.apache.xmlrpc.server.XmlRpcServer.execute(XmlRpcServer.java:86)
	at org.apache.xmlrpc.server.XmlRpcStreamServer.execute(XmlRpcStreamServer.java:200)
	at org.apache.xmlrpc.webserver.Connection.run(Connection.java:208)
	at org.apache.xmlrpc.util.ThreadPool$Poolable$1.run(ThreadPool.java:68)
Caused by: org.eclipse.emf.emfstore.internal.server.exceptions.InvalidVersionSpecException: 
	at org.eclipse.emf.emfstore.internal.server.core.subinterfaces.VersionSubInterfaceImpl.resolveBranchVersionSpec(VersionSubInterfaceImpl.java:229)
	at org.eclipse.emf.emfstore.internal.server.core.subinterfaces.VersionSubInterfaceImpl.resolveVersionSpec(VersionSubInterfaceImpl.java:106)
	... 17 more

Exception on execution: java.lang.reflect.InvocationTargetException
	at sun.reflect.GeneratedMethodAccessor11.invoke(Unknown Source)
	at sun.reflect.DelegatingMethodAccessorImpl.invoke(DelegatingMethodAccessorImpl.java:25)
	at java.lang.reflect.Method.invoke(Method.java:597)
	at org.eclipse.emf.emfstore.internal.server.core.AbstractSubEmfstoreInterface.execute(AbstractSubEmfstoreInterface.java:140)
	at org.eclipse.emf.emfstore.internal.server.core.EMFStoreImpl.invoke(EMFStoreImpl.java:158)
	at com.sun.proxy.$Proxy22.resolveVersionSpec(Unknown Source)
	at org.eclipse.emf.emfstore.internal.server.connection.xmlrpc.XmlRpcEmfStoreImpl.resolveVersionSpec(XmlRpcEmfStoreImpl.java:216)
	at sun.reflect.GeneratedMethodAccessor10.invoke(Unknown Source)
	at sun.reflect.DelegatingMethodAccessorImpl.invoke(DelegatingMethodAccessorImpl.java:25)
	at java.lang.reflect.Method.invoke(Method.java:597)
	at org.apache.xmlrpc.server.ReflectiveXmlRpcHandler.invoke(ReflectiveXmlRpcHandler.java:115)
	at org.apache.xmlrpc.server.ReflectiveXmlRpcHandler.execute(ReflectiveXmlRpcHandler.java:106)
	at org.apache.xmlrpc.server.XmlRpcServerWorker.execute(XmlRpcServerWorker.java:46)
	at org.apache.xmlrpc.server.XmlRpcServer.execute(XmlRpcServer.java:86)
	at org.apache.xmlrpc.server.XmlRpcStreamServer.execute(XmlRpcStreamServer.java:200)
	at org.apache.xmlrpc.webserver.Connection.run(Connection.java:208)
	at org.apache.xmlrpc.util.ThreadPool$Poolable$1.run(ThreadPool.java:68)
Caused by: org.eclipse.emf.emfstore.internal.server.exceptions.InvalidVersionSpecException: 
	at org.eclipse.emf.emfstore.internal.server.core.subinterfaces.VersionSubInterfaceImpl.resolveBranchVersionSpec(VersionSubInterfaceImpl.java:229)
	at org.eclipse.emf.emfstore.internal.server.core.subinterfaces.VersionSubInterfaceImpl.resolveVersionSpec(VersionSubInterfaceImpl.java:106)
	... 17 more

Exception on execution: java.lang.reflect.InvocationTargetException
	at sun.reflect.GeneratedMethodAccessor11.invoke(Unknown Source)
	at sun.reflect.DelegatingMethodAccessorImpl.invoke(DelegatingMethodAccessorImpl.java:25)
	at java.lang.reflect.Method.invoke(Method.java:597)
	at org.eclipse.emf.emfstore.internal.server.core.AbstractSubEmfstoreInterface.execute(AbstractSubEmfstoreInterface.java:140)
	at org.eclipse.emf.emfstore.internal.server.core.EMFStoreImpl.invoke(EMFStoreImpl.java:158)
	at com.sun.proxy.$Proxy22.resolveVersionSpec(Unknown Source)
	at org.eclipse.emf.emfstore.internal.server.connection.xmlrpc.XmlRpcEmfStoreImpl.resolveVersionSpec(XmlRpcEmfStoreImpl.java:216)
	at sun.reflect.GeneratedMethodAccessor10.invoke(Unknown Source)
	at sun.reflect.DelegatingMethodAccessorImpl.invoke(DelegatingMethodAccessorImpl.java:25)
	at java.lang.reflect.Method.invoke(Method.java:597)
	at org.apache.xmlrpc.server.ReflectiveXmlRpcHandler.invoke(ReflectiveXmlRpcHandler.java:115)
	at org.apache.xmlrpc.server.ReflectiveXmlRpcHandler.execute(ReflectiveXmlRpcHandler.java:106)
	at org.apache.xmlrpc.server.XmlRpcServerWorker.execute(XmlRpcServerWorker.java:46)
	at org.apache.xmlrpc.server.XmlRpcServer.execute(XmlRpcServer.java:86)
	at org.apache.xmlrpc.server.XmlRpcStreamServer.execute(XmlRpcStreamServer.java:200)
	at org.apache.xmlrpc.webserver.Connection.run(Connection.java:208)
	at org.apache.xmlrpc.util.ThreadPool$Poolable$1.run(ThreadPool.java:68)
Caused by: org.eclipse.emf.emfstore.internal.server.exceptions.InvalidVersionSpecException: 
	at org.eclipse.emf.emfstore.internal.server.core.subinterfaces.VersionSubInterfaceImpl.resolveBranchVersionSpec(VersionSubInterfaceImpl.java:229)
	at org.eclipse.emf.emfstore.internal.server.core.subinterfaces.VersionSubInterfaceImpl.resolveVersionSpec(VersionSubInterfaceImpl.java:106)
	... 17 more

Total time for commit: 4
Total time for commit: 4
Total time for commit: 4
Total time for commit: 4
Total time for commit: 4
Total time for commit: 4
Total time for commit: 4
Total time for commit: 4
Total time for commit: 4
Total time for commit: 4
Total time for commit: 5
Total time for commit: 5
Total time for commit: 5
Total time for commit: 5
Total time for commit: 5
Total time for commit: 5
Total time for commit: 5
Total time for commit: 5
Total time for commit: 5
Total time for commit: 5
Total time for commit: 5
Total time for commit: 5
Total time for commit: 5
Total time for commit: 5
Total time for commit: 5
Total time for commit: 5
Total time for commit: 5
Total time for commit: 5
Total time for commit: 5
Total time for commit: 5
Total time for commit: 4
Total time for commit: 4
Total time for commit: 4
Total time for commit: 4
Total time for commit: 4
Total time for commit: 4
Total time for commit: 4
Total time for commit: 4
Total time for commit: 4
Total time for commit: 4
Total time for commit: 5
Total time for commit: 5
Total time for commit: 5
Total time for commit: 5
Total time for commit: 5
Total time for commit: 5
Total time for commit: 5
Total time for commit: 5
Total time for commit: 5
Total time for commit: 5
Total time for commit: 6
Total time for commit: 6
Total time for commit: 6
Total time for commit: 6
Total time for commit: 6
Total time for commit: 6
Total time for commit: 6
Total time for commit: 6
Total time for commit: 6
Total time for commit: 6
Total time for commit: 6
Total time for commit: 6
Total time for commit: 6
Total time for commit: 6
Total time for commit: 6
Total time for commit: 6
Total time for commit: 6
Total time for commit: 6
Total time for commit: 6
Total time for commit: 6
Total time for commit: 8
Total time for commit: 8
Total time for commit: 8
Total time for commit: 8
Total time for commit: 8
Total time for commit: 8
Total time for commit: 8
Total time for commit: 8
Total time for commit: 8
Total time for commit: 8
Total time for commit: 4
Total time for commit: 4
Total time for commit: 4
Total time for commit: 4
Total time for commit: 4
Total time for commit: 4
Total time for commit: 4
Total time for commit: 4
Total time for commit: 4
Total time for commit: 4
Total time for commit: 4
Total time for commit: 4
Total time for commit: 4
Total time for commit: 4
Total time for commit: 4
Total time for commit: 4
Total time for commit: 4
Total time for commit: 4
Total time for commit: 4
Total time for commit: 4
Total time for commit: 4
Total time for commit: 4
Total time for commit: 4
Total time for commit: 4
Total time for commit: 4
Total time for commit: 4
Total time for commit: 4
Total time for commit: 4
Total time for commit: 4
Total time for commit: 4
Total time for commit: 5
Total time for commit: 5
Total time for commit: 5
Total time for commit: 5
Total time for commit: 5
Total time for commit: 5
Total time for commit: 5
Total time for commit: 5
Total time for commit: 5
Total time for commit: 5
Total time for commit: 6
Total time for commit: 6
Total time for commit: 6
Total time for commit: 6
Total time for commit: 6
Total time for commit: 6
Total time for commit: 6
Total time for commit: 6
Total time for commit: 6
Total time for commit: 6
Total time for commit: 7
Total time for commit: 7
Total time for commit: 7
Total time for commit: 7
Total time for commit: 7
Total time for commit: 7
Total time for commit: 7
Total time for commit: 7
Total time for commit: 7
Total time for commit: 7
Server was stopped.
Server was stopped.
Server was stopped.
Server was stopped.
Server was stopped.
Server was stopped.
Server was stopped.
Server was stopped.
Server was stopped.
Server was stopped.
Incoming cross reference for model element org.eclipse.emf.emfstore.client.test.testmodel.impl.TestElementImpl@17c57009 (name: keyRefeferenceTestElement, strings: null, description: null) is a map key.
Incoming cross reference for model element org.eclipse.emf.emfstore.client.test.testmodel.impl.TestElementImpl@17c57009 (name: keyRefeferenceTestElement, strings: null, description: null) is a map key.
Incoming cross reference for model element org.eclipse.emf.emfstore.client.test.testmodel.impl.TestElementImpl@17c57009 (name: keyRefeferenceTestElement, strings: null, description: null) is a map key.
Incoming cross reference for model element org.eclipse.emf.emfstore.client.test.testmodel.impl.TestElementImpl@17c57009 (name: keyRefeferenceTestElement, strings: null, description: null) is a map key.
Incoming cross reference for model element org.eclipse.emf.emfstore.client.test.testmodel.impl.TestElementImpl@17c57009 (name: keyRefeferenceTestElement, strings: null, description: null) is a map key.
Incoming cross reference for model element org.eclipse.emf.emfstore.client.test.testmodel.impl.TestElementImpl@17c57009 (name: keyRefeferenceTestElement, strings: null, description: null) is a map key.
Incoming cross reference for model element org.eclipse.emf.emfstore.client.test.testmodel.impl.TestElementImpl@17c57009 (name: keyRefeferenceTestElement, strings: null, description: null) is a map key.
Incoming cross reference for model element org.eclipse.emf.emfstore.client.test.testmodel.impl.TestElementImpl@17c57009 (name: keyRefeferenceTestElement, strings: null, description: null) is a map key.
Incoming cross reference for model element org.eclipse.emf.emfstore.client.test.testmodel.impl.TestElementImpl@17c57009 (name: keyRefeferenceTestElement, strings: null, description: null) is a map key.
Incoming cross reference for model element org.eclipse.emf.emfstore.client.test.testmodel.impl.TestElementImpl@17c57009 (name: keyRefeferenceTestElement, strings: null, description: null) is a map key.
Incoming cross reference for model element org.eclipse.emf.emfstore.client.test.testmodel.impl.TestElementImpl@6c7733eb (name: secondTestElement, strings: null, description: null) is a map key.
Incoming cross reference for model element org.eclipse.emf.emfstore.client.test.testmodel.impl.TestElementImpl@6c7733eb (name: secondTestElement, strings: null, description: null) is a map key.
Incoming cross reference for model element org.eclipse.emf.emfstore.client.test.testmodel.impl.TestElementImpl@6c7733eb (name: secondTestElement, strings: null, description: null) is a map key.
Incoming cross reference for model element org.eclipse.emf.emfstore.client.test.testmodel.impl.TestElementImpl@6c7733eb (name: secondTestElement, strings: null, description: null) is a map key.
Incoming cross reference for model element org.eclipse.emf.emfstore.client.test.testmodel.impl.TestElementImpl@6c7733eb (name: secondTestElement, strings: null, description: null) is a map key.
Incoming cross reference for model element org.eclipse.emf.emfstore.client.test.testmodel.impl.TestElementImpl@6c7733eb (name: secondTestElement, strings: null, description: null) is a map key.
Incoming cross reference for model element org.eclipse.emf.emfstore.client.test.testmodel.impl.TestElementImpl@6c7733eb (name: secondTestElement, strings: null, description: null) is a map key.
Incoming cross reference for model element org.eclipse.emf.emfstore.client.test.testmodel.impl.TestElementImpl@6c7733eb (name: secondTestElement, strings: null, description: null) is a map key.
Incoming cross reference for model element org.eclipse.emf.emfstore.client.test.testmodel.impl.TestElementImpl@6c7733eb (name: secondTestElement, strings: null, description: null) is a map key.
Incoming cross reference for model element org.eclipse.emf.emfstore.client.test.testmodel.impl.TestElementImpl@6c7733eb (name: secondTestElement, strings: null, description: null) is a map key.
Incoming cross reference for model element org.eclipse.emf.emfstore.client.test.testmodel.impl.TestElementImpl@42988fee (name: referenceTestElement, strings: null, description: null) is a map key.
Incoming cross reference for model element org.eclipse.emf.emfstore.client.test.testmodel.impl.TestElementImpl@42988fee (name: referenceTestElement, strings: null, description: null) is a map key.
Incoming cross reference for model element org.eclipse.emf.emfstore.client.test.testmodel.impl.TestElementImpl@42988fee (name: referenceTestElement, strings: null, description: null) is a map key.
Incoming cross reference for model element org.eclipse.emf.emfstore.client.test.testmodel.impl.TestElementImpl@42988fee (name: referenceTestElement, strings: null, description: null) is a map key.
Incoming cross reference for model element org.eclipse.emf.emfstore.client.test.testmodel.impl.TestElementImpl@42988fee (name: referenceTestElement, strings: null, description: null) is a map key.
Incoming cross reference for model element org.eclipse.emf.emfstore.client.test.testmodel.impl.TestElementImpl@42988fee (name: referenceTestElement, strings: null, description: null) is a map key.
Incoming cross reference for model element org.eclipse.emf.emfstore.client.test.testmodel.impl.TestElementImpl@42988fee (name: referenceTestElement, strings: null, description: null) is a map key.
Incoming cross reference for model element org.eclipse.emf.emfstore.client.test.testmodel.impl.TestElementImpl@42988fee (name: referenceTestElement, strings: null, description: null) is a map key.
Incoming cross reference for model element org.eclipse.emf.emfstore.client.test.testmodel.impl.TestElementImpl@42988fee (name: referenceTestElement, strings: null, description: null) is a map key.
Incoming cross reference for model element org.eclipse.emf.emfstore.client.test.testmodel.impl.TestElementImpl@42988fee (name: referenceTestElement, strings: null, description: null) is a map key.
.................................................#HHHHHHHHB.................................................
...............................................AGA&h9999hhhh9...............................................
..............................................hG393XX22XXXX39GH.............................................
.............................................hG93X25SSiS522X93&M............................................
.............................................A9hX2SisrrsiS523hhG............................................
............................................AAG9X2Ssr;;;si523hGAG...........................................
.........................................3h&AAAh325isrrrsS2X3GAA&GhG........................................
......................................3h&&GGHBA&h3X255S552X9G&AHAhG&GhA.....................................
...................................3hG&GGAHAHMHAA&hh933399h&AHH#HAA&hG&GGG..................................
................................hhG&GGAAHA....BBBAA&&&&&&&AABBB...BAAAGhG&Ghh...............................
.............................9hG&GGAAAA......AHBBMBBHBBBBBBBHHAA.....AAAAGh&&Gh.............................
..........................3hG&GGAHHA........&AAHB#..MMMMM...AAA&&.......&AAAGhGGGh..........................
.......................3hG&GGAHHA2.........hAAAH#....HHHH....A&A&A.........AAA&hh&&hG.......................
......AGAhGG&.......3hG&GGAHHHA...........hAAAH#....HAHAA....HAAA&&...........AAA&hG&GGA.......M&Gh&&G......
...Ahhhh939hhhGG.hGG&GGAHHAA.............GAAAH#.....HAHA&.....#AAA&&............MAAA&hGGGG&..9hGh933hhhh&...
..hh33XXXXXXXX3GAA&GAHHAh...............hAAAH#......HAHAA......AAAA&&..............BAAA&hG&&G9XXXX2XXXXX9h&.
.h993X25SS552239GABBA..................hAAHH........MAHAA.......BHAA&h................&AAAAG93X225SS522X33hH
HGh3X2SisssiS523GABHHAAAA&GGGhhhhhhhhh&AAHHBH3G9HHHHAHHAA;GhhG&H.BHAA&G..................AA&9X25isssii52X9hH
HGh325irr;;riS2XhAAAAA&&&&&G&&&&&&&&AAAHHHHHAAAA&&AAHHHHAAAAAAAAAHHHAAA&GhGGGGGGGGGG&&AAHHAG9X5isr;;rsS5X9GA
H&h325irr;;ri523h&HHHAAAAAAAHAHHHHAHHHHHBHHHHHAAAAHHHHHHHHHHAHAAAAHHAAA&&&&GGGGGhhhhGGGG&AA&9X2Ssr;;rsS2X9&A
H&&h322SiiiS52X9&AHM........922222.HHHAHAMHBM........MMM#...###BBBMHHHAAHHAAAAAAAAAAAAAABBB&h9X2SiiiiS2X9h&H
MH&&G99XXXXX33hGAAHAA&H...........AAHHB......MHHAAAAAMBBHHHHBM##.....#BHHHM.............&BBHAGh93XXXXX39G&AH
.MHAA&&GGhGGG&AHBBHAGGA&G9.......AAHM#.BG93X9hhG&AAAAHBHHAHHAAAHAAAHB###MHHB.........&AAHAHBMAA&GGGGhG&&AHH.
...HHHAAHAHAAHBBM.MHAA&hG&&G&...AAM#AsiS2X9&&G35isrr;;;rrsi5XhAHBBHAA&AHM#MHA.....9GGA&&AHHM#MBBAAHHHAHBHB..
.....HBMMMMMMMHHAA...BAAA&hG&&G&AB9ssS2X2s;,                 ..,:riX&A&&GhAHAB.hGG&GGAHHA...HBMMMMMMMMM#....
.......HBBMM..AAAAA.....&AAA&GAAH#2i399Gs          ...,,,,,...   .,;2HHAAA&#HAA&GGAAAH2....AAHHB.HHBMB......
.......AAHBA...A&A&&.......&AHHHB#XX9hHB#.#Bh5r;:,,...,,,::;ri2hH##.###BHAH.MHAAHAH.......&&HAH..AAHHH......
.......&AHH&....A&A&G.......HHHHM#2Xh5.rG#.........######..........M&2r9MAH.#BHBM........h&AAH...AAHHA......
.......AAHH&.....A&AGG.....&AHAB..S2&S    .;i9H#............#MA3Sr;,.. X#AH.#MBHHM......h&AAH....AAHAA......
.......AAHH&......A&AGG...GAAAHH..sXAX          .,:;;;;;;;:,,.....,,::,9#AA##MBAA&h....G&AAA.....AAHAA......
.......&AHH&.......A&A&G.&AAAHBA..iXHh                    ...,,::;;;;;:h#AA###BAA&&...G&AAA......AAHAA......
.......AAHHG........A&AAAAAAHA.M..iXHG    ..........,,,,,::::;;;;;;;;;:h#AA###.AAAGG.G&AAA.......AAHAA......
.......AAAHM.........AAAAHHHh..H..iXHG   .....,,,,,,::::::;;;;;;;;;;;;:h#AA####.AAA&AAAAA........AAHAA......
.......AAAA#..........AAHHH....A..iXHG   ....,,,,,::::::::;;;;;;;;;;;;:h#AA#####.HAAAHHH.........AAHAA......
.......AAAA#.........AAHHHHA...A#.iXHG   ....,,,,,,:::::::;;;;;;;;;;;;:h#AA####...AAHHH..........AAHAA......
.......AAAA.........GAAHHAA&&..A#.iXHG   ....,,,,,,:::::::;;;;;;;;;;;;:h#AA#####.AAHHHAG.........&AHAA......
.......AAAA........hAAAH#HAA&&.A..iXHG   ....,,,,,,:::::::;;;;;;;;;;;;:h#AA###M.AAAHHAAGG........AAHAA......
.......&AAA.......GAAAB2.9HAAAA.#.iXHG   ....,,,,,,:::::::;;;;;;;;;;;;:h#AA####AAAAHBA&AGG.......AAHAA......
.......AAAA......hAAAB2...9AAAAH..sXHG   ....,,,,,,:::::::;;;;;;;;;;;;:h#AA###HAAAH#..A&AGG......&AHAA......
.......AAAA.....hAAAB......9AAAA#.iXHG   ....,,,,,,:::::::;;;;;;;;;;;;:h#AA##MHAAHA....A&AGG.....&AHAA......
.......AAAA....hAAABr........HAAM.2XHG   ....,,,,,,:::::::;;;;;;;;;;;;:h#AH.#BHHHB......A&AGG....&AHAA......
.......AAAA...hAAAH........&AAHHM#2XHh    ...,,,,,,:::::::;;;;;;;;;;;;,3#AH.#BHB#........A&A&&...AAHH&......
.......AAAA..hAAAHr.....&GGAAAAHB#23AH:     ...,,,,,::::::;;;;;;;;:::;sAMAH.#BHHA&G&......AAA&G..AAHHG......
.......AAAA.GAAAH....G9G&&GAHHABM#ii9M.#9r,    ...,,,:::::::::,:;rihM..MA&h#MMBA&h&≫...5AAA&&.AAHHH......
......MHHHAHAHHH..AGG&&GAHHAA...###AhhAM...#GSr;,,,..,,,::;;s59H#....#BAB##MB#.AAAAGh&A&h...HAAAHHHHHA......
...B9GAA&&G&AHBBHAA&GAHAAH.....i.B#...#AAHM#......#MBBBM#.......#######..#MB#.A...&AAAGGAAAA#HAA&&A&&GGhh...
..hh3333XXX39G&AAAAHHHA...........#BB#.....###M####......#########....##BHBA.G.......AAAAGAHAAG93XXXXXXX9Gh.
.G993X255S522X3hAHBM................HHBB#..........................#.BHAAH#.............AHHAh3X255SS522X33GH
HGh3X2SisssiS523GABHAAA&GGGGGGGG&&AAAHHAAHHBBB###############MMBHHHHHHAHHAAA&&GGGGG&AAAAHBHG9X2Sisssii52X3hH
HGh325isr;;riS2XhAA&GhhhhhhhhhhhhhG&&AAAAAAA&AAAAAAAAABHAAAAA&&&&GAAAAHAAAGGhhhhhhhhGGG&AAAG925isr;;rsS2X9GA
H&h3X5irr;;ri523h&HBHAAAAAAAAAAAAAAHHAAHAHAHHHAAAAAAAAAAHAAAAAAAAAHHHHBHAAAAAAAAAAAAAAAHHHA&9X2Ssr;;rsS2X9&A
H&&h322SiiiS52X9GABM...................AAAHHH........AAAH........MHHHHA..................BH&G9X25SiiiS2X9G&H
MH&&G99XXXXXX3hGAAAAAAAA................AAAHAH.......AAAA.......AAAHHH................&AAHHAAGh933XXXX9hG&AH
.AHA&&&GGhGGG&&AHHAAGG&&&GH..............HAAAAA......AAAA......&AAHHA..............9h&AG&ABBBA&&GGGGGG&&AHH.
...HHBAAAAAAAHBH...AAAAGhG&GGh............HAAA&G.....AAAA2....HAAHHH............9hGAGGAHAHB.BHBHAAAAAAHHH#..
.....BBBBBBHMB........&AAAGhG&GhA..........AAAA&G....AAAA3...AAAHHA..........G9G&&GAHHA#.......BBBBBBBB.....
.........................&AAA&hGGG&h........BAAA&G...AAHH...BAAAHH........XhG&GGAHHA&.......................
............................AAAAGhG&G&9......MAAA&AAAHHHHAHAAAHHA......9hGAGGAHAHA..........................
...............................HAAA&hG&Gh9....MHAAA&hGGGh9&AHHHB....9hG&&GAHHAA.............................
..................................GAAA&hG&&G&..HA&9XXXX2XX3hAAB..&hGAGGAHHAA................................
.....................................AAAA&hGAAAAG3X25SSS522X9GAAA&GGAAHAB...................................
........................................MAAA&&&G9X2Sisrssi52X9h&&AHHAB......................................
...........................................9AHAG925isr;;rsi5X3GABHA.........................................
.............................................H&G9X2Sir;;riS2X9&AB...........................................
.............................................AA&G9X225SSS52X9G&HB...........................................
..............................................HA&&h9933XX39hG&AH............................................
...............................................AAAA&&GGGGG&&AAH.............................................
................................................#HHAA&&&&AAHH...............................................

                  8888888888 888b     d888 8888888888 .d8888b.  888                            
                  888        8888b   d8888 888       d88P  Y88b 888                            
                  888        88888b.d88888 888       Y88b.      888                            
                  8888888    888Y88888P888 8888888    "Y888b.   888888 .d88b.  888d888 .d88b.  
                  888        888 Y888P 888 888           "Y88b. 888   d88""88b 888P"  d8P  Y8b 
                  888        888  Y8P  888 888             "888 888   888  888 888    88888888 
                  888        888   "   888 888       Y88b  d88P Y88b. Y88..88P 888    Y8b.     
                  8888888888 888       888 888        "Y8888P"   "Y888 "Y88P"  888     "Y8888 
                  
                  
                  
                  
Property file read. (/jobs/genie.modeling.emfstore/emf-emfstore-simrel/workspace/git/tests/org.eclipse.emf.emfstore.client.test.alltests/target/work/data/profiles/default_test/./conf/es.properties)
Property file read. (/jobs/genie.modeling.emfstore/emf-emfstore-simrel/workspace/git/tests/org.eclipse.emf.emfstore.client.test.alltests/target/work/data/profiles/default_test/./conf/es.properties)
Property file read. (/jobs/genie.modeling.emfstore/emf-emfstore-simrel/workspace/git/tests/org.eclipse.emf.emfstore.client.test.alltests/target/work/data/profiles/default_test/./conf/es.properties)
Property file read. (/jobs/genie.modeling.emfstore/emf-emfstore-simrel/workspace/git/tests/org.eclipse.emf.emfstore.client.test.alltests/target/work/data/profiles/default_test/./conf/es.properties)
Property file read. (/jobs/genie.modeling.emfstore/emf-emfstore-simrel/workspace/git/tests/org.eclipse.emf.emfstore.client.test.alltests/target/work/data/profiles/default_test/./conf/es.properties)
Property file read. (/jobs/genie.modeling.emfstore/emf-emfstore-simrel/workspace/git/tests/org.eclipse.emf.emfstore.client.test.alltests/target/work/data/profiles/default_test/./conf/es.properties)
Property file read. (/jobs/genie.modeling.emfstore/emf-emfstore-simrel/workspace/git/tests/org.eclipse.emf.emfstore.client.test.alltests/target/work/data/profiles/default_test/./conf/es.properties)
Property file read. (/jobs/genie.modeling.emfstore/emf-emfstore-simrel/workspace/git/tests/org.eclipse.emf.emfstore.client.test.alltests/target/work/data/profiles/default_test/./conf/es.properties)
Property file read. (/jobs/genie.modeling.emfstore/emf-emfstore-simrel/workspace/git/tests/org.eclipse.emf.emfstore.client.test.alltests/target/work/data/profiles/default_test/./conf/es.properties)
Property file read. (/jobs/genie.modeling.emfstore/emf-emfstore-simrel/workspace/git/tests/org.eclipse.emf.emfstore.client.test.alltests/target/work/data/profiles/default_test/./conf/es.properties)
Property file read. (/jobs/genie.modeling.emfstore/emf-emfstore-simrel/workspace/git/tests/org.eclipse.emf.emfstore.client.test.alltests/target/work/data/profiles/default_test/./conf/es.properties)
Server data home location: /jobs/genie.modeling.emfstore/emf-emfstore-simrel/workspace/git/tests/org.eclipse.emf.emfstore.client.test.alltests/target/work/data/profiles/default_test/
Server data home location: /jobs/genie.modeling.emfstore/emf-emfstore-simrel/workspace/git/tests/org.eclipse.emf.emfstore.client.test.alltests/target/work/data/profiles/default_test/
Server data home location: /jobs/genie.modeling.emfstore/emf-emfstore-simrel/workspace/git/tests/org.eclipse.emf.emfstore.client.test.alltests/target/work/data/profiles/default_test/
Server data home location: /jobs/genie.modeling.emfstore/emf-emfstore-simrel/workspace/git/tests/org.eclipse.emf.emfstore.client.test.alltests/target/work/data/profiles/default_test/
Server data home location: /jobs/genie.modeling.emfstore/emf-emfstore-simrel/workspace/git/tests/org.eclipse.emf.emfstore.client.test.alltests/target/work/data/profiles/default_test/
Server data home location: /jobs/genie.modeling.emfstore/emf-emfstore-simrel/workspace/git/tests/org.eclipse.emf.emfstore.client.test.alltests/target/work/data/profiles/default_test/
Server data home location: /jobs/genie.modeling.emfstore/emf-emfstore-simrel/workspace/git/tests/org.eclipse.emf.emfstore.client.test.alltests/target/work/data/profiles/default_test/
Server data home location: /jobs/genie.modeling.emfstore/emf-emfstore-simrel/workspace/git/tests/org.eclipse.emf.emfstore.client.test.alltests/target/work/data/profiles/default_test/
Server data home location: /jobs/genie.modeling.emfstore/emf-emfstore-simrel/workspace/git/tests/org.eclipse.emf.emfstore.client.test.alltests/target/work/data/profiles/default_test/
Server data home location: /jobs/genie.modeling.emfstore/emf-emfstore-simrel/workspace/git/tests/org.eclipse.emf.emfstore.client.test.alltests/target/work/data/profiles/default_test/
Server data home location: /jobs/genie.modeling.emfstore/emf-emfstore-simrel/workspace/git/tests/org.eclipse.emf.emfstore.client.test.alltests/target/work/data/profiles/default_test/
JVM Max Memory: 477 MByte
JVM Max Memory: 477 MByte
JVM Max Memory: 477 MByte
JVM Max Memory: 477 MByte
JVM Max Memory: 477 MByte
JVM Max Memory: 477 MByte
JVM Max Memory: 477 MByte
JVM Max Memory: 477 MByte
JVM Max Memory: 477 MByte
JVM Max Memory: 477 MByte
JVM Max Memory: 477 MByte
added superuser super
added superuser super
added superuser super
added superuser super
added superuser super
added superuser super
added superuser super
added superuser super
added superuser super
added superuser super
added superuser super
Started XML RPC Webserver on port: 8080
Started XML RPC Webserver on port: 8080
Started XML RPC Webserver on port: 8080
Started XML RPC Webserver on port: 8080
Started XML RPC Webserver on port: 8080
Started XML RPC Webserver on port: 8080
Started XML RPC Webserver on port: 8080
Started XML RPC Webserver on port: 8080
Started XML RPC Webserver on port: 8080
Started XML RPC Webserver on port: 8080
Started XML RPC Webserver on port: 8080
Notifying post startup listener
Notifying post startup listener
Notifying post startup listener
Notifying post startup listener
Notifying post startup listener
Notifying post startup listener
Notifying post startup listener
Notifying post startup listener
Notifying post startup listener
Notifying post startup listener
Notifying post startup listener
Initialitation COMPLETE.
Initialitation COMPLETE.
Initialitation COMPLETE.
Initialitation COMPLETE.
Initialitation COMPLETE.
Initialitation COMPLETE.
Initialitation COMPLETE.
Initialitation COMPLETE.
Initialitation COMPLETE.
Initialitation COMPLETE.
Initialitation COMPLETE.
Server is RUNNING...Time to relax...
Server is RUNNING...Time to relax...
Server is RUNNING...Time to relax...
Server is RUNNING...Time to relax...
Server is RUNNING...Time to relax...
Server is RUNNING...Time to relax...
Server is RUNNING...Time to relax...
Server is RUNNING...Time to relax...
Server is RUNNING...Time to relax...
Server is RUNNING...Time to relax...
Server is RUNNING...Time to relax...
Jan 28, 2014 11:02:13 AM org.eclipse.emf.emfstore.client.test.SetupHelper startSever
INFO: server started. 
Jan 28, 2014 11:02:13 AM org.eclipse.emf.emfstore.client.test.SetupHelper cleanupServer
INFO: serverspce cleaned.
Total time for commit: 3
Total time for commit: 3
Total time for commit: 3
Total time for commit: 3
Total time for commit: 3
Total time for commit: 3
Total time for commit: 3
Total time for commit: 3
Total time for commit: 3
Total time for commit: 3
Total time for commit: 3
Jan 28, 2014 11:02:13 AM org.eclipse.emf.emfstore.client.test.SetupHelper cleanupServer
INFO: serverspce cleaned.
Server was stopped.
Server was stopped.
Server was stopped.
Server was stopped.
Server was stopped.
Server was stopped.
Server was stopped.
Server was stopped.
Server was stopped.
Server was stopped.
Server was stopped.
Jan 28, 2014 11:02:23 AM org.eclipse.emf.emfstore.client.test.SetupHelper cleanupServer
INFO: serverspce cleaned.
Jan 28, 2014 11:02:23 AM org.eclipse.emf.emfstore.client.test.SetupHelper cleanupWorkspace
INFO: workspace cleaned.
Jan 28, 2014 11:02:23 AM org.eclipse.emf.emfstore.client.test.SetupHelper cleanupServer
INFO: serverspce cleaned.
EObject Change Observer threw an exception: org.eclipse.emf.emfstore.internal.client.model.impl.OperationManager
java.lang.RuntimeException: org.eclipse.emf.emfstore.internal.client.model.exceptions.MissingCommandException: Element org.eclipse.emf.emfstore.client.test.testmodel.impl.TestElementImpl@5c51c1df (name: , strings: null, description: null) has been changed without using a command
	at org.eclipse.emf.emfstore.internal.client.model.util.WorkspaceUtil.log(WorkspaceUtil.java:91)
	at org.eclipse.emf.emfstore.internal.client.model.util.WorkspaceUtil.logException(WorkspaceUtil.java:66)
	at org.eclipse.emf.emfstore.internal.client.model.util.WorkspaceUtil.wrapAndHandleException(WorkspaceUtil.java:137)
	at org.eclipse.emf.emfstore.internal.client.model.util.WorkspaceUtil.handleException(WorkspaceUtil.java:118)
	at org.eclipse.emf.emfstore.internal.client.model.impl.OperationRecorder.checkCommandConstraints(OperationRecorder.java:231)
	at org.eclipse.emf.emfstore.internal.client.model.impl.OperationRecorder.modelElementAdded(OperationRecorder.java:169)
	at org.eclipse.emf.emfstore.internal.client.model.impl.OperationManager.modelElementAdded(OperationManager.java:258)
	at org.eclipse.emf.emfstore.internal.common.model.impl.NotifiableIdEObjectCollectionImpl$1.run(NotifiableIdEObjectCollectionImpl.java:108)
	at org.eclipse.emf.emfstore.internal.common.model.impl.NotifiableIdEObjectCollectionImpl$2.run(NotifiableIdEObjectCollectionImpl.java:142)
	at org.eclipse.emf.emfstore.common.ESSafeRunner.run(ESSafeRunner.java:38)
	at org.eclipse.emf.emfstore.internal.common.model.impl.NotifiableIdEObjectCollectionImpl.notifyIdEObjectCollectionChangeObservers(NotifiableIdEObjectCollectionImpl.java:165)
	at org.eclipse.emf.emfstore.internal.common.model.impl.NotifiableIdEObjectCollectionImpl.modelElementAdded(NotifiableIdEObjectCollectionImpl.java:111)
	at org.eclipse.emf.emfstore.internal.common.model.util.EObjectChangeNotifier.addAdapter(EObjectChangeNotifier.java:90)
	at org.eclipse.emf.ecore.util.EContentAdapter.handleContainment(EContentAdapter.java:139)
	at org.eclipse.emf.ecore.util.EContentAdapter.selfAdapt(EContentAdapter.java:74)
	at org.eclipse.emf.ecore.util.EContentAdapter.notifyChanged(EContentAdapter.java:40)
	at org.eclipse.emf.emfstore.internal.common.model.util.EObjectChangeNotifier.notifyChanged(EObjectChangeNotifier.java:187)
	at org.eclipse.emf.common.notify.impl.BasicNotifierImpl.eNotify(BasicNotifierImpl.java:374)
	at org.eclipse.emf.ecore.util.EcoreEList.dispatchNotification(EcoreEList.java:249)
	at org.eclipse.emf.common.notify.impl.NotifyingListImpl.addUnique(NotifyingListImpl.java:294)
	at org.eclipse.emf.common.util.AbstractEList.add(AbstractEList.java:301)
	at org.eclipse.emf.emfstore.internal.common.model.impl.IdEObjectCollectionImpl.addModelElement(IdEObjectCollectionImpl.java:175)
	at org.eclipse.emf.emfstore.client.test.changeTracking.recording.OperationRecorderTest.forceCommands(OperationRecorderTest.java:57)
	at sun.reflect.NativeMethodAccessorImpl.invoke0(Native Method)
	at sun.reflect.NativeMethodAccessorImpl.invoke(NativeMethodAccessorImpl.java:39)
	at sun.reflect.DelegatingMethodAccessorImpl.invoke(DelegatingMethodAccessorImpl.java:25)
	at java.lang.reflect.Method.invoke(Method.java:597)
	at org.junit.runners.model.FrameworkMethod$1.runReflectiveCall(FrameworkMethod.java:47)
	at org.junit.internal.runners.model.ReflectiveCallable.run(ReflectiveCallable.java:12)
	at org.junit.runners.model.FrameworkMethod.invokeExplosively(FrameworkMethod.java:44)
	at org.junit.internal.runners.statements.InvokeMethod.evaluate(InvokeMethod.java:17)
	at org.junit.internal.runners.statements.ExpectException.evaluate(ExpectException.java:19)
	at org.junit.internal.runners.statements.RunBefores.evaluate(RunBefores.java:26)
	at org.junit.internal.runners.statements.RunAfters.evaluate(RunAfters.java:27)
	at org.junit.runners.ParentRunner.runLeaf(ParentRunner.java:271)
	at org.junit.runners.BlockJUnit4ClassRunner.runChild(BlockJUnit4ClassRunner.java:70)
	at org.junit.runners.BlockJUnit4ClassRunner.runChild(BlockJUnit4ClassRunner.java:50)
	at org.junit.runners.ParentRunner$3.run(ParentRunner.java:238)
	at org.junit.runners.ParentRunner$1.schedule(ParentRunner.java:63)
	at org.junit.runners.ParentRunner.runChildren(ParentRunner.java:236)
	at org.junit.runners.ParentRunner.access$000(ParentRunner.java:53)
	at org.junit.runners.ParentRunner$2.evaluate(ParentRunner.java:229)
	at org.junit.internal.runners.statements.RunBefores.evaluate(RunBefores.java:26)
	at org.junit.internal.runners.statements.RunAfters.evaluate(RunAfters.java:27)
	at org.junit.runners.ParentRunner.run(ParentRunner.java:309)
	at org.junit.runners.Suite.runChild(Suite.java:127)
	at org.junit.runners.Suite.runChild(Suite.java:26)
	at org.junit.runners.ParentRunner$3.run(ParentRunner.java:238)
	at org.junit.runners.ParentRunner$1.schedule(ParentRunner.java:63)
	at org.junit.runners.ParentRunner.runChildren(ParentRunner.java:236)
	at org.junit.runners.ParentRunner.access$000(ParentRunner.java:53)
	at org.junit.runners.ParentRunner$2.evaluate(ParentRunner.java:229)
	at org.junit.runners.ParentRunner.run(ParentRunner.java:309)
	at org.junit.runners.Suite.runChild(Suite.java:127)
	at org.junit.runners.Suite.runChild(Suite.java:26)
	at org.junit.runners.ParentRunner$3.run(ParentRunner.java:238)
	at org.junit.runners.ParentRunner$1.schedule(ParentRunner.java:63)
	at org.junit.runners.ParentRunner.runChildren(ParentRunner.java:236)
	at org.junit.runners.ParentRunner.access$000(ParentRunner.java:53)
	at org.junit.runners.ParentRunner$2.evaluate(ParentRunner.java:229)
	at org.junit.runners.ParentRunner.run(ParentRunner.java:309)
	at org.junit.runners.Suite.runChild(Suite.java:127)
	at org.junit.runners.Suite.runChild(Suite.java:26)
	at org.junit.runners.ParentRunner$3.run(ParentRunner.java:238)
	at org.junit.runners.ParentRunner$1.schedule(ParentRunner.java:63)
	at org.junit.runners.ParentRunner.runChildren(ParentRunner.java:236)
	at org.junit.runners.ParentRunner.access$000(ParentRunner.java:53)
	at org.junit.runners.ParentRunner$2.evaluate(ParentRunner.java:229)
	at org.junit.runners.ParentRunner.run(ParentRunner.java:309)
	at org.apache.maven.surefire.junit4.JUnit4TestSet.execute(JUnit4TestSet.java:53)
	at org.apache.maven.surefire.junit4.JUnit4Provider.executeTestSet(JUnit4Provider.java:123)
	at org.apache.maven.surefire.junit4.JUnit4Provider.invoke(JUnit4Provider.java:104)
	at sun.reflect.NativeMethodAccessorImpl.invoke0(Native Method)
	at sun.reflect.NativeMethodAccessorImpl.invoke(NativeMethodAccessorImpl.java:39)
	at sun.reflect.DelegatingMethodAccessorImpl.invoke(DelegatingMethodAccessorImpl.java:25)
	at java.lang.reflect.Method.invoke(Method.java:597)
	at org.apache.maven.surefire.util.ReflectionUtils.invokeMethodWithArray(ReflectionUtils.java:164)
	at org.apache.maven.surefire.booter.ProviderFactory$ProviderProxy.invoke(ProviderFactory.java:110)
	at org.apache.maven.surefire.booter.SurefireStarter.invokeProvider(SurefireStarter.java:175)
	at org.apache.maven.surefire.booter.SurefireStarter.runSuitesInProcess(SurefireStarter.java:123)
	at org.eclipse.tycho.surefire.osgibooter.OsgiSurefireBooter.run(OsgiSurefireBooter.java:85)
	at org.eclipse.tycho.surefire.osgibooter.AbstractUITestApplication.runTests(AbstractUITestApplication.java:44)
	at org.eclipse.ui.internal.testing.WorkbenchTestable$1.run(WorkbenchTestable.java:71)
	at java.lang.Thread.run(Thread.java:662)
Caused by: org.eclipse.emf.emfstore.internal.client.model.exceptions.MissingCommandException: Element org.eclipse.emf.emfstore.client.test.testmodel.impl.TestElementImpl@5c51c1df (name: , strings: null, description: null) has been changed without using a command
	at org.eclipse.emf.emfstore.internal.client.model.impl.OperationRecorder.checkCommandConstraints(OperationRecorder.java:232)
	... 79 more
EObject Change Observer threw an exception: org.eclipse.emf.emfstore.internal.client.model.impl.OperationManager
java.lang.RuntimeException: org.eclipse.emf.emfstore.internal.client.model.exceptions.MissingCommandException: Element org.eclipse.emf.emfstore.client.test.testmodel.impl.TestElementImpl@5c51c1df (name: , strings: null, description: null) has been changed without using a command
	at org.eclipse.emf.emfstore.internal.client.model.util.WorkspaceUtil.log(WorkspaceUtil.java:91)
	at org.eclipse.emf.emfstore.internal.client.model.util.WorkspaceUtil.logException(WorkspaceUtil.java:66)
	at org.eclipse.emf.emfstore.internal.client.model.util.WorkspaceUtil.wrapAndHandleException(WorkspaceUtil.java:137)
	at org.eclipse.emf.emfstore.internal.client.model.util.WorkspaceUtil.handleException(WorkspaceUtil.java:118)
	at org.eclipse.emf.emfstore.internal.client.model.impl.OperationRecorder.checkCommandConstraints(OperationRecorder.java:231)
	at org.eclipse.emf.emfstore.internal.client.model.impl.OperationRecorder.modelElementAdded(OperationRecorder.java:169)
	at org.eclipse.emf.emfstore.internal.client.model.impl.OperationManager.modelElementAdded(OperationManager.java:258)
	at org.eclipse.emf.emfstore.internal.common.model.impl.NotifiableIdEObjectCollectionImpl$1.run(NotifiableIdEObjectCollectionImpl.java:108)
	at org.eclipse.emf.emfstore.internal.common.model.impl.NotifiableIdEObjectCollectionImpl$2.run(NotifiableIdEObjectCollectionImpl.java:142)
	at org.eclipse.emf.emfstore.common.ESSafeRunner.run(ESSafeRunner.java:38)
	at org.eclipse.emf.emfstore.internal.common.model.impl.NotifiableIdEObjectCollectionImpl.notifyIdEObjectCollectionChangeObservers(NotifiableIdEObjectCollectionImpl.java:165)
	at org.eclipse.emf.emfstore.internal.common.model.impl.NotifiableIdEObjectCollectionImpl.modelElementAdded(NotifiableIdEObjectCollectionImpl.java:111)
	at org.eclipse.emf.emfstore.internal.common.model.util.EObjectChangeNotifier.addAdapter(EObjectChangeNotifier.java:90)
	at org.eclipse.emf.ecore.util.EContentAdapter.handleContainment(EContentAdapter.java:139)
	at org.eclipse.emf.ecore.util.EContentAdapter.selfAdapt(EContentAdapter.java:74)
	at org.eclipse.emf.ecore.util.EContentAdapter.notifyChanged(EContentAdapter.java:40)
	at org.eclipse.emf.emfstore.internal.common.model.util.EObjectChangeNotifier.notifyChanged(EObjectChangeNotifier.java:187)
	at org.eclipse.emf.common.notify.impl.BasicNotifierImpl.eNotify(BasicNotifierImpl.java:374)
	at org.eclipse.emf.ecore.util.EcoreEList.dispatchNotification(EcoreEList.java:249)
	at org.eclipse.emf.common.notify.impl.NotifyingListImpl.addUnique(NotifyingListImpl.java:294)
	at org.eclipse.emf.common.util.AbstractEList.add(AbstractEList.java:301)
	at org.eclipse.emf.emfstore.internal.common.model.impl.IdEObjectCollectionImpl.addModelElement(IdEObjectCollectionImpl.java:175)
	at org.eclipse.emf.emfstore.client.test.changeTracking.recording.OperationRecorderTest.forceCommands(OperationRecorderTest.java:57)
	at sun.reflect.NativeMethodAccessorImpl.invoke0(Native Method)
	at sun.reflect.NativeMethodAccessorImpl.invoke(NativeMethodAccessorImpl.java:39)
	at sun.reflect.DelegatingMethodAccessorImpl.invoke(DelegatingMethodAccessorImpl.java:25)
	at java.lang.reflect.Method.invoke(Method.java:597)
	at org.junit.runners.model.FrameworkMethod$1.runReflectiveCall(FrameworkMethod.java:47)
	at org.junit.internal.runners.model.ReflectiveCallable.run(ReflectiveCallable.java:12)
	at org.junit.runners.model.FrameworkMethod.invokeExplosively(FrameworkMethod.java:44)
	at org.junit.internal.runners.statements.InvokeMethod.evaluate(InvokeMethod.java:17)
	at org.junit.internal.runners.statements.ExpectException.evaluate(ExpectException.java:19)
	at org.junit.internal.runners.statements.RunBefores.evaluate(RunBefores.java:26)
	at org.junit.internal.runners.statements.RunAfters.evaluate(RunAfters.java:27)
	at org.junit.runners.ParentRunner.runLeaf(ParentRunner.java:271)
	at org.junit.runners.BlockJUnit4ClassRunner.runChild(BlockJUnit4ClassRunner.java:70)
	at org.junit.runners.BlockJUnit4ClassRunner.runChild(BlockJUnit4ClassRunner.java:50)
	at org.junit.runners.ParentRunner$3.run(ParentRunner.java:238)
	at org.junit.runners.ParentRunner$1.schedule(ParentRunner.java:63)
	at org.junit.runners.ParentRunner.runChildren(ParentRunner.java:236)
	at org.junit.runners.ParentRunner.access$000(ParentRunner.java:53)
	at org.junit.runners.ParentRunner$2.evaluate(ParentRunner.java:229)
	at org.junit.internal.runners.statements.RunBefores.evaluate(RunBefores.java:26)
	at org.junit.internal.runners.statements.RunAfters.evaluate(RunAfters.java:27)
	at org.junit.runners.ParentRunner.run(ParentRunner.java:309)
	at org.junit.runners.Suite.runChild(Suite.java:127)
	at org.junit.runners.Suite.runChild(Suite.java:26)
	at org.junit.runners.ParentRunner$3.run(ParentRunner.java:238)
	at org.junit.runners.ParentRunner$1.schedule(ParentRunner.java:63)
	at org.junit.runners.ParentRunner.runChildren(ParentRunner.java:236)
	at org.junit.runners.ParentRunner.access$000(ParentRunner.java:53)
	at org.junit.runners.ParentRunner$2.evaluate(ParentRunner.java:229)
	at org.junit.runners.ParentRunner.run(ParentRunner.java:309)
	at org.junit.runners.Suite.runChild(Suite.java:127)
	at org.junit.runners.Suite.runChild(Suite.java:26)
	at org.junit.runners.ParentRunner$3.run(ParentRunner.java:238)
	at org.junit.runners.ParentRunner$1.schedule(ParentRunner.java:63)
	at org.junit.runners.ParentRunner.runChildren(ParentRunner.java:236)
	at org.junit.runners.ParentRunner.access$000(ParentRunner.java:53)
	at org.junit.runners.ParentRunner$2.evaluate(ParentRunner.java:229)
	at org.junit.runners.ParentRunner.run(ParentRunner.java:309)
	at org.junit.runners.Suite.runChild(Suite.java:127)
	at org.junit.runners.Suite.runChild(Suite.java:26)
	at org.junit.runners.ParentRunner$3.run(ParentRunner.java:238)
	at org.junit.runners.ParentRunner$1.schedule(ParentRunner.java:63)
	at org.junit.runners.ParentRunner.runChildren(ParentRunner.java:236)
	at org.junit.runners.ParentRunner.access$000(ParentRunner.java:53)
	at org.junit.runners.ParentRunner$2.evaluate(ParentRunner.java:229)
	at org.junit.runners.ParentRunner.run(ParentRunner.java:309)
	at org.apache.maven.surefire.junit4.JUnit4TestSet.execute(JUnit4TestSet.java:53)
	at org.apache.maven.surefire.junit4.JUnit4Provider.executeTestSet(JUnit4Provider.java:123)
	at org.apache.maven.surefire.junit4.JUnit4Provider.invoke(JUnit4Provider.java:104)
	at sun.reflect.NativeMethodAccessorImpl.invoke0(Native Method)
	at sun.reflect.NativeMethodAccessorImpl.invoke(NativeMethodAccessorImpl.java:39)
	at sun.reflect.DelegatingMethodAccessorImpl.invoke(DelegatingMethodAccessorImpl.java:25)
	at java.lang.reflect.Method.invoke(Method.java:597)
	at org.apache.maven.surefire.util.ReflectionUtils.invokeMethodWithArray(ReflectionUtils.java:164)
	at org.apache.maven.surefire.booter.ProviderFactory$ProviderProxy.invoke(ProviderFactory.java:110)
	at org.apache.maven.surefire.booter.SurefireStarter.invokeProvider(SurefireStarter.java:175)
	at org.apache.maven.surefire.booter.SurefireStarter.runSuitesInProcess(SurefireStarter.java:123)
	at org.eclipse.tycho.surefire.osgibooter.OsgiSurefireBooter.run(OsgiSurefireBooter.java:85)
	at org.eclipse.tycho.surefire.osgibooter.AbstractUITestApplication.runTests(AbstractUITestApplication.java:44)
	at org.eclipse.ui.internal.testing.WorkbenchTestable$1.run(WorkbenchTestable.java:71)
	at java.lang.Thread.run(Thread.java:662)
Caused by: org.eclipse.emf.emfstore.internal.client.model.exceptions.MissingCommandException: Element org.eclipse.emf.emfstore.client.test.testmodel.impl.TestElementImpl@5c51c1df (name: , strings: null, description: null) has been changed without using a command
	at org.eclipse.emf.emfstore.internal.client.model.impl.OperationRecorder.checkCommandConstraints(OperationRecorder.java:232)
	... 79 more
EObject Change Observer threw an exception: org.eclipse.emf.emfstore.internal.client.model.impl.OperationManager
java.lang.RuntimeException: org.eclipse.emf.emfstore.internal.client.model.exceptions.MissingCommandException: Element org.eclipse.emf.emfstore.client.test.testmodel.impl.TestElementImpl@5c51c1df (name: , strings: null, description: null) has been changed without using a command
	at org.eclipse.emf.emfstore.internal.client.model.util.WorkspaceUtil.log(WorkspaceUtil.java:91)
	at org.eclipse.emf.emfstore.internal.client.model.util.WorkspaceUtil.logException(WorkspaceUtil.java:66)
	at org.eclipse.emf.emfstore.internal.client.model.util.WorkspaceUtil.wrapAndHandleException(WorkspaceUtil.java:137)
	at org.eclipse.emf.emfstore.internal.client.model.util.WorkspaceUtil.handleException(WorkspaceUtil.java:118)
	at org.eclipse.emf.emfstore.internal.client.model.impl.OperationRecorder.checkCommandConstraints(OperationRecorder.java:231)
	at org.eclipse.emf.emfstore.internal.client.model.impl.OperationRecorder.modelElementAdded(OperationRecorder.java:169)
	at org.eclipse.emf.emfstore.internal.client.model.impl.OperationManager.modelElementAdded(OperationManager.java:258)
	at org.eclipse.emf.emfstore.internal.common.model.impl.NotifiableIdEObjectCollectionImpl$1.run(NotifiableIdEObjectCollectionImpl.java:108)
	at org.eclipse.emf.emfstore.internal.common.model.impl.NotifiableIdEObjectCollectionImpl$2.run(NotifiableIdEObjectCollectionImpl.java:142)
	at org.eclipse.emf.emfstore.common.ESSafeRunner.run(ESSafeRunner.java:38)
	at org.eclipse.emf.emfstore.internal.common.model.impl.NotifiableIdEObjectCollectionImpl.notifyIdEObjectCollectionChangeObservers(NotifiableIdEObjectCollectionImpl.java:165)
	at org.eclipse.emf.emfstore.internal.common.model.impl.NotifiableIdEObjectCollectionImpl.modelElementAdded(NotifiableIdEObjectCollectionImpl.java:111)
	at org.eclipse.emf.emfstore.internal.common.model.util.EObjectChangeNotifier.addAdapter(EObjectChangeNotifier.java:90)
	at org.eclipse.emf.ecore.util.EContentAdapter.handleContainment(EContentAdapter.java:139)
	at org.eclipse.emf.ecore.util.EContentAdapter.selfAdapt(EContentAdapter.java:74)
	at org.eclipse.emf.ecore.util.EContentAdapter.notifyChanged(EContentAdapter.java:40)
	at org.eclipse.emf.emfstore.internal.common.model.util.EObjectChangeNotifier.notifyChanged(EObjectChangeNotifier.java:187)
	at org.eclipse.emf.common.notify.impl.BasicNotifierImpl.eNotify(BasicNotifierImpl.java:374)
	at org.eclipse.emf.ecore.util.EcoreEList.dispatchNotification(EcoreEList.java:249)
	at org.eclipse.emf.common.notify.impl.NotifyingListImpl.addUnique(NotifyingListImpl.java:294)
	at org.eclipse.emf.common.util.AbstractEList.add(AbstractEList.java:301)
	at org.eclipse.emf.emfstore.internal.common.model.impl.IdEObjectCollectionImpl.addModelElement(IdEObjectCollectionImpl.java:175)
	at org.eclipse.emf.emfstore.client.test.changeTracking.recording.OperationRecorderTest.forceCommands(OperationRecorderTest.java:57)
	at sun.reflect.NativeMethodAccessorImpl.invoke0(Native Method)
	at sun.reflect.NativeMethodAccessorImpl.invoke(NativeMethodAccessorImpl.java:39)
	at sun.reflect.DelegatingMethodAccessorImpl.invoke(DelegatingMethodAccessorImpl.java:25)
	at java.lang.reflect.Method.invoke(Method.java:597)
	at org.junit.runners.model.FrameworkMethod$1.runReflectiveCall(FrameworkMethod.java:47)
	at org.junit.internal.runners.model.ReflectiveCallable.run(ReflectiveCallable.java:12)
	at org.junit.runners.model.FrameworkMethod.invokeExplosively(FrameworkMethod.java:44)
	at org.junit.internal.runners.statements.InvokeMethod.evaluate(InvokeMethod.java:17)
	at org.junit.internal.runners.statements.ExpectException.evaluate(ExpectException.java:19)
	at org.junit.internal.runners.statements.RunBefores.evaluate(RunBefores.java:26)
	at org.junit.internal.runners.statements.RunAfters.evaluate(RunAfters.java:27)
	at org.junit.runners.ParentRunner.runLeaf(ParentRunner.java:271)
	at org.junit.runners.BlockJUnit4ClassRunner.runChild(BlockJUnit4ClassRunner.java:70)
	at org.junit.runners.BlockJUnit4ClassRunner.runChild(BlockJUnit4ClassRunner.java:50)
	at org.junit.runners.ParentRunner$3.run(ParentRunner.java:238)
	at org.junit.runners.ParentRunner$1.schedule(ParentRunner.java:63)
	at org.junit.runners.ParentRunner.runChildren(ParentRunner.java:236)
	at org.junit.runners.ParentRunner.access$000(ParentRunner.java:53)
	at org.junit.runners.ParentRunner$2.evaluate(ParentRunner.java:229)
	at org.junit.internal.runners.statements.RunBefores.evaluate(RunBefores.java:26)
	at org.junit.internal.runners.statements.RunAfters.evaluate(RunAfters.java:27)
	at org.junit.runners.ParentRunner.run(ParentRunner.java:309)
	at org.junit.runners.Suite.runChild(Suite.java:127)
	at org.junit.runners.Suite.runChild(Suite.java:26)
	at org.junit.runners.ParentRunner$3.run(ParentRunner.java:238)
	at org.junit.runners.ParentRunner$1.schedule(ParentRunner.java:63)
	at org.junit.runners.ParentRunner.runChildren(ParentRunner.java:236)
	at org.junit.runners.ParentRunner.access$000(ParentRunner.java:53)
	at org.junit.runners.ParentRunner$2.evaluate(ParentRunner.java:229)
	at org.junit.runners.ParentRunner.run(ParentRunner.java:309)
	at org.junit.runners.Suite.runChild(Suite.java:127)
	at org.junit.runners.Suite.runChild(Suite.java:26)
	at org.junit.runners.ParentRunner$3.run(ParentRunner.java:238)
	at org.junit.runners.ParentRunner$1.schedule(ParentRunner.java:63)
	at org.junit.runners.ParentRunner.runChildren(ParentRunner.java:236)
	at org.junit.runners.ParentRunner.access$000(ParentRunner.java:53)
	at org.junit.runners.ParentRunner$2.evaluate(ParentRunner.java:229)
	at org.junit.runners.ParentRunner.run(ParentRunner.java:309)
	at org.junit.runners.Suite.runChild(Suite.java:127)
	at org.junit.runners.Suite.runChild(Suite.java:26)
	at org.junit.runners.ParentRunner$3.run(ParentRunner.java:238)
	at org.junit.runners.ParentRunner$1.schedule(ParentRunner.java:63)
	at org.junit.runners.ParentRunner.runChildren(ParentRunner.java:236)
	at org.junit.runners.ParentRunner.access$000(ParentRunner.java:53)
	at org.junit.runners.ParentRunner$2.evaluate(ParentRunner.java:229)
	at org.junit.runners.ParentRunner.run(ParentRunner.java:309)
	at org.apache.maven.surefire.junit4.JUnit4TestSet.execute(JUnit4TestSet.java:53)
	at org.apache.maven.surefire.junit4.JUnit4Provider.executeTestSet(JUnit4Provider.java:123)
	at org.apache.maven.surefire.junit4.JUnit4Provider.invoke(JUnit4Provider.java:104)
	at sun.reflect.NativeMethodAccessorImpl.invoke0(Native Method)
	at sun.reflect.NativeMethodAccessorImpl.invoke(NativeMethodAccessorImpl.java:39)
	at sun.reflect.DelegatingMethodAccessorImpl.invoke(DelegatingMethodAccessorImpl.java:25)
	at java.lang.reflect.Method.invoke(Method.java:597)
	at org.apache.maven.surefire.util.ReflectionUtils.invokeMethodWithArray(ReflectionUtils.java:164)
	at org.apache.maven.surefire.booter.ProviderFactory$ProviderProxy.invoke(ProviderFactory.java:110)
	at org.apache.maven.surefire.booter.SurefireStarter.invokeProvider(SurefireStarter.java:175)
	at org.apache.maven.surefire.booter.SurefireStarter.runSuitesInProcess(SurefireStarter.java:123)
	at org.eclipse.tycho.surefire.osgibooter.OsgiSurefireBooter.run(OsgiSurefireBooter.java:85)
	at org.eclipse.tycho.surefire.osgibooter.AbstractUITestApplication.runTests(AbstractUITestApplication.java:44)
	at org.eclipse.ui.internal.testing.WorkbenchTestable$1.run(WorkbenchTestable.java:71)
	at java.lang.Thread.run(Thread.java:662)
Caused by: org.eclipse.emf.emfstore.internal.client.model.exceptions.MissingCommandException: Element org.eclipse.emf.emfstore.client.test.testmodel.impl.TestElementImpl@5c51c1df (name: , strings: null, description: null) has been changed without using a command
	at org.eclipse.emf.emfstore.internal.client.model.impl.OperationRecorder.checkCommandConstraints(OperationRecorder.java:232)
	... 79 more
EObject Change Observer threw an exception: org.eclipse.emf.emfstore.internal.client.model.impl.OperationManager
java.lang.RuntimeException: org.eclipse.emf.emfstore.internal.client.model.exceptions.MissingCommandException: Element org.eclipse.emf.emfstore.client.test.testmodel.impl.TestElementImpl@5c51c1df (name: , strings: null, description: null) has been changed without using a command
	at org.eclipse.emf.emfstore.internal.client.model.util.WorkspaceUtil.log(WorkspaceUtil.java:91)
	at org.eclipse.emf.emfstore.internal.client.model.util.WorkspaceUtil.logException(WorkspaceUtil.java:66)
	at org.eclipse.emf.emfstore.internal.client.model.util.WorkspaceUtil.wrapAndHandleException(WorkspaceUtil.java:137)
	at org.eclipse.emf.emfstore.internal.client.model.util.WorkspaceUtil.handleException(WorkspaceUtil.java:118)
	at org.eclipse.emf.emfstore.internal.client.model.impl.OperationRecorder.checkCommandConstraints(OperationRecorder.java:231)
	at org.eclipse.emf.emfstore.internal.client.model.impl.OperationRecorder.modelElementAdded(OperationRecorder.java:169)
	at org.eclipse.emf.emfstore.internal.client.model.impl.OperationManager.modelElementAdded(OperationManager.java:258)
	at org.eclipse.emf.emfstore.internal.common.model.impl.NotifiableIdEObjectCollectionImpl$1.run(NotifiableIdEObjectCollectionImpl.java:108)
	at org.eclipse.emf.emfstore.internal.common.model.impl.NotifiableIdEObjectCollectionImpl$2.run(NotifiableIdEObjectCollectionImpl.java:142)
	at org.eclipse.emf.emfstore.common.ESSafeRunner.run(ESSafeRunner.java:38)
	at org.eclipse.emf.emfstore.internal.common.model.impl.NotifiableIdEObjectCollectionImpl.notifyIdEObjectCollectionChangeObservers(NotifiableIdEObjectCollectionImpl.java:165)
	at org.eclipse.emf.emfstore.internal.common.model.impl.NotifiableIdEObjectCollectionImpl.modelElementAdded(NotifiableIdEObjectCollectionImpl.java:111)
	at org.eclipse.emf.emfstore.internal.common.model.util.EObjectChangeNotifier.addAdapter(EObjectChangeNotifier.java:90)
	at org.eclipse.emf.ecore.util.EContentAdapter.handleContainment(EContentAdapter.java:139)
	at org.eclipse.emf.ecore.util.EContentAdapter.selfAdapt(EContentAdapter.java:74)
	at org.eclipse.emf.ecore.util.EContentAdapter.notifyChanged(EContentAdapter.java:40)
	at org.eclipse.emf.emfstore.internal.common.model.util.EObjectChangeNotifier.notifyChanged(EObjectChangeNotifier.java:187)
	at org.eclipse.emf.common.notify.impl.BasicNotifierImpl.eNotify(BasicNotifierImpl.java:374)
	at org.eclipse.emf.ecore.util.EcoreEList.dispatchNotification(EcoreEList.java:249)
	at org.eclipse.emf.common.notify.impl.NotifyingListImpl.addUnique(NotifyingListImpl.java:294)
	at org.eclipse.emf.common.util.AbstractEList.add(AbstractEList.java:301)
	at org.eclipse.emf.emfstore.internal.common.model.impl.IdEObjectCollectionImpl.addModelElement(IdEObjectCollectionImpl.java:175)
	at org.eclipse.emf.emfstore.client.test.changeTracking.recording.OperationRecorderTest.forceCommands(OperationRecorderTest.java:57)
	at sun.reflect.NativeMethodAccessorImpl.invoke0(Native Method)
	at sun.reflect.NativeMethodAccessorImpl.invoke(NativeMethodAccessorImpl.java:39)
	at sun.reflect.DelegatingMethodAccessorImpl.invoke(DelegatingMethodAccessorImpl.java:25)
	at java.lang.reflect.Method.invoke(Method.java:597)
	at org.junit.runners.model.FrameworkMethod$1.runReflectiveCall(FrameworkMethod.java:47)
	at org.junit.internal.runners.model.ReflectiveCallable.run(ReflectiveCallable.java:12)
	at org.junit.runners.model.FrameworkMethod.invokeExplosively(FrameworkMethod.java:44)
	at org.junit.internal.runners.statements.InvokeMethod.evaluate(InvokeMethod.java:17)
	at org.junit.internal.runners.statements.ExpectException.evaluate(ExpectException.java:19)
	at org.junit.internal.runners.statements.RunBefores.evaluate(RunBefores.java:26)
	at org.junit.internal.runners.statements.RunAfters.evaluate(RunAfters.java:27)
	at org.junit.runners.ParentRunner.runLeaf(ParentRunner.java:271)
	at org.junit.runners.BlockJUnit4ClassRunner.runChild(BlockJUnit4ClassRunner.java:70)
	at org.junit.runners.BlockJUnit4ClassRunner.runChild(BlockJUnit4ClassRunner.java:50)
	at org.junit.runners.ParentRunner$3.run(ParentRunner.java:238)
	at org.junit.runners.ParentRunner$1.schedule(ParentRunner.java:63)
	at org.junit.runners.ParentRunner.runChildren(ParentRunner.java:236)
	at org.junit.runners.ParentRunner.access$000(ParentRunner.java:53)
	at org.junit.runners.ParentRunner$2.evaluate(ParentRunner.java:229)
	at org.junit.internal.runners.statements.RunBefores.evaluate(RunBefores.java:26)
	at org.junit.internal.runners.statements.RunAfters.evaluate(RunAfters.java:27)
	at org.junit.runners.ParentRunner.run(ParentRunner.java:309)
	at org.junit.runners.Suite.runChild(Suite.java:127)
	at org.junit.runners.Suite.runChild(Suite.java:26)
	at org.junit.runners.ParentRunner$3.run(ParentRunner.java:238)
	at org.junit.runners.ParentRunner$1.schedule(ParentRunner.java:63)
	at org.junit.runners.ParentRunner.runChildren(ParentRunner.java:236)
	at org.junit.runners.ParentRunner.access$000(ParentRunner.java:53)
	at org.junit.runners.ParentRunner$2.evaluate(ParentRunner.java:229)
	at org.junit.runners.ParentRunner.run(ParentRunner.java:309)
	at org.junit.runners.Suite.runChild(Suite.java:127)
	at org.junit.runners.Suite.runChild(Suite.java:26)
	at org.junit.runners.ParentRunner$3.run(ParentRunner.java:238)
	at org.junit.runners.ParentRunner$1.schedule(ParentRunner.java:63)
	at org.junit.runners.ParentRunner.runChildren(ParentRunner.java:236)
	at org.junit.runners.ParentRunner.access$000(ParentRunner.java:53)
	at org.junit.runners.ParentRunner$2.evaluate(ParentRunner.java:229)
	at org.junit.runners.ParentRunner.run(ParentRunner.java:309)
	at org.junit.runners.Suite.runChild(Suite.java:127)
	at org.junit.runners.Suite.runChild(Suite.java:26)
	at org.junit.runners.ParentRunner$3.run(ParentRunner.java:238)
	at org.junit.runners.ParentRunner$1.schedule(ParentRunner.java:63)
	at org.junit.runners.ParentRunner.runChildren(ParentRunner.java:236)
	at org.junit.runners.ParentRunner.access$000(ParentRunner.java:53)
	at org.junit.runners.ParentRunner$2.evaluate(ParentRunner.java:229)
	at org.junit.runners.ParentRunner.run(ParentRunner.java:309)
	at org.apache.maven.surefire.junit4.JUnit4TestSet.execute(JUnit4TestSet.java:53)
	at org.apache.maven.surefire.junit4.JUnit4Provider.executeTestSet(JUnit4Provider.java:123)
	at org.apache.maven.surefire.junit4.JUnit4Provider.invoke(JUnit4Provider.java:104)
	at sun.reflect.NativeMethodAccessorImpl.invoke0(Native Method)
	at sun.reflect.NativeMethodAccessorImpl.invoke(NativeMethodAccessorImpl.java:39)
	at sun.reflect.DelegatingMethodAccessorImpl.invoke(DelegatingMethodAccessorImpl.java:25)
	at java.lang.reflect.Method.invoke(Method.java:597)
	at org.apache.maven.surefire.util.ReflectionUtils.invokeMethodWithArray(ReflectionUtils.java:164)
	at org.apache.maven.surefire.booter.ProviderFactory$ProviderProxy.invoke(ProviderFactory.java:110)
	at org.apache.maven.surefire.booter.SurefireStarter.invokeProvider(SurefireStarter.java:175)
	at org.apache.maven.surefire.booter.SurefireStarter.runSuitesInProcess(SurefireStarter.java:123)
	at org.eclipse.tycho.surefire.osgibooter.OsgiSurefireBooter.run(OsgiSurefireBooter.java:85)
	at org.eclipse.tycho.surefire.osgibooter.AbstractUITestApplication.runTests(AbstractUITestApplication.java:44)
	at org.eclipse.ui.internal.testing.WorkbenchTestable$1.run(WorkbenchTestable.java:71)
	at java.lang.Thread.run(Thread.java:662)
Caused by: org.eclipse.emf.emfstore.internal.client.model.exceptions.MissingCommandException: Element org.eclipse.emf.emfstore.client.test.testmodel.impl.TestElementImpl@5c51c1df (name: , strings: null, description: null) has been changed without using a command
	at org.eclipse.emf.emfstore.internal.client.model.impl.OperationRecorder.checkCommandConstraints(OperationRecorder.java:232)
	... 79 more
EObject Change Observer threw an exception: org.eclipse.emf.emfstore.internal.client.model.impl.OperationManager
java.lang.RuntimeException: org.eclipse.emf.emfstore.internal.client.model.exceptions.MissingCommandException: Element org.eclipse.emf.emfstore.client.test.testmodel.impl.TestElementImpl@5c51c1df (name: , strings: null, description: null) has been changed without using a command
	at org.eclipse.emf.emfstore.internal.client.model.util.WorkspaceUtil.log(WorkspaceUtil.java:91)
	at org.eclipse.emf.emfstore.internal.client.model.util.WorkspaceUtil.logException(WorkspaceUtil.java:66)
	at org.eclipse.emf.emfstore.internal.client.model.util.WorkspaceUtil.wrapAndHandleException(WorkspaceUtil.java:137)
	at org.eclipse.emf.emfstore.internal.client.model.util.WorkspaceUtil.handleException(WorkspaceUtil.java:118)
	at org.eclipse.emf.emfstore.internal.client.model.impl.OperationRecorder.checkCommandConstraints(OperationRecorder.java:231)
	at org.eclipse.emf.emfstore.internal.client.model.impl.OperationRecorder.modelElementAdded(OperationRecorder.java:169)
	at org.eclipse.emf.emfstore.internal.client.model.impl.OperationManager.modelElementAdded(OperationManager.java:258)
	at org.eclipse.emf.emfstore.internal.common.model.impl.NotifiableIdEObjectCollectionImpl$1.run(NotifiableIdEObjectCollectionImpl.java:108)
	at org.eclipse.emf.emfstore.internal.common.model.impl.NotifiableIdEObjectCollectionImpl$2.run(NotifiableIdEObjectCollectionImpl.java:142)
	at org.eclipse.emf.emfstore.common.ESSafeRunner.run(ESSafeRunner.java:38)
	at org.eclipse.emf.emfstore.internal.common.model.impl.NotifiableIdEObjectCollectionImpl.notifyIdEObjectCollectionChangeObservers(NotifiableIdEObjectCollectionImpl.java:165)
	at org.eclipse.emf.emfstore.internal.common.model.impl.NotifiableIdEObjectCollectionImpl.modelElementAdded(NotifiableIdEObjectCollectionImpl.java:111)
	at org.eclipse.emf.emfstore.internal.common.model.util.EObjectChangeNotifier.addAdapter(EObjectChangeNotifier.java:90)
	at org.eclipse.emf.ecore.util.EContentAdapter.handleContainment(EContentAdapter.java:139)
	at org.eclipse.emf.ecore.util.EContentAdapter.selfAdapt(EContentAdapter.java:74)
	at org.eclipse.emf.ecore.util.EContentAdapter.notifyChanged(EContentAdapter.java:40)
	at org.eclipse.emf.emfstore.internal.common.model.util.EObjectChangeNotifier.notifyChanged(EObjectChangeNotifier.java:187)
	at org.eclipse.emf.common.notify.impl.BasicNotifierImpl.eNotify(BasicNotifierImpl.java:374)
	at org.eclipse.emf.ecore.util.EcoreEList.dispatchNotification(EcoreEList.java:249)
	at org.eclipse.emf.common.notify.impl.NotifyingListImpl.addUnique(NotifyingListImpl.java:294)
	at org.eclipse.emf.common.util.AbstractEList.add(AbstractEList.java:301)
	at org.eclipse.emf.emfstore.internal.common.model.impl.IdEObjectCollectionImpl.addModelElement(IdEObjectCollectionImpl.java:175)
	at org.eclipse.emf.emfstore.client.test.changeTracking.recording.OperationRecorderTest.forceCommands(OperationRecorderTest.java:57)
	at sun.reflect.NativeMethodAccessorImpl.invoke0(Native Method)
	at sun.reflect.NativeMethodAccessorImpl.invoke(NativeMethodAccessorImpl.java:39)
	at sun.reflect.DelegatingMethodAccessorImpl.invoke(DelegatingMethodAccessorImpl.java:25)
	at java.lang.reflect.Method.invoke(Method.java:597)
	at org.junit.runners.model.FrameworkMethod$1.runReflectiveCall(FrameworkMethod.java:47)
	at org.junit.internal.runners.model.ReflectiveCallable.run(ReflectiveCallable.java:12)
	at org.junit.runners.model.FrameworkMethod.invokeExplosively(FrameworkMethod.java:44)
	at org.junit.internal.runners.statements.InvokeMethod.evaluate(InvokeMethod.java:17)
	at org.junit.internal.runners.statements.ExpectException.evaluate(ExpectException.java:19)
	at org.junit.internal.runners.statements.RunBefores.evaluate(RunBefores.java:26)
	at org.junit.internal.runners.statements.RunAfters.evaluate(RunAfters.java:27)
	at org.junit.runners.ParentRunner.runLeaf(ParentRunner.java:271)
	at org.junit.runners.BlockJUnit4ClassRunner.runChild(BlockJUnit4ClassRunner.java:70)
	at org.junit.runners.BlockJUnit4ClassRunner.runChild(BlockJUnit4ClassRunner.java:50)
	at org.junit.runners.ParentRunner$3.run(ParentRunner.java:238)
	at org.junit.runners.ParentRunner$1.schedule(ParentRunner.java:63)
	at org.junit.runners.ParentRunner.runChildren(ParentRunner.java:236)
	at org.junit.runners.ParentRunner.access$000(ParentRunner.java:53)
	at org.junit.runners.ParentRunner$2.evaluate(ParentRunner.java:229)
	at org.junit.internal.runners.statements.RunBefores.evaluate(RunBefores.java:26)
	at org.junit.internal.runners.statements.RunAfters.evaluate(RunAfters.java:27)
	at org.junit.runners.ParentRunner.run(ParentRunner.java:309)
	at org.junit.runners.Suite.runChild(Suite.java:127)
	at org.junit.runners.Suite.runChild(Suite.java:26)
	at org.junit.runners.ParentRunner$3.run(ParentRunner.java:238)
	at org.junit.runners.ParentRunner$1.schedule(ParentRunner.java:63)
	at org.junit.runners.ParentRunner.runChildren(ParentRunner.java:236)
	at org.junit.runners.ParentRunner.access$000(ParentRunner.java:53)
	at org.junit.runners.ParentRunner$2.evaluate(ParentRunner.java:229)
	at org.junit.runners.ParentRunner.run(ParentRunner.java:309)
	at org.junit.runners.Suite.runChild(Suite.java:127)
	at org.junit.runners.Suite.runChild(Suite.java:26)
	at org.junit.runners.ParentRunner$3.run(ParentRunner.java:238)
	at org.junit.runners.ParentRunner$1.schedule(ParentRunner.java:63)
	at org.junit.runners.ParentRunner.runChildren(ParentRunner.java:236)
	at org.junit.runners.ParentRunner.access$000(ParentRunner.java:53)
	at org.junit.runners.ParentRunner$2.evaluate(ParentRunner.java:229)
	at org.junit.runners.ParentRunner.run(ParentRunner.java:309)
	at org.junit.runners.Suite.runChild(Suite.java:127)
	at org.junit.runners.Suite.runChild(Suite.java:26)
	at org.junit.runners.ParentRunner$3.run(ParentRunner.java:238)
	at org.junit.runners.ParentRunner$1.schedule(ParentRunner.java:63)
	at org.junit.runners.ParentRunner.runChildren(ParentRunner.java:236)
	at org.junit.runners.ParentRunner.access$000(ParentRunner.java:53)
	at org.junit.runners.ParentRunner$2.evaluate(ParentRunner.java:229)
	at org.junit.runners.ParentRunner.run(ParentRunner.java:309)
	at org.apache.maven.surefire.junit4.JUnit4TestSet.execute(JUnit4TestSet.java:53)
	at org.apache.maven.surefire.junit4.JUnit4Provider.executeTestSet(JUnit4Provider.java:123)
	at org.apache.maven.surefire.junit4.JUnit4Provider.invoke(JUnit4Provider.java:104)
	at sun.reflect.NativeMethodAccessorImpl.invoke0(Native Method)
	at sun.reflect.NativeMethodAccessorImpl.invoke(NativeMethodAccessorImpl.java:39)
	at sun.reflect.DelegatingMethodAccessorImpl.invoke(DelegatingMethodAccessorImpl.java:25)
	at java.lang.reflect.Method.invoke(Method.java:597)
	at org.apache.maven.surefire.util.ReflectionUtils.invokeMethodWithArray(ReflectionUtils.java:164)
	at org.apache.maven.surefire.booter.ProviderFactory$ProviderProxy.invoke(ProviderFactory.java:110)
	at org.apache.maven.surefire.booter.SurefireStarter.invokeProvider(SurefireStarter.java:175)
	at org.apache.maven.surefire.booter.SurefireStarter.runSuitesInProcess(SurefireStarter.java:123)
	at org.eclipse.tycho.surefire.osgibooter.OsgiSurefireBooter.run(OsgiSurefireBooter.java:85)
	at org.eclipse.tycho.surefire.osgibooter.AbstractUITestApplication.runTests(AbstractUITestApplication.java:44)
	at org.eclipse.ui.internal.testing.WorkbenchTestable$1.run(WorkbenchTestable.java:71)
	at java.lang.Thread.run(Thread.java:662)
Caused by: org.eclipse.emf.emfstore.internal.client.model.exceptions.MissingCommandException: Element org.eclipse.emf.emfstore.client.test.testmodel.impl.TestElementImpl@5c51c1df (name: , strings: null, description: null) has been changed without using a command
	at org.eclipse.emf.emfstore.internal.client.model.impl.OperationRecorder.checkCommandConstraints(OperationRecorder.java:232)
	... 79 more
EObject Change Observer threw an exception: org.eclipse.emf.emfstore.internal.client.model.impl.OperationManager
java.lang.RuntimeException: org.eclipse.emf.emfstore.internal.client.model.exceptions.MissingCommandException: Element org.eclipse.emf.emfstore.client.test.testmodel.impl.TestElementImpl@5c51c1df (name: , strings: null, description: null) has been changed without using a command
	at org.eclipse.emf.emfstore.internal.client.model.util.WorkspaceUtil.log(WorkspaceUtil.java:91)
	at org.eclipse.emf.emfstore.internal.client.model.util.WorkspaceUtil.logException(WorkspaceUtil.java:66)
	at org.eclipse.emf.emfstore.internal.client.model.util.WorkspaceUtil.wrapAndHandleException(WorkspaceUtil.java:137)
	at org.eclipse.emf.emfstore.internal.client.model.util.WorkspaceUtil.handleException(WorkspaceUtil.java:118)
	at org.eclipse.emf.emfstore.internal.client.model.impl.OperationRecorder.checkCommandConstraints(OperationRecorder.java:231)
	at org.eclipse.emf.emfstore.internal.client.model.impl.OperationRecorder.modelElementAdded(OperationRecorder.java:169)
	at org.eclipse.emf.emfstore.internal.client.model.impl.OperationManager.modelElementAdded(OperationManager.java:258)
	at org.eclipse.emf.emfstore.internal.common.model.impl.NotifiableIdEObjectCollectionImpl$1.run(NotifiableIdEObjectCollectionImpl.java:108)
	at org.eclipse.emf.emfstore.internal.common.model.impl.NotifiableIdEObjectCollectionImpl$2.run(NotifiableIdEObjectCollectionImpl.java:142)
	at org.eclipse.emf.emfstore.common.ESSafeRunner.run(ESSafeRunner.java:38)
	at org.eclipse.emf.emfstore.internal.common.model.impl.NotifiableIdEObjectCollectionImpl.notifyIdEObjectCollectionChangeObservers(NotifiableIdEObjectCollectionImpl.java:165)
	at org.eclipse.emf.emfstore.internal.common.model.impl.NotifiableIdEObjectCollectionImpl.modelElementAdded(NotifiableIdEObjectCollectionImpl.java:111)
	at org.eclipse.emf.emfstore.internal.common.model.util.EObjectChangeNotifier.addAdapter(EObjectChangeNotifier.java:90)
	at org.eclipse.emf.ecore.util.EContentAdapter.handleContainment(EContentAdapter.java:139)
	at org.eclipse.emf.ecore.util.EContentAdapter.selfAdapt(EContentAdapter.java:74)
	at org.eclipse.emf.ecore.util.EContentAdapter.notifyChanged(EContentAdapter.java:40)
	at org.eclipse.emf.emfstore.internal.common.model.util.EObjectChangeNotifier.notifyChanged(EObjectChangeNotifier.java:187)
	at org.eclipse.emf.common.notify.impl.BasicNotifierImpl.eNotify(BasicNotifierImpl.java:374)
	at org.eclipse.emf.ecore.util.EcoreEList.dispatchNotification(EcoreEList.java:249)
	at org.eclipse.emf.common.notify.impl.NotifyingListImpl.addUnique(NotifyingListImpl.java:294)
	at org.eclipse.emf.common.util.AbstractEList.add(AbstractEList.java:301)
	at org.eclipse.emf.emfstore.internal.common.model.impl.IdEObjectCollectionImpl.addModelElement(IdEObjectCollectionImpl.java:175)
	at org.eclipse.emf.emfstore.client.test.changeTracking.recording.OperationRecorderTest.forceCommands(OperationRecorderTest.java:57)
	at sun.reflect.NativeMethodAccessorImpl.invoke0(Native Method)
	at sun.reflect.NativeMethodAccessorImpl.invoke(NativeMethodAccessorImpl.java:39)
	at sun.reflect.DelegatingMethodAccessorImpl.invoke(DelegatingMethodAccessorImpl.java:25)
	at java.lang.reflect.Method.invoke(Method.java:597)
	at org.junit.runners.model.FrameworkMethod$1.runReflectiveCall(FrameworkMethod.java:47)
	at org.junit.internal.runners.model.ReflectiveCallable.run(ReflectiveCallable.java:12)
	at org.junit.runners.model.FrameworkMethod.invokeExplosively(FrameworkMethod.java:44)
	at org.junit.internal.runners.statements.InvokeMethod.evaluate(InvokeMethod.java:17)
	at org.junit.internal.runners.statements.ExpectException.evaluate(ExpectException.java:19)
	at org.junit.internal.runners.statements.RunBefores.evaluate(RunBefores.java:26)
	at org.junit.internal.runners.statements.RunAfters.evaluate(RunAfters.java:27)
	at org.junit.runners.ParentRunner.runLeaf(ParentRunner.java:271)
	at org.junit.runners.BlockJUnit4ClassRunner.runChild(BlockJUnit4ClassRunner.java:70)
	at org.junit.runners.BlockJUnit4ClassRunner.runChild(BlockJUnit4ClassRunner.java:50)
	at org.junit.runners.ParentRunner$3.run(ParentRunner.java:238)
	at org.junit.runners.ParentRunner$1.schedule(ParentRunner.java:63)
	at org.junit.runners.ParentRunner.runChildren(ParentRunner.java:236)
	at org.junit.runners.ParentRunner.access$000(ParentRunner.java:53)
	at org.junit.runners.ParentRunner$2.evaluate(ParentRunner.java:229)
	at org.junit.internal.runners.statements.RunBefores.evaluate(RunBefores.java:26)
	at org.junit.internal.runners.statements.RunAfters.evaluate(RunAfters.java:27)
	at org.junit.runners.ParentRunner.run(ParentRunner.java:309)
	at org.junit.runners.Suite.runChild(Suite.java:127)
	at org.junit.runners.Suite.runChild(Suite.java:26)
	at org.junit.runners.ParentRunner$3.run(ParentRunner.java:238)
	at org.junit.runners.ParentRunner$1.schedule(ParentRunner.java:63)
	at org.junit.runners.ParentRunner.runChildren(ParentRunner.java:236)
	at org.junit.runners.ParentRunner.access$000(ParentRunner.java:53)
	at org.junit.runners.ParentRunner$2.evaluate(ParentRunner.java:229)
	at org.junit.runners.ParentRunner.run(ParentRunner.java:309)
	at org.junit.runners.Suite.runChild(Suite.java:127)
	at org.junit.runners.Suite.runChild(Suite.java:26)
	at org.junit.runners.ParentRunner$3.run(ParentRunner.java:238)
	at org.junit.runners.ParentRunner$1.schedule(ParentRunner.java:63)
	at org.junit.runners.ParentRunner.runChildren(ParentRunner.java:236)
	at org.junit.runners.ParentRunner.access$000(ParentRunner.java:53)
	at org.junit.runners.ParentRunner$2.evaluate(ParentRunner.java:229)
	at org.junit.runners.ParentRunner.run(ParentRunner.java:309)
	at org.junit.runners.Suite.runChild(Suite.java:127)
	at org.junit.runners.Suite.runChild(Suite.java:26)
	at org.junit.runners.ParentRunner$3.run(ParentRunner.java:238)
	at org.junit.runners.ParentRunner$1.schedule(ParentRunner.java:63)
	at org.junit.runners.ParentRunner.runChildren(ParentRunner.java:236)
	at org.junit.runners.ParentRunner.access$000(ParentRunner.java:53)
	at org.junit.runners.ParentRunner$2.evaluate(ParentRunner.java:229)
	at org.junit.runners.ParentRunner.run(ParentRunner.java:309)
	at org.apache.maven.surefire.junit4.JUnit4TestSet.execute(JUnit4TestSet.java:53)
	at org.apache.maven.surefire.junit4.JUnit4Provider.executeTestSet(JUnit4Provider.java:123)
	at org.apache.maven.surefire.junit4.JUnit4Provider.invoke(JUnit4Provider.java:104)
	at sun.reflect.NativeMethodAccessorImpl.invoke0(Native Method)
	at sun.reflect.NativeMethodAccessorImpl.invoke(NativeMethodAccessorImpl.java:39)
	at sun.reflect.DelegatingMethodAccessorImpl.invoke(DelegatingMethodAccessorImpl.java:25)
	at java.lang.reflect.Method.invoke(Method.java:597)
	at org.apache.maven.surefire.util.ReflectionUtils.invokeMethodWithArray(ReflectionUtils.java:164)
	at org.apache.maven.surefire.booter.ProviderFactory$ProviderProxy.invoke(ProviderFactory.java:110)
	at org.apache.maven.surefire.booter.SurefireStarter.invokeProvider(SurefireStarter.java:175)
	at org.apache.maven.surefire.booter.SurefireStarter.runSuitesInProcess(SurefireStarter.java:123)
	at org.eclipse.tycho.surefire.osgibooter.OsgiSurefireBooter.run(OsgiSurefireBooter.java:85)
	at org.eclipse.tycho.surefire.osgibooter.AbstractUITestApplication.runTests(AbstractUITestApplication.java:44)
	at org.eclipse.ui.internal.testing.WorkbenchTestable$1.run(WorkbenchTestable.java:71)
	at java.lang.Thread.run(Thread.java:662)
Caused by: org.eclipse.emf.emfstore.internal.client.model.exceptions.MissingCommandException: Element org.eclipse.emf.emfstore.client.test.testmodel.impl.TestElementImpl@5c51c1df (name: , strings: null, description: null) has been changed without using a command
	at org.eclipse.emf.emfstore.internal.client.model.impl.OperationRecorder.checkCommandConstraints(OperationRecorder.java:232)
	... 79 more
EObject Change Observer threw an exception: org.eclipse.emf.emfstore.internal.client.model.impl.OperationManager
java.lang.RuntimeException: org.eclipse.emf.emfstore.internal.client.model.exceptions.MissingCommandException: Element org.eclipse.emf.emfstore.client.test.testmodel.impl.TestElementImpl@5c51c1df (name: , strings: null, description: null) has been changed without using a command
	at org.eclipse.emf.emfstore.internal.client.model.util.WorkspaceUtil.log(WorkspaceUtil.java:91)
	at org.eclipse.emf.emfstore.internal.client.model.util.WorkspaceUtil.logException(WorkspaceUtil.java:66)
	at org.eclipse.emf.emfstore.internal.client.model.util.WorkspaceUtil.wrapAndHandleException(WorkspaceUtil.java:137)
	at org.eclipse.emf.emfstore.internal.client.model.util.WorkspaceUtil.handleException(WorkspaceUtil.java:118)
	at org.eclipse.emf.emfstore.internal.client.model.impl.OperationRecorder.checkCommandConstraints(OperationRecorder.java:231)
	at org.eclipse.emf.emfstore.internal.client.model.impl.OperationRecorder.modelElementAdded(OperationRecorder.java:169)
	at org.eclipse.emf.emfstore.internal.client.model.impl.OperationManager.modelElementAdded(OperationManager.java:258)
	at org.eclipse.emf.emfstore.internal.common.model.impl.NotifiableIdEObjectCollectionImpl$1.run(NotifiableIdEObjectCollectionImpl.java:108)
	at org.eclipse.emf.emfstore.internal.common.model.impl.NotifiableIdEObjectCollectionImpl$2.run(NotifiableIdEObjectCollectionImpl.java:142)
	at org.eclipse.emf.emfstore.common.ESSafeRunner.run(ESSafeRunner.java:38)
	at org.eclipse.emf.emfstore.internal.common.model.impl.NotifiableIdEObjectCollectionImpl.notifyIdEObjectCollectionChangeObservers(NotifiableIdEObjectCollectionImpl.java:165)
	at org.eclipse.emf.emfstore.internal.common.model.impl.NotifiableIdEObjectCollectionImpl.modelElementAdded(NotifiableIdEObjectCollectionImpl.java:111)
	at org.eclipse.emf.emfstore.internal.common.model.util.EObjectChangeNotifier.addAdapter(EObjectChangeNotifier.java:90)
	at org.eclipse.emf.ecore.util.EContentAdapter.handleContainment(EContentAdapter.java:139)
	at org.eclipse.emf.ecore.util.EContentAdapter.selfAdapt(EContentAdapter.java:74)
	at org.eclipse.emf.ecore.util.EContentAdapter.notifyChanged(EContentAdapter.java:40)
	at org.eclipse.emf.emfstore.internal.common.model.util.EObjectChangeNotifier.notifyChanged(EObjectChangeNotifier.java:187)
	at org.eclipse.emf.common.notify.impl.BasicNotifierImpl.eNotify(BasicNotifierImpl.java:374)
	at org.eclipse.emf.ecore.util.EcoreEList.dispatchNotification(EcoreEList.java:249)
	at org.eclipse.emf.common.notify.impl.NotifyingListImpl.addUnique(NotifyingListImpl.java:294)
	at org.eclipse.emf.common.util.AbstractEList.add(AbstractEList.java:301)
	at org.eclipse.emf.emfstore.internal.common.model.impl.IdEObjectCollectionImpl.addModelElement(IdEObjectCollectionImpl.java:175)
	at org.eclipse.emf.emfstore.client.test.changeTracking.recording.OperationRecorderTest.forceCommands(OperationRecorderTest.java:57)
	at sun.reflect.NativeMethodAccessorImpl.invoke0(Native Method)
	at sun.reflect.NativeMethodAccessorImpl.invoke(NativeMethodAccessorImpl.java:39)
	at sun.reflect.DelegatingMethodAccessorImpl.invoke(DelegatingMethodAccessorImpl.java:25)
	at java.lang.reflect.Method.invoke(Method.java:597)
	at org.junit.runners.model.FrameworkMethod$1.runReflectiveCall(FrameworkMethod.java:47)
	at org.junit.internal.runners.model.ReflectiveCallable.run(ReflectiveCallable.java:12)
	at org.junit.runners.model.FrameworkMethod.invokeExplosively(FrameworkMethod.java:44)
	at org.junit.internal.runners.statements.InvokeMethod.evaluate(InvokeMethod.java:17)
	at org.junit.internal.runners.statements.ExpectException.evaluate(ExpectException.java:19)
	at org.junit.internal.runners.statements.RunBefores.evaluate(RunBefores.java:26)
	at org.junit.internal.runners.statements.RunAfters.evaluate(RunAfters.java:27)
	at org.junit.runners.ParentRunner.runLeaf(ParentRunner.java:271)
	at org.junit.runners.BlockJUnit4ClassRunner.runChild(BlockJUnit4ClassRunner.java:70)
	at org.junit.runners.BlockJUnit4ClassRunner.runChild(BlockJUnit4ClassRunner.java:50)
	at org.junit.runners.ParentRunner$3.run(ParentRunner.java:238)
	at org.junit.runners.ParentRunner$1.schedule(ParentRunner.java:63)
	at org.junit.runners.ParentRunner.runChildren(ParentRunner.java:236)
	at org.junit.runners.ParentRunner.access$000(ParentRunner.java:53)
	at org.junit.runners.ParentRunner$2.evaluate(ParentRunner.java:229)
	at org.junit.internal.runners.statements.RunBefores.evaluate(RunBefores.java:26)
	at org.junit.internal.runners.statements.RunAfters.evaluate(RunAfters.java:27)
	at org.junit.runners.ParentRunner.run(ParentRunner.java:309)
	at org.junit.runners.Suite.runChild(Suite.java:127)
	at org.junit.runners.Suite.runChild(Suite.java:26)
	at org.junit.runners.ParentRunner$3.run(ParentRunner.java:238)
	at org.junit.runners.ParentRunner$1.schedule(ParentRunner.java:63)
	at org.junit.runners.ParentRunner.runChildren(ParentRunner.java:236)
	at org.junit.runners.ParentRunner.access$000(ParentRunner.java:53)
	at org.junit.runners.ParentRunner$2.evaluate(ParentRunner.java:229)
	at org.junit.runners.ParentRunner.run(ParentRunner.java:309)
	at org.junit.runners.Suite.runChild(Suite.java:127)
	at org.junit.runners.Suite.runChild(Suite.java:26)
	at org.junit.runners.ParentRunner$3.run(ParentRunner.java:238)
	at org.junit.runners.ParentRunner$1.schedule(ParentRunner.java:63)
	at org.junit.runners.ParentRunner.runChildren(ParentRunner.java:236)
	at org.junit.runners.ParentRunner.access$000(ParentRunner.java:53)
	at org.junit.runners.ParentRunner$2.evaluate(ParentRunner.java:229)
	at org.junit.runners.ParentRunner.run(ParentRunner.java:309)
	at org.junit.runners.Suite.runChild(Suite.java:127)
	at org.junit.runners.Suite.runChild(Suite.java:26)
	at org.junit.runners.ParentRunner$3.run(ParentRunner.java:238)
	at org.junit.runners.ParentRunner$1.schedule(ParentRunner.java:63)
	at org.junit.runners.ParentRunner.runChildren(ParentRunner.java:236)
	at org.junit.runners.ParentRunner.access$000(ParentRunner.java:53)
	at org.junit.runners.ParentRunner$2.evaluate(ParentRunner.java:229)
	at org.junit.runners.ParentRunner.run(ParentRunner.java:309)
	at org.apache.maven.surefire.junit4.JUnit4TestSet.execute(JUnit4TestSet.java:53)
	at org.apache.maven.surefire.junit4.JUnit4Provider.executeTestSet(JUnit4Provider.java:123)
	at org.apache.maven.surefire.junit4.JUnit4Provider.invoke(JUnit4Provider.java:104)
	at sun.reflect.NativeMethodAccessorImpl.invoke0(Native Method)
	at sun.reflect.NativeMethodAccessorImpl.invoke(NativeMethodAccessorImpl.java:39)
	at sun.reflect.DelegatingMethodAccessorImpl.invoke(DelegatingMethodAccessorImpl.java:25)
	at java.lang.reflect.Method.invoke(Method.java:597)
	at org.apache.maven.surefire.util.ReflectionUtils.invokeMethodWithArray(ReflectionUtils.java:164)
	at org.apache.maven.surefire.booter.ProviderFactory$ProviderProxy.invoke(ProviderFactory.java:110)
	at org.apache.maven.surefire.booter.SurefireStarter.invokeProvider(SurefireStarter.java:175)
	at org.apache.maven.surefire.booter.SurefireStarter.runSuitesInProcess(SurefireStarter.java:123)
	at org.eclipse.tycho.surefire.osgibooter.OsgiSurefireBooter.run(OsgiSurefireBooter.java:85)
	at org.eclipse.tycho.surefire.osgibooter.AbstractUITestApplication.runTests(AbstractUITestApplication.java:44)
	at org.eclipse.ui.internal.testing.WorkbenchTestable$1.run(WorkbenchTestable.java:71)
	at java.lang.Thread.run(Thread.java:662)
Caused by: org.eclipse.emf.emfstore.internal.client.model.exceptions.MissingCommandException: Element org.eclipse.emf.emfstore.client.test.testmodel.impl.TestElementImpl@5c51c1df (name: , strings: null, description: null) has been changed without using a command
	at org.eclipse.emf.emfstore.internal.client.model.impl.OperationRecorder.checkCommandConstraints(OperationRecorder.java:232)
	... 79 more
EObject Change Observer threw an exception: org.eclipse.emf.emfstore.internal.client.model.impl.OperationManager
java.lang.RuntimeException: org.eclipse.emf.emfstore.internal.client.model.exceptions.MissingCommandException: Element org.eclipse.emf.emfstore.client.test.testmodel.impl.TestElementImpl@5c51c1df (name: , strings: null, description: null) has been changed without using a command
	at org.eclipse.emf.emfstore.internal.client.model.util.WorkspaceUtil.log(WorkspaceUtil.java:91)
	at org.eclipse.emf.emfstore.internal.client.model.util.WorkspaceUtil.logException(WorkspaceUtil.java:66)
	at org.eclipse.emf.emfstore.internal.client.model.util.WorkspaceUtil.wrapAndHandleException(WorkspaceUtil.java:137)
	at org.eclipse.emf.emfstore.internal.client.model.util.WorkspaceUtil.handleException(WorkspaceUtil.java:118)
	at org.eclipse.emf.emfstore.internal.client.model.impl.OperationRecorder.checkCommandConstraints(OperationRecorder.java:231)
	at org.eclipse.emf.emfstore.internal.client.model.impl.OperationRecorder.modelElementAdded(OperationRecorder.java:169)
	at org.eclipse.emf.emfstore.internal.client.model.impl.OperationManager.modelElementAdded(OperationManager.java:258)
	at org.eclipse.emf.emfstore.internal.common.model.impl.NotifiableIdEObjectCollectionImpl$1.run(NotifiableIdEObjectCollectionImpl.java:108)
	at org.eclipse.emf.emfstore.internal.common.model.impl.NotifiableIdEObjectCollectionImpl$2.run(NotifiableIdEObjectCollectionImpl.java:142)
	at org.eclipse.emf.emfstore.common.ESSafeRunner.run(ESSafeRunner.java:38)
	at org.eclipse.emf.emfstore.internal.common.model.impl.NotifiableIdEObjectCollectionImpl.notifyIdEObjectCollectionChangeObservers(NotifiableIdEObjectCollectionImpl.java:165)
	at org.eclipse.emf.emfstore.internal.common.model.impl.NotifiableIdEObjectCollectionImpl.modelElementAdded(NotifiableIdEObjectCollectionImpl.java:111)
	at org.eclipse.emf.emfstore.internal.common.model.util.EObjectChangeNotifier.addAdapter(EObjectChangeNotifier.java:90)
	at org.eclipse.emf.ecore.util.EContentAdapter.handleContainment(EContentAdapter.java:139)
	at org.eclipse.emf.ecore.util.EContentAdapter.selfAdapt(EContentAdapter.java:74)
	at org.eclipse.emf.ecore.util.EContentAdapter.notifyChanged(EContentAdapter.java:40)
	at org.eclipse.emf.emfstore.internal.common.model.util.EObjectChangeNotifier.notifyChanged(EObjectChangeNotifier.java:187)
	at org.eclipse.emf.common.notify.impl.BasicNotifierImpl.eNotify(BasicNotifierImpl.java:374)
	at org.eclipse.emf.ecore.util.EcoreEList.dispatchNotification(EcoreEList.java:249)
	at org.eclipse.emf.common.notify.impl.NotifyingListImpl.addUnique(NotifyingListImpl.java:294)
	at org.eclipse.emf.common.util.AbstractEList.add(AbstractEList.java:301)
	at org.eclipse.emf.emfstore.internal.common.model.impl.IdEObjectCollectionImpl.addModelElement(IdEObjectCollectionImpl.java:175)
	at org.eclipse.emf.emfstore.client.test.changeTracking.recording.OperationRecorderTest.forceCommands(OperationRecorderTest.java:57)
	at sun.reflect.NativeMethodAccessorImpl.invoke0(Native Method)
	at sun.reflect.NativeMethodAccessorImpl.invoke(NativeMethodAccessorImpl.java:39)
	at sun.reflect.DelegatingMethodAccessorImpl.invoke(DelegatingMethodAccessorImpl.java:25)
	at java.lang.reflect.Method.invoke(Method.java:597)
	at org.junit.runners.model.FrameworkMethod$1.runReflectiveCall(FrameworkMethod.java:47)
	at org.junit.internal.runners.model.ReflectiveCallable.run(ReflectiveCallable.java:12)
	at org.junit.runners.model.FrameworkMethod.invokeExplosively(FrameworkMethod.java:44)
	at org.junit.internal.runners.statements.InvokeMethod.evaluate(InvokeMethod.java:17)
	at org.junit.internal.runners.statements.ExpectException.evaluate(ExpectException.java:19)
	at org.junit.internal.runners.statements.RunBefores.evaluate(RunBefores.java:26)
	at org.junit.internal.runners.statements.RunAfters.evaluate(RunAfters.java:27)
	at org.junit.runners.ParentRunner.runLeaf(ParentRunner.java:271)
	at org.junit.runners.BlockJUnit4ClassRunner.runChild(BlockJUnit4ClassRunner.java:70)
	at org.junit.runners.BlockJUnit4ClassRunner.runChild(BlockJUnit4ClassRunner.java:50)
	at org.junit.runners.ParentRunner$3.run(ParentRunner.java:238)
	at org.junit.runners.ParentRunner$1.schedule(ParentRunner.java:63)
	at org.junit.runners.ParentRunner.runChildren(ParentRunner.java:236)
	at org.junit.runners.ParentRunner.access$000(ParentRunner.java:53)
	at org.junit.runners.ParentRunner$2.evaluate(ParentRunner.java:229)
	at org.junit.internal.runners.statements.RunBefores.evaluate(RunBefores.java:26)
	at org.junit.internal.runners.statements.RunAfters.evaluate(RunAfters.java:27)
	at org.junit.runners.ParentRunner.run(ParentRunner.java:309)
	at org.junit.runners.Suite.runChild(Suite.java:127)
	at org.junit.runners.Suite.runChild(Suite.java:26)
	at org.junit.runners.ParentRunner$3.run(ParentRunner.java:238)
	at org.junit.runners.ParentRunner$1.schedule(ParentRunner.java:63)
	at org.junit.runners.ParentRunner.runChildren(ParentRunner.java:236)
	at org.junit.runners.ParentRunner.access$000(ParentRunner.java:53)
	at org.junit.runners.ParentRunner$2.evaluate(ParentRunner.java:229)
	at org.junit.runners.ParentRunner.run(ParentRunner.java:309)
	at org.junit.runners.Suite.runChild(Suite.java:127)
	at org.junit.runners.Suite.runChild(Suite.java:26)
	at org.junit.runners.ParentRunner$3.run(ParentRunner.java:238)
	at org.junit.runners.ParentRunner$1.schedule(ParentRunner.java:63)
	at org.junit.runners.ParentRunner.runChildren(ParentRunner.java:236)
	at org.junit.runners.ParentRunner.access$000(ParentRunner.java:53)
	at org.junit.runners.ParentRunner$2.evaluate(ParentRunner.java:229)
	at org.junit.runners.ParentRunner.run(ParentRunner.java:309)
	at org.junit.runners.Suite.runChild(Suite.java:127)
	at org.junit.runners.Suite.runChild(Suite.java:26)
	at org.junit.runners.ParentRunner$3.run(ParentRunner.java:238)
	at org.junit.runners.ParentRunner$1.schedule(ParentRunner.java:63)
	at org.junit.runners.ParentRunner.runChildren(ParentRunner.java:236)
	at org.junit.runners.ParentRunner.access$000(ParentRunner.java:53)
	at org.junit.runners.ParentRunner$2.evaluate(ParentRunner.java:229)
	at org.junit.runners.ParentRunner.run(ParentRunner.java:309)
	at org.apache.maven.surefire.junit4.JUnit4TestSet.execute(JUnit4TestSet.java:53)
	at org.apache.maven.surefire.junit4.JUnit4Provider.executeTestSet(JUnit4Provider.java:123)
	at org.apache.maven.surefire.junit4.JUnit4Provider.invoke(JUnit4Provider.java:104)
	at sun.reflect.NativeMethodAccessorImpl.invoke0(Native Method)
	at sun.reflect.NativeMethodAccessorImpl.invoke(NativeMethodAccessorImpl.java:39)
	at sun.reflect.DelegatingMethodAccessorImpl.invoke(DelegatingMethodAccessorImpl.java:25)
	at java.lang.reflect.Method.invoke(Method.java:597)
	at org.apache.maven.surefire.util.ReflectionUtils.invokeMethodWithArray(ReflectionUtils.java:164)
	at org.apache.maven.surefire.booter.ProviderFactory$ProviderProxy.invoke(ProviderFactory.java:110)
	at org.apache.maven.surefire.booter.SurefireStarter.invokeProvider(SurefireStarter.java:175)
	at org.apache.maven.surefire.booter.SurefireStarter.runSuitesInProcess(SurefireStarter.java:123)
	at org.eclipse.tycho.surefire.osgibooter.OsgiSurefireBooter.run(OsgiSurefireBooter.java:85)
	at org.eclipse.tycho.surefire.osgibooter.AbstractUITestApplication.runTests(AbstractUITestApplication.java:44)
	at org.eclipse.ui.internal.testing.WorkbenchTestable$1.run(WorkbenchTestable.java:71)
	at java.lang.Thread.run(Thread.java:662)
Caused by: org.eclipse.emf.emfstore.internal.client.model.exceptions.MissingCommandException: Element org.eclipse.emf.emfstore.client.test.testmodel.impl.TestElementImpl@5c51c1df (name: , strings: null, description: null) has been changed without using a command
	at org.eclipse.emf.emfstore.internal.client.model.impl.OperationRecorder.checkCommandConstraints(OperationRecorder.java:232)
	... 79 more
EObject Change Observer threw an exception: org.eclipse.emf.emfstore.internal.client.model.impl.OperationManager
java.lang.RuntimeException: org.eclipse.emf.emfstore.internal.client.model.exceptions.MissingCommandException: Element org.eclipse.emf.emfstore.client.test.testmodel.impl.TestElementImpl@5c51c1df (name: , strings: null, description: null) has been changed without using a command
	at org.eclipse.emf.emfstore.internal.client.model.util.WorkspaceUtil.log(WorkspaceUtil.java:91)
	at org.eclipse.emf.emfstore.internal.client.model.util.WorkspaceUtil.logException(WorkspaceUtil.java:66)
	at org.eclipse.emf.emfstore.internal.client.model.util.WorkspaceUtil.wrapAndHandleException(WorkspaceUtil.java:137)
	at org.eclipse.emf.emfstore.internal.client.model.util.WorkspaceUtil.handleException(WorkspaceUtil.java:118)
	at org.eclipse.emf.emfstore.internal.client.model.impl.OperationRecorder.checkCommandConstraints(OperationRecorder.java:231)
	at org.eclipse.emf.emfstore.internal.client.model.impl.OperationRecorder.modelElementAdded(OperationRecorder.java:169)
	at org.eclipse.emf.emfstore.internal.client.model.impl.OperationManager.modelElementAdded(OperationManager.java:258)
	at org.eclipse.emf.emfstore.internal.common.model.impl.NotifiableIdEObjectCollectionImpl$1.run(NotifiableIdEObjectCollectionImpl.java:108)
	at org.eclipse.emf.emfstore.internal.common.model.impl.NotifiableIdEObjectCollectionImpl$2.run(NotifiableIdEObjectCollectionImpl.java:142)
	at org.eclipse.emf.emfstore.common.ESSafeRunner.run(ESSafeRunner.java:38)
	at org.eclipse.emf.emfstore.internal.common.model.impl.NotifiableIdEObjectCollectionImpl.notifyIdEObjectCollectionChangeObservers(NotifiableIdEObjectCollectionImpl.java:165)
	at org.eclipse.emf.emfstore.internal.common.model.impl.NotifiableIdEObjectCollectionImpl.modelElementAdded(NotifiableIdEObjectCollectionImpl.java:111)
	at org.eclipse.emf.emfstore.internal.common.model.util.EObjectChangeNotifier.addAdapter(EObjectChangeNotifier.java:90)
	at org.eclipse.emf.ecore.util.EContentAdapter.handleContainment(EContentAdapter.java:139)
	at org.eclipse.emf.ecore.util.EContentAdapter.selfAdapt(EContentAdapter.java:74)
	at org.eclipse.emf.ecore.util.EContentAdapter.notifyChanged(EContentAdapter.java:40)
	at org.eclipse.emf.emfstore.internal.common.model.util.EObjectChangeNotifier.notifyChanged(EObjectChangeNotifier.java:187)
	at org.eclipse.emf.common.notify.impl.BasicNotifierImpl.eNotify(BasicNotifierImpl.java:374)
	at org.eclipse.emf.ecore.util.EcoreEList.dispatchNotification(EcoreEList.java:249)
	at org.eclipse.emf.common.notify.impl.NotifyingListImpl.addUnique(NotifyingListImpl.java:294)
	at org.eclipse.emf.common.util.AbstractEList.add(AbstractEList.java:301)
	at org.eclipse.emf.emfstore.internal.common.model.impl.IdEObjectCollectionImpl.addModelElement(IdEObjectCollectionImpl.java:175)
	at org.eclipse.emf.emfstore.client.test.changeTracking.recording.OperationRecorderTest.forceCommands(OperationRecorderTest.java:57)
	at sun.reflect.NativeMethodAccessorImpl.invoke0(Native Method)
	at sun.reflect.NativeMethodAccessorImpl.invoke(NativeMethodAccessorImpl.java:39)
	at sun.reflect.DelegatingMethodAccessorImpl.invoke(DelegatingMethodAccessorImpl.java:25)
	at java.lang.reflect.Method.invoke(Method.java:597)
	at org.junit.runners.model.FrameworkMethod$1.runReflectiveCall(FrameworkMethod.java:47)
	at org.junit.internal.runners.model.ReflectiveCallable.run(ReflectiveCallable.java:12)
	at org.junit.runners.model.FrameworkMethod.invokeExplosively(FrameworkMethod.java:44)
	at org.junit.internal.runners.statements.InvokeMethod.evaluate(InvokeMethod.java:17)
	at org.junit.internal.runners.statements.ExpectException.evaluate(ExpectException.java:19)
	at org.junit.internal.runners.statements.RunBefores.evaluate(RunBefores.java:26)
	at org.junit.internal.runners.statements.RunAfters.evaluate(RunAfters.java:27)
	at org.junit.runners.ParentRunner.runLeaf(ParentRunner.java:271)
	at org.junit.runners.BlockJUnit4ClassRunner.runChild(BlockJUnit4ClassRunner.java:70)
	at org.junit.runners.BlockJUnit4ClassRunner.runChild(BlockJUnit4ClassRunner.java:50)
	at org.junit.runners.ParentRunner$3.run(ParentRunner.java:238)
	at org.junit.runners.ParentRunner$1.schedule(ParentRunner.java:63)
	at org.junit.runners.ParentRunner.runChildren(ParentRunner.java:236)
	at org.junit.runners.ParentRunner.access$000(ParentRunner.java:53)
	at org.junit.runners.ParentRunner$2.evaluate(ParentRunner.java:229)
	at org.junit.internal.runners.statements.RunBefores.evaluate(RunBefores.java:26)
	at org.junit.internal.runners.statements.RunAfters.evaluate(RunAfters.java:27)
	at org.junit.runners.ParentRunner.run(ParentRunner.java:309)
	at org.junit.runners.Suite.runChild(Suite.java:127)
	at org.junit.runners.Suite.runChild(Suite.java:26)
	at org.junit.runners.ParentRunner$3.run(ParentRunner.java:238)
	at org.junit.runners.ParentRunner$1.schedule(ParentRunner.java:63)
	at org.junit.runners.ParentRunner.runChildren(ParentRunner.java:236)
	at org.junit.runners.ParentRunner.access$000(ParentRunner.java:53)
	at org.junit.runners.ParentRunner$2.evaluate(ParentRunner.java:229)
	at org.junit.runners.ParentRunner.run(ParentRunner.java:309)
	at org.junit.runners.Suite.runChild(Suite.java:127)
	at org.junit.runners.Suite.runChild(Suite.java:26)
	at org.junit.runners.ParentRunner$3.run(ParentRunner.java:238)
	at org.junit.runners.ParentRunner$1.schedule(ParentRunner.java:63)
	at org.junit.runners.ParentRunner.runChildren(ParentRunner.java:236)
	at org.junit.runners.ParentRunner.access$000(ParentRunner.java:53)
	at org.junit.runners.ParentRunner$2.evaluate(ParentRunner.java:229)
	at org.junit.runners.ParentRunner.run(ParentRunner.java:309)
	at org.junit.runners.Suite.runChild(Suite.java:127)
	at org.junit.runners.Suite.runChild(Suite.java:26)
	at org.junit.runners.ParentRunner$3.run(ParentRunner.java:238)
	at org.junit.runners.ParentRunner$1.schedule(ParentRunner.java:63)
	at org.junit.runners.ParentRunner.runChildren(ParentRunner.java:236)
	at org.junit.runners.ParentRunner.access$000(ParentRunner.java:53)
	at org.junit.runners.ParentRunner$2.evaluate(ParentRunner.java:229)
	at org.junit.runners.ParentRunner.run(ParentRunner.java:309)
	at org.apache.maven.surefire.junit4.JUnit4TestSet.execute(JUnit4TestSet.java:53)
	at org.apache.maven.surefire.junit4.JUnit4Provider.executeTestSet(JUnit4Provider.java:123)
	at org.apache.maven.surefire.junit4.JUnit4Provider.invoke(JUnit4Provider.java:104)
	at sun.reflect.NativeMethodAccessorImpl.invoke0(Native Method)
	at sun.reflect.NativeMethodAccessorImpl.invoke(NativeMethodAccessorImpl.java:39)
	at sun.reflect.DelegatingMethodAccessorImpl.invoke(DelegatingMethodAccessorImpl.java:25)
	at java.lang.reflect.Method.invoke(Method.java:597)
	at org.apache.maven.surefire.util.ReflectionUtils.invokeMethodWithArray(ReflectionUtils.java:164)
	at org.apache.maven.surefire.booter.ProviderFactory$ProviderProxy.invoke(ProviderFactory.java:110)
	at org.apache.maven.surefire.booter.SurefireStarter.invokeProvider(SurefireStarter.java:175)
	at org.apache.maven.surefire.booter.SurefireStarter.runSuitesInProcess(SurefireStarter.java:123)
	at org.eclipse.tycho.surefire.osgibooter.OsgiSurefireBooter.run(OsgiSurefireBooter.java:85)
	at org.eclipse.tycho.surefire.osgibooter.AbstractUITestApplication.runTests(AbstractUITestApplication.java:44)
	at org.eclipse.ui.internal.testing.WorkbenchTestable$1.run(WorkbenchTestable.java:71)
	at java.lang.Thread.run(Thread.java:662)
Caused by: org.eclipse.emf.emfstore.internal.client.model.exceptions.MissingCommandException: Element org.eclipse.emf.emfstore.client.test.testmodel.impl.TestElementImpl@5c51c1df (name: , strings: null, description: null) has been changed without using a command
	at org.eclipse.emf.emfstore.internal.client.model.impl.OperationRecorder.checkCommandConstraints(OperationRecorder.java:232)
	... 79 more
EObject Change Observer threw an exception: org.eclipse.emf.emfstore.internal.client.model.impl.OperationManager
java.lang.RuntimeException: org.eclipse.emf.emfstore.internal.client.model.exceptions.MissingCommandException: Element org.eclipse.emf.emfstore.client.test.testmodel.impl.TestElementImpl@5c51c1df (name: , strings: null, description: null) has been changed without using a command
	at org.eclipse.emf.emfstore.internal.client.model.util.WorkspaceUtil.log(WorkspaceUtil.java:91)
	at org.eclipse.emf.emfstore.internal.client.model.util.WorkspaceUtil.logException(WorkspaceUtil.java:66)
	at org.eclipse.emf.emfstore.internal.client.model.util.WorkspaceUtil.wrapAndHandleException(WorkspaceUtil.java:137)
	at org.eclipse.emf.emfstore.internal.client.model.util.WorkspaceUtil.handleException(WorkspaceUtil.java:118)
	at org.eclipse.emf.emfstore.internal.client.model.impl.OperationRecorder.checkCommandConstraints(OperationRecorder.java:231)
	at org.eclipse.emf.emfstore.internal.client.model.impl.OperationRecorder.modelElementAdded(OperationRecorder.java:169)
	at org.eclipse.emf.emfstore.internal.client.model.impl.OperationManager.modelElementAdded(OperationManager.java:258)
	at org.eclipse.emf.emfstore.internal.common.model.impl.NotifiableIdEObjectCollectionImpl$1.run(NotifiableIdEObjectCollectionImpl.java:108)
	at org.eclipse.emf.emfstore.internal.common.model.impl.NotifiableIdEObjectCollectionImpl$2.run(NotifiableIdEObjectCollectionImpl.java:142)
	at org.eclipse.emf.emfstore.common.ESSafeRunner.run(ESSafeRunner.java:38)
	at org.eclipse.emf.emfstore.internal.common.model.impl.NotifiableIdEObjectCollectionImpl.notifyIdEObjectCollectionChangeObservers(NotifiableIdEObjectCollectionImpl.java:165)
	at org.eclipse.emf.emfstore.internal.common.model.impl.NotifiableIdEObjectCollectionImpl.modelElementAdded(NotifiableIdEObjectCollectionImpl.java:111)
	at org.eclipse.emf.emfstore.internal.common.model.util.EObjectChangeNotifier.addAdapter(EObjectChangeNotifier.java:90)
	at org.eclipse.emf.ecore.util.EContentAdapter.handleContainment(EContentAdapter.java:139)
	at org.eclipse.emf.ecore.util.EContentAdapter.selfAdapt(EContentAdapter.java:74)
	at org.eclipse.emf.ecore.util.EContentAdapter.notifyChanged(EContentAdapter.java:40)
	at org.eclipse.emf.emfstore.internal.common.model.util.EObjectChangeNotifier.notifyChanged(EObjectChangeNotifier.java:187)
	at org.eclipse.emf.common.notify.impl.BasicNotifierImpl.eNotify(BasicNotifierImpl.java:374)
	at org.eclipse.emf.ecore.util.EcoreEList.dispatchNotification(EcoreEList.java:249)
	at org.eclipse.emf.common.notify.impl.NotifyingListImpl.addUnique(NotifyingListImpl.java:294)
	at org.eclipse.emf.common.util.AbstractEList.add(AbstractEList.java:301)
	at org.eclipse.emf.emfstore.internal.common.model.impl.IdEObjectCollectionImpl.addModelElement(IdEObjectCollectionImpl.java:175)
	at org.eclipse.emf.emfstore.client.test.changeTracking.recording.OperationRecorderTest.forceCommands(OperationRecorderTest.java:57)
	at sun.reflect.NativeMethodAccessorImpl.invoke0(Native Method)
	at sun.reflect.NativeMethodAccessorImpl.invoke(NativeMethodAccessorImpl.java:39)
	at sun.reflect.DelegatingMethodAccessorImpl.invoke(DelegatingMethodAccessorImpl.java:25)
	at java.lang.reflect.Method.invoke(Method.java:597)
	at org.junit.runners.model.FrameworkMethod$1.runReflectiveCall(FrameworkMethod.java:47)
	at org.junit.internal.runners.model.ReflectiveCallable.run(ReflectiveCallable.java:12)
	at org.junit.runners.model.FrameworkMethod.invokeExplosively(FrameworkMethod.java:44)
	at org.junit.internal.runners.statements.InvokeMethod.evaluate(InvokeMethod.java:17)
	at org.junit.internal.runners.statements.ExpectException.evaluate(ExpectException.java:19)
	at org.junit.internal.runners.statements.RunBefores.evaluate(RunBefores.java:26)
	at org.junit.internal.runners.statements.RunAfters.evaluate(RunAfters.java:27)
	at org.junit.runners.ParentRunner.runLeaf(ParentRunner.java:271)
	at org.junit.runners.BlockJUnit4ClassRunner.runChild(BlockJUnit4ClassRunner.java:70)
	at org.junit.runners.BlockJUnit4ClassRunner.runChild(BlockJUnit4ClassRunner.java:50)
	at org.junit.runners.ParentRunner$3.run(ParentRunner.java:238)
	at org.junit.runners.ParentRunner$1.schedule(ParentRunner.java:63)
	at org.junit.runners.ParentRunner.runChildren(ParentRunner.java:236)
	at org.junit.runners.ParentRunner.access$000(ParentRunner.java:53)
	at org.junit.runners.ParentRunner$2.evaluate(ParentRunner.java:229)
	at org.junit.internal.runners.statements.RunBefores.evaluate(RunBefores.java:26)
	at org.junit.internal.runners.statements.RunAfters.evaluate(RunAfters.java:27)
	at org.junit.runners.ParentRunner.run(ParentRunner.java:309)
	at org.junit.runners.Suite.runChild(Suite.java:127)
	at org.junit.runners.Suite.runChild(Suite.java:26)
	at org.junit.runners.ParentRunner$3.run(ParentRunner.java:238)
	at org.junit.runners.ParentRunner$1.schedule(ParentRunner.java:63)
	at org.junit.runners.ParentRunner.runChildren(ParentRunner.java:236)
	at org.junit.runners.ParentRunner.access$000(ParentRunner.java:53)
	at org.junit.runners.ParentRunner$2.evaluate(ParentRunner.java:229)
	at org.junit.runners.ParentRunner.run(ParentRunner.java:309)
	at org.junit.runners.Suite.runChild(Suite.java:127)
	at org.junit.runners.Suite.runChild(Suite.java:26)
	at org.junit.runners.ParentRunner$3.run(ParentRunner.java:238)
	at org.junit.runners.ParentRunner$1.schedule(ParentRunner.java:63)
	at org.junit.runners.ParentRunner.runChildren(ParentRunner.java:236)
	at org.junit.runners.ParentRunner.access$000(ParentRunner.java:53)
	at org.junit.runners.ParentRunner$2.evaluate(ParentRunner.java:229)
	at org.junit.runners.ParentRunner.run(ParentRunner.java:309)
	at org.junit.runners.Suite.runChild(Suite.java:127)
	at org.junit.runners.Suite.runChild(Suite.java:26)
	at org.junit.runners.ParentRunner$3.run(ParentRunner.java:238)
	at org.junit.runners.ParentRunner$1.schedule(ParentRunner.java:63)
	at org.junit.runners.ParentRunner.runChildren(ParentRunner.java:236)
	at org.junit.runners.ParentRunner.access$000(ParentRunner.java:53)
	at org.junit.runners.ParentRunner$2.evaluate(ParentRunner.java:229)
	at org.junit.runners.ParentRunner.run(ParentRunner.java:309)
	at org.apache.maven.surefire.junit4.JUnit4TestSet.execute(JUnit4TestSet.java:53)
	at org.apache.maven.surefire.junit4.JUnit4Provider.executeTestSet(JUnit4Provider.java:123)
	at org.apache.maven.surefire.junit4.JUnit4Provider.invoke(JUnit4Provider.java:104)
	at sun.reflect.NativeMethodAccessorImpl.invoke0(Native Method)
	at sun.reflect.NativeMethodAccessorImpl.invoke(NativeMethodAccessorImpl.java:39)
	at sun.reflect.DelegatingMethodAccessorImpl.invoke(DelegatingMethodAccessorImpl.java:25)
	at java.lang.reflect.Method.invoke(Method.java:597)
	at org.apache.maven.surefire.util.ReflectionUtils.invokeMethodWithArray(ReflectionUtils.java:164)
	at org.apache.maven.surefire.booter.ProviderFactory$ProviderProxy.invoke(ProviderFactory.java:110)
	at org.apache.maven.surefire.booter.SurefireStarter.invokeProvider(SurefireStarter.java:175)
	at org.apache.maven.surefire.booter.SurefireStarter.runSuitesInProcess(SurefireStarter.java:123)
	at org.eclipse.tycho.surefire.osgibooter.OsgiSurefireBooter.run(OsgiSurefireBooter.java:85)
	at org.eclipse.tycho.surefire.osgibooter.AbstractUITestApplication.runTests(AbstractUITestApplication.java:44)
	at org.eclipse.ui.internal.testing.WorkbenchTestable$1.run(WorkbenchTestable.java:71)
	at java.lang.Thread.run(Thread.java:662)
Caused by: org.eclipse.emf.emfstore.internal.client.model.exceptions.MissingCommandException: Element org.eclipse.emf.emfstore.client.test.testmodel.impl.TestElementImpl@5c51c1df (name: , strings: null, description: null) has been changed without using a command
	at org.eclipse.emf.emfstore.internal.client.model.impl.OperationRecorder.checkCommandConstraints(OperationRecorder.java:232)
	... 79 more
EObject Change Observer threw an exception: org.eclipse.emf.emfstore.internal.client.model.impl.OperationManager
java.lang.RuntimeException: org.eclipse.emf.emfstore.internal.client.model.exceptions.MissingCommandException: Element org.eclipse.emf.emfstore.client.test.testmodel.impl.TestElementImpl@5c51c1df (name: , strings: null, description: null) has been changed without using a command
	at org.eclipse.emf.emfstore.internal.client.model.util.WorkspaceUtil.log(WorkspaceUtil.java:91)
	at org.eclipse.emf.emfstore.internal.client.model.util.WorkspaceUtil.logException(WorkspaceUtil.java:66)
	at org.eclipse.emf.emfstore.internal.client.model.util.WorkspaceUtil.wrapAndHandleException(WorkspaceUtil.java:137)
	at org.eclipse.emf.emfstore.internal.client.model.util.WorkspaceUtil.handleException(WorkspaceUtil.java:118)
	at org.eclipse.emf.emfstore.internal.client.model.impl.OperationRecorder.checkCommandConstraints(OperationRecorder.java:231)
	at org.eclipse.emf.emfstore.internal.client.model.impl.OperationRecorder.modelElementAdded(OperationRecorder.java:169)
	at org.eclipse.emf.emfstore.internal.client.model.impl.OperationManager.modelElementAdded(OperationManager.java:258)
	at org.eclipse.emf.emfstore.internal.common.model.impl.NotifiableIdEObjectCollectionImpl$1.run(NotifiableIdEObjectCollectionImpl.java:108)
	at org.eclipse.emf.emfstore.internal.common.model.impl.NotifiableIdEObjectCollectionImpl$2.run(NotifiableIdEObjectCollectionImpl.java:142)
	at org.eclipse.emf.emfstore.common.ESSafeRunner.run(ESSafeRunner.java:38)
	at org.eclipse.emf.emfstore.internal.common.model.impl.NotifiableIdEObjectCollectionImpl.notifyIdEObjectCollectionChangeObservers(NotifiableIdEObjectCollectionImpl.java:165)
	at org.eclipse.emf.emfstore.internal.common.model.impl.NotifiableIdEObjectCollectionImpl.modelElementAdded(NotifiableIdEObjectCollectionImpl.java:111)
	at org.eclipse.emf.emfstore.internal.common.model.util.EObjectChangeNotifier.addAdapter(EObjectChangeNotifier.java:90)
	at org.eclipse.emf.ecore.util.EContentAdapter.handleContainment(EContentAdapter.java:139)
	at org.eclipse.emf.ecore.util.EContentAdapter.selfAdapt(EContentAdapter.java:74)
	at org.eclipse.emf.ecore.util.EContentAdapter.notifyChanged(EContentAdapter.java:40)
	at org.eclipse.emf.emfstore.internal.common.model.util.EObjectChangeNotifier.notifyChanged(EObjectChangeNotifier.java:187)
	at org.eclipse.emf.common.notify.impl.BasicNotifierImpl.eNotify(BasicNotifierImpl.java:374)
	at org.eclipse.emf.ecore.util.EcoreEList.dispatchNotification(EcoreEList.java:249)
	at org.eclipse.emf.common.notify.impl.NotifyingListImpl.addUnique(NotifyingListImpl.java:294)
	at org.eclipse.emf.common.util.AbstractEList.add(AbstractEList.java:301)
	at org.eclipse.emf.emfstore.internal.common.model.impl.IdEObjectCollectionImpl.addModelElement(IdEObjectCollectionImpl.java:175)
	at org.eclipse.emf.emfstore.client.test.changeTracking.recording.OperationRecorderTest.forceCommands(OperationRecorderTest.java:57)
	at sun.reflect.NativeMethodAccessorImpl.invoke0(Native Method)
	at sun.reflect.NativeMethodAccessorImpl.invoke(NativeMethodAccessorImpl.java:39)
	at sun.reflect.DelegatingMethodAccessorImpl.invoke(DelegatingMethodAccessorImpl.java:25)
	at java.lang.reflect.Method.invoke(Method.java:597)
	at org.junit.runners.model.FrameworkMethod$1.runReflectiveCall(FrameworkMethod.java:47)
	at org.junit.internal.runners.model.ReflectiveCallable.run(ReflectiveCallable.java:12)
	at org.junit.runners.model.FrameworkMethod.invokeExplosively(FrameworkMethod.java:44)
	at org.junit.internal.runners.statements.InvokeMethod.evaluate(InvokeMethod.java:17)
	at org.junit.internal.runners.statements.ExpectException.evaluate(ExpectException.java:19)
	at org.junit.internal.runners.statements.RunBefores.evaluate(RunBefores.java:26)
	at org.junit.internal.runners.statements.RunAfters.evaluate(RunAfters.java:27)
	at org.junit.runners.ParentRunner.runLeaf(ParentRunner.java:271)
	at org.junit.runners.BlockJUnit4ClassRunner.runChild(BlockJUnit4ClassRunner.java:70)
	at org.junit.runners.BlockJUnit4ClassRunner.runChild(BlockJUnit4ClassRunner.java:50)
	at org.junit.runners.ParentRunner$3.run(ParentRunner.java:238)
	at org.junit.runners.ParentRunner$1.schedule(ParentRunner.java:63)
	at org.junit.runners.ParentRunner.runChildren(ParentRunner.java:236)
	at org.junit.runners.ParentRunner.access$000(ParentRunner.java:53)
	at org.junit.runners.ParentRunner$2.evaluate(ParentRunner.java:229)
	at org.junit.internal.runners.statements.RunBefores.evaluate(RunBefores.java:26)
	at org.junit.internal.runners.statements.RunAfters.evaluate(RunAfters.java:27)
	at org.junit.runners.ParentRunner.run(ParentRunner.java:309)
	at org.junit.runners.Suite.runChild(Suite.java:127)
	at org.junit.runners.Suite.runChild(Suite.java:26)
	at org.junit.runners.ParentRunner$3.run(ParentRunner.java:238)
	at org.junit.runners.ParentRunner$1.schedule(ParentRunner.java:63)
	at org.junit.runners.ParentRunner.runChildren(ParentRunner.java:236)
	at org.junit.runners.ParentRunner.access$000(ParentRunner.java:53)
	at org.junit.runners.ParentRunner$2.evaluate(ParentRunner.java:229)
	at org.junit.runners.ParentRunner.run(ParentRunner.java:309)
	at org.junit.runners.Suite.runChild(Suite.java:127)
	at org.junit.runners.Suite.runChild(Suite.java:26)
	at org.junit.runners.ParentRunner$3.run(ParentRunner.java:238)
	at org.junit.runners.ParentRunner$1.schedule(ParentRunner.java:63)
	at org.junit.runners.ParentRunner.runChildren(ParentRunner.java:236)
	at org.junit.runners.ParentRunner.access$000(ParentRunner.java:53)
	at org.junit.runners.ParentRunner$2.evaluate(ParentRunner.java:229)
	at org.junit.runners.ParentRunner.run(ParentRunner.java:309)
	at org.junit.runners.Suite.runChild(Suite.java:127)
	at org.junit.runners.Suite.runChild(Suite.java:26)
	at org.junit.runners.ParentRunner$3.run(ParentRunner.java:238)
	at org.junit.runners.ParentRunner$1.schedule(ParentRunner.java:63)
	at org.junit.runners.ParentRunner.runChildren(ParentRunner.java:236)
	at org.junit.runners.ParentRunner.access$000(ParentRunner.java:53)
	at org.junit.runners.ParentRunner$2.evaluate(ParentRunner.java:229)
	at org.junit.runners.ParentRunner.run(ParentRunner.java:309)
	at org.apache.maven.surefire.junit4.JUnit4TestSet.execute(JUnit4TestSet.java:53)
	at org.apache.maven.surefire.junit4.JUnit4Provider.executeTestSet(JUnit4Provider.java:123)
	at org.apache.maven.surefire.junit4.JUnit4Provider.invoke(JUnit4Provider.java:104)
	at sun.reflect.NativeMethodAccessorImpl.invoke0(Native Method)
	at sun.reflect.NativeMethodAccessorImpl.invoke(NativeMethodAccessorImpl.java:39)
	at sun.reflect.DelegatingMethodAccessorImpl.invoke(DelegatingMethodAccessorImpl.java:25)
	at java.lang.reflect.Method.invoke(Method.java:597)
	at org.apache.maven.surefire.util.ReflectionUtils.invokeMethodWithArray(ReflectionUtils.java:164)
	at org.apache.maven.surefire.booter.ProviderFactory$ProviderProxy.invoke(ProviderFactory.java:110)
	at org.apache.maven.surefire.booter.SurefireStarter.invokeProvider(SurefireStarter.java:175)
	at org.apache.maven.surefire.booter.SurefireStarter.runSuitesInProcess(SurefireStarter.java:123)
	at org.eclipse.tycho.surefire.osgibooter.OsgiSurefireBooter.run(OsgiSurefireBooter.java:85)
	at org.eclipse.tycho.surefire.osgibooter.AbstractUITestApplication.runTests(AbstractUITestApplication.java:44)
	at org.eclipse.ui.internal.testing.WorkbenchTestable$1.run(WorkbenchTestable.java:71)
	at java.lang.Thread.run(Thread.java:662)
Caused by: org.eclipse.emf.emfstore.internal.client.model.exceptions.MissingCommandException: Element org.eclipse.emf.emfstore.client.test.testmodel.impl.TestElementImpl@5c51c1df (name: , strings: null, description: null) has been changed without using a command
	at org.eclipse.emf.emfstore.internal.client.model.impl.OperationRecorder.checkCommandConstraints(OperationRecorder.java:232)
	... 79 more
Tests run: 349, Failures: 0, Errors: 0, Skipped: 0, Time elapsed: 166.648 sec

Results :

Tests run: 349, Failures: 0, Errors: 0, Skipped: 0

[INFO] All tests passed!
[INFO] 
[INFO] --- maven-install-plugin:2.3.1:install (default-install) @ org.eclipse.emf.emfstore.client.test.alltests ---
[INFO] Installing /jobs/genie.modeling.emfstore/emf-emfstore-simrel/workspace/git/tests/org.eclipse.emf.emfstore.client.test.alltests/target/org.eclipse.emf.emfstore.client.test.alltests-1.1.0-SNAPSHOT.jar to /home/hudson/genie.modeling.emfstore/.hudson/jobs/emf-emfstore-simrel/workspace/.maven/repo/org/eclipse/emf/emfstore/org.eclipse.emf.emfstore.client.test.alltests/1.1.0-SNAPSHOT/org.eclipse.emf.emfstore.client.test.alltests-1.1.0-SNAPSHOT.jar
[INFO] Installing /jobs/genie.modeling.emfstore/emf-emfstore-simrel/workspace/git/tests/org.eclipse.emf.emfstore.client.test.alltests/pom.xml to /home/hudson/genie.modeling.emfstore/.hudson/jobs/emf-emfstore-simrel/workspace/.maven/repo/org/eclipse/emf/emfstore/org.eclipse.emf.emfstore.client.test.alltests/1.1.0-SNAPSHOT/org.eclipse.emf.emfstore.client.test.alltests-1.1.0-SNAPSHOT.pom
[INFO] Installing /jobs/genie.modeling.emfstore/emf-emfstore-simrel/workspace/git/tests/org.eclipse.emf.emfstore.client.test.alltests/target/org.eclipse.emf.emfstore.client.test.alltests-1.1.0-SNAPSHOT-sources.jar to /home/hudson/genie.modeling.emfstore/.hudson/jobs/emf-emfstore-simrel/workspace/.maven/repo/org/eclipse/emf/emfstore/org.eclipse.emf.emfstore.client.test.alltests/1.1.0-SNAPSHOT/org.eclipse.emf.emfstore.client.test.alltests-1.1.0-SNAPSHOT-sources.jar
[INFO] Installing /jobs/genie.modeling.emfstore/emf-emfstore-simrel/workspace/git/tests/org.eclipse.emf.emfstore.client.test.alltests/target/p2content.xml to /home/hudson/genie.modeling.emfstore/.hudson/jobs/emf-emfstore-simrel/workspace/.maven/repo/org/eclipse/emf/emfstore/org.eclipse.emf.emfstore.client.test.alltests/1.1.0-SNAPSHOT/org.eclipse.emf.emfstore.client.test.alltests-1.1.0-SNAPSHOT-p2metadata.xml
[INFO] Installing /jobs/genie.modeling.emfstore/emf-emfstore-simrel/workspace/git/tests/org.eclipse.emf.emfstore.client.test.alltests/target/p2artifacts.xml to /home/hudson/genie.modeling.emfstore/.hudson/jobs/emf-emfstore-simrel/workspace/.maven/repo/org/eclipse/emf/emfstore/org.eclipse.emf.emfstore.client.test.alltests/1.1.0-SNAPSHOT/org.eclipse.emf.emfstore.client.test.alltests-1.1.0-SNAPSHOT-p2artifacts.xml
[INFO] 
[INFO] --- tycho-p2-plugin:0.18.0:update-local-index (default-update-local-index) @ org.eclipse.emf.emfstore.client.test.alltests ---
[INFO] ------------------------------------------------------------------------
[INFO] Reactor Summary:
[INFO] 
[INFO] emfstore-parent ................................... SUCCESS [34.720s]
[INFO] emfstore .......................................... SUCCESS [0.660s]
[INFO] emfstore-bundles-parent ........................... SUCCESS [8.691s]
[INFO] org.eclipse.emf.emfstore.common ................... SUCCESS [42.328s]
[INFO] org.eclipse.emf.emfstore.common.model ............. SUCCESS [1:32.931s]
[INFO] org.eclipse.emf.emfstore.migration ................ SUCCESS [7.119s]
[INFO] org.eclipse.emf.emfstore.server.model ............. SUCCESS [24:13.159s]
[INFO] org.eclipse.emf.emfstore.server ................... SUCCESS [4:30.354s]
[INFO] org.eclipse.emf.emfstore.client ................... SUCCESS [10:11.640s]
[INFO] emfstore-features-parent .......................... SUCCESS [0.614s]
[INFO] org.eclipse.emf.emfstore.client.feature ........... SUCCESS [3.196s]
[INFO] org.eclipse.emf.emfstore.common.model.edit ........ SUCCESS [8.764s]
[INFO] org.eclipse.emf.emfstore.server.model.edit ........ SUCCESS [10:54.025s]
[INFO] org.eclipse.emf.emfstore.client.model.edit ........ SUCCESS [1:08.433s]
[INFO] org.eclipse.emf.emfstore.client.transaction ....... SUCCESS [12.452s]
[INFO] org.eclipse.emf.emfstore.client.transaction.feature  SUCCESS [3.091s]
[INFO] org.eclipse.emf.emfstore.client.ui ................ SUCCESS [6:26.244s]
[INFO] org.eclipse.emf.emfstore.client.ui.feature ........ SUCCESS [2.972s]
[INFO] org.eclipse.emf.emfstore.client.ui.historybrowsercomparator  SUCCESS [6.814s]
[INFO] org.eclipse.emf.emfstore.client.ui.historybrowsercomparator.feature  SUCCESS [3.027s]
[INFO] org.eclipse.emf.emfstore.common.feature ........... SUCCESS [2.365s]
[INFO] org.eclipse.emf.emfstore.ecore .................... SUCCESS [8.138s]
[INFO] org.eclipse.emf.emfstore.ecore.feature ............ SUCCESS [2.413s]
[INFO] org.eclipse.emf.emfstore.examplemodel ............. SUCCESS [2:54.041s]
[INFO] org.eclipse.emf.emfstore.examplemodel.edit ........ SUCCESS [1:21.486s]
[INFO] org.eclipse.emf.emfstore.example.installer ........ SUCCESS [2.974s]
[INFO] org.eclipse.emf.emfstore.example.feature .......... SUCCESS [2.301s]
[INFO] org.eclipse.emf.emfstore.modelmutator ............. SUCCESS [43.140s]
[INFO] org.eclipse.emf.emfstore.modelmutator.feature ..... SUCCESS [2.998s]
[INFO] org.eclipse.emf.emfstore.mongodb .................. SUCCESS [6.708s]
[INFO] org.eclipse.emf.emfstore.mongodb.client ........... SUCCESS [7.158s]
[INFO] org.eclipse.emf.emfstore.mongodb.client.feature ... SUCCESS [3.077s]
[INFO] org.eclipse.emf.emfstore.mongodb.server ........... SUCCESS [9.609s]
[INFO] org.eclipse.emf.emfstore.mongodb.server.feature ... SUCCESS [2.333s]
[INFO] org.eclipse.emf.emfstore.server.feature ........... SUCCESS [3.048s]
[INFO] org.eclipse.emf.emfstore.sdk.feature .............. SUCCESS [2.271s]
[INFO] org.eclipse.emf.emfstore.p2repository ............. SUCCESS [12.733s]
[INFO] org.eclipse.emf.emfstore.products ................. SUCCESS [21.660s]
[INFO] org.eclipse.emf.emfstore.example.helloworld ....... SUCCESS [8.450s]
[INFO] org.eclipse.emf.emfstore.example.merging .......... SUCCESS [7.803s]
[INFO] org.eclipse.emf.emfstore.fuzzy .................... SUCCESS [10.513s]
[INFO] emfstore-tests-parent ............................. SUCCESS [0.609s]
[INFO] org.eclipse.emf.emfstore.client.test .............. SUCCESS [52:36.358s]
[INFO] org.eclipse.emf.emfstore.fuzzy.emf ................ SUCCESS [1:50.502s]
[INFO] org.eclipse.emf.emfstore.fuzzy.emf.edit ........... SUCCESS [45.845s]
[INFO] org.eclipse.emf.emfstore.fuzzy.emf.editor ......... SUCCESS [44.722s]
[INFO] org.eclipse.emf.emfstore.fuzzy.emf.example ........ SUCCESS [5.740s]
[INFO] org.eclipse.emf.emfstore.fuzzy.feature ............ SUCCESS [2.813s]
[INFO] org.eclipse.emf.emfstore.fuzzy.emf.test ........... SUCCESS [17.673s]
[INFO] org.eclipse.emf.emfstore.fuzzy.test.feature ....... SUCCESS [3.267s]
[INFO] org.eclipse.emf.emfstore.client.test.ui ........... SUCCESS [2:39.201s]
[INFO] org.eclipse.emf.emfstore.client.test.alltests ..... SUCCESS [7:29.876s]
[INFO] ------------------------------------------------------------------------
[INFO] BUILD SUCCESS
[INFO] ------------------------------------------------------------------------
[INFO] Total time: 2:18:10.072s
[INFO] Finished at: Tue Jan 28 11:02:29 EST 2014
[INFO] Final Memory: 101M/293M
[INFO] ------------------------------------------------------------------------
[DEBUG] Closing connection to remote
[DEBUG] Waiting for process to finish
[DEBUG] Result: 0
Terminating xvnc.
[CHECKSTYLE] Collecting checkstyle analysis files...
[CHECKSTYLE] Finding all files that match the pattern **/checkstyle-result.xml
[CHECKSTYLE] Parsing 52 files in /home/hudson/genie.modeling.emfstore/.hudson/jobs/emf-emfstore-simrel/workspace
[CHECKSTYLE] Successfully parsed file /home/hudson/genie.modeling.emfstore/.hudson/jobs/emf-emfstore-simrel/workspace/git/bundles/org.eclipse.emf.emfstore.client.model.edit/target/checkstyle-result.xml of module  with 0 warnings.
[CHECKSTYLE] Successfully parsed file /home/hudson/genie.modeling.emfstore/.hudson/jobs/emf-emfstore-simrel/workspace/git/bundles/org.eclipse.emf.emfstore.client.transaction/target/checkstyle-result.xml of module  with 0 warnings.
[CHECKSTYLE] Successfully parsed file /home/hudson/genie.modeling.emfstore/.hudson/jobs/emf-emfstore-simrel/workspace/git/bundles/org.eclipse.emf.emfstore.client.ui.historybrowsercomparator/target/checkstyle-result.xml of module  with 3 warnings.
[CHECKSTYLE] Successfully parsed file /home/hudson/genie.modeling.emfstore/.hudson/jobs/emf-emfstore-simrel/workspace/git/bundles/org.eclipse.emf.emfstore.client.ui/target/checkstyle-result.xml of module  with 102 warnings.
[CHECKSTYLE] Successfully parsed file /home/hudson/genie.modeling.emfstore/.hudson/jobs/emf-emfstore-simrel/workspace/git/bundles/org.eclipse.emf.emfstore.client/target/checkstyle-result.xml of module  with 7 warnings.
[CHECKSTYLE] Successfully parsed file /home/hudson/genie.modeling.emfstore/.hudson/jobs/emf-emfstore-simrel/workspace/git/bundles/org.eclipse.emf.emfstore.common.model.edit/target/checkstyle-result.xml of module  with 0 warnings.
[CHECKSTYLE] Successfully parsed file /home/hudson/genie.modeling.emfstore/.hudson/jobs/emf-emfstore-simrel/workspace/git/bundles/org.eclipse.emf.emfstore.common.model/target/checkstyle-result.xml of module  with 16 warnings.
[CHECKSTYLE] Successfully parsed file /home/hudson/genie.modeling.emfstore/.hudson/jobs/emf-emfstore-simrel/workspace/git/bundles/org.eclipse.emf.emfstore.common/target/checkstyle-result.xml of module  with 21 warnings.
[CHECKSTYLE] Successfully parsed file /home/hudson/genie.modeling.emfstore/.hudson/jobs/emf-emfstore-simrel/workspace/git/bundles/org.eclipse.emf.emfstore.ecore/target/checkstyle-result.xml of module  with 5 warnings.
[CHECKSTYLE] Successfully parsed file /home/hudson/genie.modeling.emfstore/.hudson/jobs/emf-emfstore-simrel/workspace/git/bundles/org.eclipse.emf.emfstore.example.helloworld/target/checkstyle-result.xml of module  with 0 warnings.
[CHECKSTYLE] Successfully parsed file /home/hudson/genie.modeling.emfstore/.hudson/jobs/emf-emfstore-simrel/workspace/git/bundles/org.eclipse.emf.emfstore.example.installer/target/checkstyle-result.xml of module  with 0 warnings.
[CHECKSTYLE] Successfully parsed file /home/hudson/genie.modeling.emfstore/.hudson/jobs/emf-emfstore-simrel/workspace/git/bundles/org.eclipse.emf.emfstore.example.merging/target/checkstyle-result.xml of module  with 2 warnings.
[CHECKSTYLE] Successfully parsed file /home/hudson/genie.modeling.emfstore/.hudson/jobs/emf-emfstore-simrel/workspace/git/bundles/org.eclipse.emf.emfstore.examplemodel.edit/target/checkstyle-result.xml of module  with 2 warnings.
[CHECKSTYLE] Successfully parsed file /home/hudson/genie.modeling.emfstore/.hudson/jobs/emf-emfstore-simrel/workspace/git/bundles/org.eclipse.emf.emfstore.examplemodel/target/checkstyle-result.xml of module  with 7 warnings.
[CHECKSTYLE] Successfully parsed file /home/hudson/genie.modeling.emfstore/.hudson/jobs/emf-emfstore-simrel/workspace/git/bundles/org.eclipse.emf.emfstore.fuzzy.emf.edit/target/checkstyle-result.xml of module  with 0 warnings.
[CHECKSTYLE] Successfully parsed file /home/hudson/genie.modeling.emfstore/.hudson/jobs/emf-emfstore-simrel/workspace/git/bundles/org.eclipse.emf.emfstore.fuzzy.emf.editor/target/checkstyle-result.xml of module  with 0 warnings.
[CHECKSTYLE] Successfully parsed file /home/hudson/genie.modeling.emfstore/.hudson/jobs/emf-emfstore-simrel/workspace/git/bundles/org.eclipse.emf.emfstore.fuzzy.emf.example/target/checkstyle-result.xml of module  with 0 warnings.
[CHECKSTYLE] Successfully parsed file /home/hudson/genie.modeling.emfstore/.hudson/jobs/emf-emfstore-simrel/workspace/git/bundles/org.eclipse.emf.emfstore.fuzzy.emf/target/checkstyle-result.xml of module  with 5 warnings.
[CHECKSTYLE] Successfully parsed file /home/hudson/genie.modeling.emfstore/.hudson/jobs/emf-emfstore-simrel/workspace/git/bundles/org.eclipse.emf.emfstore.fuzzy/target/checkstyle-result.xml of module  with 1 warnings.
[CHECKSTYLE] Successfully parsed file /home/hudson/genie.modeling.emfstore/.hudson/jobs/emf-emfstore-simrel/workspace/git/bundles/org.eclipse.emf.emfstore.migration/target/checkstyle-result.xml of module  with 0 warnings.
[CHECKSTYLE] Successfully parsed file /home/hudson/genie.modeling.emfstore/.hudson/jobs/emf-emfstore-simrel/workspace/git/bundles/org.eclipse.emf.emfstore.modelmutator/target/checkstyle-result.xml of module  with 0 warnings.
[CHECKSTYLE] Successfully parsed file /home/hudson/genie.modeling.emfstore/.hudson/jobs/emf-emfstore-simrel/workspace/git/bundles/org.eclipse.emf.emfstore.mongodb.client/target/checkstyle-result.xml of module  with 0 warnings.
[CHECKSTYLE] Successfully parsed file /home/hudson/genie.modeling.emfstore/.hudson/jobs/emf-emfstore-simrel/workspace/git/bundles/org.eclipse.emf.emfstore.mongodb.server/target/checkstyle-result.xml of module  with 0 warnings.
[CHECKSTYLE] Successfully parsed file /home/hudson/genie.modeling.emfstore/.hudson/jobs/emf-emfstore-simrel/workspace/git/bundles/org.eclipse.emf.emfstore.mongodb/target/checkstyle-result.xml of module  with 0 warnings.
[CHECKSTYLE] Successfully parsed file /home/hudson/genie.modeling.emfstore/.hudson/jobs/emf-emfstore-simrel/workspace/git/bundles/org.eclipse.emf.emfstore.server.model.edit/target/checkstyle-result.xml of module  with 1 warnings.
[CHECKSTYLE] Successfully parsed file /home/hudson/genie.modeling.emfstore/.hudson/jobs/emf-emfstore-simrel/workspace/git/bundles/org.eclipse.emf.emfstore.server.model/target/checkstyle-result.xml of module  with 37 warnings.
[CHECKSTYLE] Successfully parsed file /home/hudson/genie.modeling.emfstore/.hudson/jobs/emf-emfstore-simrel/workspace/git/bundles/org.eclipse.emf.emfstore.server/target/checkstyle-result.xml of module  with 67 warnings.
[CHECKSTYLE] Successfully parsed file /home/hudson/genie.modeling.emfstore/.hudson/jobs/emf-emfstore-simrel/workspace/git/features/org.eclipse.emf.emfstore.client.feature/target/checkstyle-result.xml of module  with 0 warnings.
[CHECKSTYLE] Successfully parsed file /home/hudson/genie.modeling.emfstore/.hudson/jobs/emf-emfstore-simrel/workspace/git/features/org.eclipse.emf.emfstore.client.transaction.feature/target/checkstyle-result.xml of module  with 0 warnings.
[CHECKSTYLE] Successfully parsed file /home/hudson/genie.modeling.emfstore/.hudson/jobs/emf-emfstore-simrel/workspace/git/features/org.eclipse.emf.emfstore.client.ui.feature/target/checkstyle-result.xml of module  with 0 warnings.
[CHECKSTYLE] Successfully parsed file /home/hudson/genie.modeling.emfstore/.hudson/jobs/emf-emfstore-simrel/workspace/git/features/org.eclipse.emf.emfstore.client.ui.historybrowsercomparator.feature/target/checkstyle-result.xml of module  with 0 warnings.
[CHECKSTYLE] Successfully parsed file /home/hudson/genie.modeling.emfstore/.hudson/jobs/emf-emfstore-simrel/workspace/git/features/org.eclipse.emf.emfstore.common.feature/target/checkstyle-result.xml of module  with 0 warnings.
[CHECKSTYLE] Successfully parsed file /home/hudson/genie.modeling.emfstore/.hudson/jobs/emf-emfstore-simrel/workspace/git/features/org.eclipse.emf.emfstore.ecore.feature/target/checkstyle-result.xml of module  with 0 warnings.
[CHECKSTYLE] Successfully parsed file /home/hudson/genie.modeling.emfstore/.hudson/jobs/emf-emfstore-simrel/workspace/git/features/org.eclipse.emf.emfstore.example.feature/target/checkstyle-result.xml of module  with 0 warnings.
[CHECKSTYLE] Successfully parsed file /home/hudson/genie.modeling.emfstore/.hudson/jobs/emf-emfstore-simrel/workspace/git/features/org.eclipse.emf.emfstore.fuzzy.feature/target/checkstyle-result.xml of module  with 0 warnings.
[CHECKSTYLE] Successfully parsed file /home/hudson/genie.modeling.emfstore/.hudson/jobs/emf-emfstore-simrel/workspace/git/features/org.eclipse.emf.emfstore.fuzzy.test.feature/target/checkstyle-result.xml of module  with 0 warnings.
[CHECKSTYLE] Successfully parsed file /home/hudson/genie.modeling.emfstore/.hudson/jobs/emf-emfstore-simrel/workspace/git/features/org.eclipse.emf.emfstore.modelmutator.feature/target/checkstyle-result.xml of module  with 0 warnings.
[CHECKSTYLE] Successfully parsed file /home/hudson/genie.modeling.emfstore/.hudson/jobs/emf-emfstore-simrel/workspace/git/features/org.eclipse.emf.emfstore.mongodb.client.feature/target/checkstyle-result.xml of module  with 0 warnings.
[CHECKSTYLE] Successfully parsed file /home/hudson/genie.modeling.emfstore/.hudson/jobs/emf-emfstore-simrel/workspace/git/features/org.eclipse.emf.emfstore.mongodb.server.feature/target/checkstyle-result.xml of module  with 0 warnings.
[CHECKSTYLE] Successfully parsed file /home/hudson/genie.modeling.emfstore/.hudson/jobs/emf-emfstore-simrel/workspace/git/features/org.eclipse.emf.emfstore.sdk.feature/target/checkstyle-result.xml of module  with 0 warnings.
[CHECKSTYLE] Successfully parsed file /home/hudson/genie.modeling.emfstore/.hudson/jobs/emf-emfstore-simrel/workspace/git/features/org.eclipse.emf.emfstore.server.feature/target/checkstyle-result.xml of module  with 0 warnings.
[CHECKSTYLE] Successfully parsed file /home/hudson/genie.modeling.emfstore/.hudson/jobs/emf-emfstore-simrel/workspace/git/releng/_target/target/checkstyle-result.xml of module  with 0 warnings.
[CHECKSTYLE] Successfully parsed file /home/hudson/genie.modeling.emfstore/.hudson/jobs/emf-emfstore-simrel/workspace/git/releng/emfstore-parent/target/checkstyle-result.xml of module  with 0 warnings.
[CHECKSTYLE] Successfully parsed file /home/hudson/genie.modeling.emfstore/.hudson/jobs/emf-emfstore-simrel/workspace/git/releng/org.eclipse.emf.emfstore.p2repository/target/checkstyle-result.xml of module  with 0 warnings.
[CHECKSTYLE] Successfully parsed file /home/hudson/genie.modeling.emfstore/.hudson/jobs/emf-emfstore-simrel/workspace/git/releng/org.eclipse.emf.emfstore.products/target/checkstyle-result.xml of module  with 0 warnings.
[CHECKSTYLE] Successfully parsed file /home/hudson/genie.modeling.emfstore/.hudson/jobs/emf-emfstore-simrel/workspace/git/releng/org.eclipse.emf.emfstore.releng.bundles/target/checkstyle-result.xml of module  with 0 warnings.
[CHECKSTYLE] Successfully parsed file /home/hudson/genie.modeling.emfstore/.hudson/jobs/emf-emfstore-simrel/workspace/git/releng/org.eclipse.emf.emfstore.releng.features/target/checkstyle-result.xml of module  with 0 warnings.
[CHECKSTYLE] Successfully parsed file /home/hudson/genie.modeling.emfstore/.hudson/jobs/emf-emfstore-simrel/workspace/git/releng/org.eclipse.emf.emfstore.releng.tests/target/checkstyle-result.xml of module  with 0 warnings.
[CHECKSTYLE] Successfully parsed file /home/hudson/genie.modeling.emfstore/.hudson/jobs/emf-emfstore-simrel/workspace/git/tests/org.eclipse.emf.emfstore.client.test.alltests/target/checkstyle-result.xml of module  with 0 warnings.
[CHECKSTYLE] Successfully parsed file /home/hudson/genie.modeling.emfstore/.hudson/jobs/emf-emfstore-simrel/workspace/git/tests/org.eclipse.emf.emfstore.client.test.ui/target/checkstyle-result.xml of module  with 8 warnings.
[CHECKSTYLE] Successfully parsed file /home/hudson/genie.modeling.emfstore/.hudson/jobs/emf-emfstore-simrel/workspace/git/tests/org.eclipse.emf.emfstore.client.test/target/checkstyle-result.xml of module  with 113 warnings.
[CHECKSTYLE] Successfully parsed file /home/hudson/genie.modeling.emfstore/.hudson/jobs/emf-emfstore-simrel/workspace/git/tests/org.eclipse.emf.emfstore.fuzzy.emf.test/target/checkstyle-result.xml of module  with 0 warnings.
Archiving artifacts
Recording test results
Sending e-mails to: jfaltermeier@eclipsesource.com
Finished: UNSTABLE