Skip to content

Console Output

Skipping 347 KB.. Full Log
11:40:34 [2024-03-05T16:40:34.689Z] [main] WARN org.eclipse.jgit.lib.Repository - close() called when useCnt is already zero for Repository[/home/jenkins/agent/workspace/egit/repo/org.eclipse.egit.core.test/target/work/data/.git]
11:40:34 [2024-03-05T16:40:34.945Z] Tests run: 3, Failures: 0, Errors: 0, Skipped: 0, Time elapsed: 1.757 s -- in org.eclipse.egit.core.internal.indexdiff.IndexDiffCacheEntryTest
11:40:34 [2024-03-05T16:40:34.945Z] org.eclipse.egit.core.internal.indexdiff.IndexDiffCacheEntryTest.basicTest -- Time elapsed: 0.544 s
11:40:34 [2024-03-05T16:40:34.945Z] org.eclipse.egit.core.internal.indexdiff.IndexDiffCacheEntryTest.testProjectDeletion -- Time elapsed: 0.395 s
11:40:34 [2024-03-05T16:40:34.945Z] org.eclipse.egit.core.internal.indexdiff.IndexDiffCacheEntryTest.testReloadAndUpdate -- Time elapsed: 0.817 s
11:40:34 [2024-03-05T16:40:34.946Z] Running org.eclipse.egit.core.internal.indexdiff.IndexDiffCacheTest
11:40:35 [2024-03-05T16:40:35.203Z] [main] WARN org.eclipse.jgit.lib.Repository - close() called when useCnt is already zero for Repository[/home/jenkins/agent/workspace/egit/repo/org.eclipse.egit.core.test/target/work/data/.git]
11:40:35 [2024-03-05T16:40:35.460Z] [main] WARN org.eclipse.jgit.lib.Repository - close() called when useCnt is already zero for Repository[/home/jenkins/agent/workspace/egit/repo/org.eclipse.egit.core.test/target/work/data/.git]
11:40:36 [2024-03-05T16:40:36.023Z] [main] WARN org.eclipse.jgit.lib.Repository - close() called when useCnt is already zero for Repository[/home/jenkins/agent/workspace/egit/repo/org.eclipse.egit.core.test/target/work/data/.git]
11:40:36 [2024-03-05T16:40:36.280Z] [main] WARN org.eclipse.jgit.lib.Repository - close() called when useCnt is already zero for Repository[/home/jenkins/agent/workspace/egit/repo/org.eclipse.egit.core.test/target/work/data/.git]
11:40:37 [2024-03-05T16:40:37.648Z] [main] WARN org.eclipse.jgit.lib.Repository - close() called when useCnt is already zero for Repository[/home/jenkins/agent/workspace/egit/repo/org.eclipse.egit.core.test/target/work/data/.git]
11:40:40 [2024-03-05T16:40:40.168Z] [main] WARN org.eclipse.jgit.lib.Repository - close() called when useCnt is already zero for Repository[/home/jenkins/agent/workspace/egit/repo/org.eclipse.egit.core.test/target/work/data/.git]
11:40:41 [2024-03-05T16:40:41.097Z] [main] WARN org.eclipse.jgit.lib.Repository - close() called when useCnt is already zero for Repository[/home/jenkins/agent/workspace/egit/repo/org.eclipse.egit.core.test/target/work/data/.git]
11:40:41 [2024-03-05T16:40:41.097Z] Tests run: 7, Failures: 0, Errors: 0, Skipped: 0, Time elapsed: 6.368 s -- in org.eclipse.egit.core.internal.indexdiff.IndexDiffCacheTest
11:40:41 [2024-03-05T16:40:41.097Z] org.eclipse.egit.core.internal.indexdiff.IndexDiffCacheTest.testAddFileFromUntrackedFolder -- Time elapsed: 0.405 s
11:40:41 [2024-03-05T16:40:41.097Z] org.eclipse.egit.core.internal.indexdiff.IndexDiffCacheTest.testAddingAFile -- Time elapsed: 0.240 s
11:40:41 [2024-03-05T16:40:41.097Z] org.eclipse.egit.core.internal.indexdiff.IndexDiffCacheTest.testAddIgnoredFolder -- Time elapsed: 0.395 s
11:40:41 [2024-03-05T16:40:41.097Z] org.eclipse.egit.core.internal.indexdiff.IndexDiffCacheTest.testAddAndRemoveGitIgnoreFileToIgnoredDir -- Time elapsed: 0.500 s
11:40:41 [2024-03-05T16:40:41.097Z] org.eclipse.egit.core.internal.indexdiff.IndexDiffCacheTest.testModifyFileInIgnoredDir -- Time elapsed: 1.208 s
11:40:41 [2024-03-05T16:40:41.097Z] org.eclipse.egit.core.internal.indexdiff.IndexDiffCacheTest.testAddAndRemoveFileToIgnoredDir -- Time elapsed: 2.205 s
11:40:41 [2024-03-05T16:40:41.097Z] org.eclipse.egit.core.internal.indexdiff.IndexDiffCacheTest.testRemoveIgnoredFile -- Time elapsed: 1.411 s
11:40:41 [2024-03-05T16:40:41.097Z] Running org.eclipse.egit.core.internal.indexdiff.IndexDiffDataTest
11:40:41 [2024-03-05T16:40:41.354Z] Tests run: 2, Failures: 0, Errors: 0, Skipped: 0, Time elapsed: 0.059 s -- in org.eclipse.egit.core.internal.indexdiff.IndexDiffDataTest
11:40:41 [2024-03-05T16:40:41.354Z] org.eclipse.egit.core.internal.indexdiff.IndexDiffDataTest.testIsAnyPrefixOf -- Time elapsed: 0.030 s
11:40:41 [2024-03-05T16:40:41.354Z] org.eclipse.egit.core.internal.indexdiff.IndexDiffDataTest.testMergeIgnored -- Time elapsed: 0.027 s
11:40:41 [2024-03-05T16:40:41.354Z] Running org.eclipse.egit.core.internal.storage.CommitFileRevisionTest
11:40:41 [2024-03-05T16:40:41.611Z] Tests run: 4, Failures: 0, Errors: 0, Skipped: 0, Time elapsed: 0.246 s -- in org.eclipse.egit.core.internal.storage.CommitFileRevisionTest
11:40:41 [2024-03-05T16:40:41.611Z] org.eclipse.egit.core.internal.storage.CommitFileRevisionTest.testWithAttributesCheckedIn -- Time elapsed: 0.067 s
11:40:41 [2024-03-05T16:40:41.611Z] org.eclipse.egit.core.internal.storage.CommitFileRevisionTest.testWithAttributesCheckedInAndWithGlobalAttributes -- Time elapsed: 0.063 s
11:40:41 [2024-03-05T16:40:41.611Z] org.eclipse.egit.core.internal.storage.CommitFileRevisionTest.testWithAttributesNotCheckedIn -- Time elapsed: 0.054 s
11:40:41 [2024-03-05T16:40:41.611Z] org.eclipse.egit.core.internal.storage.CommitFileRevisionTest.testWithAttributesNotCheckedInButWithGlobalAttributes -- Time elapsed: 0.061 s
11:40:41 [2024-03-05T16:40:41.611Z] Running org.eclipse.egit.core.internal.storage.IndexFileRevisionTest
11:40:41 [2024-03-05T16:40:41.868Z] Tests run: 6, Failures: 0, Errors: 0, Skipped: 0, Time elapsed: 0.235 s -- in org.eclipse.egit.core.internal.storage.IndexFileRevisionTest
11:40:41 [2024-03-05T16:40:41.868Z] org.eclipse.egit.core.internal.storage.IndexFileRevisionTest.shouldUseFirstWhenNotSpecified -- Time elapsed: 0.052 s
11:40:41 [2024-03-05T16:40:41.868Z] org.eclipse.egit.core.internal.storage.IndexFileRevisionTest.stage3With2Missing -- Time elapsed: 0.033 s
11:40:41 [2024-03-05T16:40:41.868Z] org.eclipse.egit.core.internal.storage.IndexFileRevisionTest.missingEntry -- Time elapsed: 0.042 s
11:40:41 [2024-03-05T16:40:41.868Z] org.eclipse.egit.core.internal.storage.IndexFileRevisionTest.missingStage -- Time elapsed: 0.041 s
11:40:41 [2024-03-05T16:40:41.868Z] org.eclipse.egit.core.internal.storage.IndexFileRevisionTest.stage0WithoutOtherStages -- Time elapsed: 0.032 s
11:40:41 [2024-03-05T16:40:41.868Z] org.eclipse.egit.core.internal.storage.IndexFileRevisionTest.stage1WithOtherStages -- Time elapsed: 0.033 s
11:40:41 [2024-03-05T16:40:41.868Z] Running org.eclipse.egit.core.internal.util.ProjectUtilTest
11:40:42 [2024-03-05T16:40:42.125Z] OpenJDK 64-Bit Server VM warning: Sharing is only supported for boot loader classes because bootstrap classpath has been appended
11:40:44 [2024-03-05T16:40:44.056Z] Tests run: 14, Failures: 0, Errors: 0, Skipped: 0, Time elapsed: 2.416 s -- in org.eclipse.egit.core.internal.util.ProjectUtilTest
11:40:44 [2024-03-05T16:40:44.056Z] org.eclipse.egit.core.internal.util.ProjectUtilTest.testFindProjectFilesNested -- Time elapsed: 0.069 s
11:40:44 [2024-03-05T16:40:44.056Z] org.eclipse.egit.core.internal.util.ProjectUtilTest.testFindProjectFilesEmptyDir -- Time elapsed: 0.030 s
11:40:44 [2024-03-05T16:40:44.056Z] org.eclipse.egit.core.internal.util.ProjectUtilTest.testGetValidOpenProjects -- Time elapsed: 0.028 s
11:40:44 [2024-03-05T16:40:44.056Z] org.eclipse.egit.core.internal.util.ProjectUtilTest.testGetProjectsUnconnected -- Time elapsed: 0.028 s
11:40:44 [2024-03-05T16:40:44.056Z] org.eclipse.egit.core.internal.util.ProjectUtilTest.testGetValidOpenProjectsClosedProject -- Time elapsed: 0.029 s
11:40:44 [2024-03-05T16:40:44.056Z] org.eclipse.egit.core.internal.util.ProjectUtilTest.testCloseMissingProject -- Time elapsed: 1.073 s
11:40:44 [2024-03-05T16:40:44.056Z] org.eclipse.egit.core.internal.util.ProjectUtilTest.testFindProjectFiles -- Time elapsed: 0.208 s
11:40:44 [2024-03-05T16:40:44.056Z] org.eclipse.egit.core.internal.util.ProjectUtilTest.testFindProjectFilesNullDir -- Time elapsed: 0.152 s
11:40:44 [2024-03-05T16:40:44.056Z] org.eclipse.egit.core.internal.util.ProjectUtilTest.testGetProjects -- Time elapsed: 0.102 s
11:40:44 [2024-03-05T16:40:44.056Z] org.eclipse.egit.core.internal.util.ProjectUtilTest.testRefreshResource -- Time elapsed: 0.142 s
11:40:44 [2024-03-05T16:40:44.056Z] org.eclipse.egit.core.internal.util.ProjectUtilTest.testGetNestedProjectsContains -- Time elapsed: 0.180 s
11:40:44 [2024-03-05T16:40:44.056Z] org.eclipse.egit.core.internal.util.ProjectUtilTest.testFindContainer -- Time elapsed: 0.102 s
11:40:44 [2024-03-05T16:40:44.056Z] org.eclipse.egit.core.internal.util.ProjectUtilTest.testGetProjectsContains -- Time elapsed: 0.100 s
11:40:44 [2024-03-05T16:40:44.056Z] org.eclipse.egit.core.internal.util.ProjectUtilTest.testRefreshRepositoryResources -- Time elapsed: 0.171 s
11:40:44 [2024-03-05T16:40:44.056Z] Running org.eclipse.egit.core.internal.util.RepositoryPathCheckerTest
11:40:44 [2024-03-05T16:40:44.332Z] Tests run: 7, Failures: 0, Errors: 0, Skipped: 1, Time elapsed: 0.005 s -- in org.eclipse.egit.core.internal.util.RepositoryPathCheckerTest
11:40:44 [2024-03-05T16:40:44.332Z] org.eclipse.egit.core.internal.util.RepositoryPathCheckerTest.testSSH -- Time elapsed: 0 s
11:40:44 [2024-03-05T16:40:44.332Z] org.eclipse.egit.core.internal.util.RepositoryPathCheckerTest.testLocalAbsoluteFileUnix -- Time elapsed: 0.001 s
11:40:44 [2024-03-05T16:40:44.332Z] org.eclipse.egit.core.internal.util.RepositoryPathCheckerTest.testFile -- Time elapsed: 0 s
11:40:44 [2024-03-05T16:40:44.332Z] org.eclipse.egit.core.internal.util.RepositoryPathCheckerTest.testHTTP -- Time elapsed: 0 s
11:40:44 [2024-03-05T16:40:44.332Z] org.eclipse.egit.core.internal.util.RepositoryPathCheckerTest skipped
11:40:44 [2024-03-05T16:40:44.332Z] org.eclipse.egit.core.internal.util.RepositoryPathCheckerTest.testLocalRelativePath -- Time elapsed: 0 s
11:40:44 [2024-03-05T16:40:44.332Z] org.eclipse.egit.core.internal.util.RepositoryPathCheckerTest.testFooBar -- Time elapsed: 0 s
11:40:44 [2024-03-05T16:40:44.332Z] Running org.eclipse.egit.core.internal.util.ResourceUtilTest
11:40:45 [2024-03-05T16:40:45.329Z] Tests run: 6, Failures: 0, Errors: 0, Skipped: 0, Time elapsed: 0.964 s -- in org.eclipse.egit.core.internal.util.ResourceUtilTest
11:40:45 [2024-03-05T16:40:45.330Z] org.eclipse.egit.core.internal.util.ResourceUtilTest.getFileForLocationShouldReturnExistingFileInCaseOfNestedNotClosedProject -- Time elapsed: 0.225 s
11:40:45 [2024-03-05T16:40:45.330Z] org.eclipse.egit.core.internal.util.ResourceUtilTest.getFileForLocationShouldNotUseFilesWithoutRepositoryMapping -- Time elapsed: 0.170 s
11:40:45 [2024-03-05T16:40:45.330Z] org.eclipse.egit.core.internal.util.ResourceUtilTest.getFileForLocationShouldReturnExistingFileInCaseOfNestedProject -- Time elapsed: 0.176 s
11:40:45 [2024-03-05T16:40:45.330Z] org.eclipse.egit.core.internal.util.ResourceUtilTest.getResourceForLocationShouldReturnNullForInexistentFile -- Time elapsed: 0.117 s
11:40:45 [2024-03-05T16:40:45.330Z] org.eclipse.egit.core.internal.util.ResourceUtilTest.getResourceForLocationShouldReturnFile -- Time elapsed: 0.123 s
11:40:45 [2024-03-05T16:40:45.330Z] org.eclipse.egit.core.internal.util.ResourceUtilTest.getResourceForLocationShouldReturnFolder -- Time elapsed: 0.152 s
11:40:45 [2024-03-05T16:40:45.330Z] Running org.eclipse.egit.core.op.ConfigureGerritAfterCloneMatcherTest
11:40:45 [2024-03-05T16:40:45.330Z] Tests run: 1, Failures: 0, Errors: 0, Skipped: 0, Time elapsed: 0.003 s -- in org.eclipse.egit.core.op.ConfigureGerritAfterCloneMatcherTest
11:40:45 [2024-03-05T16:40:45.330Z] org.eclipse.egit.core.op.ConfigureGerritAfterCloneMatcherTest.testMatches -- Time elapsed: 0.001 s
11:40:45 [2024-03-05T16:40:45.330Z] Running org.eclipse.egit.core.project.RepositoryMappingTest
11:40:50 [2024-03-05T16:40:50.618Z] Tests run: 8, Failures: 0, Errors: 0, Skipped: 0, Time elapsed: 4.628 s -- in org.eclipse.egit.core.project.RepositoryMappingTest
11:40:50 [2024-03-05T16:40:50.618Z] org.eclipse.egit.core.project.RepositoryMappingTest.shouldReturnMappingForResourceInProject -- Time elapsed: 3.951 s
11:40:50 [2024-03-05T16:40:50.618Z] org.eclipse.egit.core.project.RepositoryMappingTest.shouldResolveRelativePathRelativeToContainer -- Time elapsed: 0.096 s
11:40:50 [2024-03-05T16:40:50.618Z] org.eclipse.egit.core.project.RepositoryMappingTest.shouldResolveAsRelativePath -- Time elapsed: 0.095 s
11:40:50 [2024-03-05T16:40:50.618Z] org.eclipse.egit.core.project.RepositoryMappingTest.shouldFindRepositoryMappingForRepository -- Time elapsed: 0.088 s
11:40:50 [2024-03-05T16:40:50.618Z] org.eclipse.egit.core.project.RepositoryMappingTest.shouldNotReturnMappingForResourceOutsideOfProject -- Time elapsed: 0.123 s
11:40:50 [2024-03-05T16:40:50.618Z] org.eclipse.egit.core.project.RepositoryMappingTest.shouldReturnMappingWhenPathIsRepository -- Time elapsed: 0.096 s
11:40:50 [2024-03-05T16:40:50.618Z] org.eclipse.egit.core.project.RepositoryMappingTest.shouldNotReturnMappingWhenPathIsOutsideRepository -- Time elapsed: 0.089 s
11:40:50 [2024-03-05T16:40:50.618Z] org.eclipse.egit.core.project.RepositoryMappingTest.shouldReturnMappingForPathOutsideOfProject -- Time elapsed: 0.087 s
11:40:50 [2024-03-05T16:40:50.618Z] Running org.eclipse.egit.core.storage.GitBlobStorageTest
11:40:50 [2024-03-05T16:40:50.618Z] Tests run: 6, Failures: 0, Errors: 0, Skipped: 0, Time elapsed: 0.298 s -- in org.eclipse.egit.core.storage.GitBlobStorageTest
11:40:50 [2024-03-05T16:40:50.618Z] org.eclipse.egit.core.storage.GitBlobStorageTest.testGitFileHistorySingleProjectOk -- Time elapsed: 0.078 s
11:40:50 [2024-03-05T16:40:50.618Z] org.eclipse.egit.core.storage.GitBlobStorageTest.testOk -- Time elapsed: 0.061 s
11:40:50 [2024-03-05T16:40:50.618Z] org.eclipse.egit.core.storage.GitBlobStorageTest.testFailNotFound -- Time elapsed: 0.036 s
11:40:50 [2024-03-05T16:40:50.618Z] org.eclipse.egit.core.storage.GitBlobStorageTest.testFailWrongType -- Time elapsed: 0.031 s
11:40:50 [2024-03-05T16:40:50.618Z] org.eclipse.egit.core.storage.GitBlobStorageTest.testFailCorrupt -- Time elapsed: 0.056 s
11:40:50 [2024-03-05T16:40:50.618Z] org.eclipse.egit.core.storage.GitBlobStorageTest.testFailCorrupt2 -- Time elapsed: 0.034 s
11:40:50 [2024-03-05T16:40:50.618Z] Running org.eclipse.egit.core.synchronize.ChangeTest
11:40:50 [2024-03-05T16:40:50.618Z] Tests run: 8, Failures: 0, Errors: 0, Skipped: 0, Time elapsed: 0.003 s -- in org.eclipse.egit.core.synchronize.ChangeTest
11:40:50 [2024-03-05T16:40:50.618Z] org.eclipse.egit.core.synchronize.ChangeTest.shouldNotBeEqualWhenObjectIdsAreDifferent -- Time elapsed: 0.001 s
11:40:50 [2024-03-05T16:40:50.618Z] org.eclipse.egit.core.synchronize.ChangeTest.shouldNotBeEqualWithDifferentType -- Time elapsed: 0 s
11:40:50 [2024-03-05T16:40:50.618Z] org.eclipse.egit.core.synchronize.ChangeTest.shouldNotBeEqualWhenOneRemoteObjectIsNull -- Time elapsed: 0 s
11:40:50 [2024-03-05T16:40:50.618Z] org.eclipse.egit.core.synchronize.ChangeTest.shouldBeEqualWhenBothIdsAreNull -- Time elapsed: 0 s
11:40:50 [2024-03-05T16:40:50.618Z] org.eclipse.egit.core.synchronize.ChangeTest.shouldBeEqualWhenBothObjectIdsAreTheSame -- Time elapsed: 0 s
11:40:50 [2024-03-05T16:40:50.618Z] org.eclipse.egit.core.synchronize.ChangeTest.shouldBeEqualWhenBothObjectIdsAndRemoteIdsAreSame -- Time elapsed: 0 s
11:40:50 [2024-03-05T16:40:50.618Z] org.eclipse.egit.core.synchronize.ChangeTest.shouldNotBeEqualWithNullReference -- Time elapsed: 0 s
11:40:50 [2024-03-05T16:40:50.618Z] org.eclipse.egit.core.synchronize.ChangeTest.shouldNotBeEqualWhenOneObjectIdIsNull -- Time elapsed: 0 s
11:40:50 [2024-03-05T16:40:50.618Z] Running org.eclipse.egit.core.synchronize.GitCommitsModelCacheTest
11:40:53 [2024-03-05T16:40:53.932Z] Tests run: 14, Failures: 0, Errors: 0, Skipped: 0, Time elapsed: 3.406 s -- in org.eclipse.egit.core.synchronize.GitCommitsModelCacheTest
11:40:53 [2024-03-05T16:40:53.932Z] org.eclipse.egit.core.synchronize.GitCommitsModelCacheTest.shouldListAllTypeOfChangesInsideSeparateFoldersInOneCommit -- Time elapsed: 3.055 s
11:40:53 [2024-03-05T16:40:53.932Z] org.eclipse.egit.core.synchronize.GitCommitsModelCacheTest.shouldListAdditionOrDeletionInsideFolderInCommit -- Time elapsed: 0.026 s
11:40:53 [2024-03-05T16:40:53.932Z] org.eclipse.egit.core.synchronize.GitCommitsModelCacheTest.shouldListAdditionsOrDeletionsInsideFolderInCommit -- Time elapsed: 0.024 s
11:40:53 [2024-03-05T16:40:53.932Z] org.eclipse.egit.core.synchronize.GitCommitsModelCacheTest.shouldListChangeInsideFolderInCommit -- Time elapsed: 0.043 s
11:40:53 [2024-03-05T16:40:53.932Z] org.eclipse.egit.core.synchronize.GitCommitsModelCacheTest.shouldListChangesInsideFolderInCommit -- Time elapsed: 0.028 s
11:40:53 [2024-03-05T16:40:53.932Z] org.eclipse.egit.core.synchronize.GitCommitsModelCacheTest.shouldListAllTypeOfChangesInOneCommit -- Time elapsed: 0.024 s
11:40:53 [2024-03-05T16:40:53.932Z] org.eclipse.egit.core.synchronize.GitCommitsModelCacheTest.shouldApplyPathFilter -- Time elapsed: 0.039 s
11:40:53 [2024-03-05T16:40:53.932Z] org.eclipse.egit.core.synchronize.GitCommitsModelCacheTest.shouldListAllTypeOfChangesInsideFolderInOneCommit -- Time elapsed: 0.029 s
11:40:53 [2024-03-05T16:40:53.932Z] org.eclipse.egit.core.synchronize.GitCommitsModelCacheTest.shouldListChangesInsideSeparateFoldersInCommit -- Time elapsed: 0.030 s
11:40:53 [2024-03-05T16:40:53.933Z] org.eclipse.egit.core.synchronize.GitCommitsModelCacheTest.shouldListAdditionOrDeletionInCommit -- Time elapsed: 0.028 s
11:40:53 [2024-03-05T16:40:53.933Z] org.eclipse.egit.core.synchronize.GitCommitsModelCacheTest.shouldListAdditionsOrDeletionsInsideSeparateFoldersInCommit -- Time elapsed: 0.024 s
11:40:53 [2024-03-05T16:40:53.933Z] org.eclipse.egit.core.synchronize.GitCommitsModelCacheTest.shouldNotListEmptyCommits -- Time elapsed: 0.015 s
11:40:53 [2024-03-05T16:40:53.933Z] org.eclipse.egit.core.synchronize.GitCommitsModelCacheTest.shouldReturnEmptyListForSameSrcAndDstCommit -- Time elapsed: 0.016 s
11:40:53 [2024-03-05T16:40:53.933Z] org.eclipse.egit.core.synchronize.GitCommitsModelCacheTest.shouldListChangeInCommit -- Time elapsed: 0.023 s
11:40:53 [2024-03-05T16:40:53.933Z] Running org.eclipse.egit.core.synchronize.GitResourceVariantComparatorTest
11:40:53 [2024-03-05T16:40:53.933Z] [main] WARN org.eclipse.jgit.lib.Repository - close() called when useCnt is already zero for Repository[/home/jenkins/agent/workspace/egit/repo/org.eclipse.egit.core.test/target/work/data/.git]
11:40:54 [2024-03-05T16:40:54.190Z] [main] WARN org.eclipse.jgit.lib.Repository - close() called when useCnt is already zero for Repository[/home/jenkins/agent/workspace/egit/repo/org.eclipse.egit.core.test/target/work/data/.git]
11:40:54 [2024-03-05T16:40:54.448Z] [main] WARN org.eclipse.jgit.lib.Repository - close() called when useCnt is already zero for Repository[/home/jenkins/agent/workspace/egit/repo/org.eclipse.egit.core.test/target/work/data/.git]
11:40:54 [2024-03-05T16:40:54.705Z] [main] WARN org.eclipse.jgit.lib.Repository - close() called when useCnt is already zero for Repository[/home/jenkins/agent/workspace/egit/repo/org.eclipse.egit.core.test/target/work/data/.git]
11:40:54 [2024-03-05T16:40:54.961Z] [main] WARN org.eclipse.jgit.lib.Repository - close() called when useCnt is already zero for Repository[/home/jenkins/agent/workspace/egit/repo/org.eclipse.egit.core.test/target/work/data/.git]
11:40:55 [2024-03-05T16:40:55.217Z] [main] WARN org.eclipse.jgit.lib.Repository - close() called when useCnt is already zero for Repository[/home/jenkins/agent/workspace/egit/repo/org.eclipse.egit.core.test/target/work/data/.git]
11:40:55 [2024-03-05T16:40:55.218Z] [main] WARN org.eclipse.jgit.lib.Repository - close() called when useCnt is already zero for Repository[/home/jenkins/agent/workspace/egit/repo/org.eclipse.egit.core.test/target/work/data/.git]
11:40:55 [2024-03-05T16:40:55.474Z] [main] WARN org.eclipse.jgit.lib.Repository - close() called when useCnt is already zero for Repository[/home/jenkins/agent/workspace/egit/repo/org.eclipse.egit.core.test/target/work/data/.git]
11:40:55 [2024-03-05T16:40:55.731Z] [main] WARN org.eclipse.jgit.lib.Repository - close() called when useCnt is already zero for Repository[/home/jenkins/agent/workspace/egit/repo/org.eclipse.egit.core.test/target/work/data/.git]
11:40:55 [2024-03-05T16:40:55.988Z] [main] WARN org.eclipse.jgit.lib.Repository - close() called when useCnt is already zero for Repository[/home/jenkins/agent/workspace/egit/repo/org.eclipse.egit.core.test/target/work/data/.git]
11:40:55 [2024-03-05T16:40:55.988Z] [main] WARN org.eclipse.jgit.lib.Repository - close() called when useCnt is already zero for Repository[/home/jenkins/agent/workspace/egit/repo/org.eclipse.egit.core.test/target/work/data/.git]
11:40:56 [2024-03-05T16:40:56.245Z] [main] WARN org.eclipse.jgit.lib.Repository - close() called when useCnt is already zero for Repository[/home/jenkins/agent/workspace/egit/repo/org.eclipse.egit.core.test/target/work/data/.git]
11:40:56 [2024-03-05T16:40:56.502Z] [main] WARN org.eclipse.jgit.lib.Repository - close() called when useCnt is already zero for Repository[/home/jenkins/agent/workspace/egit/repo/org.eclipse.egit.core.test/target/work/data/.git]
11:40:56 [2024-03-05T16:40:56.760Z] [main] WARN org.eclipse.jgit.lib.Repository - close() called when useCnt is already zero for Repository[/home/jenkins/agent/workspace/egit/repo/org.eclipse.egit.core.test/target/work/data/.git]
11:40:57 [2024-03-05T16:40:57.017Z] [main] WARN org.eclipse.jgit.lib.Repository - close() called when useCnt is already zero for Repository[/home/jenkins/agent/workspace/egit/repo/org.eclipse.egit.core.test/target/work/data/.git]
11:40:57 [2024-03-05T16:40:57.017Z] [main] WARN org.eclipse.jgit.lib.Repository - close() called when useCnt is already zero for Repository[/home/jenkins/agent/workspace/egit/repo/org.eclipse.egit.core.test/target/work/data/.git]
11:40:57 [2024-03-05T16:40:57.274Z] [main] WARN org.eclipse.jgit.lib.Repository - close() called when useCnt is already zero for Repository[/home/jenkins/agent/workspace/egit/repo/org.eclipse.egit.core.test/target/work/data/.git]
11:40:57 [2024-03-05T16:40:57.530Z] [main] WARN org.eclipse.jgit.lib.Repository - close() called when useCnt is already zero for Repository[/home/jenkins/agent/workspace/egit/repo/org.eclipse.egit.core.test/target/work/data/.git]
11:40:57 [2024-03-05T16:40:57.788Z] [main] WARN org.eclipse.jgit.lib.Repository - close() called when useCnt is already zero for Repository[/home/jenkins/agent/workspace/egit/repo/org.eclipse.egit.core.test/target/work/data/.git]
11:40:57 [2024-03-05T16:40:57.788Z] Tests run: 19, Failures: 0, Errors: 0, Skipped: 0, Time elapsed: 4.179 s -- in org.eclipse.egit.core.synchronize.GitResourceVariantComparatorTest
11:40:57 [2024-03-05T16:40:57.788Z] org.eclipse.egit.core.synchronize.GitResourceVariantComparatorTest.shouldReturnFalseWhenRemoteDoesNotExist2 -- Time elapsed: 0.224 s
11:40:57 [2024-03-05T16:40:57.788Z] org.eclipse.egit.core.synchronize.GitResourceVariantComparatorTest.shouldReturnFalseWhenComparingContainerAndContainer -- Time elapsed: 0.412 s
11:40:57 [2024-03-05T16:40:57.788Z] org.eclipse.egit.core.synchronize.GitResourceVariantComparatorTest.shouldReturnFalseWhenComparingRemoteVariantContainerWithFile -- Time elapsed: 0.214 s
11:40:57 [2024-03-05T16:40:57.788Z] org.eclipse.egit.core.synchronize.GitResourceVariantComparatorTest.shouldReturnFalseWhenShortContentIsDifferent -- Time elapsed: 0.324 s
11:40:57 [2024-03-05T16:40:57.788Z] org.eclipse.egit.core.synchronize.GitResourceVariantComparatorTest.shouldReturnFalseWhenLongContentLengthIsDifferent -- Time elapsed: 0.207 s
11:40:57 [2024-03-05T16:40:57.788Z] org.eclipse.egit.core.synchronize.GitResourceVariantComparatorTest.shouldReturnFalseWhenComparingFileAndContainer -- Time elapsed: 0.189 s
11:40:57 [2024-03-05T16:40:57.788Z] org.eclipse.egit.core.synchronize.GitResourceVariantComparatorTest.shouldReturnFalseWhenContentLengthIsDifferent -- Time elapsed: 0.188 s
11:40:57 [2024-03-05T16:40:57.788Z] org.eclipse.egit.core.synchronize.GitResourceVariantComparatorTest.shouldReturnFalseWhenRemoteDoesNotExist -- Time elapsed: 0.186 s
11:40:57 [2024-03-05T16:40:57.788Z] org.eclipse.egit.core.synchronize.GitResourceVariantComparatorTest.shouldReturnFalseWhenComparingRemoteVariantFileWithContainer -- Time elapsed: 0.197 s
11:40:57 [2024-03-05T16:40:57.788Z] org.eclipse.egit.core.synchronize.GitResourceVariantComparatorTest.shouldReturnTrueWhenComparingContainerAndContainer -- Time elapsed: 0.196 s
11:40:57 [2024-03-05T16:40:57.788Z] org.eclipse.egit.core.synchronize.GitResourceVariantComparatorTest.shouldReturnTrueWhenComparingRemoteVariantContainerWithContainer -- Time elapsed: 0.208 s
11:40:57 [2024-03-05T16:40:57.788Z] org.eclipse.egit.core.synchronize.GitResourceVariantComparatorTest.shouldReturnFalseWhenComparingRemoteVariantWithDifferentObjectId -- Time elapsed: 0.209 s
11:40:57 [2024-03-05T16:40:57.789Z] org.eclipse.egit.core.synchronize.GitResourceVariantComparatorTest.shouldReturnTrueWhenShortContentIsDifferent -- Time elapsed: 0.212 s
11:40:57 [2024-03-05T16:40:57.789Z] org.eclipse.egit.core.synchronize.GitResourceVariantComparatorTest.shouldReturnFalseWhenRemoteVariantDoesntExist -- Time elapsed: 0.209 s
11:40:57 [2024-03-05T16:40:57.789Z] org.eclipse.egit.core.synchronize.GitResourceVariantComparatorTest.shouldReturnTrueWhenLongContentLengthIsDifferent -- Time elapsed: 0.200 s
11:40:57 [2024-03-05T16:40:57.789Z] org.eclipse.egit.core.synchronize.GitResourceVariantComparatorTest.shouldReturnFalseWhenComparingRemoteVariantContainerWithContainer -- Time elapsed: 0.196 s
11:40:57 [2024-03-05T16:40:57.789Z] org.eclipse.egit.core.synchronize.GitResourceVariantComparatorTest.shouldReturnTrueWhenComparingRemoteVariant -- Time elapsed: 0.188 s
11:40:57 [2024-03-05T16:40:57.789Z] org.eclipse.egit.core.synchronize.GitResourceVariantComparatorTest.shouldReturnFalseWhenLongContentIsDifferent -- Time elapsed: 0.215 s
11:40:57 [2024-03-05T16:40:57.789Z] org.eclipse.egit.core.synchronize.GitResourceVariantComparatorTest.shouldReturnFalseWhenBaseDoesntExist -- Time elapsed: 0.200 s
11:40:57 [2024-03-05T16:40:57.789Z] Running org.eclipse.egit.core.synchronize.GitResourceVariantTreeSubscriberTest
11:40:57 [2024-03-05T16:40:57.789Z] [main] WARN org.eclipse.jgit.lib.Repository - close() called when useCnt is already zero for Repository[/home/jenkins/agent/workspace/egit/repo/org.eclipse.egit.core.test/target/work/data/.git]
11:40:58 [2024-03-05T16:40:58.046Z] [main] WARN org.eclipse.jgit.lib.Repository - close() called when useCnt is already zero for Repository[/home/jenkins/agent/workspace/egit/repo/org.eclipse.egit.core.test/target/work/data/.git]
11:40:58 [2024-03-05T16:40:58.046Z] [main] WARN org.eclipse.jgit.lib.Repository - close() called when useCnt is already zero for Repository[/home/jenkins/agent/workspace/egit/repo/org.eclipse.egit.core.test/target/work/data/.git]
11:40:58 [2024-03-05T16:40:58.046Z] Tests run: 3, Failures: 0, Errors: 0, Skipped: 0, Time elapsed: 0.359 s -- in org.eclipse.egit.core.synchronize.GitResourceVariantTreeSubscriberTest
11:40:58 [2024-03-05T16:40:58.046Z] org.eclipse.egit.core.synchronize.GitResourceVariantTreeSubscriberTest.testSyncBranchAndMaster -- Time elapsed: 0.126 s
11:40:58 [2024-03-05T16:40:58.046Z] org.eclipse.egit.core.synchronize.GitResourceVariantTreeSubscriberTest.testSyncMasterAndBranch -- Time elapsed: 0.115 s
11:40:58 [2024-03-05T16:40:58.046Z] org.eclipse.egit.core.synchronize.GitResourceVariantTreeSubscriberTest.testSyncLocalAndBranch -- Time elapsed: 0.117 s
11:40:58 [2024-03-05T16:40:58.046Z] Running org.eclipse.egit.core.synchronize.GitResourceVariantTreeTest
11:40:58 [2024-03-05T16:40:58.303Z] [main] WARN org.eclipse.jgit.lib.Repository - close() called when useCnt is already zero for Repository[/home/jenkins/agent/workspace/egit/repo/org.eclipse.egit.core.test/target/work/data/.git]
11:40:58 [2024-03-05T16:40:58.560Z] [main] WARN org.eclipse.jgit.lib.Repository - close() called when useCnt is already zero for Repository[/home/jenkins/agent/workspace/egit/repo/org.eclipse.egit.core.test/target/work/data/.git]
11:40:58 [2024-03-05T16:40:58.817Z] [main] WARN org.eclipse.jgit.lib.Repository - close() called when useCnt is already zero for Repository[/home/jenkins/agent/workspace/egit/repo/org.eclipse.egit.core.test/target/work/data/.git]
11:40:59 [2024-03-05T16:40:59.073Z] [main] WARN org.eclipse.jgit.lib.Repository - close() called when useCnt is already zero for Repository[/home/jenkins/agent/workspace/egit/repo/org.eclipse.egit.core.test/target/work/data/.git]
11:40:59 [2024-03-05T16:40:59.330Z] [main] WARN org.eclipse.jgit.lib.Repository - close() called when useCnt is already zero for Repository[/home/jenkins/agent/workspace/egit/repo/org.eclipse.egit.core.test/target/work/data/.git]
11:40:59 [2024-03-05T16:40:59.587Z] [main] WARN org.eclipse.jgit.lib.Repository - close() called when useCnt is already zero for Repository[/home/jenkins/agent/workspace/egit/repo/org.eclipse.egit.core.test/target/work/data/.git]
11:40:59 [2024-03-05T16:40:59.845Z] [main] WARN org.eclipse.jgit.lib.Repository - close() called when useCnt is already zero for Repository[/home/jenkins/agent/workspace/egit/repo/org.eclipse.egit.core.test/target/work/data/.git]
11:40:59 [2024-03-05T16:40:59.845Z] Tests run: 7, Failures: 0, Errors: 0, Skipped: 0, Time elapsed: 1.671 s -- in org.eclipse.egit.core.synchronize.GitResourceVariantTreeTest
11:40:59 [2024-03-05T16:40:59.845Z] org.eclipse.egit.core.synchronize.GitResourceVariantTreeTest.shouldReturnNullResourceVariant2 -- Time elapsed: 0.271 s
11:40:59 [2024-03-05T16:40:59.845Z] org.eclipse.egit.core.synchronize.GitResourceVariantTreeTest.shouldReturnOneRoot -- Time elapsed: 0.205 s
11:40:59 [2024-03-05T16:40:59.845Z] org.eclipse.egit.core.synchronize.GitResourceVariantTreeTest.shouldReturnTwoRoots -- Time elapsed: 0.219 s
11:40:59 [2024-03-05T16:40:59.845Z] org.eclipse.egit.core.synchronize.GitResourceVariantTreeTest.shoulReturnSameResourceVariant -- Time elapsed: 0.212 s
11:40:59 [2024-03-05T16:40:59.845Z] org.eclipse.egit.core.synchronize.GitResourceVariantTreeTest.shouldReturnNullResourceVariant -- Time elapsed: 0.220 s
11:40:59 [2024-03-05T16:40:59.845Z] org.eclipse.egit.core.synchronize.GitResourceVariantTreeTest.shouldNotReturnNullOnSameResouceVariant -- Time elapsed: 0.254 s
11:40:59 [2024-03-05T16:40:59.845Z] org.eclipse.egit.core.synchronize.GitResourceVariantTreeTest.shouldReturnDifferentResourceVariant -- Time elapsed: 0.289 s
11:40:59 [2024-03-05T16:40:59.845Z] Running org.eclipse.egit.core.synchronize.GitSubscriberMergeContextTest
11:41:00 [2024-03-05T16:41:00.102Z] [main] WARN org.eclipse.jgit.lib.Repository - close() called when useCnt is already zero for Repository[/home/jenkins/agent/workspace/egit/repo/org.eclipse.egit.core.test/target/work/data/.git]
11:41:02 [2024-03-05T16:41:02.624Z] [main] WARN org.eclipse.jgit.lib.Repository - close() called when useCnt is already zero for Repository[/home/jenkins/agent/workspace/egit/repo/org.eclipse.egit.core.test/target/work/data/.git]
11:41:02 [2024-03-05T16:41:02.624Z] [main] WARN org.eclipse.jgit.lib.Repository - close() called when useCnt is already zero for Repository[/home/jenkins/agent/workspace/egit/repo/org.eclipse.egit.core.test/target/work/data/.git]
11:41:02 [2024-03-05T16:41:02.881Z] [main] WARN org.eclipse.jgit.lib.Repository - close() called when useCnt is already zero for Repository[/home/jenkins/agent/workspace/egit/repo/org.eclipse.egit.core.test/target/work/data/.git]
11:41:03 [2024-03-05T16:41:03.445Z] [main] WARN org.eclipse.jgit.lib.Repository - close() called when useCnt is already zero for Repository[/home/jenkins/agent/workspace/egit/repo/org.eclipse.egit.core.test/target/work/data/.git]
11:41:04 [2024-03-05T16:41:04.007Z] [main] WARN org.eclipse.jgit.lib.Repository - close() called when useCnt is already zero for Repository[/home/jenkins/agent/workspace/egit/repo/org.eclipse.egit.core.test/target/work/data/.git]
11:41:04 [2024-03-05T16:41:04.007Z] Tests run: 6, Failures: 0, Errors: 0, Skipped: 0, Time elapsed: 4.203 s -- in org.eclipse.egit.core.synchronize.GitSubscriberMergeContextTest
11:41:04 [2024-03-05T16:41:04.007Z] org.eclipse.egit.core.synchronize.GitSubscriberMergeContextTest.mergeWithConflict -- Time elapsed: 0.430 s
11:41:04 [2024-03-05T16:41:04.007Z] org.eclipse.egit.core.synchronize.GitSubscriberMergeContextTest.mergeModelWithDeletedFileNoConflict -- Time elapsed: 1.925 s
11:41:04 [2024-03-05T16:41:04.007Z] org.eclipse.egit.core.synchronize.GitSubscriberMergeContextTest.mergeNoConflict -- Time elapsed: 0.487 s
11:41:04 [2024-03-05T16:41:04.007Z] org.eclipse.egit.core.synchronize.GitSubscriberMergeContextTest.mergeModelWithConflict -- Time elapsed: 0.387 s
11:41:04 [2024-03-05T16:41:04.007Z] org.eclipse.egit.core.synchronize.GitSubscriberMergeContextTest.markAsMerged -- Time elapsed: 0.519 s
11:41:04 [2024-03-05T16:41:04.007Z] org.eclipse.egit.core.synchronize.GitSubscriberMergeContextTest.mergeModelNoConflict -- Time elapsed: 0.452 s
11:41:04 [2024-03-05T16:41:04.007Z] Running org.eclipse.egit.core.synchronize.GitSubscriberResourceMappingContextTest
11:41:10 [2024-03-05T16:41:10.628Z] Tests run: 11, Failures: 0, Errors: 0, Skipped: 0, Time elapsed: 5.964 s -- in org.eclipse.egit.core.synchronize.GitSubscriberResourceMappingContextTest
11:41:10 [2024-03-05T16:41:10.629Z] org.eclipse.egit.core.synchronize.GitSubscriberResourceMappingContextTest.hasRemoteChanges -- Time elapsed: 0.241 s
11:41:10 [2024-03-05T16:41:10.629Z] org.eclipse.egit.core.synchronize.GitSubscriberResourceMappingContextTest.hasRemoteChangeInNewFile -- Time elapsed: 0.155 s
11:41:10 [2024-03-05T16:41:10.629Z] org.eclipse.egit.core.synchronize.GitSubscriberResourceMappingContextTest.hasLocalChangeWithFileRemoval -- Time elapsed: 0.138 s
11:41:10 [2024-03-05T16:41:10.629Z] org.eclipse.egit.core.synchronize.GitSubscriberResourceMappingContextTest.hasDeletion -- Time elapsed: 0.147 s
11:41:10 [2024-03-05T16:41:10.629Z] org.eclipse.egit.core.synchronize.GitSubscriberResourceMappingContextTest.hasLocalChangeInNewFolder -- Time elapsed: 0.154 s
11:41:10 [2024-03-05T16:41:10.629Z] org.eclipse.egit.core.synchronize.GitSubscriberResourceMappingContextTest.hasRemoteChangeInNewFolder -- Time elapsed: 0.161 s
11:41:10 [2024-03-05T16:41:10.629Z] org.eclipse.egit.core.synchronize.GitSubscriberResourceMappingContextTest.hasNestedDeletion -- Time elapsed: 0.156 s
11:41:10 [2024-03-05T16:41:10.629Z] org.eclipse.egit.core.synchronize.GitSubscriberResourceMappingContextTest.hasLocalChange -- Time elapsed: 0.156 s
11:41:10 [2024-03-05T16:41:10.629Z] org.eclipse.egit.core.synchronize.GitSubscriberResourceMappingContextTest.hasLocalChangeWhenRefreshingParentFolder -- Time elapsed: 4.320 s
11:41:10 [2024-03-05T16:41:10.629Z] org.eclipse.egit.core.synchronize.GitSubscriberResourceMappingContextTest.hasLocalAndRemoteChangeInSubFolder -- Time elapsed: 0.176 s
11:41:10 [2024-03-05T16:41:10.629Z] org.eclipse.egit.core.synchronize.GitSubscriberResourceMappingContextTest.hasLocalAndRemoteChange -- Time elapsed: 0.158 s
11:41:10 [2024-03-05T16:41:10.629Z] Running org.eclipse.egit.core.synchronize.StagedChangeCacheTest
11:41:10 [2024-03-05T16:41:10.629Z] Tests run: 12, Failures: 0, Errors: 0, Skipped: 0, Time elapsed: 0.179 s -- in org.eclipse.egit.core.synchronize.StagedChangeCacheTest
11:41:10 [2024-03-05T16:41:10.629Z] org.eclipse.egit.core.synchronize.StagedChangeCacheTest.shouldListSingleWorkspaceChangeInFolder -- Time elapsed: 0.016 s
11:41:10 [2024-03-05T16:41:10.629Z] org.eclipse.egit.core.synchronize.StagedChangeCacheTest.shouldListTwoWorkspaceAdditionsInFolder -- Time elapsed: 0.016 s
11:41:10 [2024-03-05T16:41:10.629Z] org.eclipse.egit.core.synchronize.StagedChangeCacheTest.shouldListTwoWorkspaceDeletionsInFolder -- Time elapsed: 0.016 s
11:41:10 [2024-03-05T16:41:10.629Z] org.eclipse.egit.core.synchronize.StagedChangeCacheTest.shouldListTwoWorkspaceChanges -- Time elapsed: 0.020 s
11:41:10 [2024-03-05T16:41:10.629Z] org.eclipse.egit.core.synchronize.StagedChangeCacheTest.shouldListSingleWorkspaceDeletion -- Time elapsed: 0.014 s
11:41:10 [2024-03-05T16:41:10.629Z] org.eclipse.egit.core.synchronize.StagedChangeCacheTest.shouldListSingleWorkspaceAdditionInFolder -- Time elapsed: 0.011 s
11:41:10 [2024-03-05T16:41:10.629Z] org.eclipse.egit.core.synchronize.StagedChangeCacheTest.shouldListTwoWorkspaceDeletions -- Time elapsed: 0.013 s
11:41:10 [2024-03-05T16:41:10.629Z] org.eclipse.egit.core.synchronize.StagedChangeCacheTest.shouldListSingleWorkspaceDeletionInFolder -- Time elapsed: 0.015 s
11:41:10 [2024-03-05T16:41:10.629Z] org.eclipse.egit.core.synchronize.StagedChangeCacheTest.shouldListSingleWorkspaceChange -- Time elapsed: 0.015 s
11:41:10 [2024-03-05T16:41:10.629Z] org.eclipse.egit.core.synchronize.StagedChangeCacheTest.shouldListTwoWorkspaceChangesInFolder -- Time elapsed: 0.018 s
11:41:10 [2024-03-05T16:41:10.629Z] org.eclipse.egit.core.synchronize.StagedChangeCacheTest.shouldListSingleWorkspaceAddition -- Time elapsed: 0.012 s
11:41:10 [2024-03-05T16:41:10.629Z] org.eclipse.egit.core.synchronize.StagedChangeCacheTest.shouldListTwoWorkspaceAdditions -- Time elapsed: 0.011 s
11:41:10 [2024-03-05T16:41:10.629Z] Running org.eclipse.egit.core.synchronize.ThreeWayDiffEntryTest
11:41:10 [2024-03-05T16:41:10.629Z] Tests run: 9, Failures: 0, Errors: 0, Skipped: 0, Time elapsed: 0.087 s -- in org.eclipse.egit.core.synchronize.ThreeWayDiffEntryTest
11:41:10 [2024-03-05T16:41:10.629Z] org.eclipse.egit.core.synchronize.ThreeWayDiffEntryTest.shouldListIncomingDelete -- Time elapsed: 0.009 s
11:41:10 [2024-03-05T16:41:10.629Z] org.eclipse.egit.core.synchronize.ThreeWayDiffEntryTest.shouldListIncomingModify -- Time elapsed: 0.012 s
11:41:10 [2024-03-05T16:41:10.629Z] org.eclipse.egit.core.synchronize.ThreeWayDiffEntryTest.shouldListIncomingAddition -- Time elapsed: 0.008 s
11:41:10 [2024-03-05T16:41:10.629Z] org.eclipse.egit.core.synchronize.ThreeWayDiffEntryTest.shouldListConflictingChange -- Time elapsed: 0.009 s
11:41:10 [2024-03-05T16:41:10.629Z] org.eclipse.egit.core.synchronize.ThreeWayDiffEntryTest.shouldListConflictingModify -- Time elapsed: 0.011 s
11:41:10 [2024-03-05T16:41:10.630Z] org.eclipse.egit.core.synchronize.ThreeWayDiffEntryTest.shouldListOutgoingAddition -- Time elapsed: 0.008 s
11:41:10 [2024-03-05T16:41:10.630Z] org.eclipse.egit.core.synchronize.ThreeWayDiffEntryTest.shouldListOutgoingDelete -- Time elapsed: 0.008 s
11:41:10 [2024-03-05T16:41:10.630Z] org.eclipse.egit.core.synchronize.ThreeWayDiffEntryTest.shouldListOutgoingModify -- Time elapsed: 0.012 s
11:41:10 [2024-03-05T16:41:10.630Z] org.eclipse.egit.core.synchronize.ThreeWayDiffEntryTest.shouldListConflictingChange2 -- Time elapsed: 0.008 s
11:41:10 [2024-03-05T16:41:10.630Z] Running org.eclipse.egit.core.synchronize.WorkingTreeChangeCacheTest
11:41:10 [2024-03-05T16:41:10.630Z] Tests run: 13, Failures: 0, Errors: 0, Skipped: 0, Time elapsed: 0.173 s -- in org.eclipse.egit.core.synchronize.WorkingTreeChangeCacheTest
11:41:10 [2024-03-05T16:41:10.630Z] org.eclipse.egit.core.synchronize.WorkingTreeChangeCacheTest.shouldListSingleWorkspaceChangeInFolder -- Time elapsed: 0.012 s
11:41:10 [2024-03-05T16:41:10.630Z] org.eclipse.egit.core.synchronize.WorkingTreeChangeCacheTest.shouldListTwoWorkspaceAdditionsInFolder -- Time elapsed: 0.009 s
11:41:10 [2024-03-05T16:41:10.630Z] org.eclipse.egit.core.synchronize.WorkingTreeChangeCacheTest.shouldListTwoWorkspaceDeletionsInFolder -- Time elapsed: 0.011 s
11:41:10 [2024-03-05T16:41:10.630Z] org.eclipse.egit.core.synchronize.WorkingTreeChangeCacheTest.shouldListTwoWorkspaceChanges -- Time elapsed: 0.012 s
11:41:10 [2024-03-05T16:41:10.630Z] org.eclipse.egit.core.synchronize.WorkingTreeChangeCacheTest.shouldListSingleWorkspaceDeletion -- Time elapsed: 0.011 s
11:41:10 [2024-03-05T16:41:10.630Z] org.eclipse.egit.core.synchronize.WorkingTreeChangeCacheTest.shouldListSingleWorkspaceAdditionInFolder -- Time elapsed: 0.011 s
11:41:10 [2024-03-05T16:41:10.630Z] org.eclipse.egit.core.synchronize.WorkingTreeChangeCacheTest.shouldNotListIgnoredFile -- Time elapsed: 0.010 s
11:41:10 [2024-03-05T16:41:10.630Z] org.eclipse.egit.core.synchronize.WorkingTreeChangeCacheTest.shouldListTwoWorkspaceDeletions -- Time elapsed: 0.018 s
11:41:10 [2024-03-05T16:41:10.630Z] org.eclipse.egit.core.synchronize.WorkingTreeChangeCacheTest.shouldListSingleWorkspaceDeletionInFolder -- Time elapsed: 0.011 s
11:41:10 [2024-03-05T16:41:10.630Z] org.eclipse.egit.core.synchronize.WorkingTreeChangeCacheTest.shouldListSingleWorkspaceChange -- Time elapsed: 0.010 s
11:41:10 [2024-03-05T16:41:10.630Z] org.eclipse.egit.core.synchronize.WorkingTreeChangeCacheTest.shouldListTwoWorkspaceChangesInFolder -- Time elapsed: 0.034 s
11:41:10 [2024-03-05T16:41:10.630Z] org.eclipse.egit.core.synchronize.WorkingTreeChangeCacheTest.shouldListSingleWorkspaceAddition -- Time elapsed: 0.010 s
11:41:10 [2024-03-05T16:41:10.630Z] org.eclipse.egit.core.synchronize.WorkingTreeChangeCacheTest.shouldListTwoWorkspaceAdditions -- Time elapsed: 0.011 s
11:41:10 [2024-03-05T16:41:10.630Z] Running org.eclipse.egit.core.synchronize.dto.GitSynchronizeDataTest
11:41:10 [2024-03-05T16:41:10.630Z] Tests run: 1, Failures: 0, Errors: 0, Skipped: 0, Time elapsed: 0.148 s -- in org.eclipse.egit.core.synchronize.dto.GitSynchronizeDataTest
11:41:10 [2024-03-05T16:41:10.630Z] org.eclipse.egit.core.synchronize.dto.GitSynchronizeDataTest.shouldReturnDstMergeForRemoteBranch -- Time elapsed: 0.148 s
11:41:10 [2024-03-05T16:41:10.630Z] Running org.eclipse.egit.core.test.CommitUtilTest
11:41:10 [2024-03-05T16:41:10.630Z] [main] WARN org.eclipse.jgit.lib.Repository - close() called when useCnt is already zero for Repository[/home/jenkins/agent/workspace/egit/repo/org.eclipse.egit.core.test/target/work/data/Project-1/.git]
11:41:10 [2024-03-05T16:41:10.630Z] Tests run: 1, Failures: 0, Errors: 0, Skipped: 0, Time elapsed: 0.180 s -- in org.eclipse.egit.core.test.CommitUtilTest
11:41:10 [2024-03-05T16:41:10.630Z] org.eclipse.egit.core.test.CommitUtilTest.sortCommits -- Time elapsed: 0.180 s
11:41:10 [2024-03-05T16:41:10.630Z] Running org.eclipse.egit.core.test.EclipseGitProgressTransformerTest
11:41:13 [2024-03-05T16:41:13.149Z] Tests run: 3, Failures: 0, Errors: 0, Skipped: 0, Time elapsed: 2.082 s -- in org.eclipse.egit.core.test.EclipseGitProgressTransformerTest
11:41:13 [2024-03-05T16:41:13.150Z] org.eclipse.egit.core.test.EclipseGitProgressTransformerTest.testUnboundedMonitor -- Time elapsed: 1.072 s
11:41:13 [2024-03-05T16:41:13.150Z] org.eclipse.egit.core.test.EclipseGitProgressTransformerTest.testBoundedMonitor -- Time elapsed: 0.001 s
11:41:13 [2024-03-05T16:41:13.150Z] org.eclipse.egit.core.test.EclipseGitProgressTransformerTest.testUnboundedMonitorFastUpdate -- Time elapsed: 1.001 s
11:41:13 [2024-03-05T16:41:13.150Z] Running org.eclipse.egit.core.test.FileDeleteHookTest
11:41:13 [2024-03-05T16:41:13.150Z] 
11:41:13 [2024-03-05T16:41:13.150Z] !ENTRY org.eclipse.egit.core 2 0 2024-03-05 16:41:12.896
11:41:13 [2024-03-05T16:41:13.150Z] !MESSAGE Could not automatically stage the deletion of '/home/jenkins/agent/workspace/egit/repo/org.eclipse.egit.core.test/target/work/data/Project-1/file1' in the git index.
11:41:13 [2024-03-05T16:41:13.150Z] [main] WARN org.eclipse.jgit.lib.Repository - close() called when useCnt is already zero for Repository[/home/jenkins/agent/workspace/egit/repo/org.eclipse.egit.core.test/target/work/data/.git]
11:41:13 [2024-03-05T16:41:13.150Z] Tests run: 1, Failures: 0, Errors: 0, Skipped: 0, Time elapsed: 0.287 s -- in org.eclipse.egit.core.test.FileDeleteHookTest
11:41:13 [2024-03-05T16:41:13.150Z] org.eclipse.egit.core.test.FileDeleteHookTest.deleteTest -- Time elapsed: 0.286 s
11:41:13 [2024-03-05T16:41:13.150Z] Running org.eclipse.egit.core.test.GitProjectSetCapabilityTest
11:41:13 [2024-03-05T16:41:13.406Z] [main] WARN org.eclipse.jgit.lib.Repository - close() called when useCnt is already zero for Repository[/home/jenkins/agent/workspace/egit/tmp/egit.tmp/45fa47463f3e426ba3061cc0aad44854/LocalRepositoriesTests1/RepositoryRoot/x/.git]
11:41:13 [2024-03-05T16:41:13.683Z] [main] WARN org.eclipse.jgit.lib.Repository - close() called when useCnt is already zero for Repository[/home/jenkins/agent/workspace/egit/tmp/egit.tmp/45fa47463f3e426ba3061cc0aad44854/LocalRepositoriesTests4/RepositoryRoot/b/.git]
11:41:13 [2024-03-05T16:41:13.683Z] [main] WARN org.eclipse.jgit.lib.Repository - close() called when useCnt is already zero for Repository[/home/jenkins/agent/workspace/egit/tmp/egit.tmp/45fa47463f3e426ba3061cc0aad44854/LocalRepositoriesTests5/RepositoryRoot/x/.git]
11:41:13 [2024-03-05T16:41:13.683Z] [main] WARN org.eclipse.jgit.lib.Repository - close() called when useCnt is already zero for Repository[/home/jenkins/agent/workspace/egit/tmp/egit.tmp/45fa47463f3e426ba3061cc0aad44854/LocalRepositoriesTests5/RepositoryRoot/x_stable/.git]
11:41:13 [2024-03-05T16:41:13.940Z] Tests run: 6, Failures: 0, Errors: 0, Skipped: 0, Time elapsed: 0.736 s -- in org.eclipse.egit.core.test.GitProjectSetCapabilityTest
11:41:13 [2024-03-05T16:41:13.940Z] org.eclipse.egit.core.test.GitProjectSetCapabilityTest.testImportWithMultipleCallsForSameDestinationRepo -- Time elapsed: 0.238 s
11:41:13 [2024-03-05T16:41:13.940Z] org.eclipse.egit.core.test.GitProjectSetCapabilityTest.testImportFromRepoWithUrlOnlyDifferingInUserName -- Time elapsed: 0.036 s
11:41:13 [2024-03-05T16:41:13.940Z] org.eclipse.egit.core.test.GitProjectSetCapabilityTest.testExport -- Time elapsed: 0.090 s
11:41:13 [2024-03-05T16:41:13.940Z] org.eclipse.egit.core.test.GitProjectSetCapabilityTest.testImport -- Time elapsed: 0.210 s
11:41:13 [2024-03-05T16:41:13.940Z] org.eclipse.egit.core.test.GitProjectSetCapabilityTest.testImportWithDifferentBranchesOfSameRepo -- Time elapsed: 0.104 s
11:41:13 [2024-03-05T16:41:13.940Z] org.eclipse.egit.core.test.GitProjectSetCapabilityTest.testImportWhereRepoAlreadyExistsAtDifferentLocation -- Time elapsed: 0.056 s
11:41:13 [2024-03-05T16:41:13.940Z] Running org.eclipse.egit.core.test.GitURITest
11:41:13 [2024-03-05T16:41:13.940Z] Tests run: 6, Failures: 0, Errors: 0, Skipped: 0, Time elapsed: 0.003 s -- in org.eclipse.egit.core.test.GitURITest
11:41:13 [2024-03-05T16:41:13.940Z] org.eclipse.egit.core.test.GitURITest.testScmUriWithPath -- Time elapsed: 0.001 s
11:41:13 [2024-03-05T16:41:13.940Z] org.eclipse.egit.core.test.GitURITest.testInvalidScmUriForCVS -- Time elapsed: 0 s
11:41:13 [2024-03-05T16:41:13.940Z] org.eclipse.egit.core.test.GitURITest.testInvalidScmUriWithoutPath -- Time elapsed: 0 s
11:41:13 [2024-03-05T16:41:13.940Z] org.eclipse.egit.core.test.GitURITest.testScmUriWithPathAndTag -- Time elapsed: 0 s
11:41:13 [2024-03-05T16:41:13.940Z] org.eclipse.egit.core.test.GitURITest.testScmUriWithPathProjectAndTag -- Time elapsed: 0 s
11:41:13 [2024-03-05T16:41:13.940Z] org.eclipse.egit.core.test.GitURITest.testInvalidScmUriWithQuotationMarks -- Time elapsed: 0 s
11:41:13 [2024-03-05T16:41:13.940Z] Running org.eclipse.egit.core.test.HistoryTest
11:41:13 [2024-03-05T16:41:13.940Z] [main] WARN org.eclipse.jgit.lib.Repository - close() called when useCnt is already zero for Repository[/home/jenkins/agent/workspace/egit/repo/org.eclipse.egit.core.test/target/work/data/.git]
11:41:14 [2024-03-05T16:41:14.197Z] [main] WARN org.eclipse.jgit.lib.Repository - close() called when useCnt is already zero for Repository[/home/jenkins/agent/workspace/egit/repo/org.eclipse.egit.core.test/target/work/data/.git]
11:41:14 [2024-03-05T16:41:14.453Z] [main] WARN org.eclipse.jgit.lib.Repository - close() called when useCnt is already zero for Repository[/home/jenkins/agent/workspace/egit/repo/org.eclipse.egit.core.test/target/work/data/.git]
11:41:14 [2024-03-05T16:41:14.454Z] [main] WARN org.eclipse.jgit.lib.Repository - close() called when useCnt is already zero for Repository[/home/jenkins/agent/workspace/egit/repo/org.eclipse.egit.core.test/target/work/data/.git]
11:41:14 [2024-03-05T16:41:14.710Z] [main] WARN org.eclipse.jgit.lib.Repository - close() called when useCnt is already zero for Repository[/home/jenkins/agent/workspace/egit/repo/org.eclipse.egit.core.test/target/work/data/.git]
11:41:14 [2024-03-05T16:41:14.968Z] [main] WARN org.eclipse.jgit.lib.Repository - close() called when useCnt is already zero for Repository[/home/jenkins/agent/workspace/egit/repo/org.eclipse.egit.core.test/target/work/data/.git]
11:41:15 [2024-03-05T16:41:15.225Z] [main] WARN org.eclipse.jgit.lib.Repository - close() called when useCnt is already zero for Repository[/home/jenkins/agent/workspace/egit/repo/org.eclipse.egit.core.test/target/work/data/.git]
11:41:15 [2024-03-05T16:41:15.481Z] [main] WARN org.eclipse.jgit.lib.Repository - close() called when useCnt is already zero for Repository[/home/jenkins/agent/workspace/egit/repo/org.eclipse.egit.core.test/target/work/data/.git]
11:41:15 [2024-03-05T16:41:15.481Z] Tests run: 8, Failures: 0, Errors: 0, Skipped: 0, Time elapsed: 1.495 s -- in org.eclipse.egit.core.test.HistoryTest
11:41:15 [2024-03-05T16:41:15.481Z] org.eclipse.egit.core.test.HistoryTest.queryFile2Targets -- Time elapsed: 0.172 s
11:41:15 [2024-03-05T16:41:15.481Z] org.eclipse.egit.core.test.HistoryTest.queryFile2Contributors -- Time elapsed: 0.161 s
11:41:15 [2024-03-05T16:41:15.481Z] org.eclipse.egit.core.test.HistoryTest.queryFile1Contributors -- Time elapsed: 0.165 s
11:41:15 [2024-03-05T16:41:15.481Z] org.eclipse.egit.core.test.HistoryTest.queryHistoryThroughTeam -- Time elapsed: 0.172 s
11:41:15 [2024-03-05T16:41:15.481Z] org.eclipse.egit.core.test.HistoryTest.queryFile1FullHistory -- Time elapsed: 0.183 s
11:41:15 [2024-03-05T16:41:15.481Z] org.eclipse.egit.core.test.HistoryTest.queryFile2FullHistory -- Time elapsed: 0.288 s
11:41:15 [2024-03-05T16:41:15.481Z] org.eclipse.egit.core.test.HistoryTest.queryFile1Targets -- Time elapsed: 0.167 s
11:41:15 [2024-03-05T16:41:15.481Z] org.eclipse.egit.core.test.HistoryTest.querySingleRevisions -- Time elapsed: 0.186 s
11:41:15 [2024-03-05T16:41:15.481Z] Running org.eclipse.egit.core.test.LinkedResourcesTest
11:41:15 [2024-03-05T16:41:15.481Z] [main] WARN org.eclipse.jgit.lib.Repository - close() called when useCnt is already zero for Repository[/home/jenkins/agent/workspace/egit/tmp/egit.tmp/30bdabc707b444a394a89ae4ed332410/project2/.git]
11:41:15 [2024-03-05T16:41:15.481Z] [main] WARN org.eclipse.jgit.lib.Repository - close() called when useCnt is already zero for Repository[/home/jenkins/agent/workspace/egit/tmp/egit.tmp/30bdabc707b444a394a89ae4ed332410/FirstRepository/.git]
11:41:15 [2024-03-05T16:41:15.739Z] [main] WARN org.eclipse.jgit.lib.Repository - close() called when useCnt is already zero for Repository[/home/jenkins/agent/workspace/egit/tmp/egit.tmp/92372830fdb943558e6eede7c1a0d845/project2/.git]
11:41:15 [2024-03-05T16:41:15.739Z] [main] WARN org.eclipse.jgit.lib.Repository - close() called when useCnt is already zero for Repository[/home/jenkins/agent/workspace/egit/tmp/egit.tmp/92372830fdb943558e6eede7c1a0d845/FirstRepository/.git]
11:41:15 [2024-03-05T16:41:15.995Z] [main] WARN org.eclipse.jgit.lib.Repository - close() called when useCnt is already zero for Repository[/home/jenkins/agent/workspace/egit/tmp/egit.tmp/7cfdc99ee5ac43c798e46ccbc12fc73d/project2/.git]
11:41:15 [2024-03-05T16:41:15.995Z] [main] WARN org.eclipse.jgit.lib.Repository - close() called when useCnt is already zero for Repository[/home/jenkins/agent/workspace/egit/tmp/egit.tmp/7cfdc99ee5ac43c798e46ccbc12fc73d/FirstRepository/.git]
11:41:16 [2024-03-05T16:41:16.250Z] [main] WARN org.eclipse.jgit.lib.Repository - close() called when useCnt is already zero for Repository[/home/jenkins/agent/workspace/egit/tmp/egit.tmp/e05ab6a8230144868c6bc1c0102e7751/project2/.git]
11:41:16 [2024-03-05T16:41:16.250Z] [main] WARN org.eclipse.jgit.lib.Repository - close() called when useCnt is already zero for Repository[/home/jenkins/agent/workspace/egit/tmp/egit.tmp/e05ab6a8230144868c6bc1c0102e7751/FirstRepository/.git]
11:41:16 [2024-03-05T16:41:16.250Z] [main] WARN org.eclipse.jgit.lib.Repository - close() called when useCnt is already zero for Repository[/home/jenkins/agent/workspace/egit/tmp/egit.tmp/7b27c9332dfe40f681d2ba9fda1c062b/project2/.git]
11:41:16 [2024-03-05T16:41:16.250Z] [main] WARN org.eclipse.jgit.lib.Repository - close() called when useCnt is already zero for Repository[/home/jenkins/agent/workspace/egit/tmp/egit.tmp/7b27c9332dfe40f681d2ba9fda1c062b/FirstRepository/.git]
11:41:16 [2024-03-05T16:41:16.250Z] Tests run: 5, Failures: 0, Errors: 0, Skipped: 0, Time elapsed: 0.948 s -- in org.eclipse.egit.core.test.LinkedResourcesTest
11:41:16 [2024-03-05T16:41:16.250Z] org.eclipse.egit.core.test.LinkedResourcesTest.testLinkedResourcesIgnoredByContainerTreeIterator -- Time elapsed: 0.214 s
11:41:16 [2024-03-05T16:41:16.250Z] org.eclipse.egit.core.test.LinkedResourcesTest.testLinkedResourcesIgnoredByGitResourceDeltaVisitor -- Time elapsed: 0.161 s
11:41:16 [2024-03-05T16:41:16.250Z] org.eclipse.egit.core.test.LinkedResourcesTest.testLinkTargetsInSameRepositoryNotIgnoredByGitResourceDeltaVisitor -- Time elapsed: 0.157 s
11:41:16 [2024-03-05T16:41:16.250Z] org.eclipse.egit.core.test.LinkedResourcesTest.testLinkedResourcesIgnoredByIteratorService -- Time elapsed: 0.263 s
11:41:16 [2024-03-05T16:41:16.250Z] org.eclipse.egit.core.test.LinkedResourcesTest.testGitProviderCanHandleLinkedResources -- Time elapsed: 0.151 s
11:41:16 [2024-03-05T16:41:16.250Z] Running org.eclipse.egit.core.test.MergeWithPreferredStrategyTest
11:41:16 [2024-03-05T16:41:16.813Z] Tests run: 3, Failures: 0, Errors: 0, Skipped: 0, Time elapsed: 0.528 s -- in org.eclipse.egit.core.test.MergeWithPreferredStrategyTest
11:41:16 [2024-03-05T16:41:16.813Z] org.eclipse.egit.core.test.MergeWithPreferredStrategyTest.testStrategyCanBeOverridden -- Time elapsed: 0.169 s
11:41:16 [2024-03-05T16:41:16.813Z] org.eclipse.egit.core.test.MergeWithPreferredStrategyTest.testMergeUsesPreferredStrategy -- Time elapsed: 0.205 s
11:41:16 [2024-03-05T16:41:16.813Z] org.eclipse.egit.core.test.MergeWithPreferredStrategyTest.testMergeUsesPreferredStrategyRegisteredWithExplicitName -- Time elapsed: 0.153 s
11:41:16 [2024-03-05T16:41:16.813Z] Running org.eclipse.egit.core.test.PreferredMergeStrategyTest
11:41:16 [2024-03-05T16:41:16.813Z] 
11:41:16 [2024-03-05T16:41:16.813Z] !ENTRY org.eclipse.egit.core 4 0 2024-03-05 16:41:16.736
11:41:16 [2024-03-05T16:41:16.813Z] !MESSAGE The configuration of the preferred merge strategy is invalid. It refers to a merge strategy called "invalid value" which is not registered. The default recursive strategy will be used instead.
11:41:16 [2024-03-05T16:41:16.813Z] Tests run: 4, Failures: 0, Errors: 0, Skipped: 0, Time elapsed: 0.002 s -- in org.eclipse.egit.core.test.PreferredMergeStrategyTest
11:41:16 [2024-03-05T16:41:16.813Z] org.eclipse.egit.core.test.PreferredMergeStrategyTest.testGetPreferredMergeStrategyWhenInvalidPreference -- Time elapsed: 0.001 s
11:41:16 [2024-03-05T16:41:16.813Z] org.eclipse.egit.core.test.PreferredMergeStrategyTest.testGetPreferredMergeStrategyWhenValidPreference -- Time elapsed: 0 s
11:41:16 [2024-03-05T16:41:16.813Z] org.eclipse.egit.core.test.PreferredMergeStrategyTest.testGetPreferredMergeStrategyWhenNoPref -- Time elapsed: 0 s
11:41:16 [2024-03-05T16:41:16.813Z] org.eclipse.egit.core.test.PreferredMergeStrategyTest.testGetDefaultPreferredMergeStrategy -- Time elapsed: 0 s
11:41:16 [2024-03-05T16:41:16.813Z] Running org.eclipse.egit.core.test.ProjectReferenceTest
11:41:16 [2024-03-05T16:41:16.813Z] Tests run: 3, Failures: 0, Errors: 0, Skipped: 0, Time elapsed: 0 s -- in org.eclipse.egit.core.test.ProjectReferenceTest
11:41:16 [2024-03-05T16:41:16.814Z] org.eclipse.egit.core.test.ProjectReferenceTest.checkProject -- Time elapsed: 0 s
11:41:16 [2024-03-05T16:41:16.814Z] org.eclipse.egit.core.test.ProjectReferenceTest.checkBranch -- Time elapsed: 0 s
11:41:16 [2024-03-05T16:41:16.814Z] org.eclipse.egit.core.test.ProjectReferenceTest.checkUrl -- Time elapsed: 0 s
11:41:16 [2024-03-05T16:41:16.814Z] Running org.eclipse.egit.core.test.RepositoryCacheTest
11:41:16 [2024-03-05T16:41:16.814Z] [main] WARN org.eclipse.jgit.lib.Repository - close() called when useCnt is already zero for Repository[/home/jenkins/agent/workspace/egit/repo/org.eclipse.egit.core.test/target/work/data/.git]
11:41:16 [2024-03-05T16:41:16.814Z] [main] WARN org.eclipse.jgit.lib.Repository - close() called when useCnt is already zero for Repository[/home/jenkins/agent/workspace/egit/repo/org.eclipse.egit.core.test/target/work/data/.git]
11:41:17 [2024-03-05T16:41:17.084Z] [main] WARN org.eclipse.jgit.lib.Repository - close() called when useCnt is already zero for Repository[/home/jenkins/agent/workspace/egit/repo/org.eclipse.egit.core.test/target/work/data/.git]
11:41:17 [2024-03-05T16:41:17.084Z] [main] WARN org.eclipse.jgit.lib.Repository - close() called when useCnt is already zero for Repository[/home/jenkins/agent/workspace/egit/repo/org.eclipse.egit.core.test/target/work/data/.git]
11:41:17 [2024-03-05T16:41:17.084Z] Tests run: 4, Failures: 0, Errors: 0, Skipped: 0, Time elapsed: 0.229 s -- in org.eclipse.egit.core.test.RepositoryCacheTest
11:41:17 [2024-03-05T16:41:17.084Z] org.eclipse.egit.core.test.RepositoryCacheTest.findsRepositoryForOpenProject -- Time elapsed: 0.026 s
11:41:17 [2024-03-05T16:41:17.084Z] org.eclipse.egit.core.test.RepositoryCacheTest.shouldNotContainDeletedRepository -- Time elapsed: 0.025 s
11:41:17 [2024-03-05T16:41:17.084Z] org.eclipse.egit.core.test.RepositoryCacheTest.findsRepositoryForClosedProject -- Time elapsed: 0.037 s
11:41:17 [2024-03-05T16:41:17.084Z] org.eclipse.egit.core.test.RepositoryCacheTest.findsNestedRepositoryForClosedProject -- Time elapsed: 0.138 s
11:41:17 [2024-03-05T16:41:17.084Z] Running org.eclipse.egit.core.test.RevUtilsTest
11:41:17 [2024-03-05T16:41:17.084Z] [main] WARN org.eclipse.jgit.lib.Repository - close() called when useCnt is already zero for Repository[/home/jenkins/agent/workspace/egit/repo/org.eclipse.egit.core.test/target/work/data/.git]
11:41:17 [2024-03-05T16:41:17.084Z] Tests run: 1, Failures: 0, Errors: 0, Skipped: 0, Time elapsed: 0.039 s -- in org.eclipse.egit.core.test.RevUtilsTest
11:41:17 [2024-03-05T16:41:17.084Z] org.eclipse.egit.core.test.RevUtilsTest.isContainedInAnyRef -- Time elapsed: 0.039 s
11:41:17 [2024-03-05T16:41:17.084Z] Running org.eclipse.egit.core.test.SubmoduleAndContainerTreeIteratorTest
11:41:17 [2024-03-05T16:41:17.341Z] [main] WARN org.eclipse.jgit.lib.Repository - close() called when useCnt is already zero for Repository[/home/jenkins/agent/workspace/egit/tmp/egit.tmp/8da4db64ff8f4556ac45fded1bd0b9f7/child/.git]
11:41:17 [2024-03-05T16:41:17.341Z] [main] WARN org.eclipse.jgit.lib.Repository - close() called when useCnt is already zero for Repository[/home/jenkins/agent/workspace/egit/tmp/egit.tmp/8da4db64ff8f4556ac45fded1bd0b9f7/parent/.git]
11:41:17 [2024-03-05T16:41:17.598Z] [main] WARN org.eclipse.jgit.lib.Repository - close() called when useCnt is already zero for Repository[/home/jenkins/agent/workspace/egit/tmp/egit.tmp/70f014d2f78340bca67064209d4e12d5/child/.git]
11:41:17 [2024-03-05T16:41:17.598Z] [main] WARN org.eclipse.jgit.lib.Repository - close() called when useCnt is already zero for Repository[/home/jenkins/agent/workspace/egit/tmp/egit.tmp/70f014d2f78340bca67064209d4e12d5/parent/.git]
11:41:17 [2024-03-05T16:41:17.598Z] Tests run: 2, Failures: 0, Errors: 0, Skipped: 0, Time elapsed: 0.497 s -- in org.eclipse.egit.core.test.SubmoduleAndContainerTreeIteratorTest
11:41:17 [2024-03-05T16:41:17.598Z] org.eclipse.egit.core.test.SubmoduleAndContainerTreeIteratorTest.testCleanStateAfterInit -- Time elapsed: 0.294 s
11:41:17 [2024-03-05T16:41:17.598Z] org.eclipse.egit.core.test.SubmoduleAndContainerTreeIteratorTest.testCleanStateFirstCommit -- Time elapsed: 0.201 s
11:41:17 [2024-03-05T16:41:17.598Z] Running org.eclipse.egit.core.test.UtilsTest
11:41:17 [2024-03-05T16:41:17.598Z] Tests run: 1, Failures: 0, Errors: 0, Skipped: 0, Time elapsed: 0.002 s -- in org.eclipse.egit.core.test.UtilsTest
11:41:17 [2024-03-05T16:41:17.599Z] org.eclipse.egit.core.test.UtilsTest.testLineEndingNormalization -- Time elapsed: 0.001 s
11:41:17 [2024-03-05T16:41:17.599Z] Running org.eclipse.egit.core.test.internal.mapping.HistoryTest
11:41:17 [2024-03-05T16:41:17.855Z] Tests run: 8, Failures: 0, Errors: 0, Skipped: 0, Time elapsed: 0.308 s -- in org.eclipse.egit.core.test.internal.mapping.HistoryTest
11:41:17 [2024-03-05T16:41:17.855Z] org.eclipse.egit.core.test.internal.mapping.HistoryTest.testIndexRevision -- Time elapsed: 0.038 s
11:41:17 [2024-03-05T16:41:17.855Z] org.eclipse.egit.core.test.internal.mapping.HistoryTest.testIndexRevisionSecondCommit -- Time elapsed: 0.039 s
11:41:17 [2024-03-05T16:41:17.855Z] org.eclipse.egit.core.test.internal.mapping.HistoryTest.testShallowHistory -- Time elapsed: 0.048 s
11:41:17 [2024-03-05T16:41:17.855Z] org.eclipse.egit.core.test.internal.mapping.HistoryTest.testSingleRevision_1 -- Time elapsed: 0.035 s
11:41:17 [2024-03-05T16:41:17.855Z] org.eclipse.egit.core.test.internal.mapping.HistoryTest.testSingleRevision_2 -- Time elapsed: 0.037 s
11:41:17 [2024-03-05T16:41:17.855Z] org.eclipse.egit.core.test.internal.mapping.HistoryTest.testSingleRevision_3 -- Time elapsed: 0.034 s
11:41:17 [2024-03-05T16:41:17.855Z] org.eclipse.egit.core.test.internal.mapping.HistoryTest.testDeepHistory_A -- Time elapsed: 0.034 s
11:41:17 [2024-03-05T16:41:17.855Z] org.eclipse.egit.core.test.internal.mapping.HistoryTest.testDeepHistory_B -- Time elapsed: 0.042 s
11:41:17 [2024-03-05T16:41:17.855Z] Running org.eclipse.egit.core.test.op.AddOperationTest
11:41:19 [2024-03-05T16:41:19.222Z] [main] WARN org.eclipse.jgit.lib.Repository - close() called when useCnt is already zero for Repository[/home/jenkins/agent/workspace/egit/repo/org.eclipse.egit.core.test/target/work/data/Project-1/.git]
11:41:20 [2024-03-05T16:41:20.589Z] [main] WARN org.eclipse.jgit.lib.Repository - close() called when useCnt is already zero for Repository[/home/jenkins/agent/workspace/egit/repo/org.eclipse.egit.core.test/target/work/data/Project-1/.git]
11:41:20 [2024-03-05T16:41:20.589Z] [main] WARN org.eclipse.jgit.lib.Repository - close() called when useCnt is already zero for Repository[/home/jenkins/agent/workspace/egit/repo/org.eclipse.egit.core.test/target/work/data/Project-1/.git]
11:41:20 [2024-03-05T16:41:20.589Z] [main] WARN org.eclipse.jgit.lib.Repository - close() called when useCnt is already zero for Repository[/home/jenkins/agent/workspace/egit/repo/org.eclipse.egit.core.test/target/work/data/Project-1/.git]
11:41:20 [2024-03-05T16:41:20.589Z] Tests run: 4, Failures: 0, Errors: 0, Skipped: 0, Time elapsed: 2.639 s -- in org.eclipse.egit.core.test.op.AddOperationTest
11:41:20 [2024-03-05T16:41:20.589Z] org.eclipse.egit.core.test.op.AddOperationTest.testAddFilesInFolder -- Time elapsed: 1.220 s
11:41:20 [2024-03-05T16:41:20.589Z] org.eclipse.egit.core.test.op.AddOperationTest.testAddFile -- Time elapsed: 1.156 s
11:41:20 [2024-03-05T16:41:20.589Z] org.eclipse.egit.core.test.op.AddOperationTest.testTrackFilesInFolder -- Time elapsed: 0.132 s
11:41:20 [2024-03-05T16:41:20.589Z] org.eclipse.egit.core.test.op.AddOperationTest.testTrackFile -- Time elapsed: 0.131 s
11:41:20 [2024-03-05T16:41:20.589Z] Running org.eclipse.egit.core.test.op.BranchOperationTest
11:41:20 [2024-03-05T16:41:20.589Z] [main] WARN org.eclipse.jgit.lib.Repository - close() called when useCnt is already zero for Repository[/home/jenkins/agent/workspace/egit/repo/org.eclipse.egit.core.test/target/work/data/.git]
11:41:20 [2024-03-05T16:41:20.589Z] Tests run: 1, Failures: 0, Errors: 0, Skipped: 0, Time elapsed: 0.041 s -- in org.eclipse.egit.core.test.op.BranchOperationTest
11:41:20 [2024-03-05T16:41:20.589Z] org.eclipse.egit.core.test.op.BranchOperationTest.testBranchOperation -- Time elapsed: 0.040 s
11:41:20 [2024-03-05T16:41:20.589Z] Running org.eclipse.egit.core.test.op.CloneOperationTest
11:41:20 [2024-03-05T16:41:20.589Z] [main] WARN org.eclipse.jgit.lib.Repository - close() called when useCnt is already zero for Repository[/home/jenkins/agent/workspace/egit/tmp/egit.tmp/65bc39fd79af4e988a8e64fbfd39006e/Repository1/.git]
11:41:20 [2024-03-05T16:41:20.846Z] [main] WARN org.eclipse.jgit.lib.Repository - close() called when useCnt is already zero for Repository[/home/jenkins/agent/workspace/egit/tmp/egit.tmp/a64898fa58ac43fc93271feb8905c35a/Repository1/.git]
11:41:20 [2024-03-05T16:41:20.846Z] [main] WARN org.eclipse.jgit.lib.Repository - close() called when useCnt is already zero for Repository[/home/jenkins/agent/workspace/egit/tmp/egit.tmp/5cae9db6114a4a559e9cfa9e1995cc46/Repository1/.git]
11:41:20 [2024-03-05T16:41:20.846Z] [main] WARN org.eclipse.jgit.lib.Repository - close() called when useCnt is already zero for Repository[/home/jenkins/agent/workspace/egit/tmp/egit.tmp/a00b4e967d8f427e97b66d34ef9c418c/Repository1/.git]
11:41:20 [2024-03-05T16:41:20.846Z] [main] WARN org.eclipse.jgit.lib.Repository - close() called when useCnt is already zero for Repository[/home/jenkins/agent/workspace/egit/tmp/egit.tmp/af66920b67144ce3a5f8513a6720baa4/Repository1/.git]
11:41:20 [2024-03-05T16:41:20.846Z] [main] WARN org.eclipse.jgit.lib.Repository - close() called when useCnt is already zero for Repository[/home/jenkins/agent/workspace/egit/tmp/egit.tmp/0cd249dfaf7c4205a85ed30b15dfc982/Repository1/.git]
11:41:20 [2024-03-05T16:41:20.846Z] Tests run: 6, Failures: 0, Errors: 0, Skipped: 0, Time elapsed: 0.303 s -- in org.eclipse.egit.core.test.op.CloneOperationTest
11:41:20 [2024-03-05T16:41:20.846Z] org.eclipse.egit.core.test.op.CloneOperationTest.testClone -- Time elapsed: 0.044 s
11:41:20 [2024-03-05T16:41:20.846Z] org.eclipse.egit.core.test.op.CloneOperationTest.testCloneBranch -- Time elapsed: 0.044 s
11:41:20 [2024-03-05T16:41:20.846Z] org.eclipse.egit.core.test.op.CloneOperationTest.testConfigureFetchAfterCloneTask -- Time elapsed: 0.068 s
11:41:20 [2024-03-05T16:41:20.846Z] org.eclipse.egit.core.test.op.CloneOperationTest.testConfigurePushAfterCloneTask -- Time elapsed: 0.066 s
11:41:20 [2024-03-05T16:41:20.846Z] org.eclipse.egit.core.test.op.CloneOperationTest.testCloneTag -- Time elapsed: 0.036 s
11:41:20 [2024-03-05T16:41:20.846Z] org.eclipse.egit.core.test.op.CloneOperationTest.testSimplePostCloneTask -- Time elapsed: 0.044 s
11:41:20 [2024-03-05T16:41:20.846Z] Running org.eclipse.egit.core.test.op.CommitOperationTest
11:41:21 [2024-03-05T16:41:21.102Z] [main] WARN org.eclipse.jgit.lib.Repository - close() called when useCnt is already zero for Repository[/home/jenkins/agent/workspace/egit/repo/org.eclipse.egit.core.test/target/work/data/Project-1/.git]
11:41:21 [2024-03-05T16:41:21.359Z] [main] WARN org.eclipse.jgit.lib.Repository - close() called when useCnt is already zero for Repository[/home/jenkins/agent/workspace/egit/repo/org.eclipse.egit.core.test/target/work/data/Project-1/.git]
11:41:21 [2024-03-05T16:41:21.359Z] [main] WARN org.eclipse.jgit.lib.Repository - close() called when useCnt is already zero for Repository[/home/jenkins/agent/workspace/egit/repo/org.eclipse.egit.core.test/target/work/data/Project-1/.git]
11:41:21 [2024-03-05T16:41:21.616Z] [main] WARN org.eclipse.jgit.lib.Repository - close() called when useCnt is already zero for Repository[/home/jenkins/agent/workspace/egit/repo/org.eclipse.egit.core.test/target/work/data/Project-1/.git]
11:41:21 [2024-03-05T16:41:21.873Z] [main] WARN org.eclipse.jgit.lib.Repository - close() called when useCnt is already zero for Repository[/home/jenkins/agent/workspace/egit/repo/org.eclipse.egit.core.test/target/work/data/Project-1/.git]
11:41:21 [2024-03-05T16:41:21.873Z] [main] WARN org.eclipse.jgit.lib.Repository - close() called when useCnt is already zero for Repository[/home/jenkins/agent/workspace/egit/repo/org.eclipse.egit.core.test/target/work/data/Project-1/.git]
11:41:22 [2024-03-05T16:41:22.128Z] [main] WARN org.eclipse.jgit.lib.Repository - close() called when useCnt is already zero for Repository[/home/jenkins/agent/workspace/egit/repo/org.eclipse.egit.core.test/target/work/data/Project-1/.git]
11:41:22 [2024-03-05T16:41:22.128Z] Tests run: 7, Failures: 0, Errors: 0, Skipped: 0, Time elapsed: 1.086 s -- in org.eclipse.egit.core.test.op.CommitOperationTest
11:41:22 [2024-03-05T16:41:22.128Z] org.eclipse.egit.core.test.op.CommitOperationTest.testCommitAddedToIndexDeletedInWorkspace -- Time elapsed: 0.160 s
11:41:22 [2024-03-05T16:41:22.128Z] org.eclipse.egit.core.test.op.CommitOperationTest.testCommitEmptiedTree -- Time elapsed: 0.152 s
11:41:22 [2024-03-05T16:41:22.128Z] org.eclipse.egit.core.test.op.CommitOperationTest.testCommitAll -- Time elapsed: 0.141 s
11:41:22 [2024-03-05T16:41:22.128Z] org.eclipse.egit.core.test.op.CommitOperationTest.testCommitUntracked -- Time elapsed: 0.189 s
11:41:22 [2024-03-05T16:41:22.129Z] org.eclipse.egit.core.test.op.CommitOperationTest.testCommitIndexSubset -- Time elapsed: 0.148 s
11:41:22 [2024-03-05T16:41:22.129Z] org.eclipse.egit.core.test.op.CommitOperationTest.testCommitStaged -- Time elapsed: 0.150 s
11:41:22 [2024-03-05T16:41:22.129Z] org.eclipse.egit.core.test.op.CommitOperationTest.testCommitWithStaging -- Time elapsed: 0.144 s
11:41:22 [2024-03-05T16:41:22.129Z] Running org.eclipse.egit.core.test.op.ConnectProviderOperationTest
11:41:22 [2024-03-05T16:41:22.389Z] Tests run: 6, Failures: 0, Errors: 0, Skipped: 0, Time elapsed: 0.274 s -- in org.eclipse.egit.core.test.op.ConnectProviderOperationTest
11:41:22 [2024-03-05T16:41:22.389Z] org.eclipse.egit.core.test.op.ConnectProviderOperationTest.testNewUnsharedFile -- Time elapsed: 0.064 s
11:41:22 [2024-03-05T16:41:22.389Z] org.eclipse.egit.core.test.op.ConnectProviderOperationTest.testNewRepositoryCaseSensitive -- Time elapsed: 0.029 s
11:41:22 [2024-03-05T16:41:22.389Z] org.eclipse.egit.core.test.op.ConnectProviderOperationTest.testAutoIgnoresDerivedFolder -- Time elapsed: 0.061 s
11:41:22 [2024-03-05T16:41:22.389Z] org.eclipse.egit.core.test.op.ConnectProviderOperationTest.testNoAutoIgnoresDerivedFolder -- Time elapsed: 0.059 s
11:41:22 [2024-03-05T16:41:22.389Z] org.eclipse.egit.core.test.op.ConnectProviderOperationTest.testNoRepository -- Time elapsed: 0.028 s
11:41:22 [2024-03-05T16:41:22.389Z] org.eclipse.egit.core.test.op.ConnectProviderOperationTest.testNewRepository -- Time elapsed: 0.033 s
11:41:22 [2024-03-05T16:41:22.389Z] Running org.eclipse.egit.core.test.op.CreatePatchOperationTest
11:41:22 [2024-03-05T16:41:22.389Z] [main] WARN org.eclipse.jgit.lib.Repository - close() called when useCnt is already zero for Repository[/home/jenkins/agent/workspace/egit/repo/org.eclipse.egit.core.test/target/work/data/Project-1/.git]
11:41:22 [2024-03-05T16:41:22.721Z] [main] WARN org.eclipse.jgit.lib.Repository - close() called when useCnt is already zero for Repository[/home/jenkins/agent/workspace/egit/repo/org.eclipse.egit.core.test/target/work/data/Project-1/.git]
11:41:23 [2024-03-05T16:41:23.000Z] [main] WARN org.eclipse.jgit.lib.Repository - close() called when useCnt is already zero for Repository[/home/jenkins/agent/workspace/egit/repo/org.eclipse.egit.core.test/target/work/data/Project-1/.git]
11:41:23 [2024-03-05T16:41:23.258Z] [main] WARN org.eclipse.jgit.lib.Repository - close() called when useCnt is already zero for Repository[/home/jenkins/agent/workspace/egit/repo/org.eclipse.egit.core.test/target/work/data/repo/.git]
11:41:23 [2024-03-05T16:41:23.515Z] [main] WARN org.eclipse.jgit.lib.Repository - close() called when useCnt is already zero for Repository[/home/jenkins/agent/workspace/egit/repo/org.eclipse.egit.core.test/target/work/data/Project-1/.git]
11:41:23 [2024-03-05T16:41:23.515Z] [main] WARN org.eclipse.jgit.lib.Repository - close() called when useCnt is already zero for Repository[/home/jenkins/agent/workspace/egit/repo/org.eclipse.egit.core.test/target/work/data/Project-1/.git]
11:41:23 [2024-03-05T16:41:23.771Z] [main] WARN org.eclipse.jgit.lib.Repository - close() called when useCnt is already zero for Repository[/home/jenkins/agent/workspace/egit/repo/org.eclipse.egit.core.test/target/work/data/Project-1/.git]
11:41:23 [2024-03-05T16:41:23.771Z] [main] WARN org.eclipse.jgit.lib.Repository - close() called when useCnt is already zero for Repository[/home/jenkins/agent/workspace/egit/repo/org.eclipse.egit.core.test/target/work/data/Project-1/.git]
11:41:24 [2024-03-05T16:41:24.027Z] [main] WARN org.eclipse.jgit.lib.Repository - close() called when useCnt is already zero for Repository[/home/jenkins/agent/workspace/egit/repo/org.eclipse.egit.core.test/target/work/data/Project-1/.git]
11:41:24 [2024-03-05T16:41:24.027Z] [main] WARN org.eclipse.jgit.lib.Repository - close() called when useCnt is already zero for Repository[/home/jenkins/agent/workspace/egit/repo/org.eclipse.egit.core.test/target/work/data/Project-1/.git]
11:41:24 [2024-03-05T16:41:24.284Z] [main] WARN org.eclipse.jgit.lib.Repository - close() called when useCnt is already zero for Repository[/home/jenkins/agent/workspace/egit/repo/org.eclipse.egit.core.test/target/work/data/Project-1/.git]
11:41:24 [2024-03-05T16:41:24.579Z] [main] WARN org.eclipse.jgit.lib.Repository - close() called when useCnt is already zero for Repository[/home/jenkins/agent/workspace/egit/repo/org.eclipse.egit.core.test/target/work/data/Project-1/.git]
11:41:24 [2024-03-05T16:41:24.579Z] [main] WARN org.eclipse.jgit.lib.Repository - close() called when useCnt is already zero for Repository[/home/jenkins/agent/workspace/egit/repo/org.eclipse.egit.core.test/target/work/data/Project-1/.git]
11:41:24 [2024-03-05T16:41:24.859Z] [main] WARN org.eclipse.jgit.lib.Repository - close() called when useCnt is already zero for Repository[/home/jenkins/agent/workspace/egit/repo/org.eclipse.egit.core.test/target/work/data/Project-1/.git]
11:41:24 [2024-03-05T16:41:24.859Z] [main] WARN org.eclipse.jgit.lib.Repository - close() called when useCnt is already zero for Repository[/home/jenkins/agent/workspace/egit/repo/org.eclipse.egit.core.test/target/work/data/Project-1/.git]
11:41:24 [2024-03-05T16:41:24.859Z] Tests run: 15, Failures: 0, Errors: 0, Skipped: 0, Time elapsed: 2.540 s -- in org.eclipse.egit.core.test.op.CreatePatchOperationTest
11:41:24 [2024-03-05T16:41:24.859Z] org.eclipse.egit.core.test.op.CreatePatchOperationTest.testSimplePatch -- Time elapsed: 0.182 s
11:41:24 [2024-03-05T16:41:24.859Z] org.eclipse.egit.core.test.op.CreatePatchOperationTest.testNullMonitor -- Time elapsed: 0.171 s
11:41:24 [2024-03-05T16:41:24.859Z] org.eclipse.egit.core.test.op.CreatePatchOperationTest.testWorkspacePatchForWorkingDir -- Time elapsed: 0.169 s
11:41:24 [2024-03-05T16:41:24.859Z] org.eclipse.egit.core.test.op.CreatePatchOperationTest.testComputeWorkspacePathRepoAboveProject -- Time elapsed: 0.452 s
11:41:24 [2024-03-05T16:41:24.859Z] org.eclipse.egit.core.test.op.CreatePatchOperationTest.testNullRepo -- Time elapsed: 0.135 s
11:41:24 [2024-03-05T16:41:24.859Z] org.eclipse.egit.core.test.op.CreatePatchOperationTest.testWorkspacePatchForCommit -- Time elapsed: 0.147 s
11:41:24 [2024-03-05T16:41:24.859Z] org.eclipse.egit.core.test.op.CreatePatchOperationTest.testUpdateWorkspacePatchPrefixes -- Time elapsed: 0.141 s
11:41:24 [2024-03-05T16:41:24.859Z] org.eclipse.egit.core.test.op.CreatePatchOperationTest.testComputeWorkspacePath -- Time elapsed: 0.133 s
11:41:24 [2024-03-05T16:41:24.859Z] org.eclipse.egit.core.test.op.CreatePatchOperationTest.testExecuteFirst -- Time elapsed: 0.144 s
11:41:24 [2024-03-05T16:41:24.859Z] org.eclipse.egit.core.test.op.CreatePatchOperationTest.testSimplePatchNoNewlineAtEnd -- Time elapsed: 0.151 s
11:41:24 [2024-03-05T16:41:24.860Z] org.eclipse.egit.core.test.op.CreatePatchOperationTest.testNullCommit -- Time elapsed: 0.135 s
11:41:24 [2024-03-05T16:41:24.860Z] org.eclipse.egit.core.test.op.CreatePatchOperationTest.testOnelineHeaderPatch -- Time elapsed: 0.143 s
11:41:24 [2024-03-05T16:41:24.860Z] org.eclipse.egit.core.test.op.CreatePatchOperationTest.testSimpleGitPatch -- Time elapsed: 0.142 s
11:41:24 [2024-03-05T16:41:24.860Z] org.eclipse.egit.core.test.op.CreatePatchOperationTest.testSuggestName -- Time elapsed: 0.153 s
11:41:24 [2024-03-05T16:41:24.860Z] org.eclipse.egit.core.test.op.CreatePatchOperationTest.testFirstCommit -- Time elapsed: 0.141 s
11:41:24 [2024-03-05T16:41:24.860Z] Running org.eclipse.egit.core.test.op.DeletePathsOperationTest
11:41:25 [2024-03-05T16:41:25.116Z] [main] WARN org.eclipse.jgit.lib.Repository - close() called when useCnt is already zero for Repository[/home/jenkins/agent/workspace/egit/tmp/egit.tmp/b94e2789103f4dd490f72e36ea0f40c4/Repository1/.git]
11:41:25 [2024-03-05T16:41:25.116Z] [main] WARN org.eclipse.jgit.lib.Repository - close() called when useCnt is already zero for Repository[/home/jenkins/agent/workspace/egit/tmp/egit.tmp/5b9f207703034199be9279dc421a4138/Repository1/.git]
11:41:25 [2024-03-05T16:41:25.116Z] Tests run: 2, Failures: 0, Errors: 0, Skipped: 0, Time elapsed: 0.254 s -- in org.eclipse.egit.core.test.op.DeletePathsOperationTest
11:41:25 [2024-03-05T16:41:25.116Z] org.eclipse.egit.core.test.op.DeletePathsOperationTest.testDeleteResourceOutsideOfProject -- Time elapsed: 0.165 s
11:41:25 [2024-03-05T16:41:25.116Z] org.eclipse.egit.core.test.op.DeletePathsOperationTest.testDeleteResourceOfProject -- Time elapsed: 0.088 s
11:41:25 [2024-03-05T16:41:25.116Z] Running org.eclipse.egit.core.test.op.DiscardChangesOperationTest
11:41:25 [2024-03-05T16:41:25.372Z] [main] WARN org.eclipse.jgit.lib.Repository - close() called when useCnt is already zero for Repository[/home/jenkins/agent/workspace/egit/tmp/egit.tmp/55fae8f1f4324181a2377eb85ea22b1f/Project2/.git]
11:41:25 [2024-03-05T16:41:25.373Z] [main] WARN org.eclipse.jgit.lib.Repository - close() called when useCnt is already zero for Repository[/home/jenkins/agent/workspace/egit/tmp/egit.tmp/55fae8f1f4324181a2377eb85ea22b1f/Repository1/.git]
11:41:25 [2024-03-05T16:41:25.373Z] [main] WARN org.eclipse.jgit.lib.Repository - close() called when useCnt is already zero for Repository[/home/jenkins/agent/workspace/egit/tmp/egit.tmp/6ed51ca48b89404795c3213f599c4ea3/Repository1/.git]
11:41:25 [2024-03-05T16:41:25.373Z] [main] WARN org.eclipse.jgit.lib.Repository - close() called when useCnt is already zero for Repository[/home/jenkins/agent/workspace/egit/tmp/egit.tmp/6ed51ca48b89404795c3213f599c4ea3/Project2/.git]
11:41:25 [2024-03-05T16:41:25.629Z] [main] WARN org.eclipse.jgit.lib.Repository - close() called when useCnt is already zero for Repository[/home/jenkins/agent/workspace/egit/tmp/egit.tmp/1a99b3d6b67c4fb19abf8ec31dfecab2/Repository1/.git]
11:41:25 [2024-03-05T16:41:25.629Z] [main] WARN org.eclipse.jgit.lib.Repository - close() called when useCnt is already zero for Repository[/home/jenkins/agent/workspace/egit/tmp/egit.tmp/1a99b3d6b67c4fb19abf8ec31dfecab2/Project2/.git]
11:41:25 [2024-03-05T16:41:25.885Z] [main] WARN org.eclipse.jgit.lib.Repository - close() called when useCnt is already zero for Repository[/home/jenkins/agent/workspace/egit/tmp/egit.tmp/76f15667f0644e87af637f3ef8c8c930/Project2/.git]
11:41:25 [2024-03-05T16:41:25.886Z] [main] WARN org.eclipse.jgit.lib.Repository - close() called when useCnt is already zero for Repository[/home/jenkins/agent/workspace/egit/tmp/egit.tmp/76f15667f0644e87af637f3ef8c8c930/Repository1/.git]
11:41:25 [2024-03-05T16:41:25.886Z] Tests run: 4, Failures: 0, Errors: 0, Skipped: 0, Time elapsed: 0.693 s -- in org.eclipse.egit.core.test.op.DiscardChangesOperationTest
11:41:25 [2024-03-05T16:41:25.886Z] org.eclipse.egit.core.test.op.DiscardChangesOperationTest.testDiscardChanges -- Time elapsed: 0.164 s
11:41:25 [2024-03-05T16:41:25.886Z] org.eclipse.egit.core.test.op.DiscardChangesOperationTest.shouldWorkWhenProjectIsRootOfRepository -- Time elapsed: 0.165 s
11:41:25 [2024-03-05T16:41:25.886Z] org.eclipse.egit.core.test.op.DiscardChangesOperationTest.testDiscardChangesWithStage -- Time elapsed: 0.188 s
11:41:25 [2024-03-05T16:41:25.886Z] org.eclipse.egit.core.test.op.DiscardChangesOperationTest.testDiscardChangesWithPath -- Time elapsed: 0.175 s
11:41:25 [2024-03-05T16:41:25.886Z] Running org.eclipse.egit.core.test.op.EditCommitOperationTest
11:41:25 [2024-03-05T16:41:25.886Z] [main] WARN org.eclipse.jgit.lib.Repository - close() called when useCnt is already zero for Repository[/home/jenkins/agent/workspace/egit/repo/org.eclipse.egit.core.test/target/work/data/Project-1/.git]
11:41:25 [2024-03-05T16:41:25.886Z] Tests run: 1, Failures: 0, Errors: 0, Skipped: 0, Time elapsed: 0.165 s -- in org.eclipse.egit.core.test.op.EditCommitOperationTest
11:41:25 [2024-03-05T16:41:25.886Z] org.eclipse.egit.core.test.op.EditCommitOperationTest.edit -- Time elapsed: 0.165 s
11:41:25 [2024-03-05T16:41:25.886Z] Running org.eclipse.egit.core.test.op.IgnoreOperationTest
11:41:26 [2024-03-05T16:41:26.142Z] [main] WARN org.eclipse.jgit.lib.Repository - close() called when useCnt is already zero for Repository[/home/jenkins/agent/workspace/egit/repo/org.eclipse.egit.core.test/target/work/data/.git]
11:41:26 [2024-03-05T16:41:26.398Z] [main] WARN org.eclipse.jgit.lib.Repository - close() called when useCnt is already zero for Repository[/home/jenkins/agent/workspace/egit/repo/org.eclipse.egit.core.test/target/work/data/.git]
11:41:26 [2024-03-05T16:41:26.398Z] [main] WARN org.eclipse.jgit.lib.Repository - close() called when useCnt is already zero for Repository[/home/jenkins/agent/workspace/egit/repo/org.eclipse.egit.core.test/target/work/data/.git]
11:41:26 [2024-03-05T16:41:26.656Z] [main] WARN org.eclipse.jgit.lib.Repository - close() called when useCnt is already zero for Repository[/home/jenkins/agent/workspace/egit/repo/org.eclipse.egit.core.test/target/work/data/.git]
11:41:26 [2024-03-05T16:41:26.656Z] [main] WARN org.eclipse.jgit.lib.Repository - close() called when useCnt is already zero for Repository[/home/jenkins/agent/workspace/egit/repo/org.eclipse.egit.core.test/target/work/data/.git]
11:41:26 [2024-03-05T16:41:26.913Z] [main] WARN org.eclipse.jgit.lib.Repository - close() called when useCnt is already zero for Repository[/home/jenkins/agent/workspace/egit/repo/org.eclipse.egit.core.test/target/work/data/.git]
11:41:26 [2024-03-05T16:41:26.913Z] [main] WARN org.eclipse.jgit.lib.Repository - close() called when useCnt is already zero for Repository[/home/jenkins/agent/workspace/egit/repo/org.eclipse.egit.core.test/target/work/data/.git]
11:41:27 [2024-03-05T16:41:27.170Z] [main] WARN org.eclipse.jgit.lib.Repository - close() called when useCnt is already zero for Repository[/home/jenkins/agent/workspace/egit/repo/org.eclipse.egit.core.test/target/work/data/.git]
11:41:27 [2024-03-05T16:41:27.170Z] [main] WARN org.eclipse.jgit.lib.Repository - close() called when useCnt is already zero for Repository[/home/jenkins/agent/workspace/egit/repo/org.eclipse.egit.core.test/target/work/data/.git]
11:41:27 [2024-03-05T16:41:27.427Z] [main] WARN org.eclipse.jgit.lib.Repository - close() called when useCnt is already zero for Repository[/home/jenkins/agent/workspace/egit/repo/org.eclipse.egit.core.test/target/work/data/.git]
11:41:27 [2024-03-05T16:41:27.427Z] Tests run: 10, Failures: 0, Errors: 0, Skipped: 0, Time elapsed: 1.439 s -- in org.eclipse.egit.core.test.op.IgnoreOperationTest
11:41:27 [2024-03-05T16:41:27.427Z] org.eclipse.egit.core.test.op.IgnoreOperationTest.testIgnoreProject -- Time elapsed: 0.189 s
11:41:27 [2024-03-05T16:41:27.427Z] org.eclipse.egit.core.test.op.IgnoreOperationTest.testIgnoreMultiFolders -- Time elapsed: 0.145 s
11:41:27 [2024-03-05T16:41:27.427Z] org.eclipse.egit.core.test.op.IgnoreOperationTest.testWithNestedProjects -- Time elapsed: 0.148 s
11:41:27 [2024-03-05T16:41:27.427Z] org.eclipse.egit.core.test.op.IgnoreOperationTest.testSchedulingRule -- Time elapsed: 0.131 s
11:41:27 [2024-03-05T16:41:27.427Z] org.eclipse.egit.core.test.op.IgnoreOperationTest.testIgnoreWithResource -- Time elapsed: 0.130 s
11:41:27 [2024-03-05T16:41:27.427Z] org.eclipse.egit.core.test.op.IgnoreOperationTest.testIgnoreFileCancel -- Time elapsed: 0.126 s
11:41:27 [2024-03-05T16:41:27.427Z] org.eclipse.egit.core.test.op.IgnoreOperationTest.testIgnoreNoTrailingNewline -- Time elapsed: 0.130 s
11:41:27 [2024-03-05T16:41:27.427Z] org.eclipse.egit.core.test.op.IgnoreOperationTest.testIgnoreFile -- Time elapsed: 0.128 s
11:41:27 [2024-03-05T16:41:27.427Z] org.eclipse.egit.core.test.op.IgnoreOperationTest.testIgnoreLinkToFolder -- Time elapsed: 0.131 s
11:41:27 [2024-03-05T16:41:27.427Z] org.eclipse.egit.core.test.op.IgnoreOperationTest.testIgnoreFolder -- Time elapsed: 0.180 s
11:41:27 [2024-03-05T16:41:27.427Z] Running org.eclipse.egit.core.test.op.ListRemoteOperationTest
11:41:27 [2024-03-05T16:41:27.684Z] [main] WARN org.eclipse.jgit.lib.Repository - close() called when useCnt is already zero for Repository[/home/jenkins/agent/workspace/egit/tmp/egit.tmp/678d7be881b1470baf6fcf512dfe1555/Repository1/.git]
11:41:27 [2024-03-05T16:41:27.684Z] [main] WARN org.eclipse.jgit.lib.Repository - close() called when useCnt is already zero for Repository[/home/jenkins/agent/workspace/egit/tmp/egit.tmp/678d7be881b1470baf6fcf512dfe1555/Repository2/.git]
11:41:27 [2024-03-05T16:41:27.684Z] [main] WARN org.eclipse.jgit.lib.Repository - close() called when useCnt is already zero for Repository[/home/jenkins/agent/workspace/egit/tmp/egit.tmp/0b1e27cd17234a5d831cbfb21c90be47/Repository2/.git]
11:41:27 [2024-03-05T16:41:27.684Z] [main] WARN org.eclipse.jgit.lib.Repository - close() called when useCnt is already zero for Repository[/home/jenkins/agent/workspace/egit/tmp/egit.tmp/0b1e27cd17234a5d831cbfb21c90be47/Repository1/.git]
11:41:27 [2024-03-05T16:41:27.684Z] [main] WARN org.eclipse.jgit.lib.Repository - close() called when useCnt is already zero for Repository[/home/jenkins/agent/workspace/egit/tmp/egit.tmp/0b3c81395d9241a0973cabc55f812cf0/Repository1/.git]
11:41:27 [2024-03-05T16:41:27.684Z] [main] WARN org.eclipse.jgit.lib.Repository - close() called when useCnt is already zero for Repository[/home/jenkins/agent/workspace/egit/tmp/egit.tmp/0b3c81395d9241a0973cabc55f812cf0/Repository2/.git]
11:41:27 [2024-03-05T16:41:27.684Z] Tests run: 3, Failures: 0, Errors: 0, Skipped: 0, Time elapsed: 0.339 s -- in org.eclipse.egit.core.test.op.ListRemoteOperationTest
11:41:27 [2024-03-05T16:41:27.684Z] org.eclipse.egit.core.test.op.ListRemoteOperationTest.testListRemote -- Time elapsed: 0.154 s
11:41:27 [2024-03-05T16:41:27.684Z] org.eclipse.egit.core.test.op.ListRemoteOperationTest.testIllegalStateException -- Time elapsed: 0.092 s
11:41:27 [2024-03-05T16:41:27.684Z] org.eclipse.egit.core.test.op.ListRemoteOperationTest.testIllegalURI -- Time elapsed: 0.092 s
11:41:27 [2024-03-05T16:41:27.684Z] Running org.eclipse.egit.core.test.op.MergeOperationTest
11:41:27 [2024-03-05T16:41:27.941Z] [main] WARN org.eclipse.jgit.lib.Repository - close() called when useCnt is already zero for Repository[/home/jenkins/agent/workspace/egit/repo/org.eclipse.egit.core.test/target/work/data/Project-1/.git]
11:41:32 [2024-03-05T16:41:32.116Z] [Worker-4: Updating Git status for repository Project-1] WARN org.eclipse.jgit.lib.Repository - close() called when useCnt is already zero for Repository[/home/jenkins/agent/workspace/egit/repo/org.eclipse.egit.core.test/target/work/data/Project-1/.git]
11:41:32 [2024-03-05T16:41:32.116Z] [main] WARN org.eclipse.jgit.lib.Repository - close() called when useCnt is already zero for Repository[/home/jenkins/agent/workspace/egit/repo/org.eclipse.egit.core.test/target/work/data/Project-1/.git]
11:41:32 [2024-03-05T16:41:32.116Z] [main] WARN org.eclipse.jgit.lib.Repository - close() called when useCnt is already zero for Repository[/home/jenkins/agent/workspace/egit/repo/org.eclipse.egit.core.test/target/work/data/Project-1/.git]
11:41:32 [2024-03-05T16:41:32.372Z] [main] WARN org.eclipse.jgit.lib.Repository - close() called when useCnt is already zero for Repository[/home/jenkins/agent/workspace/egit/repo/org.eclipse.egit.core.test/target/work/data/Project-1/.git]
11:41:32 [2024-03-05T16:41:32.372Z] Tests run: 5, Failures: 0, Errors: 0, Skipped: 0, Time elapsed: 4.506 s -- in org.eclipse.egit.core.test.op.MergeOperationTest
11:41:32 [2024-03-05T16:41:32.372Z] org.eclipse.egit.core.test.op.MergeOperationTest.testMergeNoFF -- Time elapsed: 0.149 s
11:41:32 [2024-03-05T16:41:32.372Z] org.eclipse.egit.core.test.op.MergeOperationTest.testMergeoptionsNoFF -- Time elapsed: 3.889 s
11:41:32 [2024-03-05T16:41:32.372Z] org.eclipse.egit.core.test.op.MergeOperationTest.testMergeFFOnly -- Time elapsed: 0.164 s
11:41:32 [2024-03-05T16:41:32.372Z] org.eclipse.egit.core.test.op.MergeOperationTest.testMergeFF -- Time elapsed: 0.151 s
11:41:32 [2024-03-05T16:41:32.372Z] org.eclipse.egit.core.test.op.MergeOperationTest.testMergeoptionsFFOnly -- Time elapsed: 0.151 s
11:41:32 [2024-03-05T16:41:32.373Z] Running org.eclipse.egit.core.test.op.PushOperationTest
11:41:32 [2024-03-05T16:41:32.373Z] [main] WARN org.eclipse.jgit.lib.Repository - close() called when useCnt is already zero for Repository[/home/jenkins/agent/workspace/egit/tmp/egit.tmp/a80187fa326a4a20a2d232486b1af8fa/Repository2/.git]
11:41:32 [2024-03-05T16:41:32.373Z] [main] WARN org.eclipse.jgit.lib.Repository - close() called when useCnt is already zero for Repository[/home/jenkins/agent/workspace/egit/tmp/egit.tmp/a80187fa326a4a20a2d232486b1af8fa/Repository1/.git]
11:41:32 [2024-03-05T16:41:32.630Z] [main] WARN org.eclipse.jgit.lib.Repository - close() called when useCnt is already zero for Repository[/home/jenkins/agent/workspace/egit/tmp/egit.tmp/00966fc8930144d78f7f7bf74704f01f/Repository1/.git]
11:41:32 [2024-03-05T16:41:32.630Z] [main] WARN org.eclipse.jgit.lib.Repository - close() called when useCnt is already zero for Repository[/home/jenkins/agent/workspace/egit/tmp/egit.tmp/00966fc8930144d78f7f7bf74704f01f/Repository2/.git]
11:41:32 [2024-03-05T16:41:32.630Z] [main] WARN org.eclipse.jgit.lib.Repository - close() called when useCnt is already zero for Repository[/home/jenkins/agent/workspace/egit/tmp/egit.tmp/8cd37466600c47e4816be0e09a9b87f9/Repository2/.git]
11:41:32 [2024-03-05T16:41:32.630Z] [main] WARN org.eclipse.jgit.lib.Repository - close() called when useCnt is already zero for Repository[/home/jenkins/agent/workspace/egit/tmp/egit.tmp/8cd37466600c47e4816be0e09a9b87f9/Repository1/.git]
11:41:32 [2024-03-05T16:41:32.887Z] [main] WARN org.eclipse.jgit.lib.Repository - close() called when useCnt is already zero for Repository[/home/jenkins/agent/workspace/egit/tmp/egit.tmp/ca9fc9353a814a2c8c3e54636d806733/Repository1/.git]
11:41:32 [2024-03-05T16:41:32.887Z] [main] WARN org.eclipse.jgit.lib.Repository - close() called when useCnt is already zero for Repository[/home/jenkins/agent/workspace/egit/tmp/egit.tmp/ca9fc9353a814a2c8c3e54636d806733/Repository2/.git]
11:41:32 [2024-03-05T16:41:32.887Z] 
11:41:32 [2024-03-05T16:41:32.887Z] !ENTRY org.eclipse.egit.core 4 0 2024-03-05 16:41:32.764
11:41:32 [2024-03-05T16:41:32.887Z] !MESSAGE An exception occurred during push on URI invalid-uri: invalid-uri: not found.
11:41:32 [2024-03-05T16:41:32.887Z] !STACK 0
11:41:32 [2024-03-05T16:41:32.887Z] org.eclipse.jgit.errors.NoRemoteRepositoryException: invalid-uri: not found.
11:41:32 [2024-03-05T16:41:32.887Z] 	at org.eclipse.jgit.transport.TransportLocal$1.open(TransportLocal.java:100)
11:41:32 [2024-03-05T16:41:32.887Z] 	at org.eclipse.jgit.transport.TransportBundleFile$1.open(TransportBundleFile.java:74)
11:41:32 [2024-03-05T16:41:32.887Z] 	at org.eclipse.jgit.transport.Transport.open(Transport.java:527)
11:41:32 [2024-03-05T16:41:32.887Z] 	at org.eclipse.jgit.transport.Transport.open(Transport.java:497)
11:41:32 [2024-03-05T16:41:32.887Z] 	at org.eclipse.egit.core.op.PushOperation.run(PushOperation.java:256)
11:41:32 [2024-03-05T16:41:32.887Z] 	at org.eclipse.egit.core.test.op.PushOperationTest.testInvalidUriDuringPush(PushOperationTest.java:193)
11:41:32 [2024-03-05T16:41:32.887Z] 	at java.base/jdk.internal.reflect.NativeMethodAccessorImpl.invoke0(Native Method)
11:41:32 [2024-03-05T16:41:32.887Z] 	at java.base/jdk.internal.reflect.NativeMethodAccessorImpl.invoke(NativeMethodAccessorImpl.java:77)
11:41:32 [2024-03-05T16:41:32.887Z] 	at java.base/jdk.internal.reflect.DelegatingMethodAccessorImpl.invoke(DelegatingMethodAccessorImpl.java:43)
11:41:32 [2024-03-05T16:41:32.887Z] 	at java.base/java.lang.reflect.Method.invoke(Method.java:568)
11:41:32 [2024-03-05T16:41:32.887Z] 	at org.junit.runners.model.FrameworkMethod$1.runReflectiveCall(FrameworkMethod.java:59)
11:41:32 [2024-03-05T16:41:32.887Z] 	at org.junit.internal.runners.model.ReflectiveCallable.run(ReflectiveCallable.java:12)
11:41:32 [2024-03-05T16:41:32.887Z] 	at org.junit.runners.model.FrameworkMethod.invokeExplosively(FrameworkMethod.java:56)
11:41:32 [2024-03-05T16:41:32.887Z] 	at org.junit.internal.runners.statements.InvokeMethod.evaluate(InvokeMethod.java:17)
11:41:32 [2024-03-05T16:41:32.887Z] 	at org.junit.internal.runners.statements.RunBefores.evaluate(RunBefores.java:26)
11:41:32 [2024-03-05T16:41:32.887Z] 	at org.junit.internal.runners.statements.RunAfters.evaluate(RunAfters.java:27)
11:41:32 [2024-03-05T16:41:32.887Z] 	at org.junit.runners.ParentRunner$3.evaluate(ParentRunner.java:306)
11:41:32 [2024-03-05T16:41:32.887Z] 	at org.junit.runners.BlockJUnit4ClassRunner$1.evaluate(BlockJUnit4ClassRunner.java:100)
11:41:32 [2024-03-05T16:41:32.887Z] 	at org.junit.runners.ParentRunner.runLeaf(ParentRunner.java:366)
11:41:32 [2024-03-05T16:41:32.887Z] 	at org.junit.runners.BlockJUnit4ClassRunner.runChild(BlockJUnit4ClassRunner.java:103)
11:41:32 [2024-03-05T16:41:32.888Z] 	at org.junit.runners.BlockJUnit4ClassRunner.runChild(BlockJUnit4ClassRunner.java:63)
11:41:32 [2024-03-05T16:41:32.888Z] 	at org.junit.runners.ParentRunner$4.run(ParentRunner.java:331)
11:41:32 [2024-03-05T16:41:32.888Z] 	at org.junit.runners.ParentRunner$1.schedule(ParentRunner.java:79)
11:41:32 [2024-03-05T16:41:32.888Z] 	at org.junit.runners.ParentRunner.runChildren(ParentRunner.java:329)
11:41:32 [2024-03-05T16:41:32.888Z] 	at org.junit.runners.ParentRunner.access$100(ParentRunner.java:66)
11:41:32 [2024-03-05T16:41:32.888Z] 	at org.junit.runners.ParentRunner$2.evaluate(ParentRunner.java:293)
11:41:32 [2024-03-05T16:41:32.888Z] 	at org.junit.runners.ParentRunner$3.evaluate(ParentRunner.java:306)
11:41:32 [2024-03-05T16:41:32.888Z] 	at org.junit.runners.ParentRunner.run(ParentRunner.java:413)
11:41:32 [2024-03-05T16:41:32.888Z] 	at org.apache.maven.surefire.junit4.JUnit4Provider.execute(JUnit4Provider.java:316)
11:41:32 [2024-03-05T16:41:32.888Z] 	at org.apache.maven.surefire.junit4.JUnit4Provider.executeWithRerun(JUnit4Provider.java:240)
11:41:32 [2024-03-05T16:41:32.888Z] 	at org.apache.maven.surefire.junit4.JUnit4Provider.executeTestSet(JUnit4Provider.java:214)
11:41:32 [2024-03-05T16:41:32.888Z] 	at org.apache.maven.surefire.junit4.JUnit4Provider.invoke(JUnit4Provider.java:155)
11:41:32 [2024-03-05T16:41:32.888Z] 	at java.base/jdk.internal.reflect.NativeMethodAccessorImpl.invoke0(Native Method)
11:41:32 [2024-03-05T16:41:32.888Z] 	at java.base/jdk.internal.reflect.NativeMethodAccessorImpl.invoke(NativeMethodAccessorImpl.java:77)
11:41:32 [2024-03-05T16:41:32.888Z] 	at java.base/jdk.internal.reflect.DelegatingMethodAccessorImpl.invoke(DelegatingMethodAccessorImpl.java:43)
11:41:32 [2024-03-05T16:41:32.888Z] 	at java.base/java.lang.reflect.Method.invoke(Method.java:568)
11:41:32 [2024-03-05T16:41:32.888Z] 	at org.apache.maven.surefire.api.util.ReflectionUtils.invokeMethodWithArray2(ReflectionUtils.java:137)
11:41:32 [2024-03-05T16:41:32.888Z] 	at org.apache.maven.surefire.booter.ProviderFactory$ProviderProxy.invoke(ProviderFactory.java:148)
11:41:32 [2024-03-05T16:41:32.888Z] 	at org.apache.maven.surefire.booter.ProviderFactory.invokeProvider(ProviderFactory.java:88)
11:41:32 [2024-03-05T16:41:32.888Z] 	at org.eclipse.tycho.surefire.osgibooter.OsgiSurefireBooter.run(OsgiSurefireBooter.java:140)
11:41:32 [2024-03-05T16:41:32.888Z] 	at org.eclipse.tycho.surefire.osgibooter.HeadlessTestApplication.start(HeadlessTestApplication.java:29)
11:41:32 [2024-03-05T16:41:32.888Z] 	at org.eclipse.equinox.internal.app.EclipseAppHandle.run(EclipseAppHandle.java:203)
11:41:32 [2024-03-05T16:41:32.888Z] 	at org.eclipse.core.runtime.internal.adaptor.EclipseAppLauncher.runApplication(EclipseAppLauncher.java:136)
11:41:32 [2024-03-05T16:41:32.888Z] 	at org.eclipse.core.runtime.internal.adaptor.EclipseAppLauncher.start(EclipseAppLauncher.java:104)
11:41:32 [2024-03-05T16:41:32.888Z] 	at org.eclipse.core.runtime.adaptor.EclipseStarter.run(EclipseStarter.java:402)
11:41:32 [2024-03-05T16:41:32.888Z] 	at org.eclipse.core.runtime.adaptor.EclipseStarter.run(EclipseStarter.java:255)
11:41:32 [2024-03-05T16:41:32.888Z] 	at java.base/jdk.internal.reflect.NativeMethodAccessorImpl.invoke0(Native Method)
11:41:32 [2024-03-05T16:41:32.888Z] 	at java.base/jdk.internal.reflect.NativeMethodAccessorImpl.invoke(NativeMethodAccessorImpl.java:77)
11:41:32 [2024-03-05T16:41:32.888Z] 	at java.base/jdk.internal.reflect.DelegatingMethodAccessorImpl.invoke(DelegatingMethodAccessorImpl.java:43)
11:41:32 [2024-03-05T16:41:32.888Z] 	at java.base/java.lang.reflect.Method.invoke(Method.java:568)
11:41:32 [2024-03-05T16:41:32.888Z] 	at org.eclipse.equinox.launcher.Main.invokeFramework(Main.java:659)
11:41:32 [2024-03-05T16:41:32.888Z] 	at org.eclipse.equinox.launcher.Main.basicRun(Main.java:596)
11:41:32 [2024-03-05T16:41:32.888Z] 	at org.eclipse.equinox.launcher.Main.run(Main.java:1467)
11:41:32 [2024-03-05T16:41:32.888Z] 	at org.eclipse.equinox.launcher.Main.main(Main.java:1440)
11:41:32 [2024-03-05T16:41:32.888Z] [main] WARN org.eclipse.jgit.lib.Repository - close() called when useCnt is already zero for Repository[/home/jenkins/agent/workspace/egit/tmp/egit.tmp/7cb20aeb7bc54f5293cfe499a5e154db/Repository2/.git]
11:41:32 [2024-03-05T16:41:32.888Z] [main] WARN org.eclipse.jgit.lib.Repository - close() called when useCnt is already zero for Repository[/home/jenkins/agent/workspace/egit/tmp/egit.tmp/7cb20aeb7bc54f5293cfe499a5e154db/Repository1/.git]
11:41:32 [2024-03-05T16:41:32.888Z] Tests run: 5, Failures: 0, Errors: 0, Skipped: 0, Time elapsed: 0.589 s -- in org.eclipse.egit.core.test.op.PushOperationTest
11:41:32 [2024-03-05T16:41:32.888Z] org.eclipse.egit.core.test.op.PushOperationTest.testPushWithReusedSpec -- Time elapsed: 0.163 s
11:41:32 [2024-03-05T16:41:32.888Z] org.eclipse.egit.core.test.op.PushOperationTest.testPush -- Time elapsed: 0.124 s
11:41:32 [2024-03-05T16:41:32.888Z] org.eclipse.egit.core.test.op.PushOperationTest.testIllegalStateExceptionOnGetResultWithoutRun -- Time elapsed: 0.096 s
11:41:32 [2024-03-05T16:41:32.888Z] org.eclipse.egit.core.test.op.PushOperationTest.testUpdateTrackingBranchIfSpecifiedInRemoteRefUpdate -- Time elapsed: 0.112 s
11:41:32 [2024-03-05T16:41:32.889Z] org.eclipse.egit.core.test.op.PushOperationTest.testInvalidUriDuringPush -- Time elapsed: 0.093 s
11:41:32 [2024-03-05T16:41:32.889Z] Running org.eclipse.egit.core.test.op.RebaseOperationTest
11:41:33 [2024-03-05T16:41:33.145Z] Tests run: 4, Failures: 0, Errors: 0, Skipped: 0, Time elapsed: 0.280 s -- in org.eclipse.egit.core.test.op.RebaseOperationTest
11:41:33 [2024-03-05T16:41:33.145Z] org.eclipse.egit.core.test.op.RebaseOperationTest.testStopAndAbortOnConflict -- Time elapsed: 0.068 s
11:41:33 [2024-03-05T16:41:33.145Z] org.eclipse.egit.core.test.op.RebaseOperationTest.testNoConflict -- Time elapsed: 0.075 s
11:41:33 [2024-03-05T16:41:33.145Z] org.eclipse.egit.core.test.op.RebaseOperationTest.testUpToDate -- Time elapsed: 0.077 s
11:41:33 [2024-03-05T16:41:33.145Z] org.eclipse.egit.core.test.op.RebaseOperationTest.testExceptionWhenRestartingStoppedRebase -- Time elapsed: 0.059 s
11:41:33 [2024-03-05T16:41:33.145Z] Running org.eclipse.egit.core.test.op.RemoveFromIndexOperationTest
11:41:34 [2024-03-05T16:41:34.513Z] [main] WARN org.eclipse.jgit.lib.Repository - close() called when useCnt is already zero for Repository[/home/jenkins/agent/workspace/egit/repo/org.eclipse.egit.core.test/target/work/data/Project-2/.git]
11:41:34 [2024-03-05T16:41:34.513Z] [main] WARN org.eclipse.jgit.lib.Repository - close() called when useCnt is already zero for Repository[/home/jenkins/agent/workspace/egit/repo/org.eclipse.egit.core.test/target/work/data/Project-1/.git]
11:41:34 [2024-03-05T16:41:34.770Z] [main] WARN org.eclipse.jgit.lib.Repository - close() called when useCnt is already zero for Repository[/home/jenkins/agent/workspace/egit/repo/org.eclipse.egit.core.test/target/work/data/Project-2/.git]
11:41:34 [2024-03-05T16:41:34.770Z] [main] WARN org.eclipse.jgit.lib.Repository - close() called when useCnt is already zero for Repository[/home/jenkins/agent/workspace/egit/repo/org.eclipse.egit.core.test/target/work/data/Project-1/.git]
11:41:34 [2024-03-05T16:41:34.770Z] [main] WARN org.eclipse.jgit.lib.Repository - close() called when useCnt is already zero for Repository[/home/jenkins/agent/workspace/egit/repo/org.eclipse.egit.core.test/target/work/data/Project-2/.git]
11:41:34 [2024-03-05T16:41:34.770Z] [main] WARN org.eclipse.jgit.lib.Repository - close() called when useCnt is already zero for Repository[/home/jenkins/agent/workspace/egit/repo/org.eclipse.egit.core.test/target/work/data/Project-1/.git]
11:41:35 [2024-03-05T16:41:35.027Z] [main] WARN org.eclipse.jgit.lib.Repository - close() called when useCnt is already zero for [RepositoryHandle:Repository[/home/jenkins/agent/workspace/egit/repo/org.eclipse.egit.core.test/target/work/data/Project-1/.git]]
11:41:35 [2024-03-05T16:41:35.027Z] [main] WARN org.eclipse.jgit.lib.Repository - close() called when useCnt is already zero for Repository[/home/jenkins/agent/workspace/egit/repo/org.eclipse.egit.core.test/target/work/data/Project-2/.git]
11:41:35 [2024-03-05T16:41:35.027Z] [Worker-5: Updating Git status for repository Project-1] WARN org.eclipse.jgit.lib.Repository - close() called when useCnt is already zero for Repository[/home/jenkins/agent/workspace/egit/repo/org.eclipse.egit.core.test/target/work/data/Project-1/.git]
11:41:36 [2024-03-05T16:41:36.396Z] [main] WARN org.eclipse.jgit.lib.Repository - close() called when useCnt is already zero for Repository[/home/jenkins/agent/workspace/egit/repo/org.eclipse.egit.core.test/target/work/data/Project-2/.git]
11:41:36 [2024-03-05T16:41:36.396Z] [Worker-1: Updating Git status for repository Project-1] WARN org.eclipse.jgit.lib.Repository - close() called when useCnt is already zero for Repository[/home/jenkins/agent/workspace/egit/repo/org.eclipse.egit.core.test/target/work/data/Project-1/.git]
11:41:37 [2024-03-05T16:41:37.764Z] [main] WARN org.eclipse.jgit.lib.Repository - close() called when useCnt is already zero for Repository[/home/jenkins/agent/workspace/egit/repo/org.eclipse.egit.core.test/target/work/data/Project-2/.git]
11:41:37 [2024-03-05T16:41:37.764Z] [Worker-5: Updating Git status for repository Project-1] WARN org.eclipse.jgit.lib.Repository - close() called when useCnt is already zero for Repository[/home/jenkins/agent/workspace/egit/repo/org.eclipse.egit.core.test/target/work/data/Project-1/.git]
11:41:37 [2024-03-05T16:41:37.764Z] [main] WARN org.eclipse.jgit.lib.Repository - close() called when useCnt is already zero for Repository[/home/jenkins/agent/workspace/egit/repo/org.eclipse.egit.core.test/target/work/data/Project-2/.git]
11:41:37 [2024-03-05T16:41:37.764Z] [Worker-0: Updating Git status for repository Project-1] WARN org.eclipse.jgit.lib.Repository - close() called when useCnt is already zero for Repository[/home/jenkins/agent/workspace/egit/repo/org.eclipse.egit.core.test/target/work/data/Project-1/.git]
11:41:37 [2024-03-05T16:41:37.764Z] Tests run: 7, Failures: 0, Errors: 0, Skipped: 0, Time elapsed: 4.622 s -- in org.eclipse.egit.core.test.op.RemoveFromIndexOperationTest
11:41:37 [2024-03-05T16:41:37.764Z] org.eclipse.egit.core.test.op.RemoveFromIndexOperationTest.shouldUnstageExistingFile -- Time elapsed: 1.265 s
11:41:37 [2024-03-05T16:41:37.764Z] org.eclipse.egit.core.test.op.RemoveFromIndexOperationTest.shouldUnTrackFilesInFolder -- Time elapsed: 0.209 s
11:41:37 [2024-03-05T16:41:37.764Z] org.eclipse.egit.core.test.op.RemoveFromIndexOperationTest.shouldUnTrackFile -- Time elapsed: 0.202 s
11:41:37 [2024-03-05T16:41:37.764Z] org.eclipse.egit.core.test.op.RemoveFromIndexOperationTest.shouldRemoveFromIndexOnInitialCommit -- Time elapsed: 0.281 s
11:41:37 [2024-03-05T16:41:37.764Z] org.eclipse.egit.core.test.op.RemoveFromIndexOperationTest.shouldUnstageFilesInNestedFolder -- Time elapsed: 1.219 s
11:41:37 [2024-03-05T16:41:37.765Z] org.eclipse.egit.core.test.op.RemoveFromIndexOperationTest.shouldUnstageFilesInFolder -- Time elapsed: 1.231 s
11:41:37 [2024-03-05T16:41:37.765Z] org.eclipse.egit.core.test.op.RemoveFromIndexOperationTest.shouldUnstageFilesFromMultipleRepositories -- Time elapsed: 0.214 s
11:41:37 [2024-03-05T16:41:37.765Z] Running org.eclipse.egit.core.test.op.ResetOperationTest
11:41:37 [2024-03-05T16:41:37.765Z] [main] WARN org.eclipse.jgit.lib.Repository - close() called when useCnt is already zero for Repository[/home/jenkins/agent/workspace/egit/repo/org.eclipse.egit.core.test/target/work/data/.git]
11:41:38 [2024-03-05T16:41:38.021Z] [main] WARN org.eclipse.jgit.lib.Repository - close() called when useCnt is already zero for Repository[/home/jenkins/agent/workspace/egit/repo/org.eclipse.egit.core.test/target/work/data/.git]
11:41:38 [2024-03-05T16:41:38.021Z] [main] WARN org.eclipse.jgit.lib.Repository - close() called when useCnt is already zero for Repository[/home/jenkins/agent/workspace/egit/repo/org.eclipse.egit.core.test/target/work/data/.git]
11:41:38 [2024-03-05T16:41:38.021Z] Tests run: 3, Failures: 0, Errors: 0, Skipped: 0, Time elapsed: 0.138 s -- in org.eclipse.egit.core.test.op.ResetOperationTest
11:41:38 [2024-03-05T16:41:38.021Z] org.eclipse.egit.core.test.op.ResetOperationTest.testSoftReset -- Time elapsed: 0.037 s
11:41:38 [2024-03-05T16:41:38.021Z] org.eclipse.egit.core.test.op.ResetOperationTest.testMixedReset -- Time elapsed: 0.055 s
11:41:38 [2024-03-05T16:41:38.021Z] org.eclipse.egit.core.test.op.ResetOperationTest.testHardReset -- Time elapsed: 0.045 s
11:41:38 [2024-03-05T16:41:38.021Z] Running org.eclipse.egit.core.test.op.RewordCommitsOperationTest
11:41:38 [2024-03-05T16:41:38.952Z] Tests run: 5, Failures: 0, Errors: 0, Skipped: 0, Time elapsed: 0.798 s -- in org.eclipse.egit.core.test.op.RewordCommitsOperationTest
11:41:38 [2024-03-05T16:41:38.952Z] org.eclipse.egit.core.test.op.RewordCommitsOperationTest.reword -- Time elapsed: 0.189 s
11:41:38 [2024-03-05T16:41:38.952Z] org.eclipse.egit.core.test.op.RewordCommitsOperationTest.rewordWithNewChangeIdNoNewline -- Time elapsed: 0.197 s
11:41:38 [2024-03-05T16:41:38.952Z] org.eclipse.egit.core.test.op.RewordCommitsOperationTest.rewordWithChangeId -- Time elapsed: 0.139 s
11:41:38 [2024-03-05T16:41:38.952Z] org.eclipse.egit.core.test.op.RewordCommitsOperationTest.rewordWithNewChangeId -- Time elapsed: 0.136 s
11:41:38 [2024-03-05T16:41:38.952Z] org.eclipse.egit.core.test.op.RewordCommitsOperationTest.rewordWithExistingChangeId -- Time elapsed: 0.137 s
11:41:38 [2024-03-05T16:41:38.952Z] Running org.eclipse.egit.core.test.op.SquashCommitsOperationTest
11:41:38 [2024-03-05T16:41:38.952Z] [main] WARN org.eclipse.jgit.lib.Repository - close() called when useCnt is already zero for Repository[/home/jenkins/agent/workspace/egit/repo/org.eclipse.egit.core.test/target/work/data/Project-1/.git]
11:41:38 [2024-03-05T16:41:38.952Z] Tests run: 1, Failures: 0, Errors: 0, Skipped: 0, Time elapsed: 0.173 s -- in org.eclipse.egit.core.test.op.SquashCommitsOperationTest
11:41:38 [2024-03-05T16:41:38.953Z] org.eclipse.egit.core.test.op.SquashCommitsOperationTest.squash -- Time elapsed: 0.172 s
11:41:38 [2024-03-05T16:41:38.953Z] Running org.eclipse.egit.core.test.op.StashCreateOperationTest
11:41:38 [2024-03-05T16:41:38.953Z] [main] WARN org.eclipse.jgit.lib.Repository - close() called when useCnt is already zero for Repository[/home/jenkins/agent/workspace/egit/repo/org.eclipse.egit.core.test/target/work/data/Project-1/.git]
11:41:39 [2024-03-05T16:41:39.209Z] [main] WARN org.eclipse.jgit.lib.Repository - close() called when useCnt is already zero for Repository[/home/jenkins/agent/workspace/egit/repo/org.eclipse.egit.core.test/target/work/data/Project-1/.git]
11:41:39 [2024-03-05T16:41:39.466Z] [main] WARN org.eclipse.jgit.lib.Repository - close() called when useCnt is already zero for Repository[/home/jenkins/agent/workspace/egit/repo/org.eclipse.egit.core.test/target/work/data/Project-1/.git]
11:41:39 [2024-03-05T16:41:39.466Z] Tests run: 3, Failures: 0, Errors: 0, Skipped: 0, Time elapsed: 0.421 s -- in org.eclipse.egit.core.test.op.StashCreateOperationTest
11:41:39 [2024-03-05T16:41:39.466Z] org.eclipse.egit.core.test.op.StashCreateOperationTest.testCustomMessage -- Time elapsed: 0.140 s
11:41:39 [2024-03-05T16:41:39.466Z] org.eclipse.egit.core.test.op.StashCreateOperationTest.testUntrackedFlag -- Time elapsed: 0.140 s
11:41:39 [2024-03-05T16:41:39.466Z] org.eclipse.egit.core.test.op.StashCreateOperationTest.testDefaultMessage -- Time elapsed: 0.140 s
11:41:39 [2024-03-05T16:41:39.466Z] Running org.eclipse.egit.core.test.op.TagOperationTest
11:41:39 [2024-03-05T16:41:39.466Z] [main] WARN org.eclipse.jgit.lib.Repository - close() called when useCnt is already zero for Repository[/home/jenkins/agent/workspace/egit/tmp/egit.tmp/c5d5c407465347ee8c64262c02da17ee/Repository1/.git]
11:41:39 [2024-03-05T16:41:39.723Z] [main] WARN org.eclipse.jgit.lib.Repository - close() called when useCnt is already zero for Repository[/home/jenkins/agent/workspace/egit/tmp/egit.tmp/1a71ffbf61414c6ab104796966ad0cd1/Repository1/.git]
11:41:39 [2024-03-05T16:41:39.723Z] [main] WARN org.eclipse.jgit.lib.Repository - close() called when useCnt is already zero for Repository[/home/jenkins/agent/workspace/egit/tmp/egit.tmp/704e54638d224bde90597d00dfc76a16/Repository1/.git]
11:41:39 [2024-03-05T16:41:39.723Z] [main] WARN org.eclipse.jgit.lib.Repository - close() called when useCnt is already zero for Repository[/home/jenkins/agent/workspace/egit/tmp/egit.tmp/d41645c6f65a44e7a5981f254c61cb64/Repository1/.git]
11:41:39 [2024-03-05T16:41:39.723Z] Tests run: 4, Failures: 0, Errors: 0, Skipped: 0, Time elapsed: 0.407 s -- in org.eclipse.egit.core.test.op.TagOperationTest
11:41:39 [2024-03-05T16:41:39.723Z] org.eclipse.egit.core.test.op.TagOperationTest.addTag -- Time elapsed: 0.180 s
11:41:39 [2024-03-05T16:41:39.723Z] org.eclipse.egit.core.test.op.TagOperationTest.addNullAnnotatedTag -- Time elapsed: 0.074 s
11:41:39 [2024-03-05T16:41:39.724Z] org.eclipse.egit.core.test.op.TagOperationTest.addEmptyAnnotatedTag -- Time elapsed: 0.077 s
11:41:39 [2024-03-05T16:41:39.724Z] org.eclipse.egit.core.test.op.TagOperationTest.addLightweightTag -- Time elapsed: 0.076 s
11:41:39 [2024-03-05T16:41:39.724Z] Running org.eclipse.egit.core.test.op.TrackUntrackOperationTest
11:41:39 [2024-03-05T16:41:39.980Z] [main] WARN org.eclipse.jgit.lib.Repository - close() called when useCnt is already zero for Repository[/home/jenkins/agent/workspace/egit/tmp/egit.tmp/d542788b14884fa6b57120ad70f79a2b/Repository1/.git]
11:41:39 [2024-03-05T16:41:39.980Z] [main] WARN org.eclipse.jgit.lib.Repository - close() called when useCnt is already zero for Repository[/home/jenkins/agent/workspace/egit/tmp/egit.tmp/d9116acd193742c6bdd7ae39f4e1cfa3/Repository1/.git]
11:41:39 [2024-03-05T16:41:39.980Z] Tests run: 2, Failures: 0, Errors: 0, Skipped: 0, Time elapsed: 0.145 s -- in org.eclipse.egit.core.test.op.TrackUntrackOperationTest
11:41:39 [2024-03-05T16:41:39.981Z] org.eclipse.egit.core.test.op.TrackUntrackOperationTest.testTrackProject -- Time elapsed: 0.078 s
11:41:39 [2024-03-05T16:41:39.981Z] org.eclipse.egit.core.test.op.TrackUntrackOperationTest.testTrackFiles -- Time elapsed: 0.066 s
11:41:39 [2024-03-05T16:41:39.981Z] Running org.eclipse.egit.core.test.rebase.RebaseInteractivePlanTest$JoinedListTest
11:41:39 [2024-03-05T16:41:39.981Z] Tests run: 20, Failures: 0, Errors: 0, Skipped: 0, Time elapsed: 0.004 s -- in org.eclipse.egit.core.test.rebase.RebaseInteractivePlanTest$JoinedListTest
11:41:39 [2024-03-05T16:41:39.981Z] org.eclipse.egit.core.test.rebase.RebaseInteractivePlanTest$JoinedListTest.containsTest -- Time elapsed: 0.001 s
11:41:39 [2024-03-05T16:41:39.981Z] org.eclipse.egit.core.test.rebase.RebaseInteractivePlanTest$JoinedListTest.addAllToIndexInFirstListTest -- Time elapsed: 0 s
11:41:39 [2024-03-05T16:41:39.981Z] org.eclipse.egit.core.test.rebase.RebaseInteractivePlanTest$JoinedListTest.toArrayTest -- Time elapsed: 0.001 s
11:41:39 [2024-03-05T16:41:39.981Z] org.eclipse.egit.core.test.rebase.RebaseInteractivePlanTest$JoinedListTest.subListTest -- Time elapsed: 0 s
11:41:39 [2024-03-05T16:41:39.981Z] org.eclipse.egit.core.test.rebase.RebaseInteractivePlanTest$JoinedListTest.removeElementTest -- Time elapsed: 0 s
11:41:39 [2024-03-05T16:41:39.981Z] org.eclipse.egit.core.test.rebase.RebaseInteractivePlanTest$JoinedListTest.clearTest -- Time elapsed: 0 s
11:41:39 [2024-03-05T16:41:39.981Z] org.eclipse.egit.core.test.rebase.RebaseInteractivePlanTest$JoinedListTest.listIteratorTest -- Time elapsed: 0 s
11:41:39 [2024-03-05T16:41:39.981Z] org.eclipse.egit.core.test.rebase.RebaseInteractivePlanTest$JoinedListTest.addTest -- Time elapsed: 0 s
11:41:39 [2024-03-05T16:41:39.981Z] org.eclipse.egit.core.test.rebase.RebaseInteractivePlanTest$JoinedListTest.lastIndexOfTest -- Time elapsed: 0 s
11:41:39 [2024-03-05T16:41:39.981Z] org.eclipse.egit.core.test.rebase.RebaseInteractivePlanTest$JoinedListTest.addToIndexTest -- Time elapsed: 0 s
11:41:39 [2024-03-05T16:41:39.981Z] org.eclipse.egit.core.test.rebase.RebaseInteractivePlanTest$JoinedListTest.containsAllTest -- Time elapsed: 0 s
11:41:39 [2024-03-05T16:41:39.981Z] org.eclipse.egit.core.test.rebase.RebaseInteractivePlanTest$JoinedListTest.addAllToIndexInSecondeListTest -- Time elapsed: 0 s
11:41:39 [2024-03-05T16:41:39.981Z] org.eclipse.egit.core.test.rebase.RebaseInteractivePlanTest$JoinedListTest.isEmptyTest -- Time elapsed: 0 s
11:41:39 [2024-03-05T16:41:39.981Z] org.eclipse.egit.core.test.rebase.RebaseInteractivePlanTest$JoinedListTest.getTest -- Time elapsed: 0 s
11:41:39 [2024-03-05T16:41:39.981Z] org.eclipse.egit.core.test.rebase.RebaseInteractivePlanTest$JoinedListTest.removeAllTest -- Time elapsed: 0 s
11:41:39 [2024-03-05T16:41:39.981Z] org.eclipse.egit.core.test.rebase.RebaseInteractivePlanTest$JoinedListTest.sizeTest -- Time elapsed: 0 s
11:41:39 [2024-03-05T16:41:39.981Z] org.eclipse.egit.core.test.rebase.RebaseInteractivePlanTest$JoinedListTest.addAllTest -- Time elapsed: 0 s
11:41:39 [2024-03-05T16:41:39.981Z] org.eclipse.egit.core.test.rebase.RebaseInteractivePlanTest$JoinedListTest.indexOfTest -- Time elapsed: 0 s
11:41:39 [2024-03-05T16:41:39.981Z] org.eclipse.egit.core.test.rebase.RebaseInteractivePlanTest$JoinedListTest.removeIndexTest -- Time elapsed: 0 s
11:41:39 [2024-03-05T16:41:39.981Z] org.eclipse.egit.core.test.rebase.RebaseInteractivePlanTest$JoinedListTest.setTest -- Time elapsed: 0 s
11:41:39 [2024-03-05T16:41:39.981Z] Running org.eclipse.egit.core.test.rebase.RebaseInteractivePlanTest
11:41:40 [2024-03-05T16:41:40.238Z] [main] WARN org.eclipse.jgit.lib.Repository - close() called when useCnt is already zero for Repository[/home/jenkins/agent/workspace/egit/repo/org.eclipse.egit.core.test/target/work/data/Project-1/.git]
11:41:40 [2024-03-05T16:41:40.495Z] [main] WARN org.eclipse.jgit.lib.Repository - close() called when useCnt is already zero for Repository[/home/jenkins/agent/workspace/egit/repo/org.eclipse.egit.core.test/target/work/data/Project-1/.git]
11:41:40 [2024-03-05T16:41:40.495Z] [main] WARN org.eclipse.jgit.lib.Repository - close() called when useCnt is already zero for Repository[/home/jenkins/agent/workspace/egit/repo/org.eclipse.egit.core.test/target/work/data/Project-1/.git]
11:41:40 [2024-03-05T16:41:40.753Z] [main] WARN org.eclipse.jgit.lib.Repository - close() called when useCnt is already zero for Repository[/home/jenkins/agent/workspace/egit/repo/org.eclipse.egit.core.test/target/work/data/Project-1/.git]
11:41:41 [2024-03-05T16:41:41.049Z] [main] WARN org.eclipse.jgit.lib.Repository - close() called when useCnt is already zero for Repository[/home/jenkins/agent/workspace/egit/repo/org.eclipse.egit.core.test/target/work/data/Project-1/.git]
11:41:41 [2024-03-05T16:41:41.049Z] [main] WARN org.eclipse.jgit.lib.Repository - close() called when useCnt is already zero for Repository[/home/jenkins/agent/workspace/egit/repo/org.eclipse.egit.core.test/target/work/data/Project-1/.git]
11:41:41 [2024-03-05T16:41:41.306Z] [main] WARN org.eclipse.jgit.lib.Repository - close() called when useCnt is already zero for Repository[/home/jenkins/agent/workspace/egit/repo/org.eclipse.egit.core.test/target/work/data/Project-1/.git]
11:41:41 [2024-03-05T16:41:41.307Z] [main] WARN org.eclipse.jgit.lib.Repository - close() called when useCnt is already zero for Repository[/home/jenkins/agent/workspace/egit/repo/org.eclipse.egit.core.test/target/work/data/Project-1/.git]
11:41:41 [2024-03-05T16:41:41.307Z] Tests run: 8, Failures: 0, Errors: 0, Skipped: 0, Time elapsed: 1.454 s -- in org.eclipse.egit.core.test.rebase.RebaseInteractivePlanTest
11:41:41 [2024-03-05T16:41:41.307Z] org.eclipse.egit.core.test.rebase.RebaseInteractivePlanTest.moveDownTestOneElement -- Time elapsed: 0.253 s
11:41:41 [2024-03-05T16:41:41.307Z] org.eclipse.egit.core.test.rebase.RebaseInteractivePlanTest.moveUpTestTwoElements -- Time elapsed: 0.226 s
11:41:41 [2024-03-05T16:41:41.307Z] org.eclipse.egit.core.test.rebase.RebaseInteractivePlanTest.parseTest -- Time elapsed: 0.167 s
11:41:41 [2024-03-05T16:41:41.307Z] org.eclipse.egit.core.test.rebase.RebaseInteractivePlanTest.moveUpTestOneElement -- Time elapsed: 0.184 s
11:41:41 [2024-03-05T16:41:41.307Z] org.eclipse.egit.core.test.rebase.RebaseInteractivePlanTest.persistTest -- Time elapsed: 0.153 s
11:41:41 [2024-03-05T16:41:41.307Z] org.eclipse.egit.core.test.rebase.RebaseInteractivePlanTest.moveDownTestThreeElementsWithOneComment -- Time elapsed: 0.158 s
11:41:41 [2024-03-05T16:41:41.307Z] org.eclipse.egit.core.test.rebase.RebaseInteractivePlanTest.moveUpTestThreeElementsWithOneComment -- Time elapsed: 0.157 s
11:41:41 [2024-03-05T16:41:41.307Z] org.eclipse.egit.core.test.rebase.RebaseInteractivePlanTest.moveDownTestTwoElements -- Time elapsed: 0.154 s
11:41:41 [2024-03-05T16:41:41.307Z] 
11:41:41 [2024-03-05T16:41:41.307Z] Results:
11:41:41 [2024-03-05T16:41:41.307Z] 
11:41:41 [2024-03-05T16:41:41.307Z] Failures: 
11:41:41 [2024-03-05T16:41:41.307Z]   GitMoveDeleteHookTest.testMoveProjectWithinGitRepoMoveFromTopOneLevelDown testMoveProjectWithinGitRepoMoveFromTopOneLevelDown("true" <from autoStage[0]>)
11:41:41 [2024-03-05T16:41:41.307Z] Errors: 
11:41:41 [2024-03-05T16:41:41.307Z]   GitMoveDeleteHookTest.tearDown:98 » Resource Problems encountered while deleting resources.
11:41:41 [2024-03-05T16:41:41.307Z]   GitMoveDeleteHookTest.tearDown:98 » Resource Problems encountered while deleting resources.
11:41:41 [2024-03-05T16:41:41.307Z]   GitMoveDeleteHookTest.tearDown:98 » Resource Problems encountered while deleting resources.
11:41:41 [2024-03-05T16:41:41.307Z] 
11:41:41 [2024-03-05T16:41:41.307Z] Tests run: 409, Failures: 1, Errors: 3, Skipped: 1
11:41:41 [2024-03-05T16:41:41.307Z] 
11:41:41 [2024-03-05T16:41:41.564Z] 
11:41:41 [2024-03-05T16:41:41.564Z] !ENTRY org.eclipse.core.resources 2 10035 2024-03-05 16:41:41.457
11:41:41 [2024-03-05T16:41:41.564Z] !MESSAGE The workspace will exit with unsaved changes in this session.
11:41:41 [2024-03-05T16:41:41.822Z] 16:41:41 [INFO] ------------------------------------------------------------------------
11:41:41 [2024-03-05T16:41:41.822Z] 16:41:41 [INFO] Reactor Summary for EGit Parent 6.9.1-SNAPSHOT:
11:41:41 [2024-03-05T16:41:41.822Z] 16:41:41 [INFO] 
11:41:41 [2024-03-05T16:41:41.822Z] 16:41:41 [INFO] EGit Parent ........................................ SUCCESS [ 25.045 s]
11:41:41 [2024-03-05T16:41:41.822Z] 16:41:41 [INFO] Eclipse EGit ....................................... SUCCESS [  5.454 s]
11:41:41 [2024-03-05T16:41:41.822Z] 16:41:41 [INFO] Git Team Provider (Core) ........................... SUCCESS [ 32.319 s]
11:41:41 [2024-03-05T16:41:41.822Z] 16:41:41 [INFO] Git Team Provider (UI) ............................. SUCCESS [01:16 min]
11:41:41 [2024-03-05T16:41:41.822Z] 16:41:41 [INFO] Git Team Provider (Documentation) .................. SUCCESS [  2.715 s]
11:41:41 [2024-03-05T16:41:41.822Z] 16:41:41 [INFO] Eclipse EGit Feature ............................... SUCCESS [  4.365 s]
11:41:41 [2024-03-05T16:41:41.822Z] 16:41:41 [INFO] Git Flow ........................................... SUCCESS [ 11.868 s]
11:41:41 [2024-03-05T16:41:41.822Z] 16:41:41 [INFO] Git Flow UI ........................................ SUCCESS [ 17.825 s]
11:41:41 [2024-03-05T16:41:41.822Z] 16:41:41 [INFO] Eclipse EGit Gitflow Feature ....................... SUCCESS [  5.578 s]
11:41:41 [2024-03-05T16:41:41.822Z] 16:41:41 [INFO] EGit JUnit Support ................................. SUCCESS [ 12.942 s]
11:41:41 [2024-03-05T16:41:41.822Z] 16:41:41 [INFO] GitFlow Test Plug-in ............................... SUCCESS [ 32.467 s]
11:41:41 [2024-03-05T16:41:41.822Z] 16:41:41 [INFO] Eclipse EGit Source Feature ........................ SUCCESS [  4.364 s]
11:41:41 [2024-03-05T16:41:41.822Z] 16:41:41 [INFO] EGit P2 Repository ................................. SUCCESS [ 33.560 s]
11:41:41 [2024-03-05T16:41:41.822Z] 16:41:41 [INFO] EGit Core Test Plug-in ............................. FAILURE [01:30 min]
11:41:41 [2024-03-05T16:41:41.822Z] 16:41:41 [INFO] EGit UI Test Plug-in ............................... SKIPPED
11:41:41 [2024-03-05T16:41:41.822Z] 16:41:41 [INFO] ------------------------------------------------------------------------
11:41:41 [2024-03-05T16:41:41.822Z] 16:41:41 [INFO] BUILD FAILURE
11:41:41 [2024-03-05T16:41:41.822Z] 16:41:41 [INFO] ------------------------------------------------------------------------
11:41:41 [2024-03-05T16:41:41.822Z] 16:41:41 [INFO] Total time:  06:41 min
11:41:41 [2024-03-05T16:41:41.822Z] 16:41:41 [INFO] Finished at: 2024-03-05T16:41:41Z
11:41:41 [2024-03-05T16:41:41.822Z] 16:41:41 [INFO] ------------------------------------------------------------------------
11:41:41 [2024-03-05T16:41:41.822Z] 16:41:41 [ERROR] Failed to execute goal org.eclipse.tycho:tycho-surefire-plugin:4.0.6:test (default-test) on project org.eclipse.egit.core.test: There are test failures.
11:41:41 [2024-03-05T16:41:41.822Z] 16:41:41 [ERROR] 
11:41:41 [2024-03-05T16:41:41.822Z] 16:41:41 [ERROR] Please refer to /home/jenkins/agent/workspace/egit/repo/org.eclipse.egit.core.test/target/surefire-reports for the individual test results.
11:41:41 [2024-03-05T16:41:41.822Z] 16:41:41 [ERROR] -> [Help 1]
11:41:41 [2024-03-05T16:41:41.822Z] org.apache.maven.lifecycle.LifecycleExecutionException: Failed to execute goal org.eclipse.tycho:tycho-surefire-plugin:4.0.6:test (default-test) on project org.eclipse.egit.core.test: There are test failures.
11:41:41 [2024-03-05T16:41:41.822Z] 
11:41:41 [2024-03-05T16:41:41.823Z] Please refer to /home/jenkins/agent/workspace/egit/repo/org.eclipse.egit.core.test/target/surefire-reports for the individual test results.
11:41:41 [2024-03-05T16:41:41.823Z] 
11:41:41 [2024-03-05T16:41:41.823Z] 
11:41:41 [2024-03-05T16:41:41.823Z]     at org.apache.maven.lifecycle.internal.MojoExecutor.doExecute2 (MojoExecutor.java:333)
11:41:41 [2024-03-05T16:41:41.823Z]     at org.apache.maven.lifecycle.internal.MojoExecutor.doExecute (MojoExecutor.java:316)
11:41:41 [2024-03-05T16:41:41.823Z]     at org.apache.maven.lifecycle.internal.MojoExecutor.execute (MojoExecutor.java:212)
11:41:41 [2024-03-05T16:41:41.823Z]     at org.apache.maven.lifecycle.internal.MojoExecutor.execute (MojoExecutor.java:174)
11:41:41 [2024-03-05T16:41:41.823Z]     at org.apache.maven.lifecycle.internal.MojoExecutor.access$000 (MojoExecutor.java:75)
11:41:41 [2024-03-05T16:41:41.823Z]     at org.apache.maven.lifecycle.internal.MojoExecutor$1.run (MojoExecutor.java:162)
11:41:41 [2024-03-05T16:41:41.823Z]     at org.apache.maven.plugin.DefaultMojosExecutionStrategy.execute (DefaultMojosExecutionStrategy.java:39)
11:41:41 [2024-03-05T16:41:41.823Z]     at org.apache.maven.lifecycle.internal.MojoExecutor.execute (MojoExecutor.java:159)
11:41:41 [2024-03-05T16:41:41.823Z]     at org.apache.maven.lifecycle.internal.LifecycleModuleBuilder.buildProject (LifecycleModuleBuilder.java:105)
11:41:41 [2024-03-05T16:41:41.823Z]     at org.apache.maven.lifecycle.internal.LifecycleModuleBuilder.buildProject (LifecycleModuleBuilder.java:73)
11:41:42 [2024-03-05T16:41:42.080Z]     at org.apache.maven.lifecycle.internal.builder.singlethreaded.SingleThreadedBuilder.build (SingleThreadedBuilder.java:53)
11:41:42 [2024-03-05T16:41:42.080Z]     at org.apache.maven.lifecycle.internal.LifecycleStarter.execute (LifecycleStarter.java:118)
11:41:42 [2024-03-05T16:41:42.080Z]     at org.apache.maven.DefaultMaven.doExecute (DefaultMaven.java:261)
11:41:42 [2024-03-05T16:41:42.080Z]     at org.apache.maven.DefaultMaven.doExecute (DefaultMaven.java:173)
11:41:42 [2024-03-05T16:41:42.080Z]     at org.apache.maven.DefaultMaven.execute (DefaultMaven.java:101)
11:41:42 [2024-03-05T16:41:42.080Z]     at org.apache.maven.cli.MavenCli.execute (MavenCli.java:906)
11:41:42 [2024-03-05T16:41:42.080Z]     at org.apache.maven.cli.MavenCli.doMain (MavenCli.java:283)
11:41:42 [2024-03-05T16:41:42.080Z]     at org.apache.maven.cli.MavenCli.main (MavenCli.java:206)
11:41:42 [2024-03-05T16:41:42.080Z]     at jdk.internal.reflect.NativeMethodAccessorImpl.invoke0 (Native Method)
11:41:42 [2024-03-05T16:41:42.080Z]     at jdk.internal.reflect.NativeMethodAccessorImpl.invoke (NativeMethodAccessorImpl.java:77)
11:41:42 [2024-03-05T16:41:42.080Z]     at jdk.internal.reflect.DelegatingMethodAccessorImpl.invoke (DelegatingMethodAccessorImpl.java:43)
11:41:42 [2024-03-05T16:41:42.080Z]     at java.lang.reflect.Method.invoke (Method.java:568)
11:41:42 [2024-03-05T16:41:42.080Z]     at org.codehaus.plexus.classworlds.launcher.Launcher.launchEnhanced (Launcher.java:283)
11:41:42 [2024-03-05T16:41:42.080Z]     at org.codehaus.plexus.classworlds.launcher.Launcher.launch (Launcher.java:226)
11:41:42 [2024-03-05T16:41:42.080Z]     at org.codehaus.plexus.classworlds.launcher.Launcher.mainWithExitCode (Launcher.java:407)
11:41:42 [2024-03-05T16:41:42.080Z]     at org.codehaus.plexus.classworlds.launcher.Launcher.main (Launcher.java:348)
11:41:42 [2024-03-05T16:41:42.080Z] Caused by: org.apache.maven.plugin.MojoFailureException: There are test failures.
11:41:42 [2024-03-05T16:41:42.080Z] 
11:41:42 [2024-03-05T16:41:42.080Z] Please refer to /home/jenkins/agent/workspace/egit/repo/org.eclipse.egit.core.test/target/surefire-reports for the individual test results.
11:41:42 [2024-03-05T16:41:42.080Z] 
11:41:42 [2024-03-05T16:41:42.080Z] 
11:41:42 [2024-03-05T16:41:42.080Z]     at org.eclipse.tycho.surefire.TestPluginMojo.handleTestFailures (TestPluginMojo.java:102)
11:41:42 [2024-03-05T16:41:42.081Z]     at org.eclipse.tycho.surefire.AbstractEclipseTestMojo.runTest (AbstractEclipseTestMojo.java:1041)
11:41:42 [2024-03-05T16:41:42.081Z]     at org.eclipse.tycho.surefire.AbstractEclipseTestMojo.runTests (AbstractEclipseTestMojo.java:641)
11:41:42 [2024-03-05T16:41:42.081Z]     at org.eclipse.tycho.surefire.AbstractTestMojo.execute (AbstractTestMojo.java:233)
11:41:42 [2024-03-05T16:41:42.081Z]     at org.apache.maven.plugin.DefaultBuildPluginManager.executeMojo (DefaultBuildPluginManager.java:126)
11:41:42 [2024-03-05T16:41:42.081Z]     at org.apache.maven.lifecycle.internal.MojoExecutor.doExecute2 (MojoExecutor.java:328)
11:41:42 [2024-03-05T16:41:42.081Z]     at org.apache.maven.lifecycle.internal.MojoExecutor.doExecute (MojoExecutor.java:316)
11:41:42 [2024-03-05T16:41:42.081Z]     at org.apache.maven.lifecycle.internal.MojoExecutor.execute (MojoExecutor.java:212)
11:41:42 [2024-03-05T16:41:42.081Z]     at org.apache.maven.lifecycle.internal.MojoExecutor.execute (MojoExecutor.java:174)
11:41:42 [2024-03-05T16:41:42.081Z]     at org.apache.maven.lifecycle.internal.MojoExecutor.access$000 (MojoExecutor.java:75)
11:41:42 [2024-03-05T16:41:42.081Z]     at org.apache.maven.lifecycle.internal.MojoExecutor$1.run (MojoExecutor.java:162)
11:41:42 [2024-03-05T16:41:42.081Z]     at org.apache.maven.plugin.DefaultMojosExecutionStrategy.execute (DefaultMojosExecutionStrategy.java:39)
11:41:42 [2024-03-05T16:41:42.081Z]     at org.apache.maven.lifecycle.internal.MojoExecutor.execute (MojoExecutor.java:159)
11:41:42 [2024-03-05T16:41:42.081Z]     at org.apache.maven.lifecycle.internal.LifecycleModuleBuilder.buildProject (LifecycleModuleBuilder.java:105)
11:41:42 [2024-03-05T16:41:42.081Z]     at org.apache.maven.lifecycle.internal.LifecycleModuleBuilder.buildProject (LifecycleModuleBuilder.java:73)
11:41:42 [2024-03-05T16:41:42.081Z]     at org.apache.maven.lifecycle.internal.builder.singlethreaded.SingleThreadedBuilder.build (SingleThreadedBuilder.java:53)
11:41:42 [2024-03-05T16:41:42.081Z]     at org.apache.maven.lifecycle.internal.LifecycleStarter.execute (LifecycleStarter.java:118)
11:41:42 [2024-03-05T16:41:42.081Z]     at org.apache.maven.DefaultMaven.doExecute (DefaultMaven.java:261)
11:41:42 [2024-03-05T16:41:42.081Z]     at org.apache.maven.DefaultMaven.doExecute (DefaultMaven.java:173)
11:41:42 [2024-03-05T16:41:42.081Z]     at org.apache.maven.DefaultMaven.execute (DefaultMaven.java:101)
11:41:42 [2024-03-05T16:41:42.081Z]     at org.apache.maven.cli.MavenCli.execute (MavenCli.java:906)
11:41:42 [2024-03-05T16:41:42.081Z]     at org.apache.maven.cli.MavenCli.doMain (MavenCli.java:283)
11:41:42 [2024-03-05T16:41:42.081Z]     at org.apache.maven.cli.MavenCli.main (MavenCli.java:206)
11:41:42 [2024-03-05T16:41:42.081Z]     at jdk.internal.reflect.NativeMethodAccessorImpl.invoke0 (Native Method)
11:41:42 [2024-03-05T16:41:42.081Z]     at jdk.internal.reflect.NativeMethodAccessorImpl.invoke (NativeMethodAccessorImpl.java:77)
11:41:42 [2024-03-05T16:41:42.081Z]     at jdk.internal.reflect.DelegatingMethodAccessorImpl.invoke (DelegatingMethodAccessorImpl.java:43)
11:41:42 [2024-03-05T16:41:42.081Z]     at java.lang.reflect.Method.invoke (Method.java:568)
11:41:42 [2024-03-05T16:41:42.081Z]     at org.codehaus.plexus.classworlds.launcher.Launcher.launchEnhanced (Launcher.java:283)
11:41:42 [2024-03-05T16:41:42.081Z]     at org.codehaus.plexus.classworlds.launcher.Launcher.launch (Launcher.java:226)
11:41:42 [2024-03-05T16:41:42.081Z]     at org.codehaus.plexus.classworlds.launcher.Launcher.mainWithExitCode (Launcher.java:407)
11:41:42 [2024-03-05T16:41:42.081Z]     at org.codehaus.plexus.classworlds.launcher.Launcher.main (Launcher.java:348)
11:41:42 [2024-03-05T16:41:42.081Z] 16:41:41 [ERROR] 
11:41:42 [2024-03-05T16:41:42.081Z] 16:41:41 [ERROR] Re-run Maven using the -X switch to enable full debug logging.
11:41:42 [2024-03-05T16:41:42.081Z] 16:41:41 [ERROR] 
11:41:42 [2024-03-05T16:41:42.081Z] 16:41:41 [ERROR] For more information about the errors and possible solutions, please read the following articles:
11:41:42 [2024-03-05T16:41:42.081Z] 16:41:41 [ERROR] [Help 1] http://cwiki.apache.org/confluence/display/MAVEN/MojoFailureException
11:41:42 [2024-03-05T16:41:42.081Z] 16:41:41 [ERROR] 
11:41:42 [2024-03-05T16:41:42.081Z] 16:41:41 [ERROR] After correcting the problems, you can resume the build with the command
11:41:42 [2024-03-05T16:41:42.081Z] 16:41:41 [ERROR]   mvn <args> -rf :org.eclipse.egit.core.test
11:41:42 [2024-03-05T16:41:42.081Z] Exception in thread "Thread-5" java.lang.NoClassDefFoundError: org/eclipse/jgit/internal/JGitText
11:41:42 [2024-03-05T16:41:42.081Z] 	at org.eclipse.jgit.internal.util.ShutdownHook.cleanup(ShutdownHook.java:85)
11:41:42 [2024-03-05T16:41:42.081Z] 	at java.base/java.lang.Thread.run(Thread.java:840)
11:41:42 [2024-03-05T16:41:42.081Z] Caused by: java.lang.ClassNotFoundException: org.eclipse.jgit.internal.JGitText
11:41:42 [2024-03-05T16:41:42.081Z] 	... 2 more
[Pipeline] }
[Pipeline] // withCredentials
[Pipeline] }
[Pipeline] // stage
[Pipeline] stage
[Pipeline] { (Results)
[Pipeline] archiveArtifacts
11:41:42 [2024-03-05T16:41:42.386Z] Archiving artifacts
[Pipeline] junit
11:41:50 [2024-03-05T16:41:50.658Z] Recording test results
11:41:51 [2024-03-05T16:41:51.366Z] [Checks API] No suitable checks publisher found.
[Pipeline] recordIssues
11:41:57 [2024-03-05T16:41:57.167Z] [SpotBugs] Searching for all files in '/home/jenkins/agent/workspace/egit/repo' that match the pattern '*/target/*bugsXml.xml'
11:41:57 [2024-03-05T16:41:57.167Z] [SpotBugs] Traversing of symbolic links: enabled
11:41:57 [2024-03-05T16:41:57.167Z] [SpotBugs] -> found 6 files
11:41:57 [2024-03-05T16:41:57.167Z] [SpotBugs] Successfully parsed file /home/jenkins/agent/workspace/egit/repo/org.eclipse.egit.core.junit/target/spotbugsXml.xml
11:41:57 [2024-03-05T16:41:57.167Z] [SpotBugs] -> found 10 issues (skipped 0 duplicates)
11:41:57 [2024-03-05T16:41:57.167Z] [SpotBugs] Successfully processed file 'org.eclipse.egit.core.junit/target/spotbugsXml.xml'
11:41:57 [2024-03-05T16:41:57.167Z] [SpotBugs] Successfully parsed file /home/jenkins/agent/workspace/egit/repo/org.eclipse.egit.core/target/spotbugsXml.xml
11:41:57 [2024-03-05T16:41:57.167Z] [SpotBugs] -> found 20 issues (skipped 0 duplicates)
11:41:57 [2024-03-05T16:41:57.167Z] [SpotBugs] Successfully processed file 'org.eclipse.egit.core/target/spotbugsXml.xml'
11:41:57 [2024-03-05T16:41:57.167Z] [SpotBugs] Successfully parsed file /home/jenkins/agent/workspace/egit/repo/org.eclipse.egit.gitflow.test/target/spotbugsXml.xml
11:41:57 [2024-03-05T16:41:57.167Z] [SpotBugs] -> found 0 issues (skipped 0 duplicates)
11:41:57 [2024-03-05T16:41:57.167Z] [SpotBugs] Successfully processed file 'org.eclipse.egit.gitflow.test/target/spotbugsXml.xml'
11:41:57 [2024-03-05T16:41:57.167Z] [SpotBugs] Successfully parsed file /home/jenkins/agent/workspace/egit/repo/org.eclipse.egit.gitflow.ui/target/spotbugsXml.xml
11:41:57 [2024-03-05T16:41:57.167Z] [SpotBugs] -> found 9 issues (skipped 0 duplicates)
11:41:57 [2024-03-05T16:41:57.167Z] [SpotBugs] Successfully processed file 'org.eclipse.egit.gitflow.ui/target/spotbugsXml.xml'
11:41:57 [2024-03-05T16:41:57.167Z] [SpotBugs] Successfully parsed file /home/jenkins/agent/workspace/egit/repo/org.eclipse.egit.gitflow/target/spotbugsXml.xml
11:41:57 [2024-03-05T16:41:57.167Z] [SpotBugs] -> found 9 issues (skipped 0 duplicates)
11:41:57 [2024-03-05T16:41:57.167Z] [SpotBugs] Successfully processed file 'org.eclipse.egit.gitflow/target/spotbugsXml.xml'
11:41:57 [2024-03-05T16:41:57.167Z] [SpotBugs] Successfully parsed file /home/jenkins/agent/workspace/egit/repo/org.eclipse.egit.ui/target/spotbugsXml.xml
11:41:57 [2024-03-05T16:41:57.167Z] [SpotBugs] -> found 31 issues (skipped 0 duplicates)
11:41:57 [2024-03-05T16:41:57.167Z] [SpotBugs] Successfully processed file 'org.eclipse.egit.ui/target/spotbugsXml.xml'
11:41:59 [2024-03-05T16:41:59.395Z] [SpotBugs] Post processing issues on 'centos-7-26d7j' with source code encoding 'UTF-8'
11:41:59 [2024-03-05T16:41:59.395Z] [SpotBugs] Creating SCM blamer to obtain author and commit information for affected files
11:41:59 [2024-03-05T16:41:59.395Z] [SpotBugs] -> No blamer installed yet. You need to install the 'git-forensics' plugin to enable blaming for Git.
11:41:59 [2024-03-05T16:41:59.395Z] [SpotBugs] Resolving file names for all issues in workspace '/home/jenkins/agent/workspace/egit/repo'
11:41:59 [2024-03-05T16:41:59.395Z] [SpotBugs] -> resolved paths in source directory (50 found, 0 not found)
11:41:59 [2024-03-05T16:41:59.395Z] [SpotBugs] Resolving module names from module definitions (build.xml, pom.xml, or Manifest.mf files)
11:41:59 [2024-03-05T16:41:59.395Z] [SpotBugs] -> all issues already have a valid module name
11:41:59 [2024-03-05T16:41:59.395Z] [SpotBugs] Resolving package names (or namespaces) by parsing the affected files
11:41:59 [2024-03-05T16:41:59.395Z] [SpotBugs] -> all affected files already have a valid package name
11:41:59 [2024-03-05T16:41:59.395Z] [SpotBugs] No filter has been set, publishing all 79 issues
11:41:59 [2024-03-05T16:41:59.395Z] [SpotBugs] Creating fingerprints for all affected code blocks to track issues over different builds
11:41:59 [2024-03-05T16:41:59.395Z] [SpotBugs] -> created fingerprints for 0 issues (skipped 79 issues)
11:41:59 [2024-03-05T16:41:59.395Z] [SpotBugs] Copying affected files to Jenkins' build folder '/var/jenkins/jobs/egit/builds/885/files-with-issues'
11:41:59 [2024-03-05T16:41:59.395Z] [SpotBugs] -> 50 copied, 0 not in workspace, 0 not-found, 0 with I/O error
11:41:59 [2024-03-05T16:41:59.395Z] [SpotBugs] Repository miner is not configured, skipping repository mining
11:41:59 [2024-03-05T16:41:59.397Z] [SpotBugs] Searching for all files in '/home/jenkins/agent/workspace/egit/repo' that match the pattern '*/target/*bugsXml.xml'
11:41:59 [2024-03-05T16:41:59.397Z] [SpotBugs] Traversing of symbolic links: enabled
11:41:59 [2024-03-05T16:41:59.397Z] [SpotBugs] -> found 6 files
11:41:59 [2024-03-05T16:41:59.397Z] [SpotBugs] Successfully parsed file /home/jenkins/agent/workspace/egit/repo/org.eclipse.egit.core.junit/target/spotbugsXml.xml
11:41:59 [2024-03-05T16:41:59.397Z] [SpotBugs] -> found 10 issues (skipped 0 duplicates)
11:41:59 [2024-03-05T16:41:59.397Z] [SpotBugs] Successfully processed file 'org.eclipse.egit.core.junit/target/spotbugsXml.xml'
11:41:59 [2024-03-05T16:41:59.397Z] [SpotBugs] Successfully parsed file /home/jenkins/agent/workspace/egit/repo/org.eclipse.egit.core/target/spotbugsXml.xml
11:41:59 [2024-03-05T16:41:59.397Z] [SpotBugs] -> found 20 issues (skipped 0 duplicates)
11:41:59 [2024-03-05T16:41:59.397Z] [SpotBugs] Successfully processed file 'org.eclipse.egit.core/target/spotbugsXml.xml'
11:41:59 [2024-03-05T16:41:59.397Z] [SpotBugs] Successfully parsed file /home/jenkins/agent/workspace/egit/repo/org.eclipse.egit.gitflow.test/target/spotbugsXml.xml
11:41:59 [2024-03-05T16:41:59.397Z] [SpotBugs] -> found 0 issues (skipped 0 duplicates)
11:41:59 [2024-03-05T16:41:59.397Z] [SpotBugs] Successfully processed file 'org.eclipse.egit.gitflow.test/target/spotbugsXml.xml'
11:41:59 [2024-03-05T16:41:59.397Z] [SpotBugs] Successfully parsed file /home/jenkins/agent/workspace/egit/repo/org.eclipse.egit.gitflow.ui/target/spotbugsXml.xml
11:41:59 [2024-03-05T16:41:59.397Z] [SpotBugs] -> found 9 issues (skipped 0 duplicates)
11:41:59 [2024-03-05T16:41:59.397Z] [SpotBugs] Successfully processed file 'org.eclipse.egit.gitflow.ui/target/spotbugsXml.xml'
11:41:59 [2024-03-05T16:41:59.397Z] [SpotBugs] Successfully parsed file /home/jenkins/agent/workspace/egit/repo/org.eclipse.egit.gitflow/target/spotbugsXml.xml
11:41:59 [2024-03-05T16:41:59.397Z] [SpotBugs] -> found 9 issues (skipped 0 duplicates)
11:41:59 [2024-03-05T16:41:59.397Z] [SpotBugs] Successfully processed file 'org.eclipse.egit.gitflow/target/spotbugsXml.xml'
11:41:59 [2024-03-05T16:41:59.397Z] [SpotBugs] Successfully parsed file /home/jenkins/agent/workspace/egit/repo/org.eclipse.egit.ui/target/spotbugsXml.xml
11:41:59 [2024-03-05T16:41:59.397Z] [SpotBugs] -> found 31 issues (skipped 0 duplicates)
11:41:59 [2024-03-05T16:41:59.397Z] [SpotBugs] Successfully processed file 'org.eclipse.egit.ui/target/spotbugsXml.xml'
11:41:59 [2024-03-05T16:41:59.397Z] [SpotBugs] Post processing issues on 'centos-7-26d7j' with source code encoding 'UTF-8'
11:41:59 [2024-03-05T16:41:59.397Z] [SpotBugs] Creating SCM blamer to obtain author and commit information for affected files
11:41:59 [2024-03-05T16:41:59.397Z] [SpotBugs] -> No blamer installed yet. You need to install the 'git-forensics' plugin to enable blaming for Git.
11:41:59 [2024-03-05T16:41:59.397Z] [SpotBugs] Resolving file names for all issues in workspace '/home/jenkins/agent/workspace/egit/repo'
11:41:59 [2024-03-05T16:41:59.397Z] [SpotBugs] -> resolved paths in source directory (50 found, 0 not found)
11:41:59 [2024-03-05T16:41:59.397Z] [SpotBugs] Resolving module names from module definitions (build.xml, pom.xml, or Manifest.mf files)
11:41:59 [2024-03-05T16:41:59.397Z] [SpotBugs] -> all issues already have a valid module name
11:41:59 [2024-03-05T16:41:59.397Z] [SpotBugs] Resolving package names (or namespaces) by parsing the affected files
11:41:59 [2024-03-05T16:41:59.397Z] [SpotBugs] -> all affected files already have a valid package name
11:41:59 [2024-03-05T16:41:59.397Z] [SpotBugs] No filter has been set, publishing all 79 issues
11:41:59 [2024-03-05T16:41:59.397Z] [SpotBugs] Creating fingerprints for all affected code blocks to track issues over different builds
11:41:59 [2024-03-05T16:41:59.397Z] [SpotBugs] -> created fingerprints for 0 issues (skipped 79 issues)
11:41:59 [2024-03-05T16:41:59.397Z] [SpotBugs] Copying affected files to Jenkins' build folder '/var/jenkins/jobs/egit/builds/885/files-with-issues'
11:41:59 [2024-03-05T16:41:59.397Z] [SpotBugs] -> 50 copied, 0 not in workspace, 0 not-found, 0 with I/O error
11:41:59 [2024-03-05T16:41:59.397Z] [SpotBugs] Repository miner is not configured, skipping repository mining
11:41:59 [2024-03-05T16:41:59.509Z] [SpotBugs] Reference build recorder is not configured
11:41:59 [2024-03-05T16:41:59.509Z] [SpotBugs] Obtaining reference build from same job (egit)
11:41:59 [2024-03-05T16:41:59.509Z] [SpotBugs] Using reference build 'egit #882' to compute new, fixed, and outstanding issues
11:41:59 [2024-03-05T16:41:59.510Z] [SpotBugs] Issues delta (vs. reference build): outstanding: 79, new: 0, fixed: 44
11:41:59 [2024-03-05T16:41:59.510Z] [SpotBugs] No quality gates have been set - skipping
11:41:59 [2024-03-05T16:41:59.510Z] [SpotBugs] Health report is disabled - skipping
11:41:59 [2024-03-05T16:41:59.510Z] [SpotBugs] Created analysis result for 79 issues (found 0 new issues, fixed 44 issues)
11:41:59 [2024-03-05T16:41:59.510Z] [SpotBugs] Attaching ResultAction with ID 'spotbugs' to build 'egit #885'.
11:41:59 [2024-03-05T16:41:59.576Z] [Checks API] No suitable checks publisher found.
11:41:59 [2024-03-05T16:41:59.576Z] [CPD] Using default pattern '**/cpd.xml' since user defined pattern is not set
11:42:00 [2024-03-05T16:42:00.161Z] [CPD] Searching for all files in '/home/jenkins/agent/workspace/egit/repo' that match the pattern '**/cpd.xml'
11:42:00 [2024-03-05T16:42:00.161Z] [CPD] Traversing of symbolic links: enabled
11:42:00 [2024-03-05T16:42:00.161Z] [CPD] -> found 12 files
11:42:00 [2024-03-05T16:42:00.161Z] [CPD] Successfully parsed file /home/jenkins/agent/workspace/egit/repo/org.eclipse.egit-feature/target/cpd.xml
11:42:00 [2024-03-05T16:42:00.161Z] [CPD] -> found 0 issues (skipped 0 duplicates)
11:42:00 [2024-03-05T16:42:00.161Z] [CPD] Successfully processed file 'org.eclipse.egit-feature/target/cpd.xml'
11:42:00 [2024-03-05T16:42:00.161Z] [CPD] Successfully parsed file /home/jenkins/agent/workspace/egit/repo/org.eclipse.egit.core.junit/target/cpd.xml
11:42:00 [2024-03-05T16:42:00.161Z] [CPD] -> found 0 issues (skipped 0 duplicates)
11:42:00 [2024-03-05T16:42:00.161Z] [CPD] Successfully processed file 'org.eclipse.egit.core.junit/target/cpd.xml'
11:42:00 [2024-03-05T16:42:00.161Z] [CPD] Successfully parsed file /home/jenkins/agent/workspace/egit/repo/org.eclipse.egit.core/target/cpd.xml
11:42:00 [2024-03-05T16:42:00.161Z] [CPD] -> found 2 issues (skipped 0 duplicates)
11:42:00 [2024-03-05T16:42:00.161Z] [CPD] Successfully processed file 'org.eclipse.egit.core/target/cpd.xml'
11:42:00 [2024-03-05T16:42:00.161Z] [CPD] Successfully parsed file /home/jenkins/agent/workspace/egit/repo/org.eclipse.egit.doc/target/cpd.xml
11:42:00 [2024-03-05T16:42:00.161Z] [CPD] -> found 0 issues (skipped 0 duplicates)
11:42:00 [2024-03-05T16:42:00.161Z] [CPD] Successfully processed file 'org.eclipse.egit.doc/target/cpd.xml'
11:42:00 [2024-03-05T16:42:00.161Z] [CPD] Successfully parsed file /home/jenkins/agent/workspace/egit/repo/org.eclipse.egit.gitflow-feature/target/cpd.xml
11:42:00 [2024-03-05T16:42:00.161Z] [CPD] -> found 0 issues (skipped 0 duplicates)
11:42:00 [2024-03-05T16:42:00.161Z] [CPD] Successfully processed file 'org.eclipse.egit.gitflow-feature/target/cpd.xml'
11:42:00 [2024-03-05T16:42:00.161Z] [CPD] Successfully parsed file /home/jenkins/agent/workspace/egit/repo/org.eclipse.egit.gitflow.test/target/cpd.xml
11:42:00 [2024-03-05T16:42:00.161Z] [CPD] -> found 0 issues (skipped 0 duplicates)
11:42:00 [2024-03-05T16:42:00.161Z] [CPD] Successfully processed file 'org.eclipse.egit.gitflow.test/target/cpd.xml'
11:42:00 [2024-03-05T16:42:00.161Z] [CPD] Successfully parsed file /home/jenkins/agent/workspace/egit/repo/org.eclipse.egit.gitflow.ui/target/cpd.xml
11:42:00 [2024-03-05T16:42:00.161Z] [CPD] -> found 0 issues (skipped 0 duplicates)
11:42:00 [2024-03-05T16:42:00.161Z] [CPD] Successfully processed file 'org.eclipse.egit.gitflow.ui/target/cpd.xml'
11:42:00 [2024-03-05T16:42:00.161Z] [CPD] Successfully parsed file /home/jenkins/agent/workspace/egit/repo/org.eclipse.egit.gitflow/target/cpd.xml
11:42:00 [2024-03-05T16:42:00.161Z] [CPD] -> found 0 issues (skipped 0 duplicates)
11:42:00 [2024-03-05T16:42:00.161Z] [CPD] Successfully processed file 'org.eclipse.egit.gitflow/target/cpd.xml'
11:42:00 [2024-03-05T16:42:00.161Z] [CPD] Successfully parsed file /home/jenkins/agent/workspace/egit/repo/org.eclipse.egit.repository/target/cpd.xml
11:42:00 [2024-03-05T16:42:00.161Z] [CPD] -> found 0 issues (skipped 0 duplicates)
11:42:00 [2024-03-05T16:42:00.161Z] [CPD] Successfully processed file 'org.eclipse.egit.repository/target/cpd.xml'
11:42:00 [2024-03-05T16:42:00.161Z] [CPD] Successfully parsed file /home/jenkins/agent/workspace/egit/repo/org.eclipse.egit.source-feature/target/cpd.xml
11:42:00 [2024-03-05T16:42:00.161Z] [CPD] -> found 0 issues (skipped 0 duplicates)
11:42:00 [2024-03-05T16:42:00.161Z] [CPD] Successfully processed file 'org.eclipse.egit.source-feature/target/cpd.xml'
11:42:00 [2024-03-05T16:42:00.161Z] [CPD] Successfully parsed file /home/jenkins/agent/workspace/egit/repo/org.eclipse.egit.ui/target/cpd.xml
11:42:00 [2024-03-05T16:42:00.161Z] [CPD] -> found 24 issues (skipped 0 duplicates)
11:42:00 [2024-03-05T16:42:00.161Z] [CPD] Successfully processed file 'org.eclipse.egit.ui/target/cpd.xml'
11:42:00 [2024-03-05T16:42:00.162Z] [CPD] Successfully parsed file /home/jenkins/agent/workspace/egit/repo/org.eclipse.egit/target/cpd.xml
11:42:00 [2024-03-05T16:42:00.162Z] [CPD] -> found 0 issues (skipped 0 duplicates)
11:42:00 [2024-03-05T16:42:00.162Z] [CPD] Successfully processed file 'org.eclipse.egit/target/cpd.xml'
11:42:01 [2024-03-05T16:42:01.959Z] [CPD] Post processing issues on 'centos-7-26d7j' with source code encoding 'UTF-8'
11:42:01 [2024-03-05T16:42:01.959Z] [CPD] Creating SCM blamer to obtain author and commit information for affected files
11:42:01 [2024-03-05T16:42:01.959Z] [CPD] -> No blamer installed yet. You need to install the 'git-forensics' plugin to enable blaming for Git.
11:42:01 [2024-03-05T16:42:01.959Z] [CPD] Resolving file names for all issues in workspace '/home/jenkins/agent/workspace/egit/repo'
11:42:01 [2024-03-05T16:42:01.959Z] [CPD] -> resolved paths in source directory (18 found, 0 not found)
11:42:01 [2024-03-05T16:42:01.959Z] [CPD] Resolving module names from module definitions (build.xml, pom.xml, or Manifest.mf files)
11:42:01 [2024-03-05T16:42:01.959Z] [CPD] -> resolved module names for 26 issues
11:42:01 [2024-03-05T16:42:01.959Z] [CPD] Resolving package names (or namespaces) by parsing the affected files
11:42:01 [2024-03-05T16:42:01.959Z] [CPD] -> resolved package names of 18 affected files
11:42:01 [2024-03-05T16:42:01.959Z] [CPD] No filter has been set, publishing all 26 issues
11:42:01 [2024-03-05T16:42:01.959Z] [CPD] Creating fingerprints for all affected code blocks to track issues over different builds
11:42:01 [2024-03-05T16:42:01.959Z] [CPD] -> created fingerprints for 26 issues (skipped 0 issues)
11:42:01 [2024-03-05T16:42:01.959Z] [CPD] Copying affected files to Jenkins' build folder '/var/jenkins/jobs/egit/builds/885/files-with-issues'
11:42:01 [2024-03-05T16:42:01.959Z] [CPD] -> 17 copied, 0 not in workspace, 0 not-found, 0 with I/O error
11:42:01 [2024-03-05T16:42:01.959Z] [CPD] Repository miner is not configured, skipping repository mining
11:42:01 [2024-03-05T16:42:01.960Z] [CPD] Searching for all files in '/home/jenkins/agent/workspace/egit/repo' that match the pattern '**/cpd.xml'
11:42:01 [2024-03-05T16:42:01.960Z] [CPD] Traversing of symbolic links: enabled
11:42:01 [2024-03-05T16:42:01.960Z] [CPD] -> found 12 files
11:42:01 [2024-03-05T16:42:01.960Z] [CPD] Successfully parsed file /home/jenkins/agent/workspace/egit/repo/org.eclipse.egit-feature/target/cpd.xml
11:42:01 [2024-03-05T16:42:01.960Z] [CPD] -> found 0 issues (skipped 0 duplicates)
11:42:01 [2024-03-05T16:42:01.960Z] [CPD] Successfully processed file 'org.eclipse.egit-feature/target/cpd.xml'
11:42:01 [2024-03-05T16:42:01.960Z] [CPD] Successfully parsed file /home/jenkins/agent/workspace/egit/repo/org.eclipse.egit.core.junit/target/cpd.xml
11:42:01 [2024-03-05T16:42:01.960Z] [CPD] -> found 0 issues (skipped 0 duplicates)
11:42:01 [2024-03-05T16:42:01.960Z] [CPD] Successfully processed file 'org.eclipse.egit.core.junit/target/cpd.xml'
11:42:01 [2024-03-05T16:42:01.960Z] [CPD] Successfully parsed file /home/jenkins/agent/workspace/egit/repo/org.eclipse.egit.core/target/cpd.xml
11:42:01 [2024-03-05T16:42:01.960Z] [CPD] -> found 2 issues (skipped 0 duplicates)
11:42:01 [2024-03-05T16:42:01.960Z] [CPD] Successfully processed file 'org.eclipse.egit.core/target/cpd.xml'
11:42:01 [2024-03-05T16:42:01.960Z] [CPD] Successfully parsed file /home/jenkins/agent/workspace/egit/repo/org.eclipse.egit.doc/target/cpd.xml
11:42:01 [2024-03-05T16:42:01.960Z] [CPD] -> found 0 issues (skipped 0 duplicates)
11:42:01 [2024-03-05T16:42:01.960Z] [CPD] Successfully processed file 'org.eclipse.egit.doc/target/cpd.xml'
11:42:01 [2024-03-05T16:42:01.960Z] [CPD] Successfully parsed file /home/jenkins/agent/workspace/egit/repo/org.eclipse.egit.gitflow-feature/target/cpd.xml
11:42:01 [2024-03-05T16:42:01.960Z] [CPD] -> found 0 issues (skipped 0 duplicates)
11:42:01 [2024-03-05T16:42:01.960Z] [CPD] Successfully processed file 'org.eclipse.egit.gitflow-feature/target/cpd.xml'
11:42:01 [2024-03-05T16:42:01.960Z] [CPD] Successfully parsed file /home/jenkins/agent/workspace/egit/repo/org.eclipse.egit.gitflow.test/target/cpd.xml
11:42:01 [2024-03-05T16:42:01.960Z] [CPD] -> found 0 issues (skipped 0 duplicates)
11:42:01 [2024-03-05T16:42:01.960Z] [CPD] Successfully processed file 'org.eclipse.egit.gitflow.test/target/cpd.xml'
11:42:01 [2024-03-05T16:42:01.960Z] [CPD] Successfully parsed file /home/jenkins/agent/workspace/egit/repo/org.eclipse.egit.gitflow.ui/target/cpd.xml
11:42:01 [2024-03-05T16:42:01.960Z] [CPD] -> found 0 issues (skipped 0 duplicates)
11:42:01 [2024-03-05T16:42:01.960Z] [CPD] Successfully processed file 'org.eclipse.egit.gitflow.ui/target/cpd.xml'
11:42:01 [2024-03-05T16:42:01.960Z] [CPD] Successfully parsed file /home/jenkins/agent/workspace/egit/repo/org.eclipse.egit.gitflow/target/cpd.xml
11:42:01 [2024-03-05T16:42:01.960Z] [CPD] -> found 0 issues (skipped 0 duplicates)
11:42:01 [2024-03-05T16:42:01.960Z] [CPD] Successfully processed file 'org.eclipse.egit.gitflow/target/cpd.xml'
11:42:01 [2024-03-05T16:42:01.960Z] [CPD] Successfully parsed file /home/jenkins/agent/workspace/egit/repo/org.eclipse.egit.repository/target/cpd.xml
11:42:01 [2024-03-05T16:42:01.960Z] [CPD] -> found 0 issues (skipped 0 duplicates)
11:42:01 [2024-03-05T16:42:01.961Z] [CPD] Successfully processed file 'org.eclipse.egit.repository/target/cpd.xml'
11:42:01 [2024-03-05T16:42:01.961Z] [CPD] Successfully parsed file /home/jenkins/agent/workspace/egit/repo/org.eclipse.egit.source-feature/target/cpd.xml
11:42:01 [2024-03-05T16:42:01.961Z] [CPD] -> found 0 issues (skipped 0 duplicates)
11:42:01 [2024-03-05T16:42:01.961Z] [CPD] Successfully processed file 'org.eclipse.egit.source-feature/target/cpd.xml'
11:42:01 [2024-03-05T16:42:01.961Z] [CPD] Successfully parsed file /home/jenkins/agent/workspace/egit/repo/org.eclipse.egit.ui/target/cpd.xml
11:42:01 [2024-03-05T16:42:01.961Z] [CPD] -> found 24 issues (skipped 0 duplicates)
11:42:01 [2024-03-05T16:42:01.961Z] [CPD] Successfully processed file 'org.eclipse.egit.ui/target/cpd.xml'
11:42:01 [2024-03-05T16:42:01.961Z] [CPD] Successfully parsed file /home/jenkins/agent/workspace/egit/repo/org.eclipse.egit/target/cpd.xml
11:42:01 [2024-03-05T16:42:01.961Z] [CPD] -> found 0 issues (skipped 0 duplicates)
11:42:01 [2024-03-05T16:42:01.961Z] [CPD] Successfully processed file 'org.eclipse.egit/target/cpd.xml'
11:42:01 [2024-03-05T16:42:01.961Z] [CPD] Post processing issues on 'centos-7-26d7j' with source code encoding 'UTF-8'
11:42:01 [2024-03-05T16:42:01.961Z] [CPD] Creating SCM blamer to obtain author and commit information for affected files
11:42:01 [2024-03-05T16:42:01.961Z] [CPD] -> No blamer installed yet. You need to install the 'git-forensics' plugin to enable blaming for Git.
11:42:01 [2024-03-05T16:42:01.961Z] [CPD] Resolving file names for all issues in workspace '/home/jenkins/agent/workspace/egit/repo'
11:42:01 [2024-03-05T16:42:01.961Z] [CPD] -> resolved paths in source directory (18 found, 0 not found)
11:42:01 [2024-03-05T16:42:01.961Z] [CPD] Resolving module names from module definitions (build.xml, pom.xml, or Manifest.mf files)
11:42:01 [2024-03-05T16:42:01.961Z] [CPD] -> resolved module names for 26 issues
11:42:01 [2024-03-05T16:42:01.961Z] [CPD] Resolving package names (or namespaces) by parsing the affected files
11:42:01 [2024-03-05T16:42:01.961Z] [CPD] -> resolved package names of 18 affected files
11:42:01 [2024-03-05T16:42:01.961Z] [CPD] No filter has been set, publishing all 26 issues
11:42:01 [2024-03-05T16:42:01.961Z] [CPD] Creating fingerprints for all affected code blocks to track issues over different builds
11:42:01 [2024-03-05T16:42:01.961Z] [CPD] -> created fingerprints for 26 issues (skipped 0 issues)
11:42:01 [2024-03-05T16:42:01.961Z] [CPD] Copying affected files to Jenkins' build folder '/var/jenkins/jobs/egit/builds/885/files-with-issues'
11:42:01 [2024-03-05T16:42:01.961Z] [CPD] -> 17 copied, 0 not in workspace, 0 not-found, 0 with I/O error
11:42:01 [2024-03-05T16:42:01.961Z] [CPD] Repository miner is not configured, skipping repository mining
11:42:02 [2024-03-05T16:42:02.061Z] [CPD] Reference build recorder is not configured
11:42:02 [2024-03-05T16:42:02.061Z] [CPD] Obtaining reference build from same job (egit)
11:42:02 [2024-03-05T16:42:02.061Z] [CPD] Using reference build 'egit #882' to compute new, fixed, and outstanding issues
11:42:02 [2024-03-05T16:42:02.061Z] [CPD] Issues delta (vs. reference build): outstanding: 26, new: 0, fixed: 0
11:42:02 [2024-03-05T16:42:02.061Z] [CPD] No quality gates have been set - skipping
11:42:02 [2024-03-05T16:42:02.061Z] [CPD] Health report is disabled - skipping
11:42:02 [2024-03-05T16:42:02.061Z] [CPD] Created analysis result for 26 issues (found 0 new issues, fixed 0 issues)
11:42:02 [2024-03-05T16:42:02.061Z] [CPD] Attaching ResultAction with ID 'cpd' to build 'egit #885'.
11:42:02 [2024-03-05T16:42:02.115Z] [Checks API] No suitable checks publisher found.
[Pipeline] }
[Pipeline] // stage
[Pipeline] step
11:42:02 [2024-03-05T16:42:02.143Z] Sending e-mails to: egit-build@eclipse.org
[Pipeline] }
[Pipeline] // dir
[Pipeline] }
11:42:02 [2024-03-05T16:42:02.413Z] Terminating xvnc.
[Pipeline] // xvnc
[Pipeline] }
[Pipeline] // timeout
[Pipeline] }
[Pipeline] // node
[Pipeline] }
[Pipeline] // timestamps
[Pipeline] End of Pipeline
ERROR: script returned exit code 1
Finished: FAILURE