Console Output

Skipping 176 KB.. Full Log
Downloading: https://repo.eclipse.org/content/repositories/cbi-releases/org/sonatype/sisu/sisu-guice/3.1.0/sisu-guice-3.1.0-no_aop.jar
Downloading: https://repo.eclipse.org/content/repositories/cbi-releases/org/sonatype/sisu/sisu-guava/0.9.9/sisu-guava-0.9.9.jar
Downloading: https://repo.eclipse.org/content/repositories/cbi-releases/org/apache/httpcomponents/httpclient/4.1.3/httpclient-4.1.3.jar
Downloading: https://repo.eclipse.org/content/repositories/cbi-releases/org/apache/httpcomponents/httpcore/4.1.4/httpcore-4.1.4.jar
Downloading: https://repo.eclipse.org/content/repositories/cbi-releases/commons-logging/commons-logging/1.1.1/commons-logging-1.1.1.jar
Downloading: https://repo.eclipse.org/content/repositories/cbi-releases/commons-codec/commons-codec/1.4/commons-codec-1.4.jar
Downloading: https://repo.eclipse.org/content/repositories/cbi-releases/org/apache/httpcomponents/httpmime/4.1.3/httpmime-4.1.3.jar
Downloading: https://repo.eclipse.org/content/repositories/cbi-releases/org/codehaus/plexus/plexus-utils/3.0.10/plexus-utils-3.0.10.jar
Downloading: https://repo.eclipse.org/content/repositories/maven_central/org/sonatype/aether/aether-util/1.13.1/aether-util-1.13.1.jar
Downloading: https://repo.eclipse.org/content/repositories/maven_central/org/sonatype/sisu/sisu-inject-bean/2.3.0/sisu-inject-bean-2.3.0.jar
Downloading: https://repo.eclipse.org/content/repositories/maven_central/org/sonatype/sisu/sisu-guice/3.1.0/sisu-guice-3.1.0-no_aop.jar
Downloading: https://repo.eclipse.org/content/repositories/maven_central/org/apache/httpcomponents/httpclient/4.1.3/httpclient-4.1.3.jar
Downloading: https://repo.eclipse.org/content/repositories/maven_central/org/sonatype/sisu/sisu-guava/0.9.9/sisu-guava-0.9.9.jar
Downloaded: https://repo.eclipse.org/content/repositories/maven_central/org/sonatype/sisu/sisu-guice/3.1.0/sisu-guice-3.1.0-no_aop.jar (350 KB at 9695.8 KB/sec)
Downloading: https://repo.eclipse.org/content/repositories/maven_central/org/apache/httpcomponents/httpcore/4.1.4/httpcore-4.1.4.jar
Downloaded: https://repo.eclipse.org/content/repositories/maven_central/org/apache/httpcomponents/httpclient/4.1.3/httpclient-4.1.3.jar (345 KB at 7825.5 KB/sec)
Downloading: https://repo.eclipse.org/content/repositories/maven_central/commons-logging/commons-logging/1.1.1/commons-logging-1.1.1.jar
Downloaded: https://repo.eclipse.org/content/repositories/maven_central/org/sonatype/sisu/sisu-inject-bean/2.3.0/sisu-inject-bean-2.3.0.jar (283 KB at 6136.7 KB/sec)
Downloading: https://repo.eclipse.org/content/repositories/maven_central/commons-codec/commons-codec/1.4/commons-codec-1.4.jar
Downloaded: https://repo.eclipse.org/content/repositories/maven_central/org/sonatype/aether/aether-util/1.13.1/aether-util-1.13.1.jar (127 KB at 2227.6 KB/sec)
Downloading: https://repo.eclipse.org/content/repositories/maven_central/org/apache/httpcomponents/httpmime/4.1.3/httpmime-4.1.3.jar
Downloaded: https://repo.eclipse.org/content/repositories/maven_central/org/apache/httpcomponents/httpcore/4.1.4/httpcore-4.1.4.jar (178 KB at 6561.4 KB/sec)
Downloading: https://repo.eclipse.org/content/repositories/maven_central/org/codehaus/plexus/plexus-utils/3.0.10/plexus-utils-3.0.10.jar
Downloaded: https://repo.eclipse.org/content/repositories/maven_central/commons-codec/commons-codec/1.4/commons-codec-1.4.jar (57 KB at 2271.9 KB/sec)
Downloaded: https://repo.eclipse.org/content/repositories/maven_central/commons-logging/commons-logging/1.1.1/commons-logging-1.1.1.jar (60 KB at 1852.0 KB/sec)
Downloaded: https://repo.eclipse.org/content/repositories/maven_central/org/codehaus/plexus/plexus-utils/3.0.10/plexus-utils-3.0.10.jar (226 KB at 9394.7 KB/sec)
Downloaded: https://repo.eclipse.org/content/repositories/maven_central/org/apache/httpcomponents/httpmime/4.1.3/httpmime-4.1.3.jar (27 KB at 822.1 KB/sec)
Downloaded: https://repo.eclipse.org/content/repositories/maven_central/org/sonatype/sisu/sisu-guava/0.9.9/sisu-guava-0.9.9.jar (1473 KB at 14021.8 KB/sec)
[INFO] 
[INFO] --- tycho-pack200b-plugin:0.23.1:pack (pack200-pack) @ emf.ecoretools-parent ---
[INFO]                                                                         
[INFO] ------------------------------------------------------------------------
[INFO] Building org.eclipse.emf.ecoretools 3.1.0-SNAPSHOT
[INFO] ------------------------------------------------------------------------
[INFO] 
[INFO] --- maven-clean-plugin:2.4.1:clean (default-clean) @ org.eclipse.emf.ecoretools ---
[INFO] 
[INFO] --- tycho-packaging-plugin:0.23.1:build-qualifier (default-build-qualifier) @ org.eclipse.emf.ecoretools ---
[INFO] The project's OSGi version is 3.1.0.201706160614
[INFO] 
[INFO] --- tycho-packaging-plugin:0.23.1:validate-id (default-validate-id) @ org.eclipse.emf.ecoretools ---
[INFO] 
[INFO] --- tycho-packaging-plugin:0.23.1:validate-version (default-validate-version) @ org.eclipse.emf.ecoretools ---
[INFO] 
[INFO] --- maven-resources-plugin:2.4.1:resources (default-resources) @ org.eclipse.emf.ecoretools ---
Downloading: https://repo.eclipse.org/content/repositories/cbi-releases/org/apache/maven/maven-project/2.0.6/maven-project-2.0.6.pom
Downloading: https://repo.eclipse.org/content/repositories/maven_central/org/apache/maven/maven-project/2.0.6/maven-project-2.0.6.pom
Downloaded: https://repo.eclipse.org/content/repositories/maven_central/org/apache/maven/maven-project/2.0.6/maven-project-2.0.6.pom (3 KB at 128.8 KB/sec)
Downloading: https://repo.eclipse.org/content/repositories/cbi-releases/org/apache/maven/maven-settings/2.0.6/maven-settings-2.0.6.pom
Downloading: https://repo.eclipse.org/content/repositories/maven_central/org/apache/maven/maven-settings/2.0.6/maven-settings-2.0.6.pom
Downloaded: https://repo.eclipse.org/content/repositories/maven_central/org/apache/maven/maven-settings/2.0.6/maven-settings-2.0.6.pom (2 KB at 122.1 KB/sec)
Downloading: https://repo.eclipse.org/content/repositories/cbi-releases/org/apache/maven/maven-model/2.0.6/maven-model-2.0.6.pom
Downloading: https://repo.eclipse.org/content/repositories/maven_central/org/apache/maven/maven-model/2.0.6/maven-model-2.0.6.pom
Downloaded: https://repo.eclipse.org/content/repositories/maven_central/org/apache/maven/maven-model/2.0.6/maven-model-2.0.6.pom (3 KB at 148.8 KB/sec)
Downloading: https://repo.eclipse.org/content/repositories/cbi-releases/org/codehaus/plexus/plexus-utils/1.4.1/plexus-utils-1.4.1.pom
Downloading: https://repo.eclipse.org/content/repositories/maven_central/org/codehaus/plexus/plexus-utils/1.4.1/plexus-utils-1.4.1.pom
Downloaded: https://repo.eclipse.org/content/repositories/maven_central/org/codehaus/plexus/plexus-utils/1.4.1/plexus-utils-1.4.1.pom (2 KB at 93.2 KB/sec)
Downloading: https://repo.eclipse.org/content/repositories/cbi-releases/org/codehaus/plexus/plexus-container-default/1.0-alpha-9-stable-1/plexus-container-default-1.0-alpha-9-stable-1.pom
Downloading: https://repo.eclipse.org/content/repositories/maven_central/org/codehaus/plexus/plexus-container-default/1.0-alpha-9-stable-1/plexus-container-default-1.0-alpha-9-stable-1.pom
Downloaded: https://repo.eclipse.org/content/repositories/maven_central/org/codehaus/plexus/plexus-container-default/1.0-alpha-9-stable-1/plexus-container-default-1.0-alpha-9-stable-1.pom (4 KB at 226.8 KB/sec)
Downloading: https://repo.eclipse.org/content/repositories/cbi-releases/org/codehaus/plexus/plexus-containers/1.0.3/plexus-containers-1.0.3.pom
Downloading: https://repo.eclipse.org/content/repositories/maven_central/org/codehaus/plexus/plexus-containers/1.0.3/plexus-containers-1.0.3.pom
Downloaded: https://repo.eclipse.org/content/repositories/maven_central/org/codehaus/plexus/plexus-containers/1.0.3/plexus-containers-1.0.3.pom (492 B at 22.9 KB/sec)
Downloading: https://repo.eclipse.org/content/repositories/cbi-releases/org/codehaus/plexus/plexus/1.0.4/plexus-1.0.4.pom
Downloading: https://repo.eclipse.org/content/repositories/maven_central/org/codehaus/plexus/plexus/1.0.4/plexus-1.0.4.pom
Downloaded: https://repo.eclipse.org/content/repositories/maven_central/org/codehaus/plexus/plexus/1.0.4/plexus-1.0.4.pom (6 KB at 294.9 KB/sec)
Downloading: https://repo.eclipse.org/content/repositories/cbi-releases/junit/junit/3.8.1/junit-3.8.1.pom
Downloading: https://repo.eclipse.org/content/repositories/maven_central/junit/junit/3.8.1/junit-3.8.1.pom
Downloaded: https://repo.eclipse.org/content/repositories/maven_central/junit/junit/3.8.1/junit-3.8.1.pom (998 B at 48.7 KB/sec)
Downloading: https://repo.eclipse.org/content/repositories/cbi-releases/org/codehaus/plexus/plexus-utils/1.0.4/plexus-utils-1.0.4.pom
Downloading: https://repo.eclipse.org/content/repositories/maven_central/org/codehaus/plexus/plexus-utils/1.0.4/plexus-utils-1.0.4.pom
Downloaded: https://repo.eclipse.org/content/repositories/maven_central/org/codehaus/plexus/plexus-utils/1.0.4/plexus-utils-1.0.4.pom (7 KB at 318.8 KB/sec)
Downloading: https://repo.eclipse.org/content/repositories/cbi-releases/classworlds/classworlds/1.1-alpha-2/classworlds-1.1-alpha-2.pom
Downloading: https://repo.eclipse.org/content/repositories/maven_central/classworlds/classworlds/1.1-alpha-2/classworlds-1.1-alpha-2.pom
Downloaded: https://repo.eclipse.org/content/repositories/maven_central/classworlds/classworlds/1.1-alpha-2/classworlds-1.1-alpha-2.pom (4 KB at 138.8 KB/sec)
Downloading: https://repo.eclipse.org/content/repositories/cbi-releases/org/apache/maven/maven-profile/2.0.6/maven-profile-2.0.6.pom
Downloading: https://repo.eclipse.org/content/repositories/maven_central/org/apache/maven/maven-profile/2.0.6/maven-profile-2.0.6.pom
Downloaded: https://repo.eclipse.org/content/repositories/maven_central/org/apache/maven/maven-profile/2.0.6/maven-profile-2.0.6.pom (2 KB at 101.8 KB/sec)
Downloading: https://repo.eclipse.org/content/repositories/cbi-releases/org/apache/maven/maven-artifact-manager/2.0.6/maven-artifact-manager-2.0.6.pom
Downloading: https://repo.eclipse.org/content/repositories/maven_central/org/apache/maven/maven-artifact-manager/2.0.6/maven-artifact-manager-2.0.6.pom
Downloaded: https://repo.eclipse.org/content/repositories/maven_central/org/apache/maven/maven-artifact-manager/2.0.6/maven-artifact-manager-2.0.6.pom (3 KB at 150.6 KB/sec)
Downloading: https://repo.eclipse.org/content/repositories/cbi-releases/org/apache/maven/maven-repository-metadata/2.0.6/maven-repository-metadata-2.0.6.pom
Downloading: https://repo.eclipse.org/content/repositories/maven_central/org/apache/maven/maven-repository-metadata/2.0.6/maven-repository-metadata-2.0.6.pom
Downloaded: https://repo.eclipse.org/content/repositories/maven_central/org/apache/maven/maven-repository-metadata/2.0.6/maven-repository-metadata-2.0.6.pom (2 KB at 90.3 KB/sec)
Downloading: https://repo.eclipse.org/content/repositories/cbi-releases/org/apache/maven/maven-artifact/2.0.6/maven-artifact-2.0.6.pom
Downloading: https://repo.eclipse.org/content/repositories/maven_central/org/apache/maven/maven-artifact/2.0.6/maven-artifact-2.0.6.pom
Downloaded: https://repo.eclipse.org/content/repositories/maven_central/org/apache/maven/maven-artifact/2.0.6/maven-artifact-2.0.6.pom (2 KB at 73.3 KB/sec)
Downloading: https://repo.eclipse.org/content/repositories/cbi-releases/org/apache/maven/maven-plugin-registry/2.0.6/maven-plugin-registry-2.0.6.pom
Downloading: https://repo.eclipse.org/content/repositories/maven_central/org/apache/maven/maven-plugin-registry/2.0.6/maven-plugin-registry-2.0.6.pom
Downloaded: https://repo.eclipse.org/content/repositories/maven_central/org/apache/maven/maven-plugin-registry/2.0.6/maven-plugin-registry-2.0.6.pom (2 KB at 86.4 KB/sec)
Downloading: https://repo.eclipse.org/content/repositories/cbi-releases/org/codehaus/plexus/plexus-utils/1.5.15/plexus-utils-1.5.15.pom
Downloading: https://repo.eclipse.org/content/repositories/maven_central/org/codehaus/plexus/plexus-utils/1.5.15/plexus-utils-1.5.15.pom
Downloaded: https://repo.eclipse.org/content/repositories/maven_central/org/codehaus/plexus/plexus-utils/1.5.15/plexus-utils-1.5.15.pom (7 KB at 304.0 KB/sec)
Downloading: https://repo.eclipse.org/content/repositories/cbi-releases/org/codehaus/plexus/plexus/2.0.2/plexus-2.0.2.pom
Downloading: https://repo.eclipse.org/content/repositories/maven_central/org/codehaus/plexus/plexus/2.0.2/plexus-2.0.2.pom
Downloaded: https://repo.eclipse.org/content/repositories/maven_central/org/codehaus/plexus/plexus/2.0.2/plexus-2.0.2.pom (12 KB at 539.9 KB/sec)
Downloading: https://repo.eclipse.org/content/repositories/cbi-releases/org/apache/maven/shared/maven-filtering/1.0-beta-3/maven-filtering-1.0-beta-3.pom
Downloading: https://repo.eclipse.org/content/repositories/maven_central/org/apache/maven/shared/maven-filtering/1.0-beta-3/maven-filtering-1.0-beta-3.pom
Downloaded: https://repo.eclipse.org/content/repositories/maven_central/org/apache/maven/shared/maven-filtering/1.0-beta-3/maven-filtering-1.0-beta-3.pom (6 KB at 185.6 KB/sec)
Downloading: https://repo.eclipse.org/content/repositories/cbi-releases/org/apache/maven/shared/maven-shared-components/11/maven-shared-components-11.pom
Downloading: https://repo.eclipse.org/content/repositories/maven_central/org/apache/maven/shared/maven-shared-components/11/maven-shared-components-11.pom
Downloaded: https://repo.eclipse.org/content/repositories/maven_central/org/apache/maven/shared/maven-shared-components/11/maven-shared-components-11.pom (9 KB at 407.3 KB/sec)
Downloading: https://repo.eclipse.org/content/repositories/cbi-releases/org/apache/maven/maven-core/2.0.6/maven-core-2.0.6.pom
Downloading: https://repo.eclipse.org/content/repositories/maven_central/org/apache/maven/maven-core/2.0.6/maven-core-2.0.6.pom
Downloaded: https://repo.eclipse.org/content/repositories/maven_central/org/apache/maven/maven-core/2.0.6/maven-core-2.0.6.pom (7 KB at 385.5 KB/sec)
Downloading: https://repo.eclipse.org/content/repositories/cbi-releases/org/apache/maven/maven-plugin-parameter-documenter/2.0.6/maven-plugin-parameter-documenter-2.0.6.pom
Downloading: https://repo.eclipse.org/content/repositories/maven_central/org/apache/maven/maven-plugin-parameter-documenter/2.0.6/maven-plugin-parameter-documenter-2.0.6.pom
Downloaded: https://repo.eclipse.org/content/repositories/maven_central/org/apache/maven/maven-plugin-parameter-documenter/2.0.6/maven-plugin-parameter-documenter-2.0.6.pom (2 KB at 93.3 KB/sec)
Downloading: https://repo.eclipse.org/content/repositories/cbi-releases/org/apache/maven/reporting/maven-reporting-api/2.0.6/maven-reporting-api-2.0.6.pom
Downloading: https://repo.eclipse.org/content/repositories/maven_central/org/apache/maven/reporting/maven-reporting-api/2.0.6/maven-reporting-api-2.0.6.pom
Downloaded: https://repo.eclipse.org/content/repositories/maven_central/org/apache/maven/reporting/maven-reporting-api/2.0.6/maven-reporting-api-2.0.6.pom (2 KB at 90.0 KB/sec)
Downloading: https://repo.eclipse.org/content/repositories/cbi-releases/org/apache/maven/reporting/maven-reporting/2.0.6/maven-reporting-2.0.6.pom
Downloading: https://repo.eclipse.org/content/repositories/maven_central/org/apache/maven/reporting/maven-reporting/2.0.6/maven-reporting-2.0.6.pom
Downloaded: https://repo.eclipse.org/content/repositories/maven_central/org/apache/maven/reporting/maven-reporting/2.0.6/maven-reporting-2.0.6.pom (2 KB at 78.1 KB/sec)
Downloading: https://repo.eclipse.org/content/repositories/cbi-releases/org/apache/maven/doxia/doxia-sink-api/1.0-alpha-7/doxia-sink-api-1.0-alpha-7.pom
Downloading: https://repo.eclipse.org/content/repositories/maven_central/org/apache/maven/doxia/doxia-sink-api/1.0-alpha-7/doxia-sink-api-1.0-alpha-7.pom
Downloaded: https://repo.eclipse.org/content/repositories/maven_central/org/apache/maven/doxia/doxia-sink-api/1.0-alpha-7/doxia-sink-api-1.0-alpha-7.pom (424 B at 21.8 KB/sec)
Downloading: https://repo.eclipse.org/content/repositories/cbi-releases/org/apache/maven/doxia/doxia/1.0-alpha-7/doxia-1.0-alpha-7.pom
Downloading: https://repo.eclipse.org/content/repositories/maven_central/org/apache/maven/doxia/doxia/1.0-alpha-7/doxia-1.0-alpha-7.pom
Downloaded: https://repo.eclipse.org/content/repositories/maven_central/org/apache/maven/doxia/doxia/1.0-alpha-7/doxia-1.0-alpha-7.pom (4 KB at 224.8 KB/sec)
Downloading: https://repo.eclipse.org/content/repositories/cbi-releases/org/apache/maven/maven-error-diagnostics/2.0.6/maven-error-diagnostics-2.0.6.pom
Downloading: https://repo.eclipse.org/content/repositories/maven_central/org/apache/maven/maven-error-diagnostics/2.0.6/maven-error-diagnostics-2.0.6.pom
Downloaded: https://repo.eclipse.org/content/repositories/maven_central/org/apache/maven/maven-error-diagnostics/2.0.6/maven-error-diagnostics-2.0.6.pom (2 KB at 75.6 KB/sec)
Downloading: https://repo.eclipse.org/content/repositories/cbi-releases/commons-cli/commons-cli/1.0/commons-cli-1.0.pom
Downloading: https://repo.eclipse.org/content/repositories/maven_central/commons-cli/commons-cli/1.0/commons-cli-1.0.pom
Downloaded: https://repo.eclipse.org/content/repositories/maven_central/commons-cli/commons-cli/1.0/commons-cli-1.0.pom (3 KB at 114.2 KB/sec)
Downloading: https://repo.eclipse.org/content/repositories/cbi-releases/org/apache/maven/maven-plugin-descriptor/2.0.6/maven-plugin-descriptor-2.0.6.pom
Downloading: https://repo.eclipse.org/content/repositories/maven_central/org/apache/maven/maven-plugin-descriptor/2.0.6/maven-plugin-descriptor-2.0.6.pom
Downloaded: https://repo.eclipse.org/content/repositories/maven_central/org/apache/maven/maven-plugin-descriptor/2.0.6/maven-plugin-descriptor-2.0.6.pom (2 KB at 115.9 KB/sec)
Downloading: https://repo.eclipse.org/content/repositories/cbi-releases/org/codehaus/plexus/plexus-interactivity-api/1.0-alpha-4/plexus-interactivity-api-1.0-alpha-4.pom
Downloading: https://repo.eclipse.org/content/repositories/maven_central/org/codehaus/plexus/plexus-interactivity-api/1.0-alpha-4/plexus-interactivity-api-1.0-alpha-4.pom
Downloaded: https://repo.eclipse.org/content/repositories/maven_central/org/codehaus/plexus/plexus-interactivity-api/1.0-alpha-4/plexus-interactivity-api-1.0-alpha-4.pom (7 KB at 346.2 KB/sec)
Downloading: https://repo.eclipse.org/content/repositories/cbi-releases/org/apache/maven/maven-monitor/2.0.6/maven-monitor-2.0.6.pom
Downloading: https://repo.eclipse.org/content/repositories/maven_central/org/apache/maven/maven-monitor/2.0.6/maven-monitor-2.0.6.pom
Downloaded: https://repo.eclipse.org/content/repositories/maven_central/org/apache/maven/maven-monitor/2.0.6/maven-monitor-2.0.6.pom (2 KB at 64.5 KB/sec)
Downloading: https://repo.eclipse.org/content/repositories/cbi-releases/classworlds/classworlds/1.1/classworlds-1.1.pom
Downloading: https://repo.eclipse.org/content/repositories/maven_central/classworlds/classworlds/1.1/classworlds-1.1.pom
Downloaded: https://repo.eclipse.org/content/repositories/maven_central/classworlds/classworlds/1.1/classworlds-1.1.pom (4 KB at 190.9 KB/sec)
Downloading: https://repo.eclipse.org/content/repositories/cbi-releases/org/codehaus/plexus/plexus-interpolation/1.12/plexus-interpolation-1.12.pom
Downloading: https://repo.eclipse.org/content/repositories/maven_central/org/codehaus/plexus/plexus-interpolation/1.12/plexus-interpolation-1.12.pom
Downloaded: https://repo.eclipse.org/content/repositories/maven_central/org/codehaus/plexus/plexus-interpolation/1.12/plexus-interpolation-1.12.pom (889 B at 48.2 KB/sec)
Downloading: https://repo.eclipse.org/content/repositories/cbi-releases/org/codehaus/plexus/plexus-components/1.1.14/plexus-components-1.1.14.pom
Downloading: https://repo.eclipse.org/content/repositories/maven_central/org/codehaus/plexus/plexus-components/1.1.14/plexus-components-1.1.14.pom
Downloaded: https://repo.eclipse.org/content/repositories/maven_central/org/codehaus/plexus/plexus-components/1.1.14/plexus-components-1.1.14.pom (6 KB at 118.9 KB/sec)
Downloading: https://repo.eclipse.org/content/repositories/cbi-releases/org/sonatype/plexus/plexus-build-api/0.0.4/plexus-build-api-0.0.4.pom
Downloading: https://repo.eclipse.org/content/repositories/maven_central/org/sonatype/plexus/plexus-build-api/0.0.4/plexus-build-api-0.0.4.pom
Downloaded: https://repo.eclipse.org/content/repositories/maven_central/org/sonatype/plexus/plexus-build-api/0.0.4/plexus-build-api-0.0.4.pom (3 KB at 121.6 KB/sec)
Downloading: https://repo.eclipse.org/content/repositories/cbi-releases/org/sonatype/spice/spice-parent/10/spice-parent-10.pom
Downloading: https://repo.eclipse.org/content/repositories/maven_central/org/sonatype/spice/spice-parent/10/spice-parent-10.pom
Downloaded: https://repo.eclipse.org/content/repositories/maven_central/org/sonatype/spice/spice-parent/10/spice-parent-10.pom (3 KB at 163.6 KB/sec)
Downloading: https://repo.eclipse.org/content/repositories/cbi-releases/org/sonatype/forge/forge-parent/3/forge-parent-3.pom
Downloading: https://repo.eclipse.org/content/repositories/maven_central/org/sonatype/forge/forge-parent/3/forge-parent-3.pom
Downloaded: https://repo.eclipse.org/content/repositories/maven_central/org/sonatype/forge/forge-parent/3/forge-parent-3.pom (5 KB at 245.8 KB/sec)
Downloading: https://repo.eclipse.org/content/repositories/cbi-releases/org/codehaus/plexus/plexus-utils/1.5.8/plexus-utils-1.5.8.pom
Downloading: https://repo.eclipse.org/content/repositories/maven_central/org/codehaus/plexus/plexus-utils/1.5.8/plexus-utils-1.5.8.pom
Downloaded: https://repo.eclipse.org/content/repositories/maven_central/org/codehaus/plexus/plexus-utils/1.5.8/plexus-utils-1.5.8.pom (8 KB at 375.0 KB/sec)
Downloading: https://repo.eclipse.org/content/repositories/cbi-releases/org/codehaus/plexus/plexus-interpolation/1.13/plexus-interpolation-1.13.pom
Downloading: https://repo.eclipse.org/content/repositories/maven_central/org/codehaus/plexus/plexus-interpolation/1.13/plexus-interpolation-1.13.pom
Downloaded: https://repo.eclipse.org/content/repositories/maven_central/org/codehaus/plexus/plexus-interpolation/1.13/plexus-interpolation-1.13.pom (890 B at 48.3 KB/sec)
Downloading: https://repo.eclipse.org/content/repositories/cbi-releases/org/codehaus/plexus/plexus-components/1.1.15/plexus-components-1.1.15.pom
Downloading: https://repo.eclipse.org/content/repositories/maven_central/org/codehaus/plexus/plexus-components/1.1.15/plexus-components-1.1.15.pom
Downloaded: https://repo.eclipse.org/content/repositories/maven_central/org/codehaus/plexus/plexus-components/1.1.15/plexus-components-1.1.15.pom (3 KB at 154.5 KB/sec)
Downloading: https://repo.eclipse.org/content/repositories/cbi-releases/junit/junit/3.8.1/junit-3.8.1.jar
Downloading: https://repo.eclipse.org/content/repositories/cbi-releases/org/codehaus/plexus/plexus-utils/1.5.15/plexus-utils-1.5.15.jar
Downloading: https://repo.eclipse.org/content/repositories/cbi-releases/org/apache/maven/shared/maven-filtering/1.0-beta-3/maven-filtering-1.0-beta-3.jar
Downloading: https://repo.eclipse.org/content/repositories/cbi-releases/org/apache/maven/reporting/maven-reporting-api/2.0.6/maven-reporting-api-2.0.6.jar
Downloading: https://repo.eclipse.org/content/repositories/cbi-releases/org/apache/maven/doxia/doxia-sink-api/1.0-alpha-7/doxia-sink-api-1.0-alpha-7.jar
Downloading: https://repo.eclipse.org/content/repositories/cbi-releases/commons-cli/commons-cli/1.0/commons-cli-1.0.jar
Downloading: https://repo.eclipse.org/content/repositories/cbi-releases/org/codehaus/plexus/plexus-interactivity-api/1.0-alpha-4/plexus-interactivity-api-1.0-alpha-4.jar
Downloading: https://repo.eclipse.org/content/repositories/cbi-releases/org/sonatype/plexus/plexus-build-api/0.0.4/plexus-build-api-0.0.4.jar
Downloading: https://repo.eclipse.org/content/repositories/cbi-releases/org/codehaus/plexus/plexus-interpolation/1.13/plexus-interpolation-1.13.jar
Downloading: https://repo.eclipse.org/content/repositories/maven_central/junit/junit/3.8.1/junit-3.8.1.jar
Downloading: https://repo.eclipse.org/content/repositories/maven_central/org/codehaus/plexus/plexus-utils/1.5.15/plexus-utils-1.5.15.jar
Downloading: https://repo.eclipse.org/content/repositories/maven_central/org/apache/maven/shared/maven-filtering/1.0-beta-3/maven-filtering-1.0-beta-3.jar
Downloading: https://repo.eclipse.org/content/repositories/maven_central/org/apache/maven/reporting/maven-reporting-api/2.0.6/maven-reporting-api-2.0.6.jar
Downloading: https://repo.eclipse.org/content/repositories/maven_central/org/apache/maven/doxia/doxia-sink-api/1.0-alpha-7/doxia-sink-api-1.0-alpha-7.jar
Downloaded: https://repo.eclipse.org/content/repositories/maven_central/org/apache/maven/reporting/maven-reporting-api/2.0.6/maven-reporting-api-2.0.6.jar (10 KB at 510.9 KB/sec)
Downloading: https://repo.eclipse.org/content/repositories/maven_central/commons-cli/commons-cli/1.0/commons-cli-1.0.jar
Downloaded: https://repo.eclipse.org/content/repositories/maven_central/junit/junit/3.8.1/junit-3.8.1.jar (119 KB at 4926.4 KB/sec)
Downloading: https://repo.eclipse.org/content/repositories/maven_central/org/codehaus/plexus/plexus-interactivity-api/1.0-alpha-4/plexus-interactivity-api-1.0-alpha-4.jar
Downloaded: https://repo.eclipse.org/content/repositories/maven_central/org/apache/maven/doxia/doxia-sink-api/1.0-alpha-7/doxia-sink-api-1.0-alpha-7.jar (6 KB at 231.9 KB/sec)
Downloading: https://repo.eclipse.org/content/repositories/maven_central/org/sonatype/plexus/plexus-build-api/0.0.4/plexus-build-api-0.0.4.jar
Downloaded: https://repo.eclipse.org/content/repositories/maven_central/commons-cli/commons-cli/1.0/commons-cli-1.0.jar (30 KB at 1838.2 KB/sec)
Downloading: https://repo.eclipse.org/content/repositories/maven_central/org/codehaus/plexus/plexus-interpolation/1.13/plexus-interpolation-1.13.jar
Downloaded: https://repo.eclipse.org/content/repositories/maven_central/org/codehaus/plexus/plexus-interactivity-api/1.0-alpha-4/plexus-interactivity-api-1.0-alpha-4.jar (14 KB at 654.6 KB/sec)
Downloaded: https://repo.eclipse.org/content/repositories/maven_central/org/codehaus/plexus/plexus-utils/1.5.15/plexus-utils-1.5.15.jar (223 KB at 4640.9 KB/sec)
Downloaded: https://repo.eclipse.org/content/repositories/maven_central/org/sonatype/plexus/plexus-build-api/0.0.4/plexus-build-api-0.0.4.jar (7 KB at 289.1 KB/sec)
Downloaded: https://repo.eclipse.org/content/repositories/maven_central/org/apache/maven/shared/maven-filtering/1.0-beta-3/maven-filtering-1.0-beta-3.jar (34 KB at 685.6 KB/sec)
Downloaded: https://repo.eclipse.org/content/repositories/maven_central/org/codehaus/plexus/plexus-interpolation/1.13/plexus-interpolation-1.13.jar (60 KB at 2839.3 KB/sec)
[INFO] Using 'ISO-8859-1' encoding to copy filtered resources.
[INFO] skip non existing resourceDirectory /jobs/genie.sirius/ecoretools-3.1/workspace/org.eclipse.emf.ecoretools/src/main/resources
[INFO] 
[INFO] --- tycho-compiler-plugin:0.23.1:compile (default-compile) @ org.eclipse.emf.ecoretools ---
Downloading: https://repo.eclipse.org/content/repositories/cbi-releases/org/apache/maven/maven-compat/3.0/maven-compat-3.0.pom
Downloading: https://repo.eclipse.org/content/repositories/maven_central/org/apache/maven/maven-compat/3.0/maven-compat-3.0.pom
Downloaded: https://repo.eclipse.org/content/repositories/maven_central/org/apache/maven/maven-compat/3.0/maven-compat-3.0.pom (4 KB at 218.2 KB/sec)
Downloading: https://repo.eclipse.org/content/repositories/cbi-releases/org/apache/maven/wagon/wagon-provider-api/1.0-beta-6/wagon-provider-api-1.0-beta-6.pom
Downloading: https://repo.eclipse.org/content/repositories/maven_central/org/apache/maven/wagon/wagon-provider-api/1.0-beta-6/wagon-provider-api-1.0-beta-6.pom
Downloaded: https://repo.eclipse.org/content/repositories/maven_central/org/apache/maven/wagon/wagon-provider-api/1.0-beta-6/wagon-provider-api-1.0-beta-6.pom (2 KB at 95.5 KB/sec)
Downloading: https://repo.eclipse.org/content/repositories/cbi-releases/org/apache/maven/wagon/wagon/1.0-beta-6/wagon-1.0-beta-6.pom
Downloading: https://repo.eclipse.org/content/repositories/maven_central/org/apache/maven/wagon/wagon/1.0-beta-6/wagon-1.0-beta-6.pom
Downloaded: https://repo.eclipse.org/content/repositories/maven_central/org/apache/maven/wagon/wagon/1.0-beta-6/wagon-1.0-beta-6.pom (13 KB at 711.5 KB/sec)
Downloading: https://repo.eclipse.org/content/repositories/cbi-releases/org/codehaus/plexus/plexus-compiler-manager/2.2/plexus-compiler-manager-2.2.pom
Downloading: https://repo.eclipse.org/content/repositories/maven_central/org/codehaus/plexus/plexus-compiler-manager/2.2/plexus-compiler-manager-2.2.pom
Downloaded: https://repo.eclipse.org/content/repositories/maven_central/org/codehaus/plexus/plexus-compiler-manager/2.2/plexus-compiler-manager-2.2.pom (690 B at 42.1 KB/sec)
Downloading: https://repo.eclipse.org/content/repositories/cbi-releases/org/codehaus/plexus/plexus-compiler/2.2/plexus-compiler-2.2.pom
Downloading: https://repo.eclipse.org/content/repositories/maven_central/org/codehaus/plexus/plexus-compiler/2.2/plexus-compiler-2.2.pom
Downloaded: https://repo.eclipse.org/content/repositories/maven_central/org/codehaus/plexus/plexus-compiler/2.2/plexus-compiler-2.2.pom (4 KB at 185.8 KB/sec)
Downloading: https://repo.eclipse.org/content/repositories/cbi-releases/org/codehaus/plexus/plexus-components/1.3.1/plexus-components-1.3.1.pom
Downloading: https://repo.eclipse.org/content/repositories/maven_central/org/codehaus/plexus/plexus-components/1.3.1/plexus-components-1.3.1.pom
Downloaded: https://repo.eclipse.org/content/repositories/maven_central/org/codehaus/plexus/plexus-components/1.3.1/plexus-components-1.3.1.pom (3 KB at 166.2 KB/sec)
Downloading: https://repo.eclipse.org/content/repositories/cbi-releases/org/codehaus/plexus/plexus/3.3.1/plexus-3.3.1.pom
Downloading: https://repo.eclipse.org/content/repositories/maven_central/org/codehaus/plexus/plexus/3.3.1/plexus-3.3.1.pom
Downloaded: https://repo.eclipse.org/content/repositories/maven_central/org/codehaus/plexus/plexus/3.3.1/plexus-3.3.1.pom (20 KB at 950.8 KB/sec)
Downloading: https://repo.eclipse.org/content/repositories/cbi-releases/org/codehaus/plexus/plexus-compiler-api/2.2/plexus-compiler-api-2.2.pom
Downloading: https://repo.eclipse.org/content/repositories/maven_central/org/codehaus/plexus/plexus-compiler-api/2.2/plexus-compiler-api-2.2.pom
Downloaded: https://repo.eclipse.org/content/repositories/maven_central/org/codehaus/plexus/plexus-compiler-api/2.2/plexus-compiler-api-2.2.pom (865 B at 42.2 KB/sec)
Downloading: https://repo.eclipse.org/content/repositories/cbi-releases/org/eclipse/tycho/tycho-compiler-jdt/0.23.1/tycho-compiler-jdt-0.23.1.pom
Downloading: https://repo.eclipse.org/content/repositories/maven_central/org/eclipse/tycho/tycho-compiler-jdt/0.23.1/tycho-compiler-jdt-0.23.1.pom
Downloaded: https://repo.eclipse.org/content/repositories/maven_central/org/eclipse/tycho/tycho-compiler-jdt/0.23.1/tycho-compiler-jdt-0.23.1.pom (2 KB at 59.9 KB/sec)
Downloading: https://repo.eclipse.org/content/repositories/cbi-releases/org/eclipse/tycho/org.eclipse.jdt.core/3.11.0.v20150602-1242/org.eclipse.jdt.core-3.11.0.v20150602-1242.pom
Downloading: https://repo.eclipse.org/content/repositories/maven_central/org/eclipse/tycho/org.eclipse.jdt.core/3.11.0.v20150602-1242/org.eclipse.jdt.core-3.11.0.v20150602-1242.pom
Downloaded: https://repo.eclipse.org/content/repositories/maven_central/org/eclipse/tycho/org.eclipse.jdt.core/3.11.0.v20150602-1242/org.eclipse.jdt.core-3.11.0.v20150602-1242.pom (2 KB at 36.2 KB/sec)
Downloading: https://repo.eclipse.org/content/repositories/cbi-releases/org/eclipse/tycho/org.eclipse.jdt.compiler.apt/1.2.0.v20150514-0146/org.eclipse.jdt.compiler.apt-1.2.0.v20150514-0146.pom
Downloading: https://repo.eclipse.org/content/repositories/maven_central/org/eclipse/tycho/org.eclipse.jdt.compiler.apt/1.2.0.v20150514-0146/org.eclipse.jdt.compiler.apt-1.2.0.v20150514-0146.pom
Downloaded: https://repo.eclipse.org/content/repositories/maven_central/org/eclipse/tycho/org.eclipse.jdt.compiler.apt/1.2.0.v20150514-0146/org.eclipse.jdt.compiler.apt-1.2.0.v20150514-0146.pom (2 KB at 57.6 KB/sec)
Downloading: https://repo.eclipse.org/content/repositories/cbi-releases/org/codehaus/plexus/plexus-compiler-manager/2.2/plexus-compiler-manager-2.2.jar
Downloading: https://repo.eclipse.org/content/repositories/cbi-releases/org/codehaus/plexus/plexus-compiler-api/2.2/plexus-compiler-api-2.2.jar
Downloading: https://repo.eclipse.org/content/repositories/cbi-releases/org/eclipse/tycho/tycho-compiler-jdt/0.23.1/tycho-compiler-jdt-0.23.1.jar
Downloading: https://repo.eclipse.org/content/repositories/cbi-releases/org/eclipse/tycho/org.eclipse.jdt.compiler.apt/1.2.0.v20150514-0146/org.eclipse.jdt.compiler.apt-1.2.0.v20150514-0146.jar
Downloading: https://repo.eclipse.org/content/repositories/cbi-releases/org/eclipse/tycho/org.eclipse.jdt.core/3.11.0.v20150602-1242/org.eclipse.jdt.core-3.11.0.v20150602-1242.jar
Downloading: https://repo.eclipse.org/content/repositories/maven_central/org/codehaus/plexus/plexus-compiler-manager/2.2/plexus-compiler-manager-2.2.jar
Downloading: https://repo.eclipse.org/content/repositories/maven_central/org/codehaus/plexus/plexus-compiler-api/2.2/plexus-compiler-api-2.2.jar
Downloading: https://repo.eclipse.org/content/repositories/maven_central/org/eclipse/tycho/tycho-compiler-jdt/0.23.1/tycho-compiler-jdt-0.23.1.jar
Downloading: https://repo.eclipse.org/content/repositories/maven_central/org/eclipse/tycho/org.eclipse.jdt.core/3.11.0.v20150602-1242/org.eclipse.jdt.core-3.11.0.v20150602-1242.jar
Downloading: https://repo.eclipse.org/content/repositories/maven_central/org/eclipse/tycho/org.eclipse.jdt.compiler.apt/1.2.0.v20150514-0146/org.eclipse.jdt.compiler.apt-1.2.0.v20150514-0146.jar
Downloaded: https://repo.eclipse.org/content/repositories/maven_central/org/codehaus/plexus/plexus-compiler-api/2.2/plexus-compiler-api-2.2.jar (25 KB at 976.2 KB/sec)
Downloaded: https://repo.eclipse.org/content/repositories/maven_central/org/codehaus/plexus/plexus-compiler-manager/2.2/plexus-compiler-manager-2.2.jar (5 KB at 165.0 KB/sec)
Downloaded: https://repo.eclipse.org/content/repositories/maven_central/org/eclipse/tycho/org.eclipse.jdt.compiler.apt/1.2.0.v20150514-0146/org.eclipse.jdt.compiler.apt-1.2.0.v20150514-0146.jar (164 KB at 5121.7 KB/sec)
Downloaded: https://repo.eclipse.org/content/repositories/maven_central/org/eclipse/tycho/tycho-compiler-jdt/0.23.1/tycho-compiler-jdt-0.23.1.jar (16 KB at 345.1 KB/sec)
Downloaded: https://repo.eclipse.org/content/repositories/maven_central/org/eclipse/tycho/org.eclipse.jdt.core/3.11.0.v20150602-1242/org.eclipse.jdt.core-3.11.0.v20150602-1242.jar (5583 KB at 26968.8 KB/sec)
[INFO] Compiling 17 source files to /jobs/genie.sirius/ecoretools-3.1/workspace/org.eclipse.emf.ecoretools/target/classes
[INFO] 
[INFO] --- maven-resources-plugin:2.4.1:testResources (default-testResources) @ org.eclipse.emf.ecoretools ---
[INFO] Using 'ISO-8859-1' encoding to copy filtered resources.
[INFO] skip non existing resourceDirectory /jobs/genie.sirius/ecoretools-3.1/workspace/org.eclipse.emf.ecoretools/src/test/resources
[INFO] 
[INFO] --- tycho-source-plugin:0.23.1:plugin-source (plugin-source) @ org.eclipse.emf.ecoretools ---
[INFO] Building jar: /jobs/genie.sirius/ecoretools-3.1/workspace/org.eclipse.emf.ecoretools/target/org.eclipse.emf.ecoretools-3.1.0-SNAPSHOT-sources.jar
[INFO] 
[INFO] --- target-platform-configuration:0.23.1:target-platform (default-target-platform) @ org.eclipse.emf.ecoretools ---
[INFO] 
[INFO] --- tycho-packaging-plugin:0.23.1:package-plugin (default-package-plugin) @ org.eclipse.emf.ecoretools ---
[INFO] Building jar: /jobs/genie.sirius/ecoretools-3.1/workspace/org.eclipse.emf.ecoretools/target/org.eclipse.emf.ecoretools-3.1.0-SNAPSHOT.jar
[INFO] 
[INFO] --- tycho-p2-plugin:0.23.1:p2-metadata-default (default-p2-metadata-default) @ org.eclipse.emf.ecoretools ---
[INFO] 
[INFO] --- tycho-pack200a-plugin:0.23.1:normalize (pack200-normalize) @ org.eclipse.emf.ecoretools ---
[INFO] Pack200 normalizing jar /jobs/genie.sirius/ecoretools-3.1/workspace/org.eclipse.emf.ecoretools/target/org.eclipse.emf.ecoretools-3.1.0-SNAPSHOT.jar
[INFO] 
[INFO] --- eclipse-jarsigner-plugin:1.0.4:sign (sign) @ org.eclipse.emf.ecoretools ---
[INFO] Signed org.eclipse.emf.ecoretools:org.eclipse.emf.ecoretools:eclipse-plugin:3.1.0-SNAPSHOT in 1 seconds.
[INFO] Signed org.eclipse.emf.ecoretools:org.eclipse.emf.ecoretools:java-source:sources:3.1.0-SNAPSHOT in 0 seconds.
[INFO] 
[INFO] --- tycho-pack200b-plugin:0.23.1:pack (pack200-pack) @ org.eclipse.emf.ecoretools ---
[INFO] Pack200 packing jar /jobs/genie.sirius/ecoretools-3.1/workspace/org.eclipse.emf.ecoretools/target/org.eclipse.emf.ecoretools-3.1.0-SNAPSHOT.jar
[INFO]                                                                         
[INFO] ------------------------------------------------------------------------
[INFO] Building org.eclipse.emf.ecoretools.design 3.1.0-SNAPSHOT
[INFO] ------------------------------------------------------------------------
[INFO] 
[INFO] --- maven-clean-plugin:2.4.1:clean (default-clean) @ org.eclipse.emf.ecoretools.design ---
[INFO] 
[INFO] --- tycho-packaging-plugin:0.23.1:build-qualifier (default-build-qualifier) @ org.eclipse.emf.ecoretools.design ---
[INFO] The project's OSGi version is 3.1.0.201706160614
[INFO] 
[INFO] --- tycho-packaging-plugin:0.23.1:validate-id (default-validate-id) @ org.eclipse.emf.ecoretools.design ---
[INFO] 
[INFO] --- tycho-packaging-plugin:0.23.1:validate-version (default-validate-version) @ org.eclipse.emf.ecoretools.design ---
[INFO] 
[INFO] --- maven-resources-plugin:2.4.1:resources (default-resources) @ org.eclipse.emf.ecoretools.design ---
[INFO] Using 'ISO-8859-1' encoding to copy filtered resources.
[INFO] Copying 0 resource
[INFO] 
[INFO] --- tycho-compiler-plugin:0.23.1:compile (default-compile) @ org.eclipse.emf.ecoretools.design ---
[INFO] Compiling 22 source files to /jobs/genie.sirius/ecoretools-3.1/workspace/org.eclipse.emf.ecoretools.design/target/classes
[INFO] 
[INFO] --- maven-resources-plugin:2.4.1:testResources (default-testResources) @ org.eclipse.emf.ecoretools.design ---
[INFO] Using 'ISO-8859-1' encoding to copy filtered resources.
[INFO] skip non existing resourceDirectory /jobs/genie.sirius/ecoretools-3.1/workspace/org.eclipse.emf.ecoretools.design/src/test/resources
[INFO] 
[INFO] --- tycho-source-plugin:0.23.1:plugin-source (plugin-source) @ org.eclipse.emf.ecoretools.design ---
[INFO] Building jar: /jobs/genie.sirius/ecoretools-3.1/workspace/org.eclipse.emf.ecoretools.design/target/org.eclipse.emf.ecoretools.design-3.1.0-SNAPSHOT-sources.jar
[INFO] 
[INFO] --- target-platform-configuration:0.23.1:target-platform (default-target-platform) @ org.eclipse.emf.ecoretools.design ---
[INFO] 
[INFO] --- tycho-packaging-plugin:0.23.1:package-plugin (default-package-plugin) @ org.eclipse.emf.ecoretools.design ---
[INFO] Building jar: /jobs/genie.sirius/ecoretools-3.1/workspace/org.eclipse.emf.ecoretools.design/target/org.eclipse.emf.ecoretools.design-3.1.0-SNAPSHOT.jar
[INFO] 
[INFO] --- tycho-p2-plugin:0.23.1:p2-metadata-default (default-p2-metadata-default) @ org.eclipse.emf.ecoretools.design ---
[INFO] 
[INFO] --- tycho-pack200a-plugin:0.23.1:normalize (pack200-normalize) @ org.eclipse.emf.ecoretools.design ---
[INFO] Pack200 normalizing jar /jobs/genie.sirius/ecoretools-3.1/workspace/org.eclipse.emf.ecoretools.design/target/org.eclipse.emf.ecoretools.design-3.1.0-SNAPSHOT.jar
[INFO] 
[INFO] --- eclipse-jarsigner-plugin:1.0.4:sign (sign) @ org.eclipse.emf.ecoretools.design ---
[INFO] Signed org.eclipse.emf.ecoretools:org.eclipse.emf.ecoretools.design:eclipse-plugin:3.1.0-SNAPSHOT in 0 seconds.
[INFO] Signed org.eclipse.emf.ecoretools:org.eclipse.emf.ecoretools.design:java-source:sources:3.1.0-SNAPSHOT in 1 seconds.
[INFO] 
[INFO] --- tycho-pack200b-plugin:0.23.1:pack (pack200-pack) @ org.eclipse.emf.ecoretools.design ---
[INFO] Pack200 packing jar /jobs/genie.sirius/ecoretools-3.1/workspace/org.eclipse.emf.ecoretools.design/target/org.eclipse.emf.ecoretools.design-3.1.0-SNAPSHOT.jar
[INFO]                                                                         
[INFO] ------------------------------------------------------------------------
[INFO] Building org.eclipse.emf.ecoretools.design.ui 3.1.0-SNAPSHOT
[INFO] ------------------------------------------------------------------------
[INFO] 
[INFO] --- maven-clean-plugin:2.4.1:clean (default-clean) @ org.eclipse.emf.ecoretools.design.ui ---
[INFO] 
[INFO] --- tycho-packaging-plugin:0.23.1:build-qualifier (default-build-qualifier) @ org.eclipse.emf.ecoretools.design.ui ---
[INFO] The project's OSGi version is 3.1.0.201706160614
[INFO] 
[INFO] --- tycho-packaging-plugin:0.23.1:validate-id (default-validate-id) @ org.eclipse.emf.ecoretools.design.ui ---
[INFO] 
[INFO] --- tycho-packaging-plugin:0.23.1:validate-version (default-validate-version) @ org.eclipse.emf.ecoretools.design.ui ---
[INFO] 
[INFO] --- maven-resources-plugin:2.4.1:resources (default-resources) @ org.eclipse.emf.ecoretools.design.ui ---
[INFO] Using 'ISO-8859-1' encoding to copy filtered resources.
[INFO] Copying 0 resource
[INFO] 
[INFO] --- tycho-compiler-plugin:0.23.1:compile (default-compile) @ org.eclipse.emf.ecoretools.design.ui ---
[INFO] Compiling 9 source files to /jobs/genie.sirius/ecoretools-3.1/workspace/org.eclipse.emf.ecoretools.design.ui/target/classes
[INFO]                                                                         
[INFO] ------------------------------------------------------------------------
[INFO] Building org.eclipse.emf.ecoretools.design.tests 3.1.0-SNAPSHOT
[INFO] ------------------------------------------------------------------------
[INFO] 
[INFO] --- maven-clean-plugin:2.4.1:clean (default-clean) @ org.eclipse.emf.ecoretools.design.tests ---
[INFO] 
[INFO] --- tycho-packaging-plugin:0.23.1:build-qualifier (default-build-qualifier) @ org.eclipse.emf.ecoretools.design.tests ---
[INFO] The project's OSGi version is 3.1.0.201706160614
[INFO] 
[INFO] --- tycho-packaging-plugin:0.23.1:validate-id (default-validate-id) @ org.eclipse.emf.ecoretools.design.tests ---
[INFO] 
[INFO] --- tycho-packaging-plugin:0.23.1:validate-version (default-validate-version) @ org.eclipse.emf.ecoretools.design.tests ---
[INFO] 
[INFO] --- maven-resources-plugin:2.4.1:resources (default-resources) @ org.eclipse.emf.ecoretools.design.tests ---
[INFO] Using 'ISO-8859-1' encoding to copy filtered resources.
[INFO] skip non existing resourceDirectory /jobs/genie.sirius/ecoretools-3.1/workspace/org.eclipse.emf.ecoretools.design.tests/src/main/resources
[INFO] 
[INFO] --- tycho-compiler-plugin:0.23.1:compile (default-compile) @ org.eclipse.emf.ecoretools.design.tests ---
[INFO] Compiling 7 source files to /jobs/genie.sirius/ecoretools-3.1/workspace/org.eclipse.emf.ecoretools.design.tests/target/classes
[INFO] 
[INFO] --- maven-resources-plugin:2.4.1:testResources (default-testResources) @ org.eclipse.emf.ecoretools.design.tests ---
[INFO] Using 'ISO-8859-1' encoding to copy filtered resources.
[INFO] skip non existing resourceDirectory /jobs/genie.sirius/ecoretools-3.1/workspace/org.eclipse.emf.ecoretools.design.tests/src/test/resources
[INFO] 
[INFO] --- tycho-source-plugin:0.23.1:plugin-source (plugin-source) @ org.eclipse.emf.ecoretools.design.tests ---
[WARNING] bundle localization file /jobs/genie.sirius/ecoretools-3.1/workspace/org.eclipse.emf.ecoretools.design.tests/plugin.properties not found
[WARNING] Bundle-Vendor header not found in /jobs/genie.sirius/ecoretools-3.1/workspace/org.eclipse.emf.ecoretools.design.tests/META-INF/MANIFEST.MF, fallback to 'unknown' for source bundle
[INFO] Building jar: /jobs/genie.sirius/ecoretools-3.1/workspace/org.eclipse.emf.ecoretools.design.tests/target/org.eclipse.emf.ecoretools.design.tests-3.1.0-SNAPSHOT-sources.jar
[INFO] 
[INFO] --- target-platform-configuration:0.23.1:target-platform (default-target-platform) @ org.eclipse.emf.ecoretools.design.tests ---
[INFO] 
[INFO] --- tycho-packaging-plugin:0.23.1:package-plugin (default-package-plugin) @ org.eclipse.emf.ecoretools.design.tests ---
[INFO] Building jar: /jobs/genie.sirius/ecoretools-3.1/workspace/org.eclipse.emf.ecoretools.design.tests/target/org.eclipse.emf.ecoretools.design.tests-3.1.0-SNAPSHOT.jar
[INFO] 
[INFO] --- tycho-p2-plugin:0.23.1:p2-metadata-default (default-p2-metadata-default) @ org.eclipse.emf.ecoretools.design.tests ---
[INFO] 
[INFO] --- tycho-surefire-plugin:0.23.1:test (default-test) @ org.eclipse.emf.ecoretools.design.tests ---
[INFO] Expected eclipse log file: /jobs/genie.sirius/ecoretools-3.1/workspace/org.eclipse.emf.ecoretools.design.tests/target/work/data/.metadata/.log
[INFO] Command line:
	[/opt/public/common/jdk1.8.0_121.x64/jre/bin/java, -Dosgi.noShutdown=false, -Dosgi.os=linux, -Dosgi.ws=gtk, -Dosgi.arch=x86_64, -Xmx512m, -XX:MaxPermSize=256m, -Dosgi.clean=true, -jar, /jobs/genie.sirius/ecoretools-3.1/workspace/.maven/repo/p2/osgi/bundle/org.eclipse.equinox.launcher/1.3.201.v20161025-1711/org.eclipse.equinox.launcher-1.3.201.v20161025-1711.jar, -data, /jobs/genie.sirius/ecoretools-3.1/workspace/org.eclipse.emf.ecoretools.design.tests/target/work/data, -install, /jobs/genie.sirius/ecoretools-3.1/workspace/org.eclipse.emf.ecoretools.design.tests/target/work, -configuration, /jobs/genie.sirius/ecoretools-3.1/workspace/org.eclipse.emf.ecoretools.design.tests/target/work/configuration, -application, org.eclipse.tycho.surefire.osgibooter.headlesstest, -testproperties, /jobs/genie.sirius/ecoretools-3.1/workspace/org.eclipse.emf.ecoretools.design.tests/target/surefire.properties, -testApplication, org.eclipse.ui.ide.workbench]
Java HotSpot(TM) 64-Bit Server VM warning: ignoring option MaxPermSize=256m; support was removed in 8.0

-------------------------------------------------------
 T E S T S
-------------------------------------------------------
Running org.eclipse.emf.ecoretools.design.tests.VsmValidationTests
Tests run: 1, Failures: 1, Errors: 0, Skipped: 0, Time elapsed: 2.489 sec <<< FAILURE! - in org.eclipse.emf.ecoretools.design.tests.VsmValidationTests
isValid(org.eclipse.emf.ecoretools.design.tests.VsmValidationTests)  Time elapsed: 2.133 sec  <<< FAILURE!
java.lang.AssertionError: The VSM is not valid it has errors : Diagnostic ERROR source=org.eclipse.emf.ecore code=0 Diagnosis of org.eclipse.sirius.viewpoint.description.impl.GroupImpl@3afae281{platform:/plugin/org.eclipse.emf.ecoretools.design/description/ecore.odesign#/} data=[org.eclipse.sirius.viewpoint.description.impl.GroupImpl@3afae281 (documentation: , name: EcoreTools, version: 11.0.0.201601261200)] [Diagnostic ERROR source=org.eclipse.sirius code=1 Nothing will be left after calling oclAsType:
EClassifier=EClass is not compatible with type EClassifierLiteral=DEdge data=[org.eclipse.sirius.diagram.business.internal.metamodel.description.filter.spec.MappingFilterSpec@75e09567 (filterKind: HIDE) (semanticConditionExpression: null, viewConditionExpression: aql:not self.oclAsType(diagram::DEdge).sourceNode.oclAsType(viewpoint::DSemanticDecorator).target.oclAsType(ecore::EClass).eSuperTypes->includes(self.oclAsType(diagram::DEdge).targetNode.oclAsType(viewpoint::DSemanticDecorator).target))], Diagnostic ERROR source=org.eclipse.sirius code=1 Nothing will be left after calling oclAsType:
EClassifier=EClass is not compatible with type EClassifierLiteral=DEdge data=[org.eclipse.sirius.diagram.business.internal.metamodel.description.filter.spec.MappingFilterSpec@75e09567 (filterKind: HIDE) (semanticConditionExpression: null, viewConditionExpression: aql:not self.oclAsType(diagram::DEdge).sourceNode.oclAsType(viewpoint::DSemanticDecorator).target.oclAsType(ecore::EClass).eSuperTypes->includes(self.oclAsType(diagram::DEdge).targetNode.oclAsType(viewpoint::DSemanticDecorator).target))], Diagnostic ERROR source=org.eclipse.sirius code=1 Nothing will be left after calling oclAsType:
EClassifier=EClass is not compatible with type EClassifierLiteral=DSemanticDecorator
EClassifier=EAnnotation is not compatible with type EClassifierLiteral=DSemanticDecorator
EClassifier=DAnalysisCustomData is not compatible with type EClassifierLiteral=DSemanticDecorator
EClassifier=AnnotationEntry is not compatible with type EClassifierLiteral=DSemanticDecorator
EClassifier=TableDescription is not compatible with type EClassifierLiteral=DSemanticDecorator
EClassifier=GenAnnotation is not compatible with type EClassifierLiteral=DSemanticDecorator
EClassifier=ChangeDescription is not compatible with type EClassifierLiteral=DSemanticDecorator data=[org.eclipse.sirius.diagram.business.internal.metamodel.description.filter.spec.MappingFilterSpec@cb39552 (filterKind: HIDE) (semanticConditionExpression: null, viewConditionExpression: aql:self.eContainer().oclAsType(viewpoint::DSemanticDecorator).target = self.oclAsType(viewpoint::DSemanticDecorator).target.eContainer())], Diagnostic ERROR source=org.eclipse.sirius code=1 Nothing will be left after calling oclAsType:
EClassifier=EReference is not compatible with type EClassifierLiteral=DSemanticDecorator data=[org.eclipse.sirius.diagram.business.internal.metamodel.description.filter.spec.MappingFilterSpec@cb39552 (filterKind: HIDE) (semanticConditionExpression: null, viewConditionExpression: aql:self.eContainer().oclAsType(viewpoint::DSemanticDecorator).target = self.oclAsType(viewpoint::DSemanticDecorator).target.eContainer())], Diagnostic ERROR source=org.eclipse.sirius code=1 Nothing will be left after calling oclAsType:
EClassifier=EdgeTarget is not compatible with type EClassifierLiteral=DSemanticDecorator data=[org.eclipse.sirius.diagram.business.internal.metamodel.description.spec.ConditionalEdgeStyleDescriptionSpec@3a3ed300 (predicateExpression: aql:not self.eSuperTypes->includes(view.oclAsType(diagram::DEdge).targetNode.oclAsType(viewpoint::DSemanticDecorator).target))], Diagnostic WARNING source=org.eclipse.sirius.diagram code=1 The Drop tool External EClass from treeview accepts arbitrary elements from the Model Content view as drag source. You should specify a precondition to validate the nature of the dragged element. data=[org.eclipse.sirius.diagram.business.internal.metamodel.description.tool.spec.ContainerDropDescriptionSpec@2ddb3ae8 (documentation: ) (name: External EClass from treeview, label: null, precondition: , forceRefresh: true, elementsToSelect: , inverseSelectionOrder: false) (dragSource: PROJECT_EXPLORER, moveEdges: false)], Diagnostic INFO source=org.eclipse.sirius.diagram code=80 The constraint "No reconnect on regions" is disabled.  It will not be evaluated. data=[], Diagnostic WARNING source=org.eclipse.sirius.diagram code=1 The Drop tool Drop EPackage into EPackage accepts arbitrary elements from the Model Content view as drag source. You should specify a precondition to validate the nature of the dragged element. data=[org.eclipse.sirius.diagram.business.internal.metamodel.description.tool.spec.ContainerDropDescriptionSpec@5a8c93 (documentation: ) (name: Drop EPackage into EPackage, label: null, precondition: , forceRefresh: false, elementsToSelect: , inverseSelectionOrder: false) (dragSource: BOTH, moveEdges: false)], Diagnostic WARNING source=org.eclipse.sirius code=1 There is no associated meta-model. data=[org.eclipse.sirius.table.business.internal.metamodel.description.spec.EditionTableDescriptionSpec@24c685e7 (documentation: ) (endUserDocumentation: A tabular editor (spreadsheet-like) of the entities in an Ecore model., name: Classes, label: null, titleExpression: aql:self.name + ' class table', initialisation: false, showOnStartup: false, preconditionExpression: , domainClass: ecore.EPackage, initialHeaderColumnWidth: 0)], Diagnostic WARNING source=org.eclipse.sirius.diagram code=1 The Drop tool External EPackageTo Analyze from treeview accepts arbitrary elements from the Model Content view as drag source. You should specify a precondition to validate the nature of the dragged element. data=[org.eclipse.sirius.diagram.business.internal.metamodel.description.tool.spec.ContainerDropDescriptionSpec@7e52a26b (documentation: ) (name: External EPackageTo Analyze from treeview, label: null, precondition: , forceRefresh: true, elementsToSelect: , inverseSelectionOrder: false) (dragSource: PROJECT_EXPLORER, moveEdges: false)], Diagnostic INFO source=org.eclipse.sirius code=1 Always false:
Nothing inferred when self (EClassifier=GenPackage) is type of EClassifierLiteral=GenFeature data=[org.eclipse.sirius.table.business.internal.metamodel.description.spec.FeatureColumnMappingSpec@f882465 (name: Category, label: null) (semanticElements: null) (headerLabelExpression: Category, initialWidth: 0) (canEdit: aql:self.oclIsTypeOf(genmodel::GenFeature), featureName: propertyCategory, labelExpression: aql:self->filter(genmodel::GenFeature).propertyCategory->first(), featureParentExpression: null)], Diagnostic INFO source=org.eclipse.sirius code=1 Always false:
Nothing inferred when self (EClassifier=GenPackage) is type of EClassifierLiteral=GenFeature data=[org.eclipse.sirius.table.business.internal.metamodel.description.spec.FeatureColumnMappingSpec@7f0f84d4 (name: Decription, label: null) (semanticElements: null) (headerLabelExpression: Description, initialWidth: 0) (canEdit: aql:self.oclIsTypeOf(genmodel::GenFeature), featureName: propertyDescription, labelExpression: aql:self->filter(genmodel::GenFeature).propertyDescription->first(), featureParentExpression: null)]]
	at org.junit.Assert.fail(Assert.java:88)
	at org.eclipse.emf.ecoretools.design.tests.VsmValidationTests.isValid(VsmValidationTests.java:51)

Running org.eclipse.emf.ecoretools.design.tests.TypeNameTests
3 : ecore.EAnnotation
2 : ecore.EAttribute
11 : ecore.EClass
3 : ecore.EClassifier
3 : ecore.EDataType
2 : ecore.EEnum
2 : ecore.EEnumLiteral
2 : ecore.EOperation
11 : ecore.EPackage
9 : ecore.EReference
6 : ecore.EStringToStringMapEntry
2 : ecore.EStructuralFeature
2 : ecore.ETypeParameter
1 : genmodel.GenClass
1 : genmodel.GenFeature
1 : genmodel.GenPackage
Tests run: 61, Failures: 0, Errors: 0, Skipped: 0, Time elapsed: 0.048 sec - in org.eclipse.emf.ecoretools.design.tests.TypeNameTests
isNotQualified[0](org.eclipse.emf.ecoretools.design.tests.TypeNameTests)  Time elapsed: 0 sec
isNotQualified[1](org.eclipse.emf.ecoretools.design.tests.TypeNameTests)  Time elapsed: 0 sec
isNotQualified[2](org.eclipse.emf.ecoretools.design.tests.TypeNameTests)  Time elapsed: 0 sec
isNotQualified[3](org.eclipse.emf.ecoretools.design.tests.TypeNameTests)  Time elapsed: 0 sec
isNotQualified[4](org.eclipse.emf.ecoretools.design.tests.TypeNameTests)  Time elapsed: 0 sec
isNotQualified[5](org.eclipse.emf.ecoretools.design.tests.TypeNameTests)  Time elapsed: 0 sec
isNotQualified[6](org.eclipse.emf.ecoretools.design.tests.TypeNameTests)  Time elapsed: 0 sec
isNotQualified[7](org.eclipse.emf.ecoretools.design.tests.TypeNameTests)  Time elapsed: 0 sec
isNotQualified[8](org.eclipse.emf.ecoretools.design.tests.TypeNameTests)  Time elapsed: 0 sec
isNotQualified[9](org.eclipse.emf.ecoretools.design.tests.TypeNameTests)  Time elapsed: 0 sec
isNotQualified[10](org.eclipse.emf.ecoretools.design.tests.TypeNameTests)  Time elapsed: 0 sec
isNotQualified[11](org.eclipse.emf.ecoretools.design.tests.TypeNameTests)  Time elapsed: 0 sec
isNotQualified[12](org.eclipse.emf.ecoretools.design.tests.TypeNameTests)  Time elapsed: 0 sec
isNotQualified[13](org.eclipse.emf.ecoretools.design.tests.TypeNameTests)  Time elapsed: 0 sec
isNotQualified[14](org.eclipse.emf.ecoretools.design.tests.TypeNameTests)  Time elapsed: 0 sec
isNotQualified[15](org.eclipse.emf.ecoretools.design.tests.TypeNameTests)  Time elapsed: 0.001 sec
isNotQualified[16](org.eclipse.emf.ecoretools.design.tests.TypeNameTests)  Time elapsed: 0 sec
isNotQualified[17](org.eclipse.emf.ecoretools.design.tests.TypeNameTests)  Time elapsed: 0 sec
isNotQualified[18](org.eclipse.emf.ecoretools.design.tests.TypeNameTests)  Time elapsed: 0 sec
isNotQualified[19](org.eclipse.emf.ecoretools.design.tests.TypeNameTests)  Time elapsed: 0 sec
isNotQualified[20](org.eclipse.emf.ecoretools.design.tests.TypeNameTests)  Time elapsed: 0 sec
isNotQualified[21](org.eclipse.emf.ecoretools.design.tests.TypeNameTests)  Time elapsed: 0 sec
isNotQualified[22](org.eclipse.emf.ecoretools.design.tests.TypeNameTests)  Time elapsed: 0 sec
isNotQualified[23](org.eclipse.emf.ecoretools.design.tests.TypeNameTests)  Time elapsed: 0 sec
isNotQualified[24](org.eclipse.emf.ecoretools.design.tests.TypeNameTests)  Time elapsed: 0 sec
isNotQualified[25](org.eclipse.emf.ecoretools.design.tests.TypeNameTests)  Time elapsed: 0 sec
isNotQualified[26](org.eclipse.emf.ecoretools.design.tests.TypeNameTests)  Time elapsed: 0 sec
isNotQualified[27](org.eclipse.emf.ecoretools.design.tests.TypeNameTests)  Time elapsed: 0 sec
isNotQualified[28](org.eclipse.emf.ecoretools.design.tests.TypeNameTests)  Time elapsed: 0 sec
isNotQualified[29](org.eclipse.emf.ecoretools.design.tests.TypeNameTests)  Time elapsed: 0 sec
isNotQualified[30](org.eclipse.emf.ecoretools.design.tests.TypeNameTests)  Time elapsed: 0 sec
isNotQualified[31](org.eclipse.emf.ecoretools.design.tests.TypeNameTests)  Time elapsed: 0 sec
isNotQualified[32](org.eclipse.emf.ecoretools.design.tests.TypeNameTests)  Time elapsed: 0 sec
isNotQualified[33](org.eclipse.emf.ecoretools.design.tests.TypeNameTests)  Time elapsed: 0 sec
isNotQualified[34](org.eclipse.emf.ecoretools.design.tests.TypeNameTests)  Time elapsed: 0 sec
isNotQualified[35](org.eclipse.emf.ecoretools.design.tests.TypeNameTests)  Time elapsed: 0 sec
isNotQualified[36](org.eclipse.emf.ecoretools.design.tests.TypeNameTests)  Time elapsed: 0 sec
isNotQualified[37](org.eclipse.emf.ecoretools.design.tests.TypeNameTests)  Time elapsed: 0 sec
isNotQualified[38](org.eclipse.emf.ecoretools.design.tests.TypeNameTests)  Time elapsed: 0 sec
isNotQualified[39](org.eclipse.emf.ecoretools.design.tests.TypeNameTests)  Time elapsed: 0 sec
isNotQualified[40](org.eclipse.emf.ecoretools.design.tests.TypeNameTests)  Time elapsed: 0 sec
isNotQualified[41](org.eclipse.emf.ecoretools.design.tests.TypeNameTests)  Time elapsed: 0 sec
isNotQualified[42](org.eclipse.emf.ecoretools.design.tests.TypeNameTests)  Time elapsed: 0 sec
isNotQualified[43](org.eclipse.emf.ecoretools.design.tests.TypeNameTests)  Time elapsed: 0 sec
isNotQualified[44](org.eclipse.emf.ecoretools.design.tests.TypeNameTests)  Time elapsed: 0 sec
isNotQualified[45](org.eclipse.emf.ecoretools.design.tests.TypeNameTests)  Time elapsed: 0 sec
isNotQualified[46](org.eclipse.emf.ecoretools.design.tests.TypeNameTests)  Time elapsed: 0 sec
isNotQualified[47](org.eclipse.emf.ecoretools.design.tests.TypeNameTests)  Time elapsed: 0 sec
isNotQualified[48](org.eclipse.emf.ecoretools.design.tests.TypeNameTests)  Time elapsed: 0 sec
isNotQualified[49](org.eclipse.emf.ecoretools.design.tests.TypeNameTests)  Time elapsed: 0 sec
isNotQualified[50](org.eclipse.emf.ecoretools.design.tests.TypeNameTests)  Time elapsed: 0 sec
isNotQualified[51](org.eclipse.emf.ecoretools.design.tests.TypeNameTests)  Time elapsed: 0 sec
isNotQualified[52](org.eclipse.emf.ecoretools.design.tests.TypeNameTests)  Time elapsed: 0 sec
isNotQualified[53](org.eclipse.emf.ecoretools.design.tests.TypeNameTests)  Time elapsed: 0 sec
isNotQualified[54](org.eclipse.emf.ecoretools.design.tests.TypeNameTests)  Time elapsed: 0 sec
isNotQualified[55](org.eclipse.emf.ecoretools.design.tests.TypeNameTests)  Time elapsed: 0 sec
isNotQualified[56](org.eclipse.emf.ecoretools.design.tests.TypeNameTests)  Time elapsed: 0 sec
isNotQualified[57](org.eclipse.emf.ecoretools.design.tests.TypeNameTests)  Time elapsed: 0 sec
isNotQualified[58](org.eclipse.emf.ecoretools.design.tests.TypeNameTests)  Time elapsed: 0 sec
isNotQualified[59](org.eclipse.emf.ecoretools.design.tests.TypeNameTests)  Time elapsed: 0 sec
isNotQualified[60](org.eclipse.emf.ecoretools.design.tests.TypeNameTests)  Time elapsed: 0 sec
Running org.eclipse.emf.ecoretools.design.tests.InterpretedExpressionTests
10 : -1
1 : /org.eclipse.emf.ecoretools.design/doc/user-guide.html#design.entities
1 : /org.eclipse.emf.ecoretools.design/doc/user-guide.html#quality.dependencies
9 : 0
28 : 1
4 : 10
4 : 12
1 : 14
1 : 16
1 : 2
1 : 24
2 : 3
1 : 5
1 : Category
1 : Description
1 : Domain Documentation
1 : Name
1 : T
1 : aql:'Constraint1 Constraint2'
1 : aql:'New documentation note'
1 : aql:'NewAbstractClass' + self.eContainer().eContents(ecore::EClass)->size()
1 : aql:'NewDataType' + self.eContainer().eContents(ecore::EDataType)->size()
2 : aql:'NewEClass'  + self.eContainer().eContents(ecore::EClass)->size()
1 : aql:'NewEnum' + self.eContainer().eContents(ecore::EEnum)->size()
1 : aql:'NewInterface' + self.eContainer().eContents(ecore::EClass)->size()
1 : aql:'The ' + self.target.oclAsType(ecore::EClass).name +' class has more than 10 super types'
1 : aql:'The ' + self.target.oclAsType(ecore::EClass).name +' class is never used'
1 : aql:'constraints'
2 : aql:'documentation'
1 : aql:'http://www.eclipse.org/emf/2002/Ecore'
2 : aql:'http://www.eclipse.org/emf/2002/GenModel'
1 : aql:'newDataType' + self.eContainer().eContents(ecore::EDataType)->size()
1 : aql:'newDescription' + self.eContainer()->filter(ecore::EPackage).eClassifiers->filter(ecore::EClass)->size()
1 : aql:'newMomentInterval' + self.eContainer()->filter(ecore::EPackage).eClassifiers->filter(ecore::EClass)->size()
1 : aql:'newOperation' + self.eContainer().eContents(ecore::EOperation)->size()
1 : aql:'newPackage' + self.eContainer().eContents(ecore::EPackage)->size()
1 : aql:'newRole' + self.eContainer()->filter(ecore::EPackage).eClassifiers->filter(ecore::EClass)->size()
1 : aql:'newThing' + self.eContainer()->filter(ecore::EPackage).eClassifiers->filter(ecore::EClass)->size()
1 : aql:('literal' +( self.eContainer().eContents(ecore::EEnumLiteral)->size() -1)).toUpper()
1 : aql:container <> self.eContainer()
3 : aql:container.oclIsTypeOf(ecore::EClass)
3 : aql:container.oclIsTypeOf(ecore::EPackage)
1 : aql:containerView.oclAsType(diagram::DDiagram).ownedDiagramElements.target->excluding(containerView.oclAsType(diagram::DSemanticDiagram).target)->size() = 0
1 : aql:containerView.oclIsKindOf(diagram::DDiagram)
3 : aql:element.eOpposite
1 : aql:element.eOpposite.eType
1 : aql:element.eOpposite.name
1 : aql:element.eType
1 : aql:element.name
1 : aql:false
1 : aql:lineSemantic.eAnnotations->select(a | a.source = 'http://www.eclipse.org/emf/2002/GenModel')->first()
1 : aql:lineSemantic.eAnnotations->select(a | a.source = 'http://www.eclipse.org/emf/2002/GenModel')->size() = 0
1 : aql:lineSemantic.eAnnotations->select(a | a.source = 'http://www.eclipse.org/emf/2002/GenModel').details->select(a | a.key = 'documentation')->first()
1 : aql:newSource
1 : aql:not self.derived
1 : aql:not self.eSuperTypes->includes(view.oclAsType(diagram::DEdge).targetNode.oclAsType(viewpoint::DSemanticDecorator).target)
1 : aql:not self.oclAsType(diagram::DEdge).sourceNode.oclAsType(viewpoint::DSemanticDecorator).target.oclAsType(ecore::EClass).eSuperTypes->includes(self.oclAsType(diagram::DEdge).targetNode.oclAsType(viewpoint::DSemanticDecorator).target)
1 : aql:not self.target.oclAsType(ecore::EClass).eAllSuperTypes->including(self.target)->asSet().eInverse('eType')->isEmpty()
1 : aql:self->filter(genmodel::GenFeature).propertyCategory->first()
1 : aql:self->filter(genmodel::GenFeature).propertyDescription->first()
2 : aql:self.addArchetypeAnnotation('Description')
2 : aql:self.addArchetypeAnnotation('MomentInterval')
2 : aql:self.addArchetypeAnnotation('Role')
2 : aql:self.addArchetypeAnnotation('Thing')
1 : aql:self.details->select(a | a.key = 'constraints')->asSequence()->first()
1 : aql:self.details->select(a | a.key = 'constraints')->size() = 0
1 : aql:self.details->select(a | a.key = 'documentation')->asSequence()->first()
1 : aql:self.details->select(a | a.key = 'documentation')->size() = 0
1 : aql:self.details->select(a| a.key = 'documentation')->size() = 0
2 : aql:self.eAllContents()
1 : aql:self.eAllContents(ecore::EAnnotation)->select(a | a.source = 'http://www.eclipse.org/emf/2002/GenModel').details->select(a | a.key = 'documentation')
1 : aql:self.eAllContents(genmodel::GenFeature)->select(a | a.ecoreFeature.oclIsTypeOf(ecore::EAttribute) or a.ecoreFeature.oclIsTypeOf(ecore::EReference) and not(a.ecoreFeature.oclAsType(ecore::EReference).containment) and not(a.ecoreFeature.oclAsType(ecore::EReference).derived))
1 : aql:self.eAnnotations->select(a | a.source = 'http://www.eclipse.org/emf/2002/Ecore')->asSequence()->first()
1 : aql:self.eAnnotations->select(a | a.source = 'http://www.eclipse.org/emf/2002/Ecore')->size() = 0
1 : aql:self.eAnnotations->select(a | a.source = 'http://www.eclipse.org/emf/2002/GenModel')->asSequence()->first()
1 : aql:self.eAnnotations->select(a | a.source = 'http://www.eclipse.org/emf/2002/GenModel')->size() = 0
2 : aql:self.eClass().name + ' : ' + self.name
1 : aql:self.eContainer().eContents(ecore::EEnumLiteral)->size()-1
1 : aql:self.eContainer().oclAsType(viewpoint::DSemanticDecorator).target = self.oclAsType(viewpoint::DSemanticDecorator).target.eContainer()
1 : aql:self.eContainer(ecore::EAnnotation).eContainer()
1 : aql:self.ecoreClass.name
1 : aql:self.ecoreFeature.name
1 : aql:self.name
1 : aql:self.name + ' class diagram'
1 : aql:self.name + ' class table'
1 : aql:self.name + ' documentation table'
1 : aql:self.name + ' package dependencies'
1 : aql:self.name + ' package entities'
2 : aql:self.oclIsTypeOf(genmodel::GenFeature)
1 : aql:self.prefix + ' generation table'
1 : aql:self.propertyCategory = ''
1 : aql:self.reconnectESuperTypeSource(target,source,otherEnd,edgeView,sourceView)
1 : aql:self.reconnectESuperTypeTarget(target,source,otherEnd,edgeView,sourceView)
1 : aql:self.target.oclAsType(ecore::EClass).eAllSuperTypes->size() < 10
1 : aql:self.value
1 : aql:source
1 : aql:source = target
2 : aql:source.eContainer(ecore::EAnnotation)
1 : aql:source.name.toLower()
3 : aql:target.name.toLower()
1 : aql:target.name.toLower() + 'eOpposite'
3 : false
3 : feature:abstract
1 : feature:container
1 : feature:containment
1 : feature:derived
1 : feature:eAttributes
1 : feature:eClassifiers
3 : feature:eContainer
4 : feature:eContents
1 : feature:eLiterals
1 : feature:eOperations
1 : feature:eType
1 : feature:eTypeParameters
1 : feature:instanceClassName
2 : feature:interface
11 : feature:name
1 : feature:nsURI
1 : feature:required
1 : feature:target
2 : feature:value
1 : newAttribute
2 : service:arrowsFillDiamond
1 : service:container.paste(copiedElement, copiedView, containerView)
1 : service:createTypeArgumentsIfNeeded(target)
2 : service:eContainerEContainer
1 : service:eKeysLabel
1 : service:eOperationSemanticElements
1 : service:fontFormatBold
1 : service:getClassesTableName
1 : service:getDependenciesAmount()
1 : service:getDependenciesLabel
1 : service:getDependenciesTooltip(view)
1 : service:getDirectSuperTypesOrMostSpecificVisibleOnes(diagram)
1 : service:getEOppositeEReferences(diagram)
1 : service:getEOppositeSemanticElements
1 : service:getEReferenceTarget
1 : service:getEReferencesToDisplay(diagram)
1 : service:getEdgeSourceSemantic(elementView)
1 : service:getEdgeTargetSemantic(elementView)
1 : service:getElementsIntroducingDependencies(diagram)
1 : service:getExternalEClasses(diagram)
1 : service:getInverseEReferences
1 : service:getNonDisplayedEReferences(diagram)
2 : service:getPackageDependencies
1 : service:getRelated(elementView,diagram)
2 : service:getRelated(views,diagram)
2 : service:getRootContainer
2 : service:getValidsForDiagram(containerView)
1 : service:getVisibleConstraintsAnnotations(diagram)
1 : service:getVisibleDocAnnotations(diagram)
1 : service:hasError
1 : service:hasNoDocAnnotation
1 : service:isDescription
9 : service:isEClass
5 : service:isEDataType
4 : service:isEEnum
1 : service:isEOperation
9 : service:isEPackage
1 : service:isEStructuralFeature
1 : service:isMomentInterval
1 : service:isRole
1 : service:isThing
4 : service:markForAutosize
1 : service:noEOpposite
1 : service:openClassDiagramContextHelp
2 : service:performEdit(arg0)
1 : service:performEditAsAttribute(arg0)
1 : service:reconnectEReferenceSource(target)
1 : service:reconnectEReferenceTarget(target)
4 : service:render
2 : service:renderAsNode
1 : service:renderEOperationTooltip
1 : service:renderEOpposite
13 : service:renderTooltip
2 : service:rootEPackages
2 : service:setEType(target)
1 : service:stdEmptyCollection
1 : service:superTypeSemanticElements
3 : service:superTypesLabel
1 : service:targetIsInterface(view)
1 : service:toCamelCase(arg0)
1 : service:viewContainerNotSemanticContainer(diagram,containerView)
7 : true
6 : var:arg0
11 : var:container
4 : var:containerView
7 : var:diagram
20 : var:element
2 : var:elementView
1 : var:instanceSource
2 : var:instanceTarget
1 : var:lineSemantic
6 : var:newContainerView
1 : var:newPackage
5 : var:newSemanticContainer
1 : var:newTarget
2 : var:selected
9 : var:self
4 : var:source
9 : var:target
Tests run: 425, Failures: 0, Errors: 0, Skipped: 0, Time elapsed: 0.119 sec - in org.eclipse.emf.ecoretools.design.tests.InterpretedExpressionTests
isNotAcceleo[0](org.eclipse.emf.ecoretools.design.tests.InterpretedExpressionTests)  Time elapsed: 0 sec
isNotAcceleo[1](org.eclipse.emf.ecoretools.design.tests.InterpretedExpressionTests)  Time elapsed: 0 sec
isNotAcceleo[2](org.eclipse.emf.ecoretools.design.tests.InterpretedExpressionTests)  Time elapsed: 0 sec
isNotAcceleo[3](org.eclipse.emf.ecoretools.design.tests.InterpretedExpressionTests)  Time elapsed: 0 sec
isNotAcceleo[4](org.eclipse.emf.ecoretools.design.tests.InterpretedExpressionTests)  Time elapsed: 0 sec
isNotAcceleo[5](org.eclipse.emf.ecoretools.design.tests.InterpretedExpressionTests)  Time elapsed: 0 sec
isNotAcceleo[6](org.eclipse.emf.ecoretools.design.tests.InterpretedExpressionTests)  Time elapsed: 0 sec
isNotAcceleo[7](org.eclipse.emf.ecoretools.design.tests.InterpretedExpressionTests)  Time elapsed: 0 sec
isNotAcceleo[8](org.eclipse.emf.ecoretools.design.tests.InterpretedExpressionTests)  Time elapsed: 0 sec
isNotAcceleo[9](org.eclipse.emf.ecoretools.design.tests.InterpretedExpressionTests)  Time elapsed: 0 sec
isNotAcceleo[10](org.eclipse.emf.ecoretools.design.tests.InterpretedExpressionTests)  Time elapsed: 0 sec
isNotAcceleo[11](org.eclipse.emf.ecoretools.design.tests.InterpretedExpressionTests)  Time elapsed: 0 sec
isNotAcceleo[12](org.eclipse.emf.ecoretools.design.tests.InterpretedExpressionTests)  Time elapsed: 0 sec
isNotAcceleo[13](org.eclipse.emf.ecoretools.design.tests.InterpretedExpressionTests)  Time elapsed: 0 sec
isNotAcceleo[14](org.eclipse.emf.ecoretools.design.tests.InterpretedExpressionTests)  Time elapsed: 0 sec
isNotAcceleo[15](org.eclipse.emf.ecoretools.design.tests.InterpretedExpressionTests)  Time elapsed: 0 sec
isNotAcceleo[16](org.eclipse.emf.ecoretools.design.tests.InterpretedExpressionTests)  Time elapsed: 0 sec
isNotAcceleo[17](org.eclipse.emf.ecoretools.design.tests.InterpretedExpressionTests)  Time elapsed: 0 sec
isNotAcceleo[18](org.eclipse.emf.ecoretools.design.tests.InterpretedExpressionTests)  Time elapsed: 0 sec
isNotAcceleo[19](org.eclipse.emf.ecoretools.design.tests.InterpretedExpressionTests)  Time elapsed: 0 sec
isNotAcceleo[20](org.eclipse.emf.ecoretools.design.tests.InterpretedExpressionTests)  Time elapsed: 0 sec
isNotAcceleo[21](org.eclipse.emf.ecoretools.design.tests.InterpretedExpressionTests)  Time elapsed: 0 sec
isNotAcceleo[22](org.eclipse.emf.ecoretools.design.tests.InterpretedExpressionTests)  Time elapsed: 0 sec
isNotAcceleo[23](org.eclipse.emf.ecoretools.design.tests.InterpretedExpressionTests)  Time elapsed: 0 sec
isNotAcceleo[24](org.eclipse.emf.ecoretools.design.tests.InterpretedExpressionTests)  Time elapsed: 0 sec
isNotAcceleo[25](org.eclipse.emf.ecoretools.design.tests.InterpretedExpressionTests)  Time elapsed: 0 sec
isNotAcceleo[26](org.eclipse.emf.ecoretools.design.tests.InterpretedExpressionTests)  Time elapsed: 0 sec
isNotAcceleo[27](org.eclipse.emf.ecoretools.design.tests.InterpretedExpressionTests)  Time elapsed: 0 sec
isNotAcceleo[28](org.eclipse.emf.ecoretools.design.tests.InterpretedExpressionTests)  Time elapsed: 0 sec
isNotAcceleo[29](org.eclipse.emf.ecoretools.design.tests.InterpretedExpressionTests)  Time elapsed: 0 sec
isNotAcceleo[30](org.eclipse.emf.ecoretools.design.tests.InterpretedExpressionTests)  Time elapsed: 0 sec
isNotAcceleo[31](org.eclipse.emf.ecoretools.design.tests.InterpretedExpressionTests)  Time elapsed: 0 sec
isNotAcceleo[32](org.eclipse.emf.ecoretools.design.tests.InterpretedExpressionTests)  Time elapsed: 0 sec
isNotAcceleo[33](org.eclipse.emf.ecoretools.design.tests.InterpretedExpressionTests)  Time elapsed: 0 sec
isNotAcceleo[34](org.eclipse.emf.ecoretools.design.tests.InterpretedExpressionTests)  Time elapsed: 0 sec
isNotAcceleo[35](org.eclipse.emf.ecoretools.design.tests.InterpretedExpressionTests)  Time elapsed: 0 sec
isNotAcceleo[36](org.eclipse.emf.ecoretools.design.tests.InterpretedExpressionTests)  Time elapsed: 0 sec
isNotAcceleo[37](org.eclipse.emf.ecoretools.design.tests.InterpretedExpressionTests)  Time elapsed: 0 sec
isNotAcceleo[38](org.eclipse.emf.ecoretools.design.tests.InterpretedExpressionTests)  Time elapsed: 0 sec
isNotAcceleo[39](org.eclipse.emf.ecoretools.design.tests.InterpretedExpressionTests)  Time elapsed: 0 sec
isNotAcceleo[40](org.eclipse.emf.ecoretools.design.tests.InterpretedExpressionTests)  Time elapsed: 0 sec
isNotAcceleo[41](org.eclipse.emf.ecoretools.design.tests.InterpretedExpressionTests)  Time elapsed: 0 sec
isNotAcceleo[42](org.eclipse.emf.ecoretools.design.tests.InterpretedExpressionTests)  Time elapsed: 0 sec
isNotAcceleo[43](org.eclipse.emf.ecoretools.design.tests.InterpretedExpressionTests)  Time elapsed: 0 sec
isNotAcceleo[44](org.eclipse.emf.ecoretools.design.tests.InterpretedExpressionTests)  Time elapsed: 0 sec
isNotAcceleo[45](org.eclipse.emf.ecoretools.design.tests.InterpretedExpressionTests)  Time elapsed: 0 sec
isNotAcceleo[46](org.eclipse.emf.ecoretools.design.tests.InterpretedExpressionTests)  Time elapsed: 0 sec
isNotAcceleo[47](org.eclipse.emf.ecoretools.design.tests.InterpretedExpressionTests)  Time elapsed: 0 sec
isNotAcceleo[48](org.eclipse.emf.ecoretools.design.tests.InterpretedExpressionTests)  Time elapsed: 0 sec
isNotAcceleo[49](org.eclipse.emf.ecoretools.design.tests.InterpretedExpressionTests)  Time elapsed: 0 sec
isNotAcceleo[50](org.eclipse.emf.ecoretools.design.tests.InterpretedExpressionTests)  Time elapsed: 0 sec
isNotAcceleo[51](org.eclipse.emf.ecoretools.design.tests.InterpretedExpressionTests)  Time elapsed: 0 sec
isNotAcceleo[52](org.eclipse.emf.ecoretools.design.tests.InterpretedExpressionTests)  Time elapsed: 0.001 sec
isNotAcceleo[53](org.eclipse.emf.ecoretools.design.tests.InterpretedExpressionTests)  Time elapsed: 0 sec
isNotAcceleo[54](org.eclipse.emf.ecoretools.design.tests.InterpretedExpressionTests)  Time elapsed: 0 sec
isNotAcceleo[55](org.eclipse.emf.ecoretools.design.tests.InterpretedExpressionTests)  Time elapsed: 0 sec
isNotAcceleo[56](org.eclipse.emf.ecoretools.design.tests.InterpretedExpressionTests)  Time elapsed: 0 sec
isNotAcceleo[57](org.eclipse.emf.ecoretools.design.tests.InterpretedExpressionTests)  Time elapsed: 0 sec
isNotAcceleo[58](org.eclipse.emf.ecoretools.design.tests.InterpretedExpressionTests)  Time elapsed: 0 sec
isNotAcceleo[59](org.eclipse.emf.ecoretools.design.tests.InterpretedExpressionTests)  Time elapsed: 0 sec
isNotAcceleo[60](org.eclipse.emf.ecoretools.design.tests.InterpretedExpressionTests)  Time elapsed: 0 sec
isNotAcceleo[61](org.eclipse.emf.ecoretools.design.tests.InterpretedExpressionTests)  Time elapsed: 0 sec
isNotAcceleo[62](org.eclipse.emf.ecoretools.design.tests.InterpretedExpressionTests)  Time elapsed: 0 sec
isNotAcceleo[63](org.eclipse.emf.ecoretools.design.tests.InterpretedExpressionTests)  Time elapsed: 0 sec
isNotAcceleo[64](org.eclipse.emf.ecoretools.design.tests.InterpretedExpressionTests)  Time elapsed: 0 sec
isNotAcceleo[65](org.eclipse.emf.ecoretools.design.tests.InterpretedExpressionTests)  Time elapsed: 0 sec
isNotAcceleo[66](org.eclipse.emf.ecoretools.design.tests.InterpretedExpressionTests)  Time elapsed: 0 sec
isNotAcceleo[67](org.eclipse.emf.ecoretools.design.tests.InterpretedExpressionTests)  Time elapsed: 0 sec
isNotAcceleo[68](org.eclipse.emf.ecoretools.design.tests.InterpretedExpressionTests)  Time elapsed: 0 sec
isNotAcceleo[69](org.eclipse.emf.ecoretools.design.tests.InterpretedExpressionTests)  Time elapsed: 0 sec
isNotAcceleo[70](org.eclipse.emf.ecoretools.design.tests.InterpretedExpressionTests)  Time elapsed: 0 sec
isNotAcceleo[71](org.eclipse.emf.ecoretools.design.tests.InterpretedExpressionTests)  Time elapsed: 0 sec
isNotAcceleo[72](org.eclipse.emf.ecoretools.design.tests.InterpretedExpressionTests)  Time elapsed: 0 sec
isNotAcceleo[73](org.eclipse.emf.ecoretools.design.tests.InterpretedExpressionTests)  Time elapsed: 0 sec
isNotAcceleo[74](org.eclipse.emf.ecoretools.design.tests.InterpretedExpressionTests)  Time elapsed: 0 sec
isNotAcceleo[75](org.eclipse.emf.ecoretools.design.tests.InterpretedExpressionTests)  Time elapsed: 0 sec
isNotAcceleo[76](org.eclipse.emf.ecoretools.design.tests.InterpretedExpressionTests)  Time elapsed: 0 sec
isNotAcceleo[77](org.eclipse.emf.ecoretools.design.tests.InterpretedExpressionTests)  Time elapsed: 0 sec
isNotAcceleo[78](org.eclipse.emf.ecoretools.design.tests.InterpretedExpressionTests)  Time elapsed: 0 sec
isNotAcceleo[79](org.eclipse.emf.ecoretools.design.tests.InterpretedExpressionTests)  Time elapsed: 0 sec
isNotAcceleo[80](org.eclipse.emf.ecoretools.design.tests.InterpretedExpressionTests)  Time elapsed: 0 sec
isNotAcceleo[81](org.eclipse.emf.ecoretools.design.tests.InterpretedExpressionTests)  Time elapsed: 0 sec
isNotAcceleo[82](org.eclipse.emf.ecoretools.design.tests.InterpretedExpressionTests)  Time elapsed: 0 sec
isNotAcceleo[83](org.eclipse.emf.ecoretools.design.tests.InterpretedExpressionTests)  Time elapsed: 0 sec
isNotAcceleo[84](org.eclipse.emf.ecoretools.design.tests.InterpretedExpressionTests)  Time elapsed: 0 sec
isNotAcceleo[85](org.eclipse.emf.ecoretools.design.tests.InterpretedExpressionTests)  Time elapsed: 0 sec
isNotAcceleo[86](org.eclipse.emf.ecoretools.design.tests.InterpretedExpressionTests)  Time elapsed: 0 sec
isNotAcceleo[87](org.eclipse.emf.ecoretools.design.tests.InterpretedExpressionTests)  Time elapsed: 0 sec
isNotAcceleo[88](org.eclipse.emf.ecoretools.design.tests.InterpretedExpressionTests)  Time elapsed: 0 sec
isNotAcceleo[89](org.eclipse.emf.ecoretools.design.tests.InterpretedExpressionTests)  Time elapsed: 0 sec
isNotAcceleo[90](org.eclipse.emf.ecoretools.design.tests.InterpretedExpressionTests)  Time elapsed: 0 sec
isNotAcceleo[91](org.eclipse.emf.ecoretools.design.tests.InterpretedExpressionTests)  Time elapsed: 0 sec
isNotAcceleo[92](org.eclipse.emf.ecoretools.design.tests.InterpretedExpressionTests)  Time elapsed: 0 sec
isNotAcceleo[93](org.eclipse.emf.ecoretools.design.tests.InterpretedExpressionTests)  Time elapsed: 0 sec
isNotAcceleo[94](org.eclipse.emf.ecoretools.design.tests.InterpretedExpressionTests)  Time elapsed: 0 sec
isNotAcceleo[95](org.eclipse.emf.ecoretools.design.tests.InterpretedExpressionTests)  Time elapsed: 0 sec
isNotAcceleo[96](org.eclipse.emf.ecoretools.design.tests.InterpretedExpressionTests)  Time elapsed: 0 sec
isNotAcceleo[97](org.eclipse.emf.ecoretools.design.tests.InterpretedExpressionTests)  Time elapsed: 0 sec
isNotAcceleo[98](org.eclipse.emf.ecoretools.design.tests.InterpretedExpressionTests)  Time elapsed: 0 sec
isNotAcceleo[99](org.eclipse.emf.ecoretools.design.tests.InterpretedExpressionTests)  Time elapsed: 0.001 sec
isNotAcceleo[100](org.eclipse.emf.ecoretools.design.tests.InterpretedExpressionTests)  Time elapsed: 0 sec
isNotAcceleo[101](org.eclipse.emf.ecoretools.design.tests.InterpretedExpressionTests)  Time elapsed: 0 sec
isNotAcceleo[102](org.eclipse.emf.ecoretools.design.tests.InterpretedExpressionTests)  Time elapsed: 0 sec
isNotAcceleo[103](org.eclipse.emf.ecoretools.design.tests.InterpretedExpressionTests)  Time elapsed: 0 sec
isNotAcceleo[104](org.eclipse.emf.ecoretools.design.tests.InterpretedExpressionTests)  Time elapsed: 0 sec
isNotAcceleo[105](org.eclipse.emf.ecoretools.design.tests.InterpretedExpressionTests)  Time elapsed: 0 sec
isNotAcceleo[106](org.eclipse.emf.ecoretools.design.tests.InterpretedExpressionTests)  Time elapsed: 0 sec
isNotAcceleo[107](org.eclipse.emf.ecoretools.design.tests.InterpretedExpressionTests)  Time elapsed: 0 sec
isNotAcceleo[108](org.eclipse.emf.ecoretools.design.tests.InterpretedExpressionTests)  Time elapsed: 0.001 sec
isNotAcceleo[109](org.eclipse.emf.ecoretools.design.tests.InterpretedExpressionTests)  Time elapsed: 0 sec
isNotAcceleo[110](org.eclipse.emf.ecoretools.design.tests.InterpretedExpressionTests)  Time elapsed: 0 sec
isNotAcceleo[111](org.eclipse.emf.ecoretools.design.tests.InterpretedExpressionTests)  Time elapsed: 0 sec
isNotAcceleo[112](org.eclipse.emf.ecoretools.design.tests.InterpretedExpressionTests)  Time elapsed: 0 sec
isNotAcceleo[113](org.eclipse.emf.ecoretools.design.tests.InterpretedExpressionTests)  Time elapsed: 0 sec
isNotAcceleo[114](org.eclipse.emf.ecoretools.design.tests.InterpretedExpressionTests)  Time elapsed: 0 sec
isNotAcceleo[115](org.eclipse.emf.ecoretools.design.tests.InterpretedExpressionTests)  Time elapsed: 0 sec
isNotAcceleo[116](org.eclipse.emf.ecoretools.design.tests.InterpretedExpressionTests)  Time elapsed: 0 sec
isNotAcceleo[117](org.eclipse.emf.ecoretools.design.tests.InterpretedExpressionTests)  Time elapsed: 0 sec
isNotAcceleo[118](org.eclipse.emf.ecoretools.design.tests.InterpretedExpressionTests)  Time elapsed: 0 sec
isNotAcceleo[119](org.eclipse.emf.ecoretools.design.tests.InterpretedExpressionTests)  Time elapsed: 0 sec
isNotAcceleo[120](org.eclipse.emf.ecoretools.design.tests.InterpretedExpressionTests)  Time elapsed: 0 sec
isNotAcceleo[121](org.eclipse.emf.ecoretools.design.tests.InterpretedExpressionTests)  Time elapsed: 0 sec
isNotAcceleo[122](org.eclipse.emf.ecoretools.design.tests.InterpretedExpressionTests)  Time elapsed: 0 sec
isNotAcceleo[123](org.eclipse.emf.ecoretools.design.tests.InterpretedExpressionTests)  Time elapsed: 0 sec
isNotAcceleo[124](org.eclipse.emf.ecoretools.design.tests.InterpretedExpressionTests)  Time elapsed: 0 sec
isNotAcceleo[125](org.eclipse.emf.ecoretools.design.tests.InterpretedExpressionTests)  Time elapsed: 0 sec
isNotAcceleo[126](org.eclipse.emf.ecoretools.design.tests.InterpretedExpressionTests)  Time elapsed: 0 sec
isNotAcceleo[127](org.eclipse.emf.ecoretools.design.tests.InterpretedExpressionTests)  Time elapsed: 0 sec
isNotAcceleo[128](org.eclipse.emf.ecoretools.design.tests.InterpretedExpressionTests)  Time elapsed: 0 sec
isNotAcceleo[129](org.eclipse.emf.ecoretools.design.tests.InterpretedExpressionTests)  Time elapsed: 0 sec
isNotAcceleo[130](org.eclipse.emf.ecoretools.design.tests.InterpretedExpressionTests)  Time elapsed: 0 sec
isNotAcceleo[131](org.eclipse.emf.ecoretools.design.tests.InterpretedExpressionTests)  Time elapsed: 0 sec
isNotAcceleo[132](org.eclipse.emf.ecoretools.design.tests.InterpretedExpressionTests)  Time elapsed: 0 sec
isNotAcceleo[133](org.eclipse.emf.ecoretools.design.tests.InterpretedExpressionTests)  Time elapsed: 0.001 sec
isNotAcceleo[134](org.eclipse.emf.ecoretools.design.tests.InterpretedExpressionTests)  Time elapsed: 0 sec
isNotAcceleo[135](org.eclipse.emf.ecoretools.design.tests.InterpretedExpressionTests)  Time elapsed: 0 sec
isNotAcceleo[136](org.eclipse.emf.ecoretools.design.tests.InterpretedExpressionTests)  Time elapsed: 0 sec
isNotAcceleo[137](org.eclipse.emf.ecoretools.design.tests.InterpretedExpressionTests)  Time elapsed: 0 sec
isNotAcceleo[138](org.eclipse.emf.ecoretools.design.tests.InterpretedExpressionTests)  Time elapsed: 0 sec
isNotAcceleo[139](org.eclipse.emf.ecoretools.design.tests.InterpretedExpressionTests)  Time elapsed: 0 sec
isNotAcceleo[140](org.eclipse.emf.ecoretools.design.tests.InterpretedExpressionTests)  Time elapsed: 0 sec
isNotAcceleo[141](org.eclipse.emf.ecoretools.design.tests.InterpretedExpressionTests)  Time elapsed: 0 sec
isNotAcceleo[142](org.eclipse.emf.ecoretools.design.tests.InterpretedExpressionTests)  Time elapsed: 0 sec
isNotAcceleo[143](org.eclipse.emf.ecoretools.design.tests.InterpretedExpressionTests)  Time elapsed: 0 sec
isNotAcceleo[144](org.eclipse.emf.ecoretools.design.tests.InterpretedExpressionTests)  Time elapsed: 0 sec
isNotAcceleo[145](org.eclipse.emf.ecoretools.design.tests.InterpretedExpressionTests)  Time elapsed: 0 sec
isNotAcceleo[146](org.eclipse.emf.ecoretools.design.tests.InterpretedExpressionTests)  Time elapsed: 0 sec
isNotAcceleo[147](org.eclipse.emf.ecoretools.design.tests.InterpretedExpressionTests)  Time elapsed: 0 sec
isNotAcceleo[148](org.eclipse.emf.ecoretools.design.tests.InterpretedExpressionTests)  Time elapsed: 0 sec
isNotAcceleo[149](org.eclipse.emf.ecoretools.design.tests.InterpretedExpressionTests)  Time elapsed: 0 sec
isNotAcceleo[150](org.eclipse.emf.ecoretools.design.tests.InterpretedExpressionTests)  Time elapsed: 0 sec
isNotAcceleo[151](org.eclipse.emf.ecoretools.design.tests.InterpretedExpressionTests)  Time elapsed: 0 sec
isNotAcceleo[152](org.eclipse.emf.ecoretools.design.tests.InterpretedExpressionTests)  Time elapsed: 0 sec
isNotAcceleo[153](org.eclipse.emf.ecoretools.design.tests.InterpretedExpressionTests)  Time elapsed: 0 sec
isNotAcceleo[154](org.eclipse.emf.ecoretools.design.tests.InterpretedExpressionTests)  Time elapsed: 0 sec
isNotAcceleo[155](org.eclipse.emf.ecoretools.design.tests.InterpretedExpressionTests)  Time elapsed: 0 sec
isNotAcceleo[156](org.eclipse.emf.ecoretools.design.tests.InterpretedExpressionTests)  Time elapsed: 0 sec
isNotAcceleo[157](org.eclipse.emf.ecoretools.design.tests.InterpretedExpressionTests)  Time elapsed: 0 sec
isNotAcceleo[158](org.eclipse.emf.ecoretools.design.tests.InterpretedExpressionTests)  Time elapsed: 0 sec
isNotAcceleo[159](org.eclipse.emf.ecoretools.design.tests.InterpretedExpressionTests)  Time elapsed: 0 sec
isNotAcceleo[160](org.eclipse.emf.ecoretools.design.tests.InterpretedExpressionTests)  Time elapsed: 0 sec
isNotAcceleo[161](org.eclipse.emf.ecoretools.design.tests.InterpretedExpressionTests)  Time elapsed: 0 sec
isNotAcceleo[162](org.eclipse.emf.ecoretools.design.tests.InterpretedExpressionTests)  Time elapsed: 0 sec
isNotAcceleo[163](org.eclipse.emf.ecoretools.design.tests.InterpretedExpressionTests)  Time elapsed: 0 sec
isNotAcceleo[164](org.eclipse.emf.ecoretools.design.tests.InterpretedExpressionTests)  Time elapsed: 0 sec
isNotAcceleo[165](org.eclipse.emf.ecoretools.design.tests.InterpretedExpressionTests)  Time elapsed: 0 sec
isNotAcceleo[166](org.eclipse.emf.ecoretools.design.tests.InterpretedExpressionTests)  Time elapsed: 0 sec
isNotAcceleo[167](org.eclipse.emf.ecoretools.design.tests.InterpretedExpressionTests)  Time elapsed: 0 sec
isNotAcceleo[168](org.eclipse.emf.ecoretools.design.tests.InterpretedExpressionTests)  Time elapsed: 0 sec
isNotAcceleo[169](org.eclipse.emf.ecoretools.design.tests.InterpretedExpressionTests)  Time elapsed: 0 sec
isNotAcceleo[170](org.eclipse.emf.ecoretools.design.tests.InterpretedExpressionTests)  Time elapsed: 0 sec
isNotAcceleo[171](org.eclipse.emf.ecoretools.design.tests.InterpretedExpressionTests)  Time elapsed: 0 sec
isNotAcceleo[172](org.eclipse.emf.ecoretools.design.tests.InterpretedExpressionTests)  Time elapsed: 0 sec
isNotAcceleo[173](org.eclipse.emf.ecoretools.design.tests.InterpretedExpressionTests)  Time elapsed: 0 sec
isNotAcceleo[174](org.eclipse.emf.ecoretools.design.tests.InterpretedExpressionTests)  Time elapsed: 0 sec
isNotAcceleo[175](org.eclipse.emf.ecoretools.design.tests.InterpretedExpressionTests)  Time elapsed: 0 sec
isNotAcceleo[176](org.eclipse.emf.ecoretools.design.tests.InterpretedExpressionTests)  Time elapsed: 0 sec
isNotAcceleo[177](org.eclipse.emf.ecoretools.design.tests.InterpretedExpressionTests)  Time elapsed: 0 sec
isNotAcceleo[178](org.eclipse.emf.ecoretools.design.tests.InterpretedExpressionTests)  Time elapsed: 0 sec
isNotAcceleo[179](org.eclipse.emf.ecoretools.design.tests.InterpretedExpressionTests)  Time elapsed: 0 sec
isNotAcceleo[180](org.eclipse.emf.ecoretools.design.tests.InterpretedExpressionTests)  Time elapsed: 0 sec
isNotAcceleo[181](org.eclipse.emf.ecoretools.design.tests.InterpretedExpressionTests)  Time elapsed: 0 sec
isNotAcceleo[182](org.eclipse.emf.ecoretools.design.tests.InterpretedExpressionTests)  Time elapsed: 0 sec
isNotAcceleo[183](org.eclipse.emf.ecoretools.design.tests.InterpretedExpressionTests)  Time elapsed: 0 sec
isNotAcceleo[184](org.eclipse.emf.ecoretools.design.tests.InterpretedExpressionTests)  Time elapsed: 0 sec
isNotAcceleo[185](org.eclipse.emf.ecoretools.design.tests.InterpretedExpressionTests)  Time elapsed: 0 sec
isNotAcceleo[186](org.eclipse.emf.ecoretools.design.tests.InterpretedExpressionTests)  Time elapsed: 0 sec
isNotAcceleo[187](org.eclipse.emf.ecoretools.design.tests.InterpretedExpressionTests)  Time elapsed: 0 sec
isNotAcceleo[188](org.eclipse.emf.ecoretools.design.tests.InterpretedExpressionTests)  Time elapsed: 0 sec
isNotAcceleo[189](org.eclipse.emf.ecoretools.design.tests.InterpretedExpressionTests)  Time elapsed: 0 sec
isNotAcceleo[190](org.eclipse.emf.ecoretools.design.tests.InterpretedExpressionTests)  Time elapsed: 0 sec
isNotAcceleo[191](org.eclipse.emf.ecoretools.design.tests.InterpretedExpressionTests)  Time elapsed: 0 sec
isNotAcceleo[192](org.eclipse.emf.ecoretools.design.tests.InterpretedExpressionTests)  Time elapsed: 0 sec
isNotAcceleo[193](org.eclipse.emf.ecoretools.design.tests.InterpretedExpressionTests)  Time elapsed: 0 sec
isNotAcceleo[194](org.eclipse.emf.ecoretools.design.tests.InterpretedExpressionTests)  Time elapsed: 0 sec
isNotAcceleo[195](org.eclipse.emf.ecoretools.design.tests.InterpretedExpressionTests)  Time elapsed: 0 sec
isNotAcceleo[196](org.eclipse.emf.ecoretools.design.tests.InterpretedExpressionTests)  Time elapsed: 0 sec
isNotAcceleo[197](org.eclipse.emf.ecoretools.design.tests.InterpretedExpressionTests)  Time elapsed: 0 sec
isNotAcceleo[198](org.eclipse.emf.ecoretools.design.tests.InterpretedExpressionTests)  Time elapsed: 0 sec
isNotAcceleo[199](org.eclipse.emf.ecoretools.design.tests.InterpretedExpressionTests)  Time elapsed: 0 sec
isNotAcceleo[200](org.eclipse.emf.ecoretools.design.tests.InterpretedExpressionTests)  Time elapsed: 0 sec
isNotAcceleo[201](org.eclipse.emf.ecoretools.design.tests.InterpretedExpressionTests)  Time elapsed: 0 sec
isNotAcceleo[202](org.eclipse.emf.ecoretools.design.tests.InterpretedExpressionTests)  Time elapsed: 0 sec
isNotAcceleo[203](org.eclipse.emf.ecoretools.design.tests.InterpretedExpressionTests)  Time elapsed: 0 sec
isNotAcceleo[204](org.eclipse.emf.ecoretools.design.tests.InterpretedExpressionTests)  Time elapsed: 0 sec
isNotAcceleo[205](org.eclipse.emf.ecoretools.design.tests.InterpretedExpressionTests)  Time elapsed: 0 sec
isNotAcceleo[206](org.eclipse.emf.ecoretools.design.tests.InterpretedExpressionTests)  Time elapsed: 0 sec
isNotAcceleo[207](org.eclipse.emf.ecoretools.design.tests.InterpretedExpressionTests)  Time elapsed: 0 sec
isNotAcceleo[208](org.eclipse.emf.ecoretools.design.tests.InterpretedExpressionTests)  Time elapsed: 0 sec
isNotAcceleo[209](org.eclipse.emf.ecoretools.design.tests.InterpretedExpressionTests)  Time elapsed: 0 sec
isNotAcceleo[210](org.eclipse.emf.ecoretools.design.tests.InterpretedExpressionTests)  Time elapsed: 0 sec
isNotAcceleo[211](org.eclipse.emf.ecoretools.design.tests.InterpretedExpressionTests)  Time elapsed: 0 sec
isNotAcceleo[212](org.eclipse.emf.ecoretools.design.tests.InterpretedExpressionTests)  Time elapsed: 0 sec
isNotAcceleo[213](org.eclipse.emf.ecoretools.design.tests.InterpretedExpressionTests)  Time elapsed: 0 sec
isNotAcceleo[214](org.eclipse.emf.ecoretools.design.tests.InterpretedExpressionTests)  Time elapsed: 0 sec
isNotAcceleo[215](org.eclipse.emf.ecoretools.design.tests.InterpretedExpressionTests)  Time elapsed: 0 sec
isNotAcceleo[216](org.eclipse.emf.ecoretools.design.tests.InterpretedExpressionTests)  Time elapsed: 0 sec
isNotAcceleo[217](org.eclipse.emf.ecoretools.design.tests.InterpretedExpressionTests)  Time elapsed: 0 sec
isNotAcceleo[218](org.eclipse.emf.ecoretools.design.tests.InterpretedExpressionTests)  Time elapsed: 0.001 sec
isNotAcceleo[219](org.eclipse.emf.ecoretools.design.tests.InterpretedExpressionTests)  Time elapsed: 0 sec
isNotAcceleo[220](org.eclipse.emf.ecoretools.design.tests.InterpretedExpressionTests)  Time elapsed: 0 sec
isNotAcceleo[221](org.eclipse.emf.ecoretools.design.tests.InterpretedExpressionTests)  Time elapsed: 0 sec
isNotAcceleo[222](org.eclipse.emf.ecoretools.design.tests.InterpretedExpressionTests)  Time elapsed: 0 sec
isNotAcceleo[223](org.eclipse.emf.ecoretools.design.tests.InterpretedExpressionTests)  Time elapsed: 0 sec
isNotAcceleo[224](org.eclipse.emf.ecoretools.design.tests.InterpretedExpressionTests)  Time elapsed: 0 sec
isNotAcceleo[225](org.eclipse.emf.ecoretools.design.tests.InterpretedExpressionTests)  Time elapsed: 0 sec
isNotAcceleo[226](org.eclipse.emf.ecoretools.design.tests.InterpretedExpressionTests)  Time elapsed: 0 sec
isNotAcceleo[227](org.eclipse.emf.ecoretools.design.tests.InterpretedExpressionTests)  Time elapsed: 0 sec
isNotAcceleo[228](org.eclipse.emf.ecoretools.design.tests.InterpretedExpressionTests)  Time elapsed: 0 sec
isNotAcceleo[229](org.eclipse.emf.ecoretools.design.tests.InterpretedExpressionTests)  Time elapsed: 0 sec
isNotAcceleo[230](org.eclipse.emf.ecoretools.design.tests.InterpretedExpressionTests)  Time elapsed: 0 sec
isNotAcceleo[231](org.eclipse.emf.ecoretools.design.tests.InterpretedExpressionTests)  Time elapsed: 0 sec
isNotAcceleo[232](org.eclipse.emf.ecoretools.design.tests.InterpretedExpressionTests)  Time elapsed: 0 sec
isNotAcceleo[233](org.eclipse.emf.ecoretools.design.tests.InterpretedExpressionTests)  Time elapsed: 0 sec
isNotAcceleo[234](org.eclipse.emf.ecoretools.design.tests.InterpretedExpressionTests)  Time elapsed: 0 sec
isNotAcceleo[235](org.eclipse.emf.ecoretools.design.tests.InterpretedExpressionTests)  Time elapsed: 0 sec
isNotAcceleo[236](org.eclipse.emf.ecoretools.design.tests.InterpretedExpressionTests)  Time elapsed: 0 sec
isNotAcceleo[237](org.eclipse.emf.ecoretools.design.tests.InterpretedExpressionTests)  Time elapsed: 0 sec
isNotAcceleo[238](org.eclipse.emf.ecoretools.design.tests.InterpretedExpressionTests)  Time elapsed: 0 sec
isNotAcceleo[239](org.eclipse.emf.ecoretools.design.tests.InterpretedExpressionTests)  Time elapsed: 0 sec
isNotAcceleo[240](org.eclipse.emf.ecoretools.design.tests.InterpretedExpressionTests)  Time elapsed: 0 sec
isNotAcceleo[241](org.eclipse.emf.ecoretools.design.tests.InterpretedExpressionTests)  Time elapsed: 0 sec
isNotAcceleo[242](org.eclipse.emf.ecoretools.design.tests.InterpretedExpressionTests)  Time elapsed: 0 sec
isNotAcceleo[243](org.eclipse.emf.ecoretools.design.tests.InterpretedExpressionTests)  Time elapsed: 0 sec
isNotAcceleo[244](org.eclipse.emf.ecoretools.design.tests.InterpretedExpressionTests)  Time elapsed: 0 sec
isNotAcceleo[245](org.eclipse.emf.ecoretools.design.tests.InterpretedExpressionTests)  Time elapsed: 0 sec
isNotAcceleo[246](org.eclipse.emf.ecoretools.design.tests.InterpretedExpressionTests)  Time elapsed: 0 sec
isNotAcceleo[247](org.eclipse.emf.ecoretools.design.tests.InterpretedExpressionTests)  Time elapsed: 0 sec
isNotAcceleo[248](org.eclipse.emf.ecoretools.design.tests.InterpretedExpressionTests)  Time elapsed: 0 sec
isNotAcceleo[249](org.eclipse.emf.ecoretools.design.tests.InterpretedExpressionTests)  Time elapsed: 0 sec
isNotAcceleo[250](org.eclipse.emf.ecoretools.design.tests.InterpretedExpressionTests)  Time elapsed: 0 sec
isNotAcceleo[251](org.eclipse.emf.ecoretools.design.tests.InterpretedExpressionTests)  Time elapsed: 0 sec
isNotAcceleo[252](org.eclipse.emf.ecoretools.design.tests.InterpretedExpressionTests)  Time elapsed: 0 sec
isNotAcceleo[253](org.eclipse.emf.ecoretools.design.tests.InterpretedExpressionTests)  Time elapsed: 0 sec
isNotAcceleo[254](org.eclipse.emf.ecoretools.design.tests.InterpretedExpressionTests)  Time elapsed: 0 sec
isNotAcceleo[255](org.eclipse.emf.ecoretools.design.tests.InterpretedExpressionTests)  Time elapsed: 0 sec
isNotAcceleo[256](org.eclipse.emf.ecoretools.design.tests.InterpretedExpressionTests)  Time elapsed: 0 sec
isNotAcceleo[257](org.eclipse.emf.ecoretools.design.tests.InterpretedExpressionTests)  Time elapsed: 0 sec
isNotAcceleo[258](org.eclipse.emf.ecoretools.design.tests.InterpretedExpressionTests)  Time elapsed: 0 sec
isNotAcceleo[259](org.eclipse.emf.ecoretools.design.tests.InterpretedExpressionTests)  Time elapsed: 0 sec
isNotAcceleo[260](org.eclipse.emf.ecoretools.design.tests.InterpretedExpressionTests)  Time elapsed: 0 sec
isNotAcceleo[261](org.eclipse.emf.ecoretools.design.tests.InterpretedExpressionTests)  Time elapsed: 0 sec
isNotAcceleo[262](org.eclipse.emf.ecoretools.design.tests.InterpretedExpressionTests)  Time elapsed: 0 sec
isNotAcceleo[263](org.eclipse.emf.ecoretools.design.tests.InterpretedExpressionTests)  Time elapsed: 0 sec
isNotAcceleo[264](org.eclipse.emf.ecoretools.design.tests.InterpretedExpressionTests)  Time elapsed: 0 sec
isNotAcceleo[265](org.eclipse.emf.ecoretools.design.tests.InterpretedExpressionTests)  Time elapsed: 0 sec
isNotAcceleo[266](org.eclipse.emf.ecoretools.design.tests.InterpretedExpressionTests)  Time elapsed: 0 sec
isNotAcceleo[267](org.eclipse.emf.ecoretools.design.tests.InterpretedExpressionTests)  Time elapsed: 0 sec
isNotAcceleo[268](org.eclipse.emf.ecoretools.design.tests.InterpretedExpressionTests)  Time elapsed: 0 sec
isNotAcceleo[269](org.eclipse.emf.ecoretools.design.tests.InterpretedExpressionTests)  Time elapsed: 0 sec
isNotAcceleo[270](org.eclipse.emf.ecoretools.design.tests.InterpretedExpressionTests)  Time elapsed: 0 sec
isNotAcceleo[271](org.eclipse.emf.ecoretools.design.tests.InterpretedExpressionTests)  Time elapsed: 0 sec
isNotAcceleo[272](org.eclipse.emf.ecoretools.design.tests.InterpretedExpressionTests)  Time elapsed: 0 sec
isNotAcceleo[273](org.eclipse.emf.ecoretools.design.tests.InterpretedExpressionTests)  Time elapsed: 0 sec
isNotAcceleo[274](org.eclipse.emf.ecoretools.design.tests.InterpretedExpressionTests)  Time elapsed: 0 sec
isNotAcceleo[275](org.eclipse.emf.ecoretools.design.tests.InterpretedExpressionTests)  Time elapsed: 0 sec
isNotAcceleo[276](org.eclipse.emf.ecoretools.design.tests.InterpretedExpressionTests)  Time elapsed: 0 sec
isNotAcceleo[277](org.eclipse.emf.ecoretools.design.tests.InterpretedExpressionTests)  Time elapsed: 0 sec
isNotAcceleo[278](org.eclipse.emf.ecoretools.design.tests.InterpretedExpressionTests)  Time elapsed: 0 sec
isNotAcceleo[279](org.eclipse.emf.ecoretools.design.tests.InterpretedExpressionTests)  Time elapsed: 0 sec
isNotAcceleo[280](org.eclipse.emf.ecoretools.design.tests.InterpretedExpressionTests)  Time elapsed: 0 sec
isNotAcceleo[281](org.eclipse.emf.ecoretools.design.tests.InterpretedExpressionTests)  Time elapsed: 0 sec
isNotAcceleo[282](org.eclipse.emf.ecoretools.design.tests.InterpretedExpressionTests)  Time elapsed: 0 sec
isNotAcceleo[283](org.eclipse.emf.ecoretools.design.tests.InterpretedExpressionTests)  Time elapsed: 0.001 sec
isNotAcceleo[284](org.eclipse.emf.ecoretools.design.tests.InterpretedExpressionTests)  Time elapsed: 0 sec
isNotAcceleo[285](org.eclipse.emf.ecoretools.design.tests.InterpretedExpressionTests)  Time elapsed: 0 sec
isNotAcceleo[286](org.eclipse.emf.ecoretools.design.tests.InterpretedExpressionTests)  Time elapsed: 0 sec
isNotAcceleo[287](org.eclipse.emf.ecoretools.design.tests.InterpretedExpressionTests)  Time elapsed: 0 sec
isNotAcceleo[288](org.eclipse.emf.ecoretools.design.tests.InterpretedExpressionTests)  Time elapsed: 0 sec
isNotAcceleo[289](org.eclipse.emf.ecoretools.design.tests.InterpretedExpressionTests)  Time elapsed: 0 sec
isNotAcceleo[290](org.eclipse.emf.ecoretools.design.tests.InterpretedExpressionTests)  Time elapsed: 0 sec
isNotAcceleo[291](org.eclipse.emf.ecoretools.design.tests.InterpretedExpressionTests)  Time elapsed: 0 sec
isNotAcceleo[292](org.eclipse.emf.ecoretools.design.tests.InterpretedExpressionTests)  Time elapsed: 0 sec
isNotAcceleo[293](org.eclipse.emf.ecoretools.design.tests.InterpretedExpressionTests)  Time elapsed: 0 sec
isNotAcceleo[294](org.eclipse.emf.ecoretools.design.tests.InterpretedExpressionTests)  Time elapsed: 0 sec
isNotAcceleo[295](org.eclipse.emf.ecoretools.design.tests.InterpretedExpressionTests)  Time elapsed: 0 sec
isNotAcceleo[296](org.eclipse.emf.ecoretools.design.tests.InterpretedExpressionTests)  Time elapsed: 0 sec
isNotAcceleo[297](org.eclipse.emf.ecoretools.design.tests.InterpretedExpressionTests)  Time elapsed: 0 sec
isNotAcceleo[298](org.eclipse.emf.ecoretools.design.tests.InterpretedExpressionTests)  Time elapsed: 0 sec
isNotAcceleo[299](org.eclipse.emf.ecoretools.design.tests.InterpretedExpressionTests)  Time elapsed: 0 sec
isNotAcceleo[300](org.eclipse.emf.ecoretools.design.tests.InterpretedExpressionTests)  Time elapsed: 0 sec
isNotAcceleo[301](org.eclipse.emf.ecoretools.design.tests.InterpretedExpressionTests)  Time elapsed: 0 sec
isNotAcceleo[302](org.eclipse.emf.ecoretools.design.tests.InterpretedExpressionTests)  Time elapsed: 0 sec
isNotAcceleo[303](org.eclipse.emf.ecoretools.design.tests.InterpretedExpressionTests)  Time elapsed: 0 sec
isNotAcceleo[304](org.eclipse.emf.ecoretools.design.tests.InterpretedExpressionTests)  Time elapsed: 0 sec
isNotAcceleo[305](org.eclipse.emf.ecoretools.design.tests.InterpretedExpressionTests)  Time elapsed: 0 sec
isNotAcceleo[306](org.eclipse.emf.ecoretools.design.tests.InterpretedExpressionTests)  Time elapsed: 0 sec
isNotAcceleo[307](org.eclipse.emf.ecoretools.design.tests.InterpretedExpressionTests)  Time elapsed: 0 sec
isNotAcceleo[308](org.eclipse.emf.ecoretools.design.tests.InterpretedExpressionTests)  Time elapsed: 0 sec
isNotAcceleo[309](org.eclipse.emf.ecoretools.design.tests.InterpretedExpressionTests)  Time elapsed: 0 sec
isNotAcceleo[310](org.eclipse.emf.ecoretools.design.tests.InterpretedExpressionTests)  Time elapsed: 0 sec
isNotAcceleo[311](org.eclipse.emf.ecoretools.design.tests.InterpretedExpressionTests)  Time elapsed: 0 sec
isNotAcceleo[312](org.eclipse.emf.ecoretools.design.tests.InterpretedExpressionTests)  Time elapsed: 0 sec
isNotAcceleo[313](org.eclipse.emf.ecoretools.design.tests.InterpretedExpressionTests)  Time elapsed: 0 sec
isNotAcceleo[314](org.eclipse.emf.ecoretools.design.tests.InterpretedExpressionTests)  Time elapsed: 0 sec
isNotAcceleo[315](org.eclipse.emf.ecoretools.design.tests.InterpretedExpressionTests)  Time elapsed: 0 sec
isNotAcceleo[316](org.eclipse.emf.ecoretools.design.tests.InterpretedExpressionTests)  Time elapsed: 0 sec
isNotAcceleo[317](org.eclipse.emf.ecoretools.design.tests.InterpretedExpressionTests)  Time elapsed: 0 sec
isNotAcceleo[318](org.eclipse.emf.ecoretools.design.tests.InterpretedExpressionTests)  Time elapsed: 0 sec
isNotAcceleo[319](org.eclipse.emf.ecoretools.design.tests.InterpretedExpressionTests)  Time elapsed: 0.001 sec
isNotAcceleo[320](org.eclipse.emf.ecoretools.design.tests.InterpretedExpressionTests)  Time elapsed: 0 sec
isNotAcceleo[321](org.eclipse.emf.ecoretools.design.tests.InterpretedExpressionTests)  Time elapsed: 0 sec
isNotAcceleo[322](org.eclipse.emf.ecoretools.design.tests.InterpretedExpressionTests)  Time elapsed: 0 sec
isNotAcceleo[323](org.eclipse.emf.ecoretools.design.tests.InterpretedExpressionTests)  Time elapsed: 0 sec
isNotAcceleo[324](org.eclipse.emf.ecoretools.design.tests.InterpretedExpressionTests)  Time elapsed: 0 sec
isNotAcceleo[325](org.eclipse.emf.ecoretools.design.tests.InterpretedExpressionTests)  Time elapsed: 0 sec
isNotAcceleo[326](org.eclipse.emf.ecoretools.design.tests.InterpretedExpressionTests)  Time elapsed: 0 sec
isNotAcceleo[327](org.eclipse.emf.ecoretools.design.tests.InterpretedExpressionTests)  Time elapsed: 0 sec
isNotAcceleo[328](org.eclipse.emf.ecoretools.design.tests.InterpretedExpressionTests)  Time elapsed: 0 sec
isNotAcceleo[329](org.eclipse.emf.ecoretools.design.tests.InterpretedExpressionTests)  Time elapsed: 0.001 sec
isNotAcceleo[330](org.eclipse.emf.ecoretools.design.tests.InterpretedExpressionTests)  Time elapsed: 0 sec
isNotAcceleo[331](org.eclipse.emf.ecoretools.design.tests.InterpretedExpressionTests)  Time elapsed: 0 sec
isNotAcceleo[332](org.eclipse.emf.ecoretools.design.tests.InterpretedExpressionTests)  Time elapsed: 0 sec
isNotAcceleo[333](org.eclipse.emf.ecoretools.design.tests.InterpretedExpressionTests)  Time elapsed: 0 sec
isNotAcceleo[334](org.eclipse.emf.ecoretools.design.tests.InterpretedExpressionTests)  Time elapsed: 0 sec
isNotAcceleo[335](org.eclipse.emf.ecoretools.design.tests.InterpretedExpressionTests)  Time elapsed: 0 sec
isNotAcceleo[336](org.eclipse.emf.ecoretools.design.tests.InterpretedExpressionTests)  Time elapsed: 0 sec
isNotAcceleo[337](org.eclipse.emf.ecoretools.design.tests.InterpretedExpressionTests)  Time elapsed: 0 sec
isNotAcceleo[338](org.eclipse.emf.ecoretools.design.tests.InterpretedExpressionTests)  Time elapsed: 0 sec
isNotAcceleo[339](org.eclipse.emf.ecoretools.design.tests.InterpretedExpressionTests)  Time elapsed: 0 sec
isNotAcceleo[340](org.eclipse.emf.ecoretools.design.tests.InterpretedExpressionTests)  Time elapsed: 0 sec
isNotAcceleo[341](org.eclipse.emf.ecoretools.design.tests.InterpretedExpressionTests)  Time elapsed: 0 sec
isNotAcceleo[342](org.eclipse.emf.ecoretools.design.tests.InterpretedExpressionTests)  Time elapsed: 0 sec
isNotAcceleo[343](org.eclipse.emf.ecoretools.design.tests.InterpretedExpressionTests)  Time elapsed: 0 sec
isNotAcceleo[344](org.eclipse.emf.ecoretools.design.tests.InterpretedExpressionTests)  Time elapsed: 0 sec
isNotAcceleo[345](org.eclipse.emf.ecoretools.design.tests.InterpretedExpressionTests)  Time elapsed: 0 sec
isNotAcceleo[346](org.eclipse.emf.ecoretools.design.tests.InterpretedExpressionTests)  Time elapsed: 0 sec
isNotAcceleo[347](org.eclipse.emf.ecoretools.design.tests.InterpretedExpressionTests)  Time elapsed: 0 sec
isNotAcceleo[348](org.eclipse.emf.ecoretools.design.tests.InterpretedExpressionTests)  Time elapsed: 0 sec
isNotAcceleo[349](org.eclipse.emf.ecoretools.design.tests.InterpretedExpressionTests)  Time elapsed: 0 sec
isNotAcceleo[350](org.eclipse.emf.ecoretools.design.tests.InterpretedExpressionTests)  Time elapsed: 0 sec
isNotAcceleo[351](org.eclipse.emf.ecoretools.design.tests.InterpretedExpressionTests)  Time elapsed: 0 sec
isNotAcceleo[352](org.eclipse.emf.ecoretools.design.tests.InterpretedExpressionTests)  Time elapsed: 0 sec
isNotAcceleo[353](org.eclipse.emf.ecoretools.design.tests.InterpretedExpressionTests)  Time elapsed: 0 sec
isNotAcceleo[354](org.eclipse.emf.ecoretools.design.tests.InterpretedExpressionTests)  Time elapsed: 0 sec
isNotAcceleo[355](org.eclipse.emf.ecoretools.design.tests.InterpretedExpressionTests)  Time elapsed: 0 sec
isNotAcceleo[356](org.eclipse.emf.ecoretools.design.tests.InterpretedExpressionTests)  Time elapsed: 0 sec
isNotAcceleo[357](org.eclipse.emf.ecoretools.design.tests.InterpretedExpressionTests)  Time elapsed: 0 sec
isNotAcceleo[358](org.eclipse.emf.ecoretools.design.tests.InterpretedExpressionTests)  Time elapsed: 0 sec
isNotAcceleo[359](org.eclipse.emf.ecoretools.design.tests.InterpretedExpressionTests)  Time elapsed: 0 sec
isNotAcceleo[360](org.eclipse.emf.ecoretools.design.tests.InterpretedExpressionTests)  Time elapsed: 0 sec
isNotAcceleo[361](org.eclipse.emf.ecoretools.design.tests.InterpretedExpressionTests)  Time elapsed: 0 sec
isNotAcceleo[362](org.eclipse.emf.ecoretools.design.tests.InterpretedExpressionTests)  Time elapsed: 0 sec
isNotAcceleo[363](org.eclipse.emf.ecoretools.design.tests.InterpretedExpressionTests)  Time elapsed: 0 sec
isNotAcceleo[364](org.eclipse.emf.ecoretools.design.tests.InterpretedExpressionTests)  Time elapsed: 0 sec
isNotAcceleo[365](org.eclipse.emf.ecoretools.design.tests.InterpretedExpressionTests)  Time elapsed: 0 sec
isNotAcceleo[366](org.eclipse.emf.ecoretools.design.tests.InterpretedExpressionTests)  Time elapsed: 0 sec
isNotAcceleo[367](org.eclipse.emf.ecoretools.design.tests.InterpretedExpressionTests)  Time elapsed: 0 sec
isNotAcceleo[368](org.eclipse.emf.ecoretools.design.tests.InterpretedExpressionTests)  Time elapsed: 0 sec
isNotAcceleo[369](org.eclipse.emf.ecoretools.design.tests.InterpretedExpressionTests)  Time elapsed: 0 sec
isNotAcceleo[370](org.eclipse.emf.ecoretools.design.tests.InterpretedExpressionTests)  Time elapsed: 0 sec
isNotAcceleo[371](org.eclipse.emf.ecoretools.design.tests.InterpretedExpressionTests)  Time elapsed: 0 sec
isNotAcceleo[372](org.eclipse.emf.ecoretools.design.tests.InterpretedExpressionTests)  Time elapsed: 0 sec
isNotAcceleo[373](org.eclipse.emf.ecoretools.design.tests.InterpretedExpressionTests)  Time elapsed: 0 sec
isNotAcceleo[374](org.eclipse.emf.ecoretools.design.tests.InterpretedExpressionTests)  Time elapsed: 0 sec
isNotAcceleo[375](org.eclipse.emf.ecoretools.design.tests.InterpretedExpressionTests)  Time elapsed: 0 sec
isNotAcceleo[376](org.eclipse.emf.ecoretools.design.tests.InterpretedExpressionTests)  Time elapsed: 0 sec
isNotAcceleo[377](org.eclipse.emf.ecoretools.design.tests.InterpretedExpressionTests)  Time elapsed: 0 sec
isNotAcceleo[378](org.eclipse.emf.ecoretools.design.tests.InterpretedExpressionTests)  Time elapsed: 0 sec
isNotAcceleo[379](org.eclipse.emf.ecoretools.design.tests.InterpretedExpressionTests)  Time elapsed: 0 sec
isNotAcceleo[380](org.eclipse.emf.ecoretools.design.tests.InterpretedExpressionTests)  Time elapsed: 0 sec
isNotAcceleo[381](org.eclipse.emf.ecoretools.design.tests.InterpretedExpressionTests)  Time elapsed: 0 sec
isNotAcceleo[382](org.eclipse.emf.ecoretools.design.tests.InterpretedExpressionTests)  Time elapsed: 0 sec
isNotAcceleo[383](org.eclipse.emf.ecoretools.design.tests.InterpretedExpressionTests)  Time elapsed: 0 sec
isNotAcceleo[384](org.eclipse.emf.ecoretools.design.tests.InterpretedExpressionTests)  Time elapsed: 0 sec
isNotAcceleo[385](org.eclipse.emf.ecoretools.design.tests.InterpretedExpressionTests)  Time elapsed: 0 sec
isNotAcceleo[386](org.eclipse.emf.ecoretools.design.tests.InterpretedExpressionTests)  Time elapsed: 0 sec
isNotAcceleo[387](org.eclipse.emf.ecoretools.design.tests.InterpretedExpressionTests)  Time elapsed: 0 sec
isNotAcceleo[388](org.eclipse.emf.ecoretools.design.tests.InterpretedExpressionTests)  Time elapsed: 0 sec
isNotAcceleo[389](org.eclipse.emf.ecoretools.design.tests.InterpretedExpressionTests)  Time elapsed: 0 sec
isNotAcceleo[390](org.eclipse.emf.ecoretools.design.tests.InterpretedExpressionTests)  Time elapsed: 0 sec
isNotAcceleo[391](org.eclipse.emf.ecoretools.design.tests.InterpretedExpressionTests)  Time elapsed: 0 sec
isNotAcceleo[392](org.eclipse.emf.ecoretools.design.tests.InterpretedExpressionTests)  Time elapsed: 0 sec
isNotAcceleo[393](org.eclipse.emf.ecoretools.design.tests.InterpretedExpressionTests)  Time elapsed: 0 sec
isNotAcceleo[394](org.eclipse.emf.ecoretools.design.tests.InterpretedExpressionTests)  Time elapsed: 0 sec
isNotAcceleo[395](org.eclipse.emf.ecoretools.design.tests.InterpretedExpressionTests)  Time elapsed: 0 sec
isNotAcceleo[396](org.eclipse.emf.ecoretools.design.tests.InterpretedExpressionTests)  Time elapsed: 0 sec
isNotAcceleo[397](org.eclipse.emf.ecoretools.design.tests.InterpretedExpressionTests)  Time elapsed: 0 sec
isNotAcceleo[398](org.eclipse.emf.ecoretools.design.tests.InterpretedExpressionTests)  Time elapsed: 0 sec
isNotAcceleo[399](org.eclipse.emf.ecoretools.design.tests.InterpretedExpressionTests)  Time elapsed: 0 sec
isNotAcceleo[400](org.eclipse.emf.ecoretools.design.tests.InterpretedExpressionTests)  Time elapsed: 0 sec
isNotAcceleo[401](org.eclipse.emf.ecoretools.design.tests.InterpretedExpressionTests)  Time elapsed: 0 sec
isNotAcceleo[402](org.eclipse.emf.ecoretools.design.tests.InterpretedExpressionTests)  Time elapsed: 0 sec
isNotAcceleo[403](org.eclipse.emf.ecoretools.design.tests.InterpretedExpressionTests)  Time elapsed: 0 sec
isNotAcceleo[404](org.eclipse.emf.ecoretools.design.tests.InterpretedExpressionTests)  Time elapsed: 0.001 sec
isNotAcceleo[405](org.eclipse.emf.ecoretools.design.tests.InterpretedExpressionTests)  Time elapsed: 0 sec
isNotAcceleo[406](org.eclipse.emf.ecoretools.design.tests.InterpretedExpressionTests)  Time elapsed: 0 sec
isNotAcceleo[407](org.eclipse.emf.ecoretools.design.tests.InterpretedExpressionTests)  Time elapsed: 0 sec
isNotAcceleo[408](org.eclipse.emf.ecoretools.design.tests.InterpretedExpressionTests)  Time elapsed: 0 sec
isNotAcceleo[409](org.eclipse.emf.ecoretools.design.tests.InterpretedExpressionTests)  Time elapsed: 0 sec
isNotAcceleo[410](org.eclipse.emf.ecoretools.design.tests.InterpretedExpressionTests)  Time elapsed: 0 sec
isNotAcceleo[411](org.eclipse.emf.ecoretools.design.tests.InterpretedExpressionTests)  Time elapsed: 0 sec
isNotAcceleo[412](org.eclipse.emf.ecoretools.design.tests.InterpretedExpressionTests)  Time elapsed: 0 sec
isNotAcceleo[413](org.eclipse.emf.ecoretools.design.tests.InterpretedExpressionTests)  Time elapsed: 0 sec
isNotAcceleo[414](org.eclipse.emf.ecoretools.design.tests.InterpretedExpressionTests)  Time elapsed: 0 sec
isNotAcceleo[415](org.eclipse.emf.ecoretools.design.tests.InterpretedExpressionTests)  Time elapsed: 0 sec
isNotAcceleo[416](org.eclipse.emf.ecoretools.design.tests.InterpretedExpressionTests)  Time elapsed: 0 sec
isNotAcceleo[417](org.eclipse.emf.ecoretools.design.tests.InterpretedExpressionTests)  Time elapsed: 0 sec
isNotAcceleo[418](org.eclipse.emf.ecoretools.design.tests.InterpretedExpressionTests)  Time elapsed: 0 sec
isNotAcceleo[419](org.eclipse.emf.ecoretools.design.tests.InterpretedExpressionTests)  Time elapsed: 0 sec
isNotAcceleo[420](org.eclipse.emf.ecoretools.design.tests.InterpretedExpressionTests)  Time elapsed: 0 sec
isNotAcceleo[421](org.eclipse.emf.ecoretools.design.tests.InterpretedExpressionTests)  Time elapsed: 0 sec
isNotAcceleo[422](org.eclipse.emf.ecoretools.design.tests.InterpretedExpressionTests)  Time elapsed: 0 sec
isNotAcceleo[423](org.eclipse.emf.ecoretools.design.tests.InterpretedExpressionTests)  Time elapsed: 0 sec
isNotAcceleo[424](org.eclipse.emf.ecoretools.design.tests.InterpretedExpressionTests)  Time elapsed: 0 sec

Results :

Failed tests: 
  VsmValidationTests.isValid:51 The VSM is not valid it has errors : Diagnostic ERROR source=org.eclipse.emf.ecore code=0 Diagnosis of org.eclipse.sirius.viewpoint.description.impl.GroupImpl@3afae281{platform:/plugin/org.eclipse.emf.ecoretools.design/description/ecore.odesign#/} data=[org.eclipse.sirius.viewpoint.description.impl.GroupImpl@3afae281 (documentation: , name: EcoreTools, version: 11.0.0.201601261200)] [Diagnostic ERROR source=org.eclipse.sirius code=1 Nothing will be left after calling oclAsType:
EClassifier=EClass is not compatible with type EClassifierLiteral=DEdge data=[org.eclipse.sirius.diagram.business.internal.metamodel.description.filter.spec.MappingFilterSpec@75e09567 (filterKind: HIDE) (semanticConditionExpression: null, viewConditionExpression: aql:not self.oclAsType(diagram::DEdge).sourceNode.oclAsType(viewpoint::DSemanticDecorator).target.oclAsType(ecore::EClass).eSuperTypes->includes(self.oclAsType(diagram::DEdge).targetNode.oclAsType(viewpoint::DSemanticDecorator).target))], Diagnostic ERROR source=org.eclipse.sirius code=1 Nothing will be left after calling oclAsType:
EClassifier=EClass is not compatible with type EClassifierLiteral=DEdge data=[org.eclipse.sirius.diagram.business.internal.metamodel.description.filter.spec.MappingFilterSpec@75e09567 (filterKind: HIDE) (semanticConditionExpression: null, viewConditionExpression: aql:not self.oclAsType(diagram::DEdge).sourceNode.oclAsType(viewpoint::DSemanticDecorator).target.oclAsType(ecore::EClass).eSuperTypes->includes(self.oclAsType(diagram::DEdge).targetNode.oclAsType(viewpoint::DSemanticDecorator).target))], Diagnostic ERROR source=org.eclipse.sirius code=1 Nothing will be left after calling oclAsType:
EClassifier=EClass is not compatible with type EClassifierLiteral=DSemanticDecorator
EClassifier=EAnnotation is not compatible with type EClassifierLiteral=DSemanticDecorator
EClassifier=DAnalysisCustomData is not compatible with type EClassifierLiteral=DSemanticDecorator
EClassifier=AnnotationEntry is not compatible with type EClassifierLiteral=DSemanticDecorator
EClassifier=TableDescription is not compatible with type EClassifierLiteral=DSemanticDecorator
EClassifier=GenAnnotation is not compatible with type EClassifierLiteral=DSemanticDecorator
EClassifier=ChangeDescription is not compatible with type EClassifierLiteral=DSemanticDecorator data=[org.eclipse.sirius.diagram.business.internal.metamodel.description.filter.spec.MappingFilterSpec@cb39552 (filterKind: HIDE) (semanticConditionExpression: null, viewConditionExpression: aql:self.eContainer().oclAsType(viewpoint::DSemanticDecorator).target = self.oclAsType(viewpoint::DSemanticDecorator).target.eContainer())], Diagnostic ERROR source=org.eclipse.sirius code=1 Nothing will be left after calling oclAsType:
EClassifier=EReference is not compatible with type EClassifierLiteral=DSemanticDecorator data=[org.eclipse.sirius.diagram.business.internal.metamodel.description.filter.spec.MappingFilterSpec@cb39552 (filterKind: HIDE) (semanticConditionExpression: null, viewConditionExpression: aql:self.eContainer().oclAsType(viewpoint::DSemanticDecorator).target = self.oclAsType(viewpoint::DSemanticDecorator).target.eContainer())], Diagnostic ERROR source=org.eclipse.sirius code=1 Nothing will be left after calling oclAsType:
EClassifier=EdgeTarget is not compatible with type EClassifierLiteral=DSemanticDecorator data=[org.eclipse.sirius.diagram.business.internal.metamodel.description.spec.ConditionalEdgeStyleDescriptionSpec@3a3ed300 (predicateExpression: aql:not self.eSuperTypes->includes(view.oclAsType(diagram::DEdge).targetNode.oclAsType(viewpoint::DSemanticDecorator).target))], Diagnostic WARNING source=org.eclipse.sirius.diagram code=1 The Drop tool External EClass from treeview accepts arbitrary elements from the Model Content view as drag source. You should specify a precondition to validate the nature of the dragged element. data=[org.eclipse.sirius.diagram.business.internal.metamodel.description.tool.spec.ContainerDropDescriptionSpec@2ddb3ae8 (documentation: ) (name: External EClass from treeview, label: null, precondition: , forceRefresh: true, elementsToSelect: , inverseSelectionOrder: false) (dragSource: PROJECT_EXPLORER, moveEdges: false)], Diagnostic INFO source=org.eclipse.sirius.diagram code=80 The constraint "No reconnect on regions" is disabled.  It will not be evaluated. data=[], Diagnostic WARNING source=org.eclipse.sirius.diagram code=1 The Drop tool Drop EPackage into EPackage accepts arbitrary elements from the Model Content view as drag source. You should specify a precondition to validate the nature of the dragged element. data=[org.eclipse.sirius.diagram.business.internal.metamodel.description.tool.spec.ContainerDropDescriptionSpec@5a8c93 (documentation: ) (name: Drop EPackage into EPackage, label: null, precondition: , forceRefresh: false, elementsToSelect: , inverseSelectionOrder: false) (dragSource: BOTH, moveEdges: false)], Diagnostic WARNING source=org.eclipse.sirius code=1 There is no associated meta-model. data=[org.eclipse.sirius.table.business.internal.metamodel.description.spec.EditionTableDescriptionSpec@24c685e7 (documentation: ) (endUserDocumentation: A tabular editor (spreadsheet-like) of the entities in an Ecore model., name: Classes, label: null, titleExpression: aql:self.name + ' class table', initialisation: false, showOnStartup: false, preconditionExpression: , domainClass: ecore.EPackage, initialHeaderColumnWidth: 0)], Diagnostic WARNING source=org.eclipse.sirius.diagram code=1 The Drop tool External EPackageTo Analyze from treeview accepts arbitrary elements from the Model Content view as drag source. You should specify a precondition to validate the nature of the dragged element. data=[org.eclipse.sirius.diagram.business.internal.metamodel.description.tool.spec.ContainerDropDescriptionSpec@7e52a26b (documentation: ) (name: External EPackageTo Analyze from treeview, label: null, precondition: , forceRefresh: true, elementsToSelect: , inverseSelectionOrder: false) (dragSource: PROJECT_EXPLORER, moveEdges: false)], Diagnostic INFO source=org.eclipse.sirius code=1 Always false:
Nothing inferred when self (EClassifier=GenPackage) is type of EClassifierLiteral=GenFeature data=[org.eclipse.sirius.table.business.internal.metamodel.description.spec.FeatureColumnMappingSpec@f882465 (name: Category, label: null) (semanticElements: null) (headerLabelExpression: Category, initialWidth: 0) (canEdit: aql:self.oclIsTypeOf(genmodel::GenFeature), featureName: propertyCategory, labelExpression: aql:self->filter(genmodel::GenFeature).propertyCategory->first(), featureParentExpression: null)], Diagnostic INFO source=org.eclipse.sirius code=1 Always false:
Nothing inferred when self (EClassifier=GenPackage) is type of EClassifierLiteral=GenFeature data=[org.eclipse.sirius.table.business.internal.metamodel.description.spec.FeatureColumnMappingSpec@7f0f84d4 (name: Decription, label: null) (semanticElements: null) (headerLabelExpression: Description, initialWidth: 0) (canEdit: aql:self.oclIsTypeOf(genmodel::GenFeature), featureName: propertyDescription, labelExpression: aql:self->filter(genmodel::GenFeature).propertyDescription->first(), featureParentExpression: null)]]

Tests run: 487, Failures: 1, Errors: 0, Skipped: 0

[ERROR] There are test failures.

Please refer to /jobs/genie.sirius/ecoretools-3.1/workspace/org.eclipse.emf.ecoretools.design.tests/target/surefire-reports for the individual test results.
[INFO] 
[INFO] --- tycho-pack200a-plugin:0.23.1:normalize (pack200-normalize) @ org.eclipse.emf.ecoretools.design.tests ---
[INFO] Pack200 normalizing jar /jobs/genie.sirius/ecoretools-3.1/workspace/org.eclipse.emf.ecoretools.design.tests/target/org.eclipse.emf.ecoretools.design.tests-3.1.0-SNAPSHOT.jar
[INFO] 
[INFO] --- eclipse-jarsigner-plugin:1.0.4:sign (sign) @ org.eclipse.emf.ecoretools.design.tests ---
[INFO] Signed org.eclipse.emf.ecoretools:org.eclipse.emf.ecoretools.design.tests:eclipse-test-plugin:3.1.0-SNAPSHOT in 0 seconds.
[INFO] Signed org.eclipse.emf.ecoretools:org.eclipse.emf.ecoretools.design.tests:java-source:sources:3.1.0-SNAPSHOT in 0 seconds.
[INFO] 
[INFO] --- tycho-pack200b-plugin:0.23.1:pack (pack200-pack) @ org.eclipse.emf.ecoretools.design.tests ---
[INFO] Pack200 packing jar /jobs/genie.sirius/ecoretools-3.1/workspace/org.eclipse.emf.ecoretools.design.tests/target/org.eclipse.emf.ecoretools.design.tests-3.1.0-SNAPSHOT.jar
[INFO]                                                                         
[INFO] ------------------------------------------------------------------------
[INFO] Building org.eclipse.emf.ecoretools.doc 3.1.0-SNAPSHOT
[INFO] ------------------------------------------------------------------------
[INFO] 
[INFO] --- maven-clean-plugin:2.4.1:clean (default-clean) @ org.eclipse.emf.ecoretools.doc ---
[INFO] 
[INFO] --- tycho-packaging-plugin:0.23.1:build-qualifier (default-build-qualifier) @ org.eclipse.emf.ecoretools.doc ---
[INFO] The project's OSGi version is 3.1.0.201706160614
[INFO] 
[INFO] --- tycho-packaging-plugin:0.23.1:validate-id (default-validate-id) @ org.eclipse.emf.ecoretools.doc ---
[INFO] 
[INFO] --- tycho-packaging-plugin:0.23.1:validate-version (default-validate-version) @ org.eclipse.emf.ecoretools.doc ---
[INFO] 
[INFO] --- maven-resources-plugin:2.4.1:resources (default-resources) @ org.eclipse.emf.ecoretools.doc ---
[INFO] Using 'ISO-8859-1' encoding to copy filtered resources.
[INFO] skip non existing resourceDirectory /jobs/genie.sirius/ecoretools-3.1/workspace/org.eclipse.emf.ecoretools.doc/src/main/resources
[INFO] 
[INFO] --- tycho-compiler-plugin:0.23.1:compile (default-compile) @ org.eclipse.emf.ecoretools.doc ---
[INFO] 
[INFO] --- maven-resources-plugin:2.4.1:testResources (default-testResources) @ org.eclipse.emf.ecoretools.doc ---
[INFO] Using 'ISO-8859-1' encoding to copy filtered resources.
[INFO] skip non existing resourceDirectory /jobs/genie.sirius/ecoretools-3.1/workspace/org.eclipse.emf.ecoretools.doc/src/test/resources
[INFO] 
[INFO] --- tycho-source-plugin:0.23.1:plugin-source (plugin-source) @ org.eclipse.emf.ecoretools.doc ---
[INFO] 
[INFO] --- target-platform-configuration:0.23.1:target-platform (default-target-platform) @ org.eclipse.emf.ecoretools.doc ---
[INFO] 
[INFO] --- tycho-packaging-plugin:0.23.1:package-plugin (default-package-plugin) @ org.eclipse.emf.ecoretools.doc ---
[INFO] Building jar: /jobs/genie.sirius/ecoretools-3.1/workspace/org.eclipse.emf.ecoretools.doc/target/org.eclipse.emf.ecoretools.doc-3.1.0-SNAPSHOT.jar
[INFO] 
[INFO] --- tycho-p2-plugin:0.23.1:p2-metadata-default (default-p2-metadata-default) @ org.eclipse.emf.ecoretools.doc ---
[INFO] 
[INFO] --- tycho-pack200a-plugin:0.23.1:normalize (pack200-normalize) @ org.eclipse.emf.ecoretools.doc ---
[INFO] Pack200 normalizing jar /jobs/genie.sirius/ecoretools-3.1/workspace/org.eclipse.emf.ecoretools.doc/target/org.eclipse.emf.ecoretools.doc-3.1.0-SNAPSHOT.jar
[INFO] 
[INFO] --- eclipse-jarsigner-plugin:1.0.4:sign (sign) @ org.eclipse.emf.ecoretools.doc ---
[INFO] Signed org.eclipse.emf.ecoretools:org.eclipse.emf.ecoretools.doc:eclipse-plugin:3.1.0-SNAPSHOT in 1 seconds.
[INFO] 
[INFO] --- tycho-pack200b-plugin:0.23.1:pack (pack200-pack) @ org.eclipse.emf.ecoretools.doc ---
[INFO] Pack200 packing jar /jobs/genie.sirius/ecoretools-3.1/workspace/org.eclipse.emf.ecoretools.doc/target/org.eclipse.emf.ecoretools.doc-3.1.0-SNAPSHOT.jar
[INFO]                                                                         
[INFO] ------------------------------------------------------------------------
[INFO] Building org.eclipse.emf.ecoretools.tabbedproperties 3.1.0-SNAPSHOT
[INFO] ------------------------------------------------------------------------
[INFO] 
[INFO] --- maven-clean-plugin:2.4.1:clean (default-clean) @ org.eclipse.emf.ecoretools.tabbedproperties ---
[INFO] 
[INFO] --- tycho-packaging-plugin:0.23.1:build-qualifier (default-build-qualifier) @ org.eclipse.emf.ecoretools.tabbedproperties ---
[INFO] The project's OSGi version is 3.1.0.201706160614
[INFO] 
[INFO] --- tycho-packaging-plugin:0.23.1:validate-id (default-validate-id) @ org.eclipse.emf.ecoretools.tabbedproperties ---
[INFO] 
[INFO] --- tycho-packaging-plugin:0.23.1:validate-version (default-validate-version) @ org.eclipse.emf.ecoretools.tabbedproperties ---
[INFO] 
[INFO] --- maven-resources-plugin:2.4.1:resources (default-resources) @ org.eclipse.emf.ecoretools.tabbedproperties ---
[INFO] Using 'ISO-8859-1' encoding to copy filtered resources.
[INFO] skip non existing resourceDirectory /jobs/genie.sirius/ecoretools-3.1/workspace/org.eclipse.emf.ecoretools.tabbedproperties/src/main/resources
[INFO] 
[INFO] --- tycho-compiler-plugin:0.23.1:compile (default-compile) @ org.eclipse.emf.ecoretools.tabbedproperties ---
[INFO] Compiling 39 source files to /jobs/genie.sirius/ecoretools-3.1/workspace/org.eclipse.emf.ecoretools.tabbedproperties/target/classes
[INFO] 
[INFO] --- maven-resources-plugin:2.4.1:testResources (default-testResources) @ org.eclipse.emf.ecoretools.tabbedproperties ---
[INFO] Using 'ISO-8859-1' encoding to copy filtered resources.
[INFO] skip non existing resourceDirectory /jobs/genie.sirius/ecoretools-3.1/workspace/org.eclipse.emf.ecoretools.tabbedproperties/src/test/resources
[INFO] 
[INFO] --- tycho-source-plugin:0.23.1:plugin-source (plugin-source) @ org.eclipse.emf.ecoretools.tabbedproperties ---
[INFO] Building jar: /jobs/genie.sirius/ecoretools-3.1/workspace/org.eclipse.emf.ecoretools.tabbedproperties/target/org.eclipse.emf.ecoretools.tabbedproperties-3.1.0-SNAPSHOT-sources.jar
[INFO] 
[INFO] --- target-platform-configuration:0.23.1:target-platform (default-target-platform) @ org.eclipse.emf.ecoretools.tabbedproperties ---
[INFO] 
[INFO] --- tycho-packaging-plugin:0.23.1:package-plugin (default-package-plugin) @ org.eclipse.emf.ecoretools.tabbedproperties ---
[INFO] Building jar: /jobs/genie.sirius/ecoretools-3.1/workspace/org.eclipse.emf.ecoretools.tabbedproperties/target/org.eclipse.emf.ecoretools.tabbedproperties-3.1.0-SNAPSHOT.jar
[INFO] 
[INFO] --- tycho-p2-plugin:0.23.1:p2-metadata-default (default-p2-metadata-default) @ org.eclipse.emf.ecoretools.tabbedproperties ---
[INFO] 
[INFO] --- tycho-pack200a-plugin:0.23.1:normalize (pack200-normalize) @ org.eclipse.emf.ecoretools.tabbedproperties ---
[INFO] Pack200 normalizing jar /jobs/genie.sirius/ecoretools-3.1/workspace/org.eclipse.emf.ecoretools.tabbedproperties/target/org.eclipse.emf.ecoretools.tabbedproperties-3.1.0-SNAPSHOT.jar
[INFO] 
[INFO] --- eclipse-jarsigner-plugin:1.0.4:sign (sign) @ org.eclipse.emf.ecoretools.tabbedproperties ---
[INFO] Signed org.eclipse.emf.ecoretools:org.eclipse.emf.ecoretools.tabbedproperties:eclipse-plugin:3.1.0-SNAPSHOT in 0 seconds.
[INFO] Signed org.eclipse.emf.ecoretools:org.eclipse.emf.ecoretools.tabbedproperties:java-source:sources:3.1.0-SNAPSHOT in 0 seconds.
[INFO] 
[INFO] --- tycho-pack200b-plugin:0.23.1:pack (pack200-pack) @ org.eclipse.emf.ecoretools.tabbedproperties ---
[INFO] Pack200 packing jar /jobs/genie.sirius/ecoretools-3.1/workspace/org.eclipse.emf.ecoretools.tabbedproperties/target/org.eclipse.emf.ecoretools.tabbedproperties-3.1.0-SNAPSHOT.jar
[INFO]                                                                         
[INFO] ------------------------------------------------------------------------
[INFO] Building org.eclipse.emf.ecoretools.properties 3.1.0-SNAPSHOT
[INFO] ------------------------------------------------------------------------
[INFO] 
[INFO] --- maven-clean-plugin:2.4.1:clean (default-clean) @ org.eclipse.emf.ecoretools.properties ---
[INFO] 
[INFO] --- tycho-packaging-plugin:0.23.1:build-qualifier (default-build-qualifier) @ org.eclipse.emf.ecoretools.properties ---
[INFO] The project's OSGi version is 3.1.0.201706160614
[INFO] 
[INFO] --- tycho-packaging-plugin:0.23.1:validate-id (default-validate-id) @ org.eclipse.emf.ecoretools.properties ---
[INFO] 
[INFO] --- tycho-packaging-plugin:0.23.1:validate-version (default-validate-version) @ org.eclipse.emf.ecoretools.properties ---
[INFO] 
[INFO] --- maven-resources-plugin:2.4.1:resources (default-resources) @ org.eclipse.emf.ecoretools.properties ---
[INFO] Using 'ISO-8859-1' encoding to copy filtered resources.
[INFO] skip non existing resourceDirectory /jobs/genie.sirius/ecoretools-3.1/workspace/org.eclipse.emf.ecoretools.properties/src/main/resources
[INFO] 
[INFO] --- tycho-compiler-plugin:0.23.1:compile (default-compile) @ org.eclipse.emf.ecoretools.properties ---
[INFO] Compiling 45 source files to /jobs/genie.sirius/ecoretools-3.1/workspace/org.eclipse.emf.ecoretools.properties/target/classes
[INFO] 
[INFO] --- maven-resources-plugin:2.4.1:testResources (default-testResources) @ org.eclipse.emf.ecoretools.properties ---
[INFO] Using 'ISO-8859-1' encoding to copy filtered resources.
[INFO] skip non existing resourceDirectory /jobs/genie.sirius/ecoretools-3.1/workspace/org.eclipse.emf.ecoretools.properties/src/test/resources
[INFO] 
[INFO] --- tycho-source-plugin:0.23.1:plugin-source (plugin-source) @ org.eclipse.emf.ecoretools.properties ---
[INFO] Building jar: /jobs/genie.sirius/ecoretools-3.1/workspace/org.eclipse.emf.ecoretools.properties/target/org.eclipse.emf.ecoretools.properties-3.1.0-SNAPSHOT-sources.jar
[INFO] 
[INFO] --- target-platform-configuration:0.23.1:target-platform (default-target-platform) @ org.eclipse.emf.ecoretools.properties ---
[INFO] 
[INFO] --- tycho-packaging-plugin:0.23.1:package-plugin (default-package-plugin) @ org.eclipse.emf.ecoretools.properties ---
[INFO] Building jar: /jobs/genie.sirius/ecoretools-3.1/workspace/org.eclipse.emf.ecoretools.properties/target/org.eclipse.emf.ecoretools.properties-3.1.0-SNAPSHOT.jar
[INFO] 
[INFO] --- tycho-p2-plugin:0.23.1:p2-metadata-default (default-p2-metadata-default) @ org.eclipse.emf.ecoretools.properties ---
[INFO] 
[INFO] --- tycho-pack200a-plugin:0.23.1:normalize (pack200-normalize) @ org.eclipse.emf.ecoretools.properties ---
[INFO] Pack200 normalizing jar /jobs/genie.sirius/ecoretools-3.1/workspace/org.eclipse.emf.ecoretools.properties/target/org.eclipse.emf.ecoretools.properties-3.1.0-SNAPSHOT.jar
[INFO] 
[INFO] --- eclipse-jarsigner-plugin:1.0.4:sign (sign) @ org.eclipse.emf.ecoretools.properties ---
[INFO] Signed org.eclipse.emf.ecoretools:org.eclipse.emf.ecoretools.properties:eclipse-plugin:3.1.0-SNAPSHOT in 0 seconds.
[INFO] Signed org.eclipse.emf.ecoretools:org.eclipse.emf.ecoretools.properties:java-source:sources:3.1.0-SNAPSHOT in 0 seconds.
[INFO] 
[INFO] --- tycho-pack200b-plugin:0.23.1:pack (pack200-pack) @ org.eclipse.emf.ecoretools.properties ---
[INFO] Pack200 packing jar /jobs/genie.sirius/ecoretools-3.1/workspace/org.eclipse.emf.ecoretools.properties/target/org.eclipse.emf.ecoretools.properties-3.1.0-SNAPSHOT.jar
[INFO]                                                                         
[INFO] ------------------------------------------------------------------------
[INFO] Building org.eclipse.emf.ecoretools.design.properties 3.1.0-SNAPSHOT
[INFO] ------------------------------------------------------------------------
[INFO] 
[INFO] --- maven-clean-plugin:2.4.1:clean (default-clean) @ org.eclipse.emf.ecoretools.design.properties ---
[INFO] 
[INFO] --- tycho-packaging-plugin:0.23.1:build-qualifier (default-build-qualifier) @ org.eclipse.emf.ecoretools.design.properties ---
[INFO] The project's OSGi version is 3.1.0.201706160614
[INFO] 
[INFO] --- tycho-packaging-plugin:0.23.1:validate-id (default-validate-id) @ org.eclipse.emf.ecoretools.design.properties ---
[INFO] 
[INFO] --- tycho-packaging-plugin:0.23.1:validate-version (default-validate-version) @ org.eclipse.emf.ecoretools.design.properties ---
[INFO] 
[INFO] --- maven-resources-plugin:2.4.1:resources (default-resources) @ org.eclipse.emf.ecoretools.design.properties ---
[INFO] Using 'ISO-8859-1' encoding to copy filtered resources.
[INFO] Copying 0 resource
[INFO] 
[INFO] --- tycho-compiler-plugin:0.23.1:compile (default-compile) @ org.eclipse.emf.ecoretools.design.properties ---
[INFO] Compiling 69 source files to /jobs/genie.sirius/ecoretools-3.1/workspace/org.eclipse.emf.ecoretools.design.properties/target/classes
[INFO] 
[INFO] --- maven-resources-plugin:2.4.1:testResources (default-testResources) @ org.eclipse.emf.ecoretools.design.properties ---
[INFO] Using 'ISO-8859-1' encoding to copy filtered resources.
[INFO] skip non existing resourceDirectory /jobs/genie.sirius/ecoretools-3.1/workspace/org.eclipse.emf.ecoretools.design.properties/src/test/resources
[INFO] 
[INFO] --- tycho-source-plugin:0.23.1:plugin-source (plugin-source) @ org.eclipse.emf.ecoretools.design.properties ---
[INFO] Building jar: /jobs/genie.sirius/ecoretools-3.1/workspace/org.eclipse.emf.ecoretools.design.properties/target/org.eclipse.emf.ecoretools.design.properties-3.1.0-SNAPSHOT-sources.jar
[INFO] 
[INFO] --- target-platform-configuration:0.23.1:target-platform (default-target-platform) @ org.eclipse.emf.ecoretools.design.properties ---
[INFO] 
[INFO] --- tycho-packaging-plugin:0.23.1:package-plugin (default-package-plugin) @ org.eclipse.emf.ecoretools.design.properties ---
[INFO] Building jar: /jobs/genie.sirius/ecoretools-3.1/workspace/org.eclipse.emf.ecoretools.design.properties/target/org.eclipse.emf.ecoretools.design.properties-3.1.0-SNAPSHOT.jar
[INFO] 
[INFO] --- tycho-p2-plugin:0.23.1:p2-metadata-default (default-p2-metadata-default) @ org.eclipse.emf.ecoretools.design.properties ---
[INFO] 
[INFO] --- tycho-pack200a-plugin:0.23.1:normalize (pack200-normalize) @ org.eclipse.emf.ecoretools.design.properties ---
[INFO] Pack200 normalizing jar /jobs/genie.sirius/ecoretools-3.1/workspace/org.eclipse.emf.ecoretools.design.properties/target/org.eclipse.emf.ecoretools.design.properties-3.1.0-SNAPSHOT.jar
[INFO] 
[INFO] --- eclipse-jarsigner-plugin:1.0.4:sign (sign) @ org.eclipse.emf.ecoretools.design.properties ---
[INFO] Signed org.eclipse.emf.ecoretools:org.eclipse.emf.ecoretools.design.properties:eclipse-plugin:3.1.0-SNAPSHOT in 1 seconds.
[INFO] Signed org.eclipse.emf.ecoretools:org.eclipse.emf.ecoretools.design.properties:java-source:sources:3.1.0-SNAPSHOT in 0 seconds.
[INFO] 
[INFO] --- tycho-pack200b-plugin:0.23.1:pack (pack200-pack) @ org.eclipse.emf.ecoretools.design.properties ---
[INFO] Pack200 packing jar /jobs/genie.sirius/ecoretools-3.1/workspace/org.eclipse.emf.ecoretools.design.properties/target/org.eclipse.emf.ecoretools.design.properties-3.1.0-SNAPSHOT.jar
[INFO]                                                                         
[INFO] ------------------------------------------------------------------------
[INFO] Skipping org.eclipse.emf.ecoretools.design
[INFO] This project has been banned from the build due to previous failures.
[INFO] ------------------------------------------------------------------------
[INFO]                                                                         
[INFO] ------------------------------------------------------------------------
[INFO] Building org.eclipse.emf.ecoretools.doc 3.1.0-SNAPSHOT
[INFO] ------------------------------------------------------------------------
[INFO] 
[INFO] --- maven-clean-plugin:2.4.1:clean (default-clean) @ org.eclipse.emf.ecoretools.doc ---
[INFO] 
[INFO] --- tycho-packaging-plugin:0.23.1:build-qualifier-aggregator (default-build-qualifier-aggregator) @ org.eclipse.emf.ecoretools.doc ---
[INFO] The project's OSGi version is 3.1.0.201706160614
[INFO] 
[INFO] --- tycho-packaging-plugin:0.23.1:validate-id (default-validate-id) @ org.eclipse.emf.ecoretools.doc ---
[INFO] 
[INFO] --- tycho-packaging-plugin:0.23.1:validate-version (default-validate-version) @ org.eclipse.emf.ecoretools.doc ---
[INFO] 
[INFO] --- target-platform-configuration:0.23.1:target-platform (default-target-platform) @ org.eclipse.emf.ecoretools.doc ---
[INFO] 
[INFO] --- tycho-packaging-plugin:0.23.1:package-feature (default-package-feature) @ org.eclipse.emf.ecoretools.doc ---
[INFO] Building jar: /jobs/genie.sirius/ecoretools-3.1/workspace/org.eclipse.emf.ecoretools.doc-feature/target/org.eclipse.emf.ecoretools.doc-3.1.0-SNAPSHOT.jar
[INFO] 
[INFO] --- tycho-p2-plugin:0.23.1:p2-metadata-default (default-p2-metadata-default) @ org.eclipse.emf.ecoretools.doc ---
[INFO] 
[INFO] --- tycho-p2-plugin:0.23.1:feature-p2-metadata (default-feature-p2-metadata) @ org.eclipse.emf.ecoretools.doc ---
[INFO] 
[INFO] --- tycho-pack200a-plugin:0.23.1:normalize (pack200-normalize) @ org.eclipse.emf.ecoretools.doc ---
[INFO] 
[INFO] --- eclipse-jarsigner-plugin:1.0.4:sign (sign) @ org.eclipse.emf.ecoretools.doc ---
[INFO] Signed org.eclipse.emf.ecoretools.features:org.eclipse.emf.ecoretools.doc:eclipse-feature:3.1.0-SNAPSHOT in 0 seconds.
[INFO] 
[INFO] --- tycho-pack200b-plugin:0.23.1:pack (pack200-pack) @ org.eclipse.emf.ecoretools.doc ---
[INFO]                                                                         
[INFO] ------------------------------------------------------------------------
[INFO] Building org.eclipse.emf.ecoretools.registration 3.1.0-SNAPSHOT
[INFO] ------------------------------------------------------------------------
[INFO] 
[INFO] --- maven-clean-plugin:2.4.1:clean (default-clean) @ org.eclipse.emf.ecoretools.registration ---
[INFO] 
[INFO] --- tycho-packaging-plugin:0.23.1:build-qualifier (default-build-qualifier) @ org.eclipse.emf.ecoretools.registration ---
[INFO] The project's OSGi version is 3.1.0.201706160614
[INFO] 
[INFO] --- tycho-packaging-plugin:0.23.1:validate-id (default-validate-id) @ org.eclipse.emf.ecoretools.registration ---
[INFO] 
[INFO] --- tycho-packaging-plugin:0.23.1:validate-version (default-validate-version) @ org.eclipse.emf.ecoretools.registration ---
[INFO] 
[INFO] --- maven-resources-plugin:2.4.1:resources (default-resources) @ org.eclipse.emf.ecoretools.registration ---
[INFO] Using 'ISO-8859-1' encoding to copy filtered resources.
[INFO] skip non existing resourceDirectory /jobs/genie.sirius/ecoretools-3.1/workspace/org.eclipse.emf.ecoretools.registration/src/main/resources
[INFO] 
[INFO] --- tycho-compiler-plugin:0.23.1:compile (default-compile) @ org.eclipse.emf.ecoretools.registration ---
[INFO] Compiling 18 source files to /jobs/genie.sirius/ecoretools-3.1/workspace/org.eclipse.emf.ecoretools.registration/target/classes
[INFO] 
[INFO] --- maven-resources-plugin:2.4.1:testResources (default-testResources) @ org.eclipse.emf.ecoretools.registration ---
[INFO] Using 'ISO-8859-1' encoding to copy filtered resources.
[INFO] skip non existing resourceDirectory /jobs/genie.sirius/ecoretools-3.1/workspace/org.eclipse.emf.ecoretools.registration/src/test/resources
[INFO] 
[INFO] --- tycho-source-plugin:0.23.1:plugin-source (plugin-source) @ org.eclipse.emf.ecoretools.registration ---
[INFO] Building jar: /jobs/genie.sirius/ecoretools-3.1/workspace/org.eclipse.emf.ecoretools.registration/target/org.eclipse.emf.ecoretools.registration-3.1.0-SNAPSHOT-sources.jar
[INFO] 
[INFO] --- target-platform-configuration:0.23.1:target-platform (default-target-platform) @ org.eclipse.emf.ecoretools.registration ---
[INFO] 
[INFO] --- tycho-packaging-plugin:0.23.1:package-plugin (default-package-plugin) @ org.eclipse.emf.ecoretools.registration ---
[INFO] Building jar: /jobs/genie.sirius/ecoretools-3.1/workspace/org.eclipse.emf.ecoretools.registration/target/org.eclipse.emf.ecoretools.registration-3.1.0-SNAPSHOT.jar
[INFO] 
[INFO] --- tycho-p2-plugin:0.23.1:p2-metadata-default (default-p2-metadata-default) @ org.eclipse.emf.ecoretools.registration ---
[INFO] 
[INFO] --- tycho-pack200a-plugin:0.23.1:normalize (pack200-normalize) @ org.eclipse.emf.ecoretools.registration ---
[INFO] Pack200 normalizing jar /jobs/genie.sirius/ecoretools-3.1/workspace/org.eclipse.emf.ecoretools.registration/target/org.eclipse.emf.ecoretools.registration-3.1.0-SNAPSHOT.jar
[INFO] 
[INFO] --- eclipse-jarsigner-plugin:1.0.4:sign (sign) @ org.eclipse.emf.ecoretools.registration ---
[INFO] Signed org.eclipse.emf.ecoretools:org.eclipse.emf.ecoretools.registration:eclipse-plugin:3.1.0-SNAPSHOT in 0 seconds.
[INFO] Signed org.eclipse.emf.ecoretools:org.eclipse.emf.ecoretools.registration:java-source:sources:3.1.0-SNAPSHOT in 0 seconds.
[INFO] 
[INFO] --- tycho-pack200b-plugin:0.23.1:pack (pack200-pack) @ org.eclipse.emf.ecoretools.registration ---
[INFO] Pack200 packing jar /jobs/genie.sirius/ecoretools-3.1/workspace/org.eclipse.emf.ecoretools.registration/target/org.eclipse.emf.ecoretools.registration-3.1.0-SNAPSHOT.jar
[INFO]                                                                         
[INFO] ------------------------------------------------------------------------
[INFO] Skipping org.eclipse.emf.ecoretools.sdk
[INFO] This project has been banned from the build due to previous failures.
[INFO] ------------------------------------------------------------------------
[INFO]                                                                         
[INFO] ------------------------------------------------------------------------
[INFO] Building org.eclipse.emf.ecoretools.explorer.contextual 3.1.0-SNAPSHOT
[INFO] ------------------------------------------------------------------------
[INFO] 
[INFO] --- maven-clean-plugin:2.4.1:clean (default-clean) @ org.eclipse.emf.ecoretools.explorer.contextual ---
[INFO] 
[INFO] --- tycho-packaging-plugin:0.23.1:build-qualifier (default-build-qualifier) @ org.eclipse.emf.ecoretools.explorer.contextual ---
[INFO] The project's OSGi version is 3.1.0.201706160614
[INFO] 
[INFO] --- tycho-packaging-plugin:0.23.1:validate-id (default-validate-id) @ org.eclipse.emf.ecoretools.explorer.contextual ---
[INFO] 
[INFO] --- tycho-packaging-plugin:0.23.1:validate-version (default-validate-version) @ org.eclipse.emf.ecoretools.explorer.contextual ---
[INFO] 
[INFO] --- maven-resources-plugin:2.4.1:resources (default-resources) @ org.eclipse.emf.ecoretools.explorer.contextual ---
[INFO] Using 'ISO-8859-1' encoding to copy filtered resources.
[INFO] Copying 0 resource
[INFO] 
[INFO] --- tycho-compiler-plugin:0.23.1:compile (default-compile) @ org.eclipse.emf.ecoretools.explorer.contextual ---
[INFO] Compiling 10 source files to /jobs/genie.sirius/ecoretools-3.1/workspace/org.eclipse.emf.ecoretools.explorer.contextual/target/classes
[INFO] 
[INFO] --- maven-resources-plugin:2.4.1:testResources (default-testResources) @ org.eclipse.emf.ecoretools.explorer.contextual ---
[INFO] Using 'ISO-8859-1' encoding to copy filtered resources.
[INFO] skip non existing resourceDirectory /jobs/genie.sirius/ecoretools-3.1/workspace/org.eclipse.emf.ecoretools.explorer.contextual/src/test/resources
[INFO] 
[INFO] --- tycho-source-plugin:0.23.1:plugin-source (plugin-source) @ org.eclipse.emf.ecoretools.explorer.contextual ---
[INFO] Building jar: /jobs/genie.sirius/ecoretools-3.1/workspace/org.eclipse.emf.ecoretools.explorer.contextual/target/org.eclipse.emf.ecoretools.explorer.contextual-3.1.0-SNAPSHOT-sources.jar
[INFO] 
[INFO] --- target-platform-configuration:0.23.1:target-platform (default-target-platform) @ org.eclipse.emf.ecoretools.explorer.contextual ---
[INFO] 
[INFO] --- tycho-packaging-plugin:0.23.1:package-plugin (default-package-plugin) @ org.eclipse.emf.ecoretools.explorer.contextual ---
[INFO] Building jar: /jobs/genie.sirius/ecoretools-3.1/workspace/org.eclipse.emf.ecoretools.explorer.contextual/target/org.eclipse.emf.ecoretools.explorer.contextual-3.1.0-SNAPSHOT.jar
[INFO] 
[INFO] --- tycho-p2-plugin:0.23.1:p2-metadata-default (default-p2-metadata-default) @ org.eclipse.emf.ecoretools.explorer.contextual ---
[INFO] 
[INFO] --- tycho-pack200a-plugin:0.23.1:normalize (pack200-normalize) @ org.eclipse.emf.ecoretools.explorer.contextual ---
[INFO] Pack200 normalizing jar /jobs/genie.sirius/ecoretools-3.1/workspace/org.eclipse.emf.ecoretools.explorer.contextual/target/org.eclipse.emf.ecoretools.explorer.contextual-3.1.0-SNAPSHOT.jar
[INFO] 
[INFO] --- eclipse-jarsigner-plugin:1.0.4:sign (sign) @ org.eclipse.emf.ecoretools.explorer.contextual ---
[INFO] Signed org.eclipse.emf.ecoretools:org.eclipse.emf.ecoretools.explorer.contextual:eclipse-plugin:3.1.0-SNAPSHOT in 0 seconds.
[INFO] Signed org.eclipse.emf.ecoretools:org.eclipse.emf.ecoretools.explorer.contextual:java-source:sources:3.1.0-SNAPSHOT in 0 seconds.
[INFO] 
[INFO] --- tycho-pack200b-plugin:0.23.1:pack (pack200-pack) @ org.eclipse.emf.ecoretools.explorer.contextual ---
[INFO] Pack200 packing jar /jobs/genie.sirius/ecoretools-3.1/workspace/org.eclipse.emf.ecoretools.explorer.contextual/target/org.eclipse.emf.ecoretools.explorer.contextual-3.1.0-SNAPSHOT.jar
[INFO]                                                                         
[INFO] ------------------------------------------------------------------------
[INFO] Building org.eclipse.emf.ecoretools.explorer.contextual 3.1.0-SNAPSHOT
[INFO] ------------------------------------------------------------------------
[INFO] 
[INFO] --- maven-clean-plugin:2.4.1:clean (default-clean) @ org.eclipse.emf.ecoretools.explorer.contextual ---
[INFO] 
[INFO] --- tycho-packaging-plugin:0.23.1:build-qualifier-aggregator (default-build-qualifier-aggregator) @ org.eclipse.emf.ecoretools.explorer.contextual ---
[INFO] The project's OSGi version is 3.1.0.201706160614
[INFO] 
[INFO] --- tycho-packaging-plugin:0.23.1:validate-id (default-validate-id) @ org.eclipse.emf.ecoretools.explorer.contextual ---
[INFO] 
[INFO] --- tycho-packaging-plugin:0.23.1:validate-version (default-validate-version) @ org.eclipse.emf.ecoretools.explorer.contextual ---
[INFO] 
[INFO] --- target-platform-configuration:0.23.1:target-platform (default-target-platform) @ org.eclipse.emf.ecoretools.explorer.contextual ---
[INFO] 
[INFO] --- tycho-packaging-plugin:0.23.1:package-feature (default-package-feature) @ org.eclipse.emf.ecoretools.explorer.contextual ---
[INFO] Building jar: /jobs/genie.sirius/ecoretools-3.1/workspace/org.eclipse.emf.ecoretools.explorer.contextual-feature/target/org.eclipse.emf.ecoretools.explorer.contextual-3.1.0-SNAPSHOT.jar
[INFO] 
[INFO] --- tycho-p2-plugin:0.23.1:p2-metadata-default (default-p2-metadata-default) @ org.eclipse.emf.ecoretools.explorer.contextual ---
[INFO] 
[INFO] --- tycho-p2-plugin:0.23.1:feature-p2-metadata (default-feature-p2-metadata) @ org.eclipse.emf.ecoretools.explorer.contextual ---
[INFO] 
[INFO] --- tycho-pack200a-plugin:0.23.1:normalize (pack200-normalize) @ org.eclipse.emf.ecoretools.explorer.contextual ---
[INFO] 
[INFO] --- eclipse-jarsigner-plugin:1.0.4:sign (sign) @ org.eclipse.emf.ecoretools.explorer.contextual ---
[INFO] Signed org.eclipse.emf.ecoretools.features:org.eclipse.emf.ecoretools.explorer.contextual:eclipse-feature:3.1.0-SNAPSHOT in 0 seconds.
[INFO] 
[INFO] --- tycho-pack200b-plugin:0.23.1:pack (pack200-pack) @ org.eclipse.emf.ecoretools.explorer.contextual ---
[INFO]                                                                         
[INFO] ------------------------------------------------------------------------
[INFO] Skipping org.eclipse.emf.ecoretools.update
[INFO] This project has been banned from the build due to previous failures.
[INFO] ------------------------------------------------------------------------
[INFO]                                                                         
[INFO] ------------------------------------------------------------------------
[INFO] Skipping org.eclipse.emf.ecoretools.update-all
[INFO] This project has been banned from the build due to previous failures.
[INFO] ------------------------------------------------------------------------
[INFO] ------------------------------------------------------------------------
[INFO] Reactor Summary:
[INFO] 
[INFO] emf.ecoretools-parent ............................. SUCCESS [2.479s]
[INFO] org.eclipse.emf.ecoretools ........................ SUCCESS [5.592s]
[INFO] org.eclipse.emf.ecoretools.design ................. SUCCESS [3.220s]
[INFO] org.eclipse.emf.ecoretools.design.ui .............. FAILURE [0.532s]
[INFO] org.eclipse.emf.ecoretools.design.tests ........... SUCCESS [9.834s]
[INFO] org.eclipse.emf.ecoretools.doc .................... SUCCESS [1.690s]
[INFO] org.eclipse.emf.ecoretools.tabbedproperties ....... SUCCESS [2.422s]
[INFO] org.eclipse.emf.ecoretools.properties ............. SUCCESS [2.616s]
[INFO] org.eclipse.emf.ecoretools.design.properties ...... SUCCESS [3.737s]
[INFO] org.eclipse.emf.ecoretools.design ................. SKIPPED
[INFO] org.eclipse.emf.ecoretools.doc .................... SUCCESS [0.864s]
[INFO] org.eclipse.emf.ecoretools.registration ........... SUCCESS [1.839s]
[INFO] org.eclipse.emf.ecoretools.sdk .................... SKIPPED
[INFO] org.eclipse.emf.ecoretools.explorer.contextual .... SUCCESS [1.682s]
[INFO] org.eclipse.emf.ecoretools.explorer.contextual .... SUCCESS [0.726s]
[INFO] org.eclipse.emf.ecoretools.update ................. SKIPPED
[INFO] org.eclipse.emf.ecoretools.update-all ............. SKIPPED
[INFO] ------------------------------------------------------------------------
[INFO] BUILD FAILURE
[INFO] ------------------------------------------------------------------------
[INFO] Total time: 2:32.687s
[INFO] Finished at: Fri Jun 16 02:15:30 EDT 2017
[INFO] Final Memory: 185M/3300M
[INFO] ------------------------------------------------------------------------
[INFO] o.h.m.e.h.MavenExecutionResultHandler - Build failed with exception(s)
[INFO] o.h.m.e.h.MavenExecutionResultHandler - [1] org.apache.maven.lifecycle.LifecycleExecutionException: Failed to execute goal org.eclipse.tycho:tycho-compiler-plugin:0.23.1:compile (default-compile) on project org.eclipse.emf.ecoretools.design.ui: Compilation failure
[DEBUG] Closing connection to remote
[ERROR] Failed to execute goal org.eclipse.tycho:tycho-compiler-plugin:0.23.1:compile (default-compile) on project org.eclipse.emf.ecoretools.design.ui: Compilation failure: Compilation failure:
[ERROR] /jobs/genie.sirius/ecoretools-3.1/workspace/org.eclipse.emf.ecoretools.design.ui/src/org/eclipse/emf/ecoretools/design/ui/wizard/EcoreModelerWizard.java:[300]
[ERROR] for (DRepresentation dRepresentation : view.getOwnedRepresentations()) {
[ERROR] ^^^^^^^^^^^^^^^^^^^^^^^
[ERROR] The method getOwnedRepresentations() is undefined for the type DView
[ERROR] 1 problem (1 error)
[ERROR] -> [Help 1]
[ERROR] 
[ERROR] To see the full stack trace of the errors, re-run Maven with the -e switch.
[ERROR] Re-run Maven using the -X switch to enable full debug logging.
[ERROR] 
[ERROR] For more information about the errors and possible solutions, please read the following articles:
[ERROR] [Help 1] http://cwiki.apache.org/confluence/display/MAVEN/MojoFailureException
[ERROR] 
[ERROR] After correcting the problems, you can resume the build with the command
[ERROR]   mvn <goals> -rf :org.eclipse.emf.ecoretools.design.ui
[DEBUG] Waiting for process to finish
[DEBUG] Result: 1
Terminating xvnc.
Recording test results
Archiving artifacts
Finished: FAILURE