FailedConsole Output

Skipping 1,091 KB.. Full Log
b85aBtbiIQSOjNKU4P0+vIKc0PTOvWK8kMze1uCQxtyC1SC8ExvbLL0llgABGJgYmLwaB3MycnMzi4My85FTXgvzkDB8G3tScxILi1BRfsEwJg4BPVmJZon5OYl66vk9+Xrp1RRGDFNSy5Py84vycVD1nCI1qPENFAZDOmMW1VBfoPj6QKXogU/TApnQ/mXCmX/k+EwOjFwNrWWJOaSrQXAGEIr/S3KTUorY1U2W5pzzohpoGBPzeUwGkuyBx8gAAAA==Downloaded: https://repo.eclipse.org/content/repositories/maven_central/org/eclipse/aether/aether-api/0.9.0.M2/aether-api-0.9.0.M2.jar (131 KB at 7267.6 KB/sec)
09:36:55 Downloading: https://repo.eclipse.org/content/repositories/maven_central/javax/annotation/jsr250-api/1.0/jsr250-api-1.0.jar
09:36:55 Downloaded: https://repo.eclipse.org/content/repositories/maven_central/org/eclipse/aether/aether-impl/0.9.0.M2/aether-impl-0.9.0.M2.jar (142 KB at 7073.5 KB/sec)
09:36:55 Downloading: https://repo.eclipse.org/content/repositories/maven_central/org/sonatype/sisu/sisu-guice/3.1.0/sisu-guice-3.1.0-no_aop.jar
09:36:55 Downloaded: https://repo.eclipse.org/content/repositories/maven_central/org/eclipse/aether/aether-util/0.9.0.M2/aether-util-0.9.0.M2.jar (131 KB at 4831.7 KB/sec)
09:36:55 Downloading: https://repo.eclipse.org/content/repositories/maven_central/org/eclipse/sisu/org.eclipse.sisu.inject/0.0.0.M5/org.eclipse.sisu.inject-0.0.0.M5.jar
09:36:55 Downloaded: https://repo.eclipse.org/content/repositories/maven_central/javax/enterprise/cdi-api/1.0/cdi-api-1.0.jar (44 KB at 1993.4 KB/sec)
09:36:55 Downloading: https://repo.eclipse.org/content/repositories/maven_central/org/codehaus/plexus/plexus-interpolation/1.19/plexus-interpolation-1.19.jar
09:36:55 Downloaded: https://repo.eclipse.org/content/repositories/maven_central/javax/annotation/jsr250-api/1.0/jsr250-api-1.0.jar (6 KB at 204.0 KB/sec)
09:36:55 Downloading: https://repo.eclipse.org/content/repositories/maven_central/org/codehaus/plexus/plexus-utils/3.0.17/plexus-utils-3.0.17.jar
09:36:55 Downloaded: https://repo.eclipse.org/content/repositories/maven_central/org/eclipse/sisu/org.eclipse.sisu.plexus/0.0.0.M5/org.eclipse.sisu.plexus-0.0.0.M5.jar (192 KB at 5483.9 KB/sec)
09:36:55 Downloading: https://repo.eclipse.org/content/repositories/maven_central/org/codehaus/plexus/plexus-component-annotations/1.5.5/plexus-component-annotations-1.5.5.jar
09:36:55 Downloaded: https://repo.eclipse.org/content/repositories/maven_central/org/sonatype/sisu/sisu-guice/3.1.0/sisu-guice-3.1.0-no_aop.jar (350 KB at 12036.1 KB/sec)
09:36:55 Downloading: https://repo.eclipse.org/content/repositories/maven_central/org/sonatype/plexus/plexus-cipher/1.4/plexus-cipher-1.4.jar
09:36:55 Downloaded: https://repo.eclipse.org/content/repositories/maven_central/org/eclipse/sisu/org.eclipse.sisu.inject/0.0.0.M5/org.eclipse.sisu.inject-0.0.0.M5.jar (285 KB at 14977.2 KB/sec)
09:36:55 Downloaded: https://repo.eclipse.org/content/repositories/maven_central/org/codehaus/plexus/plexus-component-annotations/1.5.5/plexus-component-annotations-1.5.5.jar (5 KB at 241.9 KB/sec)
09:36:55 Downloaded: https://repo.eclipse.org/content/repositories/maven_central/org/codehaus/plexus/plexus-interpolation/1.19/plexus-interpolation-1.19.jar (61 KB at 2619.6 KB/sec)
09:36:55 Downloaded: https://repo.eclipse.org/content/repositories/maven_central/org/sonatype/plexus/plexus-cipher/1.4/plexus-cipher-1.4.jar (14 KB at 941.3 KB/sec)
09:36:55 Downloaded: https://repo.eclipse.org/content/repositories/maven_central/org/codehaus/plexus/plexus-utils/3.0.17/plexus-utils-3.0.17.jar (246 KB at 12294.5 KB/sec)
09:36:56 Jan 29, 2019 9:36:56 AM org.sonatype.guice.bean.reflect.Logs$JULSink warn
09:36:56 WARNING: Error injecting: org.eclipse.xtend.maven.XtendCompile
09:36:56 com.google.inject.ProvisionException: Guice provision errors:
09:36:56 
09:36:56 1) Error injecting constructor, com.google.inject.internal.util.$ComputationException: com.google.inject.internal.util.$ComputationException: java.lang.SecurityException: class "org.eclipse.core.runtime.OperationCanceledException"'s signer information does not match signer information of other classes in the same package
09:36:56   at org.eclipse.xtend.maven.XtendCompile.<init>(Unknown Source)
09:36:56   while locating org.eclipse.xtend.maven.XtendCompile
09:36:56 
09:36:56 1 error
09:36:56 	at com.google.inject.internal.InjectorImpl$3.get(InjectorImpl.java:974)
09:36:56 	at com.google.inject.internal.InjectorImpl.getInstance(InjectorImpl.java:1000)
09:36:56 	at org.sonatype.guice.bean.reflect.AbstractDeferredClass.get(AbstractDeferredClass.java:45)
09:36:56 	at com.google.inject.internal.ProviderInternalFactory.provision(ProviderInternalFactory.java:84)
09:36:56 	at com.google.inject.internal.InternalFactoryToInitializableAdapter.provision(InternalFactoryToInitializableAdapter.java:52)
09:36:56 	at com.google.inject.internal.ProviderInternalFactory$1.call(ProviderInternalFactory.java:70)
09:36:56 	at com.google.inject.internal.ProvisionListenerStackCallback$Provision.provision(ProvisionListenerStackCallback.java:100)
09:36:56 	at org.sonatype.guice.plexus.lifecycles.PlexusLifecycleManager.onProvision(PlexusLifecycleManager.java:138)
09:36:56 	at com.google.inject.internal.ProvisionListenerStackCallback$Provision.provision(ProvisionListenerStackCallback.java:108)
09:36:56 	at com.google.inject.internal.ProvisionListenerStackCallback.provision(ProvisionListenerStackCallback.java:55)
09:36:56 	at com.google.inject.internal.ProviderInternalFactory.circularGet(ProviderInternalFactory.java:68)
09:36:56 	at com.google.inject.internal.InternalFactoryToInitializableAdapter.get(InternalFactoryToInitializableAdapter.java:45)
09:36:56 	at com.google.inject.internal.InjectorImpl$3$1.call(InjectorImpl.java:965)
09:36:56 	at com.google.inject.internal.InjectorImpl.callInContext(InjectorImpl.java:1011)
09:36:56 	at com.google.inject.internal.InjectorImpl$3.get(InjectorImpl.java:961)
09:36:56 	at com.google.inject.Scopes$1$1.get(Scopes.java:59)
09:36:56 	at org.sonatype.guice.bean.locators.LazyBeanEntry.getValue(LazyBeanEntry.java:83)
09:36:56 	at org.sonatype.guice.plexus.locators.LazyPlexusBean.getValue(LazyPlexusBean.java:49)
09:36:56 	at org.codehaus.plexus.DefaultPlexusContainer.lookup(DefaultPlexusContainer.java:253)
09:36:56 	at org.codehaus.plexus.DefaultPlexusContainer.lookup(DefaultPlexusContainer.java:245)
09:36:56 	at org.apache.maven.plugin.internal.DefaultMavenPluginManager.getConfiguredMojo(DefaultMavenPluginManager.java:455)
09:36:56 	at org.apache.maven.plugin.DefaultBuildPluginManager.executeMojo(DefaultBuildPluginManager.java:92)
09:36:56 	at org.apache.maven.lifecycle.internal.MojoExecutor.execute(MojoExecutor.java:209)
09:36:56 	at org.apache.maven.lifecycle.internal.MojoExecutor.execute(MojoExecutor.java:153)
09:36:56 	at org.apache.maven.lifecycle.internal.MojoExecutor.execute(MojoExecutor.java:145)
09:36:56 	at org.apache.maven.lifecycle.internal.LifecycleModuleBuilder.buildProject(LifecycleModuleBuilder.java:84)
09:36:56 	at org.apache.maven.lifecycle.internal.LifecycleModuleBuilder.buildProject(LifecycleModuleBuilder.java:59)
09:36:56 	at org.apache.maven.lifecycle.internal.LifecycleStarter.singleThreadedBuild(LifecycleStarter.java:183)
09:36:56 	at org.apache.maven.lifecycle.internal.LifecycleStarter.execute(LifecycleStarter.java:161)
09:36:56 	at org.apache.maven.DefaultMaven.doExecute(DefaultMaven.java:320)
09:36:56 	at org.apache.maven.DefaultMaven.execute(DefaultMaven.java:156)
09:36:56 	at org.apache.maven.cli.MavenCli.execute(MavenCli.java:537)
09:36:56 	at org.apache.maven.cli.MavenCli.doMain(MavenCli.java:196)
09:36:56 	at org.apache.maven.cli.MavenCli.main(MavenCli.java:141)
09:36:56 	at sun.reflect.NativeMethodAccessorImpl.invoke0(Native Method)
09:36:56 	at sun.reflect.NativeMethodAccessorImpl.invoke(NativeMethodAccessorImpl.java:62)
09:36:56 	at sun.reflect.DelegatingMethodAccessorImpl.invoke(DelegatingMethodAccessorImpl.java:43)
09:36:56 	at java.lang.reflect.Method.invoke(Method.java:498)
09:36:56 	at org.codehaus.plexus.classworlds.launcher.Launcher.launchEnhanced(Launcher.java:290)
09:36:56 	at org.codehaus.plexus.classworlds.launcher.Launcher.launch(Launcher.java:230)
09:36:56 	at org.codehaus.plexus.classworlds.launcher.Launcher.mainWithExitCode(Launcher.java:409)
09:36:56 	at org.codehaus.plexus.classworlds.launcher.Launcher.main(Launcher.java:352)
09:36:56 Caused by: com.google.inject.internal.util.$ComputationException: com.google.inject.internal.util.$ComputationException: java.lang.SecurityException: class "org.eclipse.core.runtime.OperationCanceledException"'s signer information does not match signer information of other classes in the same package
09:36:56 	at com.google.inject.internal.util.$MapMaker$StrategyImpl.compute(MapMaker.java:553)
09:36:56 	at com.google.inject.internal.util.$MapMaker$StrategyImpl.compute(MapMaker.java:419)
09:36:56 	at com.google.inject.internal.util.$CustomConcurrentHashMap$ComputingImpl.get(CustomConcurrentHashMap.java:2041)
09:36:56 	at com.google.inject.internal.FailableCache.get(FailableCache.java:50)
09:36:56 	at com.google.inject.internal.ConstructorInjectorStore.get(ConstructorInjectorStore.java:49)
09:36:56 	at com.google.inject.internal.ConstructorBindingImpl.initialize(ConstructorBindingImpl.java:125)
09:36:56 	at com.google.inject.internal.InjectorImpl.initializeJitBinding(InjectorImpl.java:521)
09:36:56 	at com.google.inject.internal.InjectorImpl.createJustInTimeBinding(InjectorImpl.java:847)
09:36:56 	at com.google.inject.internal.InjectorImpl.createJustInTimeBindingRecursive(InjectorImpl.java:772)
09:36:56 	at com.google.inject.internal.InjectorImpl.getJustInTimeBinding(InjectorImpl.java:256)
09:36:56 	at com.google.inject.internal.InjectorImpl.getBindingOrThrow(InjectorImpl.java:205)
09:36:56 	at com.google.inject.internal.InjectorImpl.getInternalFactory(InjectorImpl.java:853)
09:36:56 	at com.google.inject.internal.FactoryProxy.notify(FactoryProxy.java:46)
09:36:56 	at com.google.inject.internal.ProcessedBindingData.runCreationListeners(ProcessedBindingData.java:50)
09:36:56 	at com.google.inject.internal.InternalInjectorCreator.initializeStatically(InternalInjectorCreator.java:133)
09:36:56 	at com.google.inject.internal.InternalInjectorCreator.build(InternalInjectorCreator.java:106)
09:36:56 	at com.google.inject.Guice.createInjector(Guice.java:95)
09:36:56 	at com.google.inject.Guice.createInjector(Guice.java:72)
09:36:56 	at com.google.inject.Guice.createInjector(Guice.java:62)
09:36:56 	at org.eclipse.xtext.xbase.XtypeStandaloneSetupGenerated.createInjector(XtypeStandaloneSetupGenerated.java:44)
09:36:56 	at org.eclipse.xtext.xbase.XtypeStandaloneSetupGenerated.createInjectorAndDoEMFRegistration(XtypeStandaloneSetupGenerated.java:38)
09:36:56 	at org.eclipse.xtext.xbase.XtypeStandaloneSetup.createInjectorAndDoEMFRegistration(XtypeStandaloneSetup.java:34)
09:36:56 	at org.eclipse.xtext.xbase.XtypeStandaloneSetup.doSetup(XtypeStandaloneSetup.java:25)
09:36:56 	at org.eclipse.xtext.xbase.XbaseStandaloneSetupGenerated.createInjectorAndDoEMFRegistration(XbaseStandaloneSetupGenerated.java:22)
09:36:56 	at org.eclipse.xtext.xbase.XbaseStandaloneSetup.createInjectorAndDoEMFRegistration(XbaseStandaloneSetup.java:31)
09:36:56 	at org.eclipse.xtext.xbase.XbaseStandaloneSetup.doSetup(XbaseStandaloneSetup.java:24)
09:36:56 	at org.eclipse.xtext.xbase.annotations.XbaseWithAnnotationsStandaloneSetupGenerated.createInjectorAndDoEMFRegistration(XbaseWithAnnotationsStandaloneSetupGenerated.java:23)
09:36:56 	at org.eclipse.xtext.xbase.annotations.XbaseWithAnnotationsStandaloneSetup.createInjectorAndDoEMFRegistration(XbaseWithAnnotationsStandaloneSetup.java:30)
09:36:56 	at org.eclipse.xtext.xbase.annotations.XbaseWithAnnotationsStandaloneSetup.doSetup(XbaseWithAnnotationsStandaloneSetup.java:23)
09:36:56 	at org.eclipse.xtend.maven.XtendMavenStandaloneSetup.createInjectorAndDoEMFRegistration(XtendMavenStandaloneSetup.java:19)
09:36:56 	at org.eclipse.xtend.maven.AbstractXtendMojo.injectMembers(AbstractXtendMojo.java:44)
09:36:56 	at org.eclipse.xtend.maven.AbstractXtendMojo.<init>(AbstractXtendMojo.java:31)
09:36:56 	at org.eclipse.xtend.maven.AbstractXtendCompilerMojo.<init>(AbstractXtendCompilerMojo.java:43)
09:36:56 	at org.eclipse.xtend.maven.XtendCompile.<init>(XtendCompile.java:27)
09:36:56 	at sun.reflect.NativeConstructorAccessorImpl.newInstance0(Native Method)
09:36:56 	at sun.reflect.NativeConstructorAccessorImpl.newInstance(NativeConstructorAccessorImpl.java:62)
09:36:56 	at sun.reflect.DelegatingConstructorAccessorImpl.newInstance(DelegatingConstructorAccessorImpl.java:45)
09:36:56 	at java.lang.reflect.Constructor.newInstance(Constructor.java:423)
09:36:56 	at com.google.inject.internal.DefaultConstructionProxyFactory$1.newInstance(DefaultConstructionProxyFactory.java:86)
09:36:56 	at com.google.inject.internal.ConstructorInjector.provision(ConstructorInjector.java:108)
09:36:56 	at com.google.inject.internal.ConstructorInjector.access$000(ConstructorInjector.java:32)
09:36:56 	at com.google.inject.internal.ConstructorInjector$1.call(ConstructorInjector.java:91)
09:36:56 	at com.google.inject.internal.ProvisionListenerStackCallback$Provision.provision(ProvisionListenerStackCallback.java:100)
09:36:56 	at com.google.inject.internal.ProvisionListenerStackCallback$Provision.provision(ProvisionListenerStackCallback.java:115)
09:36:56 	at com.google.inject.internal.ProvisionListenerStackCallback.provision(ProvisionListenerStackCallback.java:55)
09:36:56 	at com.google.inject.internal.ConstructorInjector.construct(ConstructorInjector.java:89)
09:36:56 	at com.google.inject.internal.ConstructorBindingImpl$Factory.get(ConstructorBindingImpl.java:259)
09:36:56 	at com.google.inject.internal.InjectorImpl$3$1.call(InjectorImpl.java:965)
09:36:56 	at com.google.inject.internal.InjectorImpl.callInContext(InjectorImpl.java:1018)
09:36:56 	at com.google.inject.internal.InjectorImpl$3.get(InjectorImpl.java:961)
09:36:56 	... 41 more
09:36:56 Caused by: com.google.inject.internal.util.$ComputationException: java.lang.SecurityException: class "org.eclipse.core.runtime.OperationCanceledException"'s signer information does not match signer information of other classes in the same package
09:36:56 	at com.google.inject.internal.util.$MapMaker$StrategyImpl.compute(MapMaker.java:553)
09:36:56 	at com.google.inject.internal.util.$MapMaker$StrategyImpl.compute(MapMaker.java:419)
09:36:56 	at com.google.inject.internal.util.$CustomConcurrentHashMap$ComputingImpl.get(CustomConcurrentHashMap.java:2041)
09:36:56 	at com.google.inject.internal.FailableCache.get(FailableCache.java:50)
09:36:56 	at com.google.inject.internal.MembersInjectorStore.get(MembersInjectorStore.java:65)
09:36:56 	at com.google.inject.internal.ConstructorInjectorStore.createConstructor(ConstructorInjectorStore.java:73)
09:36:56 	at com.google.inject.internal.ConstructorInjectorStore.access$000(ConstructorInjectorStore.java:28)
09:36:56 	at com.google.inject.internal.ConstructorInjectorStore$1.create(ConstructorInjectorStore.java:36)
09:36:56 	at com.google.inject.internal.ConstructorInjectorStore$1.create(ConstructorInjectorStore.java:32)
09:36:56 	at com.google.inject.internal.FailableCache$1.apply(FailableCache.java:39)
09:36:56 	at com.google.inject.internal.util.$MapMaker$StrategyImpl.compute(MapMaker.java:549)
09:36:56 	... 90 more
09:36:56 Caused by: java.lang.SecurityException: class "org.eclipse.core.runtime.OperationCanceledException"'s signer information does not match signer information of other classes in the same package
09:36:56 	at java.lang.ClassLoader.checkCerts(ClassLoader.java:898)
09:36:56 	at java.lang.ClassLoader.preDefineClass(ClassLoader.java:668)
09:36:56 	at java.lang.ClassLoader.defineClass(ClassLoader.java:761)
09:36:56 	at java.security.SecureClassLoader.defineClass(SecureClassLoader.java:142)
09:36:56 	at java.net.URLClassLoader.defineClass(URLClassLoader.java:468)
09:36:56 	at java.net.URLClassLoader.access$100(URLClassLoader.java:74)
09:36:56 	at java.net.URLClassLoader$1.run(URLClassLoader.java:369)
09:36:56 	at java.net.URLClassLoader$1.run(URLClassLoader.java:363)
09:36:56 	at java.security.AccessController.doPrivileged(Native Method)
09:36:56 	at java.net.URLClassLoader.findClass(URLClassLoader.java:362)
09:36:56 	at org.codehaus.plexus.classworlds.realm.ClassRealm.loadClassFromSelf(ClassRealm.java:386)
09:36:56 	at org.codehaus.plexus.classworlds.strategy.SelfFirstStrategy.loadClass(SelfFirstStrategy.java:42)
09:36:56 	at org.codehaus.plexus.classworlds.realm.ClassRealm.loadClass(ClassRealm.java:244)
09:36:56 	at org.codehaus.plexus.classworlds.realm.ClassRealm.loadClass(ClassRealm.java:230)
09:36:56 	at java.lang.Class.getDeclaredConstructors0(Native Method)
09:36:56 	at java.lang.Class.privateGetDeclaredConstructors(Class.java:2671)
09:36:56 	at java.lang.Class.getDeclaredConstructors(Class.java:2020)
09:36:56 	at com.google.inject.spi.InjectionPoint.forConstructorOf(InjectionPoint.java:243)
09:36:56 	at com.google.inject.internal.ConstructorBindingImpl.create(ConstructorBindingImpl.java:96)
09:36:56 	at com.google.inject.internal.InjectorImpl.createUninitializedBinding(InjectorImpl.java:629)
09:36:56 	at com.google.inject.internal.InjectorImpl.createJustInTimeBinding(InjectorImpl.java:845)
09:36:56 	at com.google.inject.internal.InjectorImpl.createJustInTimeBindingRecursive(InjectorImpl.java:772)
09:36:56 	at com.google.inject.internal.InjectorImpl.getJustInTimeBinding(InjectorImpl.java:256)
09:36:56 	at com.google.inject.internal.InjectorImpl.getBindingOrThrow(InjectorImpl.java:205)
09:36:56 	at com.google.inject.internal.InjectorImpl.getInternalFactory(InjectorImpl.java:853)
09:36:56 	at com.google.inject.internal.SingleFieldInjector.<init>(SingleFieldInjector.java:41)
09:36:56 	at com.google.inject.internal.MembersInjectorStore.getInjectors(MembersInjectorStore.java:125)
09:36:56 	at com.google.inject.internal.MembersInjectorStore.createWithListeners(MembersInjectorStore.java:95)
09:36:56 	at com.google.inject.internal.MembersInjectorStore.access$000(MembersInjectorStore.java:34)
09:36:56 	at com.google.inject.internal.MembersInjectorStore$1.create(MembersInjectorStore.java:42)
09:36:56 	at com.google.inject.internal.MembersInjectorStore$1.create(MembersInjectorStore.java:39)
09:36:56 	at com.google.inject.internal.FailableCache$1.apply(FailableCache.java:39)
09:36:56 	at com.google.inject.internal.util.$MapMaker$StrategyImpl.compute(MapMaker.java:549)
09:36:56 	... 100 more
09:36:56 
09:36:56 [INFO]                                                                         
09:36:56 [INFO] ------------------------------------------------------------------------
09:36:56 [INFO] Skipping org.eclipse.xpect.target.eclipse_4_4_2-xtext_2_9_2
09:36:56 [INFO] This project has been banned from the build due to previous failures.
09:36:56 [INFO] ------------------------------------------------------------------------
09:36:56 [INFO]                                                                         
09:36:56 [INFO] ------------------------------------------------------------------------
09:36:56 [INFO] Skipping org.eclipse.xpect
09:36:56 [INFO] This project has been banned from the build due to previous failures.
09:36:56 [INFO] ------------------------------------------------------------------------
09:36:56 [INFO]                                                                         
09:36:56 [INFO] ------------------------------------------------------------------------
09:36:56 [INFO] Skipping org.eclipse.xpect.ui
09:36:56 [INFO] This project has been banned from the build due to previous failures.
09:36:56 [INFO] ------------------------------------------------------------------------
09:36:56 [INFO]                                                                         
09:36:56 [INFO] ------------------------------------------------------------------------
09:36:56 [INFO] Skipping org.eclipse.xpect.ui.junit
09:36:56 [INFO] This project has been banned from the build due to previous failures.
09:36:56 [INFO] ------------------------------------------------------------------------
09:36:56 [INFO]                                                                         
09:36:56 [INFO] ------------------------------------------------------------------------
09:36:56 [INFO] Skipping org.eclipse.xpect.xtext.lib
09:36:56 [INFO] This project has been banned from the build due to previous failures.
09:36:56 [INFO] ------------------------------------------------------------------------
09:36:56 [INFO]                                                                         
09:36:56 [INFO] ------------------------------------------------------------------------
09:36:56 [INFO] Skipping org.eclipse.xpect.xtext.xbase.lib
09:36:56 [INFO] This project has been banned from the build due to previous failures.
09:36:56 [INFO] ------------------------------------------------------------------------
09:36:56 [INFO]                                                                         
09:36:56 [INFO] ------------------------------------------------------------------------
09:36:56 [INFO] Skipping org.eclipse.xpect.xtext.lib.feature
09:36:56 [INFO] This project has been banned from the build due to previous failures.
09:36:56 [INFO] ------------------------------------------------------------------------
09:36:56 [INFO]                                                                         
09:36:56 [INFO] ------------------------------------------------------------------------
09:36:56 [INFO] Skipping org.eclipse.xpect.xtext.xbase.lib.feature
09:36:56 [INFO] This project has been banned from the build due to previous failures.
09:36:56 [INFO] ------------------------------------------------------------------------
09:36:56 [INFO]                                                                         
09:36:56 [INFO] ------------------------------------------------------------------------
09:36:56 [INFO] Skipping org.eclipse.xpect.sdk
09:36:56 [INFO] This project has been banned from the build due to previous failures.
09:36:56 [INFO] ------------------------------------------------------------------------
09:36:56 [INFO]                                                                         
09:36:56 [INFO] ------------------------------------------------------------------------
09:36:56 [INFO] Skipping org.eclipse.xpect.repository
09:36:56 [INFO] This project has been banned from the build due to previous failures.
09:36:56 [INFO] ------------------------------------------------------------------------
09:36:56 [INFO]                                                                         
09:36:56 [INFO] ------------------------------------------------------------------------
09:36:56 [INFO] Skipping org.eclipse.xtext.example.maven_parents.grammar_plugin
09:36:56 [INFO] This project has been banned from the build due to previous failures.
09:36:56 [INFO] ------------------------------------------------------------------------
09:36:56 [INFO]                                                                         
09:36:56 [INFO] ------------------------------------------------------------------------
09:36:56 [INFO] Skipping org.eclipse.xtext.example.arithmetics
09:36:56 [INFO] This project has been banned from the build due to previous failures.
09:36:56 [INFO] ------------------------------------------------------------------------
09:36:56 [INFO]                                                                         
09:36:56 [INFO] ------------------------------------------------------------------------
09:36:56 [INFO] Skipping org.eclipse.xtext.example.arithmetics.ide
09:36:56 [INFO] This project has been banned from the build due to previous failures.
09:36:56 [INFO] ------------------------------------------------------------------------
09:36:56 [INFO]                                                                         
09:36:56 [INFO] ------------------------------------------------------------------------
09:36:56 [INFO] Skipping org.eclipse.xtext.example.arithmetics.ui
09:36:56 [INFO] This project has been banned from the build due to previous failures.
09:36:56 [INFO] ------------------------------------------------------------------------
09:36:56 [INFO]                                                                         
09:36:56 [INFO] ------------------------------------------------------------------------
09:36:56 [INFO] Skipping org.eclipse.xtext.example.domainmodel
09:36:56 [INFO] This project has been banned from the build due to previous failures.
09:36:56 [INFO] ------------------------------------------------------------------------
09:36:56 [INFO]                                                                         
09:36:56 [INFO] ------------------------------------------------------------------------
09:36:56 [INFO] Skipping org.eclipse.xtext.example.domainmodel.ui
09:36:56 [INFO] This project has been banned from the build due to previous failures.
09:36:56 [INFO] ------------------------------------------------------------------------
09:36:56 [INFO]                                                                         
09:36:56 [INFO] ------------------------------------------------------------------------
09:36:56 [INFO] Building org.eclipse.xpect.root 0.0.1-SNAPSHOT
09:36:56 [INFO] ------------------------------------------------------------------------
09:36:56 [INFO] 
09:36:56 [INFO] --- maven-clean-plugin:2.4.1:clean (default-clean) @ org.eclipse.xpect.root ---
09:36:56 [INFO] 
09:36:56 [INFO] --- maven-install-plugin:2.3.1:install (default-install) @ org.eclipse.xpect.root ---
09:36:56 Downloading: https://repo.eclipse.org/content/repositories/maven_central/org/apache/maven/maven-project/2.0.6/maven-project-2.0.6.pom
09:36:56 Downloaded: https://repo.eclipse.org/content/repositories/maven_central/org/apache/maven/maven-project/2.0.6/maven-project-2.0.6.pom (3 KB at 135.5 KB/sec)
09:36:56 Downloading: https://repo.eclipse.org/content/repositories/maven_central/org/apache/maven/maven-settings/2.0.6/maven-settings-2.0.6.pom
09:36:56 Downloaded: https://repo.eclipse.org/content/repositories/maven_central/org/apache/maven/maven-settings/2.0.6/maven-settings-2.0.6.pom (2 KB at 122.1 KB/sec)
09:36:56 Downloading: https://repo.eclipse.org/content/repositories/maven_central/org/apache/maven/maven-model/2.0.6/maven-model-2.0.6.pom
09:36:56 Downloaded: https://repo.eclipse.org/content/repositories/maven_central/org/apache/maven/maven-model/2.0.6/maven-model-2.0.6.pom (3 KB at 124.0 KB/sec)
09:36:56 Downloading: https://repo.eclipse.org/content/repositories/maven_central/org/codehaus/plexus/plexus-utils/1.4.1/plexus-utils-1.4.1.pom
09:36:56 Downloaded: https://repo.eclipse.org/content/repositories/maven_central/org/codehaus/plexus/plexus-utils/1.4.1/plexus-utils-1.4.1.pom (2 KB at 43.4 KB/sec)
09:36:56 Downloading: https://repo.eclipse.org/content/repositories/maven_central/org/codehaus/plexus/plexus-container-default/1.0-alpha-9-stable-1/plexus-container-default-1.0-alpha-9-stable-1.pom
09:36:56 Downloaded: https://repo.eclipse.org/content/repositories/maven_central/org/codehaus/plexus/plexus-container-default/1.0-alpha-9-stable-1/plexus-container-default-1.0-alpha-9-stable-1.pom (4 KB at 160.7 KB/sec)
09:36:56 Downloading: https://repo.eclipse.org/content/repositories/maven_central/org/codehaus/plexus/plexus-containers/1.0.3/plexus-containers-1.0.3.pom
09:36:56 Downloaded: https://repo.eclipse.org/content/repositories/maven_central/org/codehaus/plexus/plexus-containers/1.0.3/plexus-containers-1.0.3.pom (492 B at 37.0 KB/sec)
09:36:56 Downloading: https://repo.eclipse.org/content/repositories/maven_central/org/codehaus/plexus/plexus/1.0.4/plexus-1.0.4.pom
09:36:56 Downloaded: https://repo.eclipse.org/content/repositories/maven_central/org/codehaus/plexus/plexus/1.0.4/plexus-1.0.4.pom (6 KB at 155.6 KB/sec)
09:36:56 Downloading: https://repo.eclipse.org/content/repositories/maven_central/junit/junit/3.8.1/junit-3.8.1.pom
09:36:56 Downloaded: https://repo.eclipse.org/content/repositories/maven_central/junit/junit/3.8.1/junit-3.8.1.pom (998 B at 31.4 KB/sec)
09:36:56 Downloading: https://repo.eclipse.org/content/repositories/maven_central/org/codehaus/plexus/plexus-utils/1.0.4/plexus-utils-1.0.4.pom
09:36:56 Downloaded: https://repo.eclipse.org/content/repositories/maven_central/org/codehaus/plexus/plexus-utils/1.0.4/plexus-utils-1.0.4.pom (7 KB at 352.4 KB/sec)
09:36:56 Downloading: https://repo.eclipse.org/content/repositories/maven_central/classworlds/classworlds/1.1-alpha-2/classworlds-1.1-alpha-2.pom
09:36:56 Downloaded: https://repo.eclipse.org/content/repositories/maven_central/classworlds/classworlds/1.1-alpha-2/classworlds-1.1-alpha-2.pom (4 KB at 179.7 KB/sec)
09:36:56 Downloading: https://repo.eclipse.org/content/repositories/maven_central/org/apache/maven/maven-profile/2.0.6/maven-profile-2.0.6.pom
09:36:57 Downloaded: https://repo.eclipse.org/content/repositories/maven_central/org/apache/maven/maven-profile/2.0.6/maven-profile-2.0.6.pom (2 KB at 101.8 KB/sec)
09:36:57 Downloading: https://repo.eclipse.org/content/repositories/maven_central/org/apache/maven/maven-artifact-manager/2.0.6/maven-artifact-manager-2.0.6.pom
09:36:57 Downloaded: https://repo.eclipse.org/content/repositories/maven_central/org/apache/maven/maven-artifact-manager/2.0.6/maven-artifact-manager-2.0.6.pom (3 KB at 134.8 KB/sec)
09:36:57 Downloading: https://repo.eclipse.org/content/repositories/maven_central/org/apache/maven/maven-repository-metadata/2.0.6/maven-repository-metadata-2.0.6.pom
09:36:57 Downloaded: https://repo.eclipse.org/content/repositories/maven_central/org/apache/maven/maven-repository-metadata/2.0.6/maven-repository-metadata-2.0.6.pom (2 KB at 95.1 KB/sec)
09:36:57 Downloading: https://repo.eclipse.org/content/repositories/maven_central/org/apache/maven/maven-artifact/2.0.6/maven-artifact-2.0.6.pom
09:36:57 Downloaded: https://repo.eclipse.org/content/repositories/maven_central/org/apache/maven/maven-artifact/2.0.6/maven-artifact-2.0.6.pom (2 KB at 77.0 KB/sec)
09:36:57 Downloading: https://repo.eclipse.org/content/repositories/maven_central/org/apache/maven/maven-plugin-registry/2.0.6/maven-plugin-registry-2.0.6.pom
09:36:57 Downloaded: https://repo.eclipse.org/content/repositories/maven_central/org/apache/maven/maven-plugin-registry/2.0.6/maven-plugin-registry-2.0.6.pom (2 KB at 90.5 KB/sec)
09:36:57 Downloading: https://repo.eclipse.org/content/repositories/maven_central/org/codehaus/plexus/plexus-digest/1.0/plexus-digest-1.0.pom
09:36:57 Downloaded: https://repo.eclipse.org/content/repositories/maven_central/org/codehaus/plexus/plexus-digest/1.0/plexus-digest-1.0.pom (2 KB at 43.1 KB/sec)
09:36:57 Downloading: https://repo.eclipse.org/content/repositories/maven_central/org/codehaus/plexus/plexus-components/1.1.7/plexus-components-1.1.7.pom
09:36:57 Downloaded: https://repo.eclipse.org/content/repositories/maven_central/org/codehaus/plexus/plexus-components/1.1.7/plexus-components-1.1.7.pom (5 KB at 285.8 KB/sec)
09:36:57 Downloading: https://repo.eclipse.org/content/repositories/maven_central/org/codehaus/plexus/plexus/1.0.8/plexus-1.0.8.pom
09:36:57 Downloaded: https://repo.eclipse.org/content/repositories/maven_central/org/codehaus/plexus/plexus/1.0.8/plexus-1.0.8.pom (8 KB at 415.3 KB/sec)
09:36:57 Downloading: https://repo.eclipse.org/content/repositories/maven_central/org/codehaus/plexus/plexus-container-default/1.0-alpha-8/plexus-container-default-1.0-alpha-8.pom
09:36:57 Downloaded: https://repo.eclipse.org/content/repositories/maven_central/org/codehaus/plexus/plexus-container-default/1.0-alpha-8/plexus-container-default-1.0-alpha-8.pom (8 KB at 394.0 KB/sec)
09:36:57 Downloading: https://repo.eclipse.org/content/repositories/maven_central/junit/junit/3.8.1/junit-3.8.1.jar
09:36:57 Downloading: https://repo.eclipse.org/content/repositories/maven_central/org/codehaus/plexus/plexus-digest/1.0/plexus-digest-1.0.jar
09:36:57 Downloaded: https://repo.eclipse.org/content/repositories/maven_central/org/codehaus/plexus/plexus-digest/1.0/plexus-digest-1.0.jar (12 KB at 551.4 KB/sec)
09:36:57 Downloaded: https://repo.eclipse.org/content/repositories/maven_central/junit/junit/3.8.1/junit-3.8.1.jar (119 KB at 4729.3 KB/sec)
09:36:57 [INFO] Installing /jobs/genie.xpect/Xpect/branches/master/workspace/pom.xml to /jobs/genie.xpect/Xpect/branches/master/workspace/xpect-local-maven-repository/org/eclipse/xpect/org.eclipse.xpect.root/0.0.1-SNAPSHOT/org.eclipse.xpect.root-0.0.1-SNAPSHOT.pom
09:36:57 [INFO] ------------------------------------------------------------------------
09:36:57 [INFO] Reactor Summary:
09:36:57 [INFO] 
09:36:57 [INFO] org.eclipse.xpect.parent .......................... FAILURE [11:05.355s]
09:36:57 [INFO] org.eclipse.xpect.target.eclipse_4_4_2-xtext_2_9_2  SKIPPED
09:36:57 [INFO] org.eclipse.xpect ................................. SKIPPED
09:36:57 [INFO] org.eclipse.xpect.ui .............................. SKIPPED
09:36:57 [INFO] org.eclipse.xpect.ui.junit ........................ SKIPPED
09:36:57 [INFO] org.eclipse.xpect.xtext.lib ....................... SKIPPED
09:36:57 [INFO] org.eclipse.xpect.xtext.xbase.lib ................. SKIPPED
09:36:57 [INFO] org.eclipse.xpect.xtext.lib.feature ............... SKIPPED
09:36:57 [INFO] org.eclipse.xpect.xtext.xbase.lib.feature ......... SKIPPED
09:36:57 [INFO] org.eclipse.xpect.sdk ............................. SKIPPED
09:36:57 [INFO] org.eclipse.xpect.repository ...................... SKIPPED
09:36:57 [INFO] org.eclipse.xtext.example.maven_parents.grammar_plugin  SKIPPED
09:36:57 [INFO] org.eclipse.xtext.example.arithmetics ............. SKIPPED
09:36:57 [INFO] org.eclipse.xtext.example.arithmetics.ide ......... SKIPPED
09:36:57 [INFO] org.eclipse.xtext.example.arithmetics.ui .......... SKIPPED
09:36:57 [INFO] org.eclipse.xtext.example.domainmodel ............. SKIPPED
09:36:57 [INFO] org.eclipse.xtext.example.domainmodel.ui .......... SKIPPED
09:36:57 [INFO] org.eclipse.xpect.root ............................ SUCCESS [0.560s]
09:36:57 [INFO] ------------------------------------------------------------------------
09:36:57 [INFO] BUILD FAILURE
09:36:57 [INFO] ------------------------------------------------------------------------
09:36:57 [INFO] Total time: 15:55.542s
09:36:57 [INFO] Finished at: Tue Jan 29 09:36:57 EST 2019
09:36:57 [INFO] Final Memory: 86M/974M
09:36:57 [INFO] ------------------------------------------------------------------------
09:36:57 [ERROR] Failed to execute goal org.eclipse.xtend:xtend-maven-plugin:2.9.2:compile (default) on project org.eclipse.xpect.parent: Execution default of goal org.eclipse.xtend:xtend-maven-plugin:2.9.2:compile failed: Unable to load the mojo 'compile' (or one of its required components) from the plugin 'org.eclipse.xtend:xtend-maven-plugin:2.9.2': com.google.inject.ProvisionException: Guice provision errors:
09:36:57 [ERROR] 
09:36:57 [ERROR] 1) Error injecting constructor, com.google.inject.internal.util.$ComputationException: com.google.inject.internal.util.$ComputationException: java.lang.SecurityException: class "org.eclipse.core.runtime.OperationCanceledException"'s signer information does not match signer information of other classes in the same package
09:36:57 [ERROR] at org.eclipse.xtend.maven.XtendCompile.<init>(Unknown Source)
09:36:57 [ERROR] while locating org.eclipse.xtend.maven.XtendCompile
09:36:57 [ERROR] at ClassRealm[plugin>org.eclipse.xtend:xtend-maven-plugin:2.9.2, parent: sun.misc.Launcher$AppClassLoader@7852e922]
09:36:57 [ERROR] while locating org.apache.maven.plugin.Mojo annotated with @com.google.inject.name.Named(value=org.eclipse.xtend:xtend-maven-plugin:2.9.2:compile)
09:36:57 [ERROR] 
09:36:57 [ERROR] 1 error
09:36:57 [ERROR] role: org.apache.maven.plugin.Mojo
09:36:57 [ERROR] roleHint: org.eclipse.xtend:xtend-maven-plugin:2.9.2:compile
09:36:57 [ERROR] -> [Help 1]
09:36:57 [ERROR] 
09:36:57 [ERROR] To see the full stack trace of the errors, re-run Maven with the -e switch.
09:36:57 [ERROR] Re-run Maven using the -X switch to enable full debug logging.
09:36:57 [ERROR] 
09:36:57 [ERROR] For more information about the errors and possible solutions, please read the following articles:
09:36:57 [ERROR] [Help 1] http://cwiki.apache.org/confluence/display/MAVEN/PluginContainerException
[Pipeline] }
[Pipeline] // stage
[Pipeline] }
[Pipeline] // timeout
[Pipeline] }
[Pipeline] // node
[Pipeline] }
[Pipeline] // timestamps
[Pipeline] End of Pipeline
ERROR: script returned exit code 1
Finished: FAILURE