FailedConsole Output

Started by user jakub.siberski@gmail.com
Obtained Jenkinsfile from git https://github.com/eclipse/Xpect.git
[Pipeline] timestamps
[Pipeline] {
[Pipeline] node
11:32:05 Running on master in /home/hudson/genie.xpect/.jenkins/jobs/Xpect-Integration-Release/workspace
[Pipeline] {
[Pipeline] tool
[Pipeline] timeout
11:32:05 Timeout set to expire in 1 hr 0 min
[Pipeline] {
[Pipeline] stage
[Pipeline] { (log configuration)
[Pipeline] sh
11:32:05 [workspace] Running shell script
11:32:05 + echo '===== checking tools versions ====='
11:32:05 ===== checking tools versions =====
11:32:05 + pwd
11:32:05 /jobs/genie.xpect/Xpect-Integration-Release/workspace
11:32:05 + ls -ls
11:32:05 total 0
11:32:05 0 drwxrwsr-x 1 genie.xpect modeling.xpect 0 Nov  9 10:56 xpect-local-maven-repository
11:32:05 + /shared/common/apache-maven-3.0.5/bin/mvn -v
11:32:05 Apache Maven 3.0.5 (r01de14724cdef164cd33c7c8c2fe155faf9602da; 2013-02-19 08:51:28-0500)
11:32:05 Maven home: /shared/common/apache-maven-3.0.5
11:32:05 Java version: 1.8.0_131, vendor: Oracle Corporation
11:32:05 Java home: /opt/public/common/jdk1.8.0_131.x64/jre
11:32:05 Default locale: en_US, platform encoding: UTF-8
11:32:05 OS name: "linux", version: "3.12.62-60.64.8-default", arch: "amd64", family: "unix"
11:32:05 + echo ===================================
11:32:05 ===================================
[Pipeline] }
[Pipeline] // stage
[Pipeline] stage
[Pipeline] { (compile with Eclipse Luna and Xtext 2.9.2)
[Pipeline] sh
11:32:05 [workspace] Running shell script
11:32:05 + /shared/common/apache-maven-3.0.5/bin/mvn '-P!tests' -Dtarget-platform=eclipse_4_4_2-xtext_2_9_2 --batch-mode --update-snapshots -fae -Dmaven.repo.local=xpect-local-maven-repository -DtestOnly=false clean install
11:32:07 [INFO] Scanning for projects...
11:32:07 [INFO] ------------------------------------------------------------------------
11:32:07 [INFO] BUILD FAILURE
11:32:07 [INFO] ------------------------------------------------------------------------
11:32:07 [INFO] Total time: 0.304s
11:32:07 [INFO] Finished at: Thu Nov 09 11:32:06 EST 2017
11:32:07 [INFO] Final Memory: 20M/1932M
11:32:07 [INFO] ------------------------------------------------------------------------
11:32:07 [ERROR] The goal you specified requires a project to execute but there is no POM in this directory (/jobs/genie.xpect/Xpect-Integration-Release/workspace). Please verify you invoked Maven from the correct directory. -> [Help 1]
11:32:07 [ERROR] 
11:32:07 [ERROR] To see the full stack trace of the errors, re-run Maven with the -e switch.
11:32:07 [ERROR] Re-run Maven using the -X switch to enable full debug logging.
11:32:07 [ERROR] 
11:32:07 [ERROR] For more information about the errors and possible solutions, please read the following articles:
11:32:07 [ERROR] [Help 1] http://cwiki.apache.org/confluence/display/MAVEN/MissingProjectException
[Pipeline] }
[Pipeline] // stage
[Pipeline] }
[Pipeline] // timeout
[Pipeline] }
[Pipeline] // node
[Pipeline] }
[Pipeline] // timestamps
[Pipeline] End of Pipeline
ERROR: script returned exit code 1
Finished: FAILURE