FailedConsole Output

10:58:51 [workspace] Running shell script
10:58:51 + /shared/common/apache-maven-3.0.5/bin/mvn '-P!tests' -Dtarget-platform=eclipse_4_4_2-xtext_2_9_2 --batch-mode --update-snapshots -fae -Dmaven.repo.local=xpect-local-maven-repository -DtestOnly=false clean install
10:58:53 [INFO] Scanning for projects...
10:58:53 [INFO] ------------------------------------------------------------------------
10:58:53 [INFO] BUILD FAILURE
10:58:53 [INFO] ------------------------------------------------------------------------
10:58:53 [INFO] Total time: 0.314s
10:58:53 [INFO] Finished at: Thu Nov 09 10:58:53 EST 2017
10:58:53 [INFO] Final Memory: 20M/1932M
10:58:53 [INFO] ------------------------------------------------------------------------
10:58:53 [ERROR] The goal you specified requires a project to execute but there is no POM in this directory (/jobs/genie.xpect/Xpect-Integration-Release/workspace). Please verify you invoked Maven from the correct directory. -> [Help 1]
10:58:53 [ERROR] 
10:58:53 [ERROR] To see the full stack trace of the errors, re-run Maven with the -e switch.
10:58:53 [ERROR] Re-run Maven using the -X switch to enable full debug logging.
10:58:53 [ERROR] 
10:58:53 [ERROR] For more information about the errors and possible solutions, please read the following articles:
10:58:53 [ERROR] [Help 1] http://cwiki.apache.org/confluence/display/MAVEN/MissingProjectException