UnstableConsole Output

Started calculate disk usage of build
Finished Calculation of disk usage of build in 0 seconds
Started calculate disk usage of workspace
Finished Calculation of disk usage of workspace in 0 seconds
[INFO] 
[INFO] --------< org.eclipse.winery:org.eclipse.winery.accountability >--------
[INFO] Building org.eclipse.winery.accountability 2.0.0-SNAPSHOT         [8/25]
[INFO] --------------------------------[ jar ]---------------------------------
[INFO] 
[INFO] --- maven-checkstyle-plugin:2.17:check (checkstyle) @ org.eclipse.winery.accountability ---
[INFO] 
[INFO] --- jacoco-maven-plugin:0.7.9:prepare-agent (default) @ org.eclipse.winery.accountability ---
[INFO] argLine set to -javaagent:/opt/public/hipp/homes/genie.winery/.m2/repository/org/jacoco/org.jacoco.agent/0.7.9/org.jacoco.agent-0.7.9-runtime.jar=destfile=/home/hudson/genie.winery/.jenkins/jobs/winery/workspace/org.eclipse.winery.accountability/target/jacoco.exec
[INFO] 
[INFO] --- web3j-maven-plugin:4.2.0:generate-sources (generate-sources) @ org.eclipse.winery.accountability ---
[INFO] Adding to process 'authorization.sol'
[INFO] Adding to process 'provenance.sol'
[INFO] Solidity Compiler not installed.
[INFO] Solidity Compiler from library is used
[WARNING] Issue with travis [canonicalSolCPath=/tmp/genie.winery/solc/solc,commandParts=/tmp/genie.winery/solc/solc,--optimize,--combined-json,abi,bin,interface,metadata,--allow-paths,/home/hudson/genie.winery/.jenkins/jobs/winery/workspace/org.eclipse.winery.accountability/src/main/solidity,/home/hudson/genie.winery/.jenkins/jobs/winery/workspace/org.eclipse.winery.accountability/src/main/solidity/authorization.sol,/home/hudson/genie.winery/.jenkins/jobs/winery/workspace/org.eclipse.winery.accountability/src/main/solidity/provenance.sol],getWorkingDirectory=/tmp/genie.winery/solc]
[WARNING] /tmp/genie.winery/solc/solc
[INFO] 	Built Class for contract 'authorization'
[INFO] 	Built Class for contract 'Provenance'
[INFO] 
[INFO] --- build-helper-maven-plugin:3.0.0:add-source (add-source) @ org.eclipse.winery.accountability ---
[INFO] Source directory: /home/hudson/genie.winery/.jenkins/jobs/winery/workspace/org.eclipse.winery.accountability/src/gen/java added.
[INFO] 
[INFO] --- maven-resources-plugin:2.6:resources (default-resources) @ org.eclipse.winery.accountability ---
[INFO] Using 'UTF-8' encoding to copy filtered resources.
[INFO] skip non existing resourceDirectory /home/hudson/genie.winery/.jenkins/jobs/winery/workspace/org.eclipse.winery.accountability/src/main/resources
[INFO] 
[INFO] --- maven-compiler-plugin:3.7.0:compile (default-compile) @ org.eclipse.winery.accountability ---
[INFO] Changes detected - recompiling the module!
[INFO] Compiling 31 source files to /home/hudson/genie.winery/.jenkins/jobs/winery/workspace/org.eclipse.winery.accountability/target/classes
[INFO] /home/hudson/genie.winery/.jenkins/jobs/winery/workspace/org.eclipse.winery.accountability/src/main/java/org/eclipse/winery/accountability/blockchain/ethereum/SmartContractProvider.java: /home/hudson/genie.winery/.jenkins/jobs/winery/workspace/org.eclipse.winery.accountability/src/main/java/org/eclipse/winery/accountability/blockchain/ethereum/SmartContractProvider.java uses or overrides a deprecated API.
[INFO] /home/hudson/genie.winery/.jenkins/jobs/winery/workspace/org.eclipse.winery.accountability/src/main/java/org/eclipse/winery/accountability/blockchain/ethereum/SmartContractProvider.java: Recompile with -Xlint:deprecation for details.
[INFO] 
[INFO] --- maven-resources-plugin:2.6:testResources (default-testResources) @ org.eclipse.winery.accountability ---
[INFO] Using 'UTF-8' encoding to copy filtered resources.
[INFO] Copying 4 resources
[INFO] 
[INFO] --- maven-compiler-plugin:3.7.0:testCompile (default-testCompile) @ org.eclipse.winery.accountability ---
[INFO] Changes detected - recompiling the module!
[INFO] Compiling 6 source files to /home/hudson/genie.winery/.jenkins/jobs/winery/workspace/org.eclipse.winery.accountability/target/test-classes
[INFO] 
[INFO] --- maven-surefire-plugin:2.21.0:test (default-test) @ org.eclipse.winery.accountability ---
[INFO] 
[INFO] -------------------------------------------------------
[INFO]  T E S T S
[INFO] -------------------------------------------------------
[INFO] Running org.eclipse.winery.accountability.storage.swarm.SwarmProviderTest
10:27:52.582 [pool-1-thread-1] DEBUG org.eclipse.winery.accountability.storage.swarm.SwarmProviderTest - retrieved hash is: 66b8d05e26fba2acff1792037fb5cc1a14742e815e2cdf4fd89d4b7f7cb4671b
10:27:52.776 [pool-1-thread-2] DEBUG org.eclipse.winery.accountability.storage.swarm.SwarmProviderTest - retrieved msg is: This a string intended for testing!
[INFO] Tests run: 1, Failures: 0, Errors: 0, Skipped: 0, Time elapsed: 1.282 s - in org.eclipse.winery.accountability.storage.swarm.SwarmProviderTest
[INFO] Running org.eclipse.winery.accountability.AccountabilityManagerImplIntegrationTest
10:28:16.463 [main] DEBUG org.web3j.protocol.http.HttpService - --> POST http://127.0.0.1:8545/ http/1.1
10:28:16.464 [main] DEBUG org.web3j.protocol.http.HttpService - Content-Type: application/json; charset=utf-8
10:28:16.464 [main] DEBUG org.web3j.protocol.http.HttpService - Content-Length: 125
10:28:16.465 [main] DEBUG org.web3j.protocol.http.HttpService - 
10:28:16.465 [main] DEBUG org.web3j.protocol.http.HttpService - {"jsonrpc":"2.0","method":"eth_getTransactionCount","params":["0x44fb31577305b7b6ed8ff05ee7c0f07b3cc99306","pending"],"id":0}
10:28:16.466 [main] DEBUG org.web3j.protocol.http.HttpService - --> END POST (125-byte body)
10:28:16.484 [main] DEBUG org.web3j.protocol.http.HttpService - <-- HTTP FAILED: java.net.ConnectException: Failed to connect to /127.0.0.1:8545
10:28:18.162 [main] DEBUG org.web3j.protocol.http.HttpService - --> POST http://127.0.0.1:8545/ http/1.1
10:28:18.163 [main] DEBUG org.web3j.protocol.http.HttpService - Content-Type: application/json; charset=utf-8
10:28:18.163 [main] DEBUG org.web3j.protocol.http.HttpService - Content-Length: 125
10:28:18.163 [main] DEBUG org.web3j.protocol.http.HttpService - 
10:28:18.163 [main] DEBUG org.web3j.protocol.http.HttpService - {"jsonrpc":"2.0","method":"eth_getTransactionCount","params":["0x44fb31577305b7b6ed8ff05ee7c0f07b3cc99306","pending"],"id":1}
10:28:18.163 [main] DEBUG org.web3j.protocol.http.HttpService - --> END POST (125-byte body)
10:28:18.165 [main] DEBUG org.web3j.protocol.http.HttpService - <-- HTTP FAILED: java.net.ConnectException: Failed to connect to /127.0.0.1:8545
10:28:19.874 [main] DEBUG org.web3j.protocol.http.HttpService - --> POST http://127.0.0.1:8545/ http/1.1
10:28:19.874 [main] DEBUG org.web3j.protocol.http.HttpService - Content-Type: application/json; charset=utf-8
10:28:19.874 [main] DEBUG org.web3j.protocol.http.HttpService - Content-Length: 125
10:28:19.874 [main] DEBUG org.web3j.protocol.http.HttpService - 
10:28:19.874 [main] DEBUG org.web3j.protocol.http.HttpService - {"jsonrpc":"2.0","method":"eth_getTransactionCount","params":["0x44fb31577305b7b6ed8ff05ee7c0f07b3cc99306","pending"],"id":2}
10:28:19.874 [main] DEBUG org.web3j.protocol.http.HttpService - --> END POST (125-byte body)
10:28:19.875 [main] DEBUG org.web3j.protocol.http.HttpService - <-- HTTP FAILED: java.net.ConnectException: Failed to connect to /127.0.0.1:8545
[ERROR] Tests run: 3, Failures: 0, Errors: 3, Skipped: 0, Time elapsed: 26.292 s <<< FAILURE! - in org.eclipse.winery.accountability.AccountabilityManagerImplIntegrationTest
[ERROR] getHistoryWithoutAuthenticationData  Time elapsed: 2.908 s  <<< ERROR!
java.lang.RuntimeException: java.net.ConnectException: Failed to connect to /127.0.0.1:8545
	at org.eclipse.winery.accountability.AccountabilityManagerImplIntegrationTest.setUp(AccountabilityManagerImplIntegrationTest.java:79)
Caused by: java.net.ConnectException: Failed to connect to /127.0.0.1:8545
	at org.eclipse.winery.accountability.AccountabilityManagerImplIntegrationTest.setUp(AccountabilityManagerImplIntegrationTest.java:79)
Caused by: java.net.ConnectException: Connection refused (Connection refused)
	at org.eclipse.winery.accountability.AccountabilityManagerImplIntegrationTest.setUp(AccountabilityManagerImplIntegrationTest.java:79)

[ERROR] addParticipant  Time elapsed: 1.666 s  <<< ERROR!
java.lang.RuntimeException: java.net.ConnectException: Failed to connect to /127.0.0.1:8545
	at org.eclipse.winery.accountability.AccountabilityManagerImplIntegrationTest.setUp(AccountabilityManagerImplIntegrationTest.java:79)
Caused by: java.net.ConnectException: Failed to connect to /127.0.0.1:8545
	at org.eclipse.winery.accountability.AccountabilityManagerImplIntegrationTest.setUp(AccountabilityManagerImplIntegrationTest.java:79)
Caused by: java.net.ConnectException: Connection refused (Connection refused)
	at org.eclipse.winery.accountability.AccountabilityManagerImplIntegrationTest.setUp(AccountabilityManagerImplIntegrationTest.java:79)

[ERROR] getHistory  Time elapsed: 1.709 s  <<< ERROR!
java.lang.RuntimeException: java.net.ConnectException: Failed to connect to /127.0.0.1:8545
	at org.eclipse.winery.accountability.AccountabilityManagerImplIntegrationTest.setUp(AccountabilityManagerImplIntegrationTest.java:79)
Caused by: java.net.ConnectException: Failed to connect to /127.0.0.1:8545
	at org.eclipse.winery.accountability.AccountabilityManagerImplIntegrationTest.setUp(AccountabilityManagerImplIntegrationTest.java:79)
Caused by: java.net.ConnectException: Connection refused (Connection refused)
	at org.eclipse.winery.accountability.AccountabilityManagerImplIntegrationTest.setUp(AccountabilityManagerImplIntegrationTest.java:79)

[INFO] Running org.eclipse.winery.accountability.model.authorization.AuthorizationTreeTest
10:28:19.886 [main] DEBUG org.eclipse.winery.accountability.model.authorization.AuthorizationTree - Participant (0x1111) tried to re-authorize the participant: (0x3333) which was already authorized before!
10:28:19.886 [main] DEBUG org.eclipse.winery.accountability.model.authorization.AuthorizationTree - Unauthorized participant (0xffff) tried to authorize the participant: (0xeeee)
10:28:19.886 [main] DEBUG org.eclipse.winery.accountability.model.authorization.AuthorizationTree - Unauthorized participant (0xffff) tried to authorize the participant: (0x2222)
10:28:19.901 [main] DEBUG org.eclipse.winery.accountability.model.authorization.AuthorizationTree - Participant (0x1111) tried to re-authorize the participant: (0x3333) which was already authorized before!
10:28:19.901 [main] DEBUG org.eclipse.winery.accountability.model.authorization.AuthorizationTree - Unauthorized participant (0xffff) tried to authorize the participant: (0xeeee)
10:28:19.901 [main] DEBUG org.eclipse.winery.accountability.model.authorization.AuthorizationTree - Unauthorized participant (0xffff) tried to authorize the participant: (0x2222)
10:28:19.901 [main] ERROR org.eclipse.winery.accountability.model.authorization.AuthorizationTree - Failed to build tree-of-trust: Input is empty!
10:28:19.903 [main] DEBUG org.eclipse.winery.accountability.model.authorization.AuthorizationTree - Participant (0x1111) tried to re-authorize the participant: (0x3333) which was already authorized before!
10:28:19.903 [main] DEBUG org.eclipse.winery.accountability.model.authorization.AuthorizationTree - Unauthorized participant (0xffff) tried to authorize the participant: (0xeeee)
10:28:19.903 [main] DEBUG org.eclipse.winery.accountability.model.authorization.AuthorizationTree - Unauthorized participant (0xffff) tried to authorize the participant: (0x2222)
10:28:19.909 [main] DEBUG org.eclipse.winery.accountability.model.authorization.AuthorizationTree - Participant (0x1111) tried to re-authorize the participant: (0x3333) which was already authorized before!
10:28:19.909 [main] DEBUG org.eclipse.winery.accountability.model.authorization.AuthorizationTree - Unauthorized participant (0xffff) tried to authorize the participant: (0xeeee)
10:28:19.909 [main] DEBUG org.eclipse.winery.accountability.model.authorization.AuthorizationTree - Unauthorized participant (0xffff) tried to authorize the participant: (0x2222)
10:28:19.910 [main] DEBUG org.eclipse.winery.accountability.model.authorization.AuthorizationTree - Participant (0x1111) tried to re-authorize the participant: (0x3333) which was already authorized before!
10:28:19.910 [main] DEBUG org.eclipse.winery.accountability.model.authorization.AuthorizationTree - Unauthorized participant (0xffff) tried to authorize the participant: (0xeeee)
10:28:19.910 [main] DEBUG org.eclipse.winery.accountability.model.authorization.AuthorizationTree - Unauthorized participant (0xffff) tried to authorize the participant: (0x2222)
10:28:19.912 [main] DEBUG org.eclipse.winery.accountability.model.authorization.AuthorizationTree - Participant (0x1111) tried to re-authorize the participant: (0x3333) which was already authorized before!
10:28:19.912 [main] DEBUG org.eclipse.winery.accountability.model.authorization.AuthorizationTree - Unauthorized participant (0xffff) tried to authorize the participant: (0xeeee)
10:28:19.912 [main] DEBUG org.eclipse.winery.accountability.model.authorization.AuthorizationTree - Unauthorized participant (0xffff) tried to authorize the participant: (0x2222)
10:28:19.913 [main] DEBUG org.eclipse.winery.accountability.model.authorization.AuthorizationTree - Participant (0x1111) tried to re-authorize the participant: (0x3333) which was already authorized before!
10:28:19.913 [main] DEBUG org.eclipse.winery.accountability.model.authorization.AuthorizationTree - Unauthorized participant (0xffff) tried to authorize the participant: (0xeeee)
10:28:19.913 [main] DEBUG org.eclipse.winery.accountability.model.authorization.AuthorizationTree - Unauthorized participant (0xffff) tried to authorize the participant: (0x2222)
10:28:19.915 [main] DEBUG org.eclipse.winery.accountability.model.authorization.AuthorizationTree - Participant (0x1111) tried to re-authorize the participant: (0x3333) which was already authorized before!
10:28:19.915 [main] DEBUG org.eclipse.winery.accountability.model.authorization.AuthorizationTree - Unauthorized participant (0xffff) tried to authorize the participant: (0xeeee)
10:28:19.915 [main] DEBUG org.eclipse.winery.accountability.model.authorization.AuthorizationTree - Unauthorized participant (0xffff) tried to authorize the participant: (0x2222)
[INFO] Tests run: 8, Failures: 0, Errors: 0, Skipped: 0, Time elapsed: 0.03 s - in org.eclipse.winery.accountability.model.authorization.AuthorizationTreeTest
[INFO] Running org.eclipse.winery.accountability.AccountabilityManagerImplTest
10:28:19.941 [main] DEBUG org.eclipse.winery.accountability.model.authorization.AuthorizationTree - Participant (0x11111) tried to re-authorize the participant: (0x11111) which was already authorized before!
10:28:20.005 [main] INFO org.eclipse.winery.accountability.AccountabilityManagerImpl - Start validating files...
10:28:20.005 [main] INFO org.eclipse.winery.accountability.AccountabilityManagerImpl - Validating "myTestFile.tosca"
10:28:20.007 [main] INFO org.eclipse.winery.accountability.AccountabilityManagerImpl - "myTestFile.tosca" VERIFIED
10:28:20.007 [main] INFO org.eclipse.winery.accountability.AccountabilityManagerImpl - Validating "myTestFile2.tosca"
10:28:20.008 [main] INFO org.eclipse.winery.accountability.AccountabilityManagerImpl - "myTestFile2.tosca" VERIFIED
10:28:20.008 [main] INFO org.eclipse.winery.accountability.AccountabilityManagerImpl - Completed files validation.
10:28:20.010 [main] INFO org.eclipse.winery.accountability.AccountabilityManagerImpl - Start validating files...
10:28:20.010 [main] INFO org.eclipse.winery.accountability.AccountabilityManagerImpl - Validating "myTestFile.tosca"
10:28:20.011 [main] INFO org.eclipse.winery.accountability.AccountabilityManagerImpl - "myTestFile.tosca" VERIFIED
10:28:20.011 [main] INFO org.eclipse.winery.accountability.AccountabilityManagerImpl - Validating "myTestFile2.tosca"
10:28:20.012 [main] INFO org.eclipse.winery.accountability.AccountabilityManagerImpl - "myTestFile2.tosca" INVALID
10:28:20.012 [main] INFO org.eclipse.winery.accountability.AccountabilityManagerImpl - Completed files validation.
10:28:20.014 [main] INFO org.eclipse.winery.accountability.AccountabilityManagerImpl - Start validating files...
10:28:20.014 [main] INFO org.eclipse.winery.accountability.AccountabilityManagerImpl - Validating "myTestFile.tosca"
10:28:20.015 [main] INFO org.eclipse.winery.accountability.AccountabilityManagerImpl - "myTestFile.tosca" VERIFIED
10:28:20.015 [main] INFO org.eclipse.winery.accountability.AccountabilityManagerImpl - Validating "myTestFile2.tosca"
10:28:20.016 [main] INFO org.eclipse.winery.accountability.AccountabilityManagerImpl - "myTestFile2.tosca" NO_HASH_AVAILABLE
10:28:20.016 [main] INFO org.eclipse.winery.accountability.AccountabilityManagerImpl - Completed files validation.
10:28:20.018 [main] INFO org.eclipse.winery.accountability.AccountabilityManagerImpl - Start validating files...
10:28:20.018 [main] INFO org.eclipse.winery.accountability.AccountabilityManagerImpl - Validating "myTestFile.tosca"
10:28:20.019 [main] INFO org.eclipse.winery.accountability.AccountabilityManagerImpl - "myTestFile.tosca" VERIFIED
10:28:20.019 [main] INFO org.eclipse.winery.accountability.AccountabilityManagerImpl - Validating "myTestFile2.tosca"
10:28:20.020 [main] INFO org.eclipse.winery.accountability.AccountabilityManagerImpl - "myTestFile2.tosca" ID_NOT_FOUND
10:28:20.020 [main] INFO org.eclipse.winery.accountability.AccountabilityManagerImpl - Completed files validation.
10:28:20.384 [main] DEBUG org.eclipse.winery.accountability.model.authorization.AuthorizationTree - Participant (0x11111) tried to re-authorize the participant: (0x11111) which was already authorized before!
10:28:20.387 [main] INFO org.eclipse.winery.accountability.AccountabilityManagerImpl - Start validating manifest file...
10:28:20.388 [main] INFO org.eclipse.winery.accountability.AccountabilityManagerImpl - Manifest verification resulted in VERIFIED
10:28:20.390 [main] INFO org.eclipse.winery.accountability.AccountabilityManagerImpl - Start validating manifest file...
10:28:20.391 [main] INFO org.eclipse.winery.accountability.AccountabilityManagerImpl - Manifest verification resulted in INVALID
10:28:20.393 [main] INFO org.eclipse.winery.accountability.AccountabilityManagerImpl - Start validating manifest file...
10:28:20.393 [main] INFO org.eclipse.winery.accountability.AccountabilityManagerImpl - Manifest verification resulted in NO_MANIFEST_FILE_IN_PROVENANCE_LAYER
10:28:20.394 [main] INFO org.eclipse.winery.accountability.AccountabilityManagerImpl - Start validating manifest file...
10:28:20.396 [main] INFO org.eclipse.winery.accountability.AccountabilityManagerImpl - Manifest verification resulted in UNAUTHORIZED
10:28:20.397 [main] DEBUG org.eclipse.winery.accountability.model.authorization.AuthorizationTree - Participant (0x11111) tried to re-authorize the participant: (0x11111) which was already authorized before!
10:28:20.400 [main] INFO org.eclipse.winery.accountability.AccountabilityManagerImpl - Start validating...
10:28:20.400 [main] INFO org.eclipse.winery.accountability.AccountabilityManagerImpl - Start validating manifest file...
10:28:20.401 [main] INFO org.eclipse.winery.accountability.AccountabilityManagerImpl - Manifest verification resulted in VERIFIED
10:28:20.401 [main] INFO org.eclipse.winery.accountability.AccountabilityManagerImpl - Start validating files...
10:28:20.401 [main] INFO org.eclipse.winery.accountability.AccountabilityManagerImpl - Validating "myTestFile.tosca"
10:28:20.402 [main] INFO org.eclipse.winery.accountability.AccountabilityManagerImpl - "myTestFile.tosca" VERIFIED
10:28:20.402 [main] INFO org.eclipse.winery.accountability.AccountabilityManagerImpl - Validating "myTestFile2.tosca"
10:28:20.403 [main] INFO org.eclipse.winery.accountability.AccountabilityManagerImpl - "myTestFile2.tosca" VERIFIED
10:28:20.403 [main] INFO org.eclipse.winery.accountability.AccountabilityManagerImpl - Completed files validation.
10:28:20.403 [main] INFO org.eclipse.winery.accountability.AccountabilityManagerImpl - Completed validation.
[INFO] Tests run: 16, Failures: 0, Errors: 0, Skipped: 0, Time elapsed: 0.485 s - in org.eclipse.winery.accountability.AccountabilityManagerImplTest
[INFO] 
[INFO] Results:
[INFO] 
[ERROR] Errors: 
[ERROR]   AccountabilityManagerImplIntegrationTest.setUp:79 » Runtime java.net.ConnectEx...
[ERROR]   AccountabilityManagerImplIntegrationTest.setUp:79 » Runtime java.net.ConnectEx...
[ERROR]   AccountabilityManagerImplIntegrationTest.setUp:79 » Runtime java.net.ConnectEx...
[INFO] 
[ERROR] Tests run: 28, Failures: 0, Errors: 3, Skipped: 0
[INFO] 
[ERROR] There are test failures.

Please refer to /home/hudson/genie.winery/.jenkins/jobs/winery/workspace/org.eclipse.winery.accountability/target/surefire-reports for the individual test results.
Please refer to dump files (if any exist) [date]-jvmRun[N].dump, [date].dumpstream and [date]-jvmRun[N].dumpstream.
[JENKINS] Recording test results
[INFO] 
[INFO] --- jacoco-maven-plugin:0.7.9:report (report) @ org.eclipse.winery.accountability ---
[INFO] Loading execution data file /home/hudson/genie.winery/.jenkins/jobs/winery/workspace/org.eclipse.winery.accountability/target/jacoco.exec
[INFO] Analyzed bundle 'org.eclipse.winery.accountability' with 49 classes
[INFO] 
[INFO] --- maven-jar-plugin:2.4:jar (default-jar) @ org.eclipse.winery.accountability ---
[INFO] Building jar: /home/hudson/genie.winery/.jenkins/jobs/winery/workspace/org.eclipse.winery.accountability/target/org.eclipse.winery.accountability-2.0.0-SNAPSHOT.jar