UnstableConsole Output

Started calculate disk usage of build
Finished Calculation of disk usage of build in 0 seconds
Started calculate disk usage of workspace
Finished Calculation of disk usage of workspace in 0 seconds
[INFO] 
[INFO] --------< org.eclipse.winery:org.eclipse.winery.accountability >--------
[INFO] Building org.eclipse.winery.accountability 2.0.0-SNAPSHOT         [8/25]
[INFO] --------------------------------[ jar ]---------------------------------
[INFO] 
[INFO] --- maven-checkstyle-plugin:2.17:check (checkstyle) @ org.eclipse.winery.accountability ---
[INFO] 
[INFO] --- jacoco-maven-plugin:0.7.9:prepare-agent (default) @ org.eclipse.winery.accountability ---
[INFO] argLine set to -javaagent:/opt/public/hipp/homes/genie.winery/.m2/repository/org/jacoco/org.jacoco.agent/0.7.9/org.jacoco.agent-0.7.9-runtime.jar=destfile=/home/hudson/genie.winery/.jenkins/jobs/winery/workspace/org.eclipse.winery.accountability/target/jacoco.exec
[INFO] 
[INFO] --- web3j-maven-plugin:4.2.0:generate-sources (generate-sources) @ org.eclipse.winery.accountability ---
[INFO] Adding to process 'authorization.sol'
[INFO] Adding to process 'provenance.sol'
[INFO] Solidity Compiler not installed.
[INFO] Solidity Compiler from library is used
[WARNING] Issue with travis [canonicalSolCPath=/tmp/genie.winery/solc/solc,commandParts=/tmp/genie.winery/solc/solc,--optimize,--combined-json,abi,bin,interface,metadata,--allow-paths,/home/hudson/genie.winery/.jenkins/jobs/winery/workspace/org.eclipse.winery.accountability/src/main/solidity,/home/hudson/genie.winery/.jenkins/jobs/winery/workspace/org.eclipse.winery.accountability/src/main/solidity/authorization.sol,/home/hudson/genie.winery/.jenkins/jobs/winery/workspace/org.eclipse.winery.accountability/src/main/solidity/provenance.sol],getWorkingDirectory=/tmp/genie.winery/solc]
[WARNING] /tmp/genie.winery/solc/solc
[INFO] 	Built Class for contract 'authorization'
[INFO] 	Built Class for contract 'Provenance'
[INFO] 
[INFO] --- build-helper-maven-plugin:3.0.0:add-source (add-source) @ org.eclipse.winery.accountability ---
[INFO] Source directory: /home/hudson/genie.winery/.jenkins/jobs/winery/workspace/org.eclipse.winery.accountability/src/gen/java added.
[INFO] 
[INFO] --- maven-resources-plugin:2.6:resources (default-resources) @ org.eclipse.winery.accountability ---
[INFO] Using 'UTF-8' encoding to copy filtered resources.
[INFO] skip non existing resourceDirectory /home/hudson/genie.winery/.jenkins/jobs/winery/workspace/org.eclipse.winery.accountability/src/main/resources
[INFO] 
[INFO] --- maven-compiler-plugin:3.7.0:compile (default-compile) @ org.eclipse.winery.accountability ---
[INFO] Changes detected - recompiling the module!
[INFO] Compiling 31 source files to /home/hudson/genie.winery/.jenkins/jobs/winery/workspace/org.eclipse.winery.accountability/target/classes
[INFO] /home/hudson/genie.winery/.jenkins/jobs/winery/workspace/org.eclipse.winery.accountability/src/main/java/org/eclipse/winery/accountability/blockchain/ethereum/SmartContractProvider.java: /home/hudson/genie.winery/.jenkins/jobs/winery/workspace/org.eclipse.winery.accountability/src/main/java/org/eclipse/winery/accountability/blockchain/ethereum/SmartContractProvider.java uses or overrides a deprecated API.
[INFO] /home/hudson/genie.winery/.jenkins/jobs/winery/workspace/org.eclipse.winery.accountability/src/main/java/org/eclipse/winery/accountability/blockchain/ethereum/SmartContractProvider.java: Recompile with -Xlint:deprecation for details.
[INFO] 
[INFO] --- maven-resources-plugin:2.6:testResources (default-testResources) @ org.eclipse.winery.accountability ---
[INFO] Using 'UTF-8' encoding to copy filtered resources.
[INFO] Copying 4 resources
[INFO] 
[INFO] --- maven-compiler-plugin:3.7.0:testCompile (default-testCompile) @ org.eclipse.winery.accountability ---
[INFO] Changes detected - recompiling the module!
[INFO] Compiling 6 source files to /home/hudson/genie.winery/.jenkins/jobs/winery/workspace/org.eclipse.winery.accountability/target/test-classes
[INFO] 
[INFO] --- maven-surefire-plugin:2.21.0:test (default-test) @ org.eclipse.winery.accountability ---
[INFO] 
[INFO] -------------------------------------------------------
[INFO]  T E S T S
[INFO] -------------------------------------------------------
[INFO] Running org.eclipse.winery.accountability.storage.swarm.SwarmProviderTest
04:56:41.096 [pool-1-thread-1] DEBUG org.eclipse.winery.accountability.storage.swarm.SwarmProviderTest - retrieved hash is: 66b8d05e26fba2acff1792037fb5cc1a14742e815e2cdf4fd89d4b7f7cb4671b
04:57:41.345 [pool-1-thread-2] DEBUG org.eclipse.winery.accountability.storage.swarm.SwarmProviderTest - retrieved msg is: This a string intended for testing!
[INFO] Tests run: 1, Failures: 0, Errors: 0, Skipped: 0, Time elapsed: 61.374 s - in org.eclipse.winery.accountability.storage.swarm.SwarmProviderTest
[INFO] Running org.eclipse.winery.accountability.AccountabilityManagerImplIntegrationTest
04:58:05.113 [main] DEBUG org.web3j.protocol.http.HttpService - --> POST http://127.0.0.1:8545/ http/1.1
04:58:05.113 [main] DEBUG org.web3j.protocol.http.HttpService - Content-Type: application/json; charset=utf-8
04:58:05.114 [main] DEBUG org.web3j.protocol.http.HttpService - Content-Length: 125
04:58:05.115 [main] DEBUG org.web3j.protocol.http.HttpService - 
04:58:05.115 [main] DEBUG org.web3j.protocol.http.HttpService - {"jsonrpc":"2.0","method":"eth_getTransactionCount","params":["0x44fb31577305b7b6ed8ff05ee7c0f07b3cc99306","pending"],"id":0}
04:58:05.115 [main] DEBUG org.web3j.protocol.http.HttpService - --> END POST (125-byte body)
04:58:05.133 [main] DEBUG org.web3j.protocol.http.HttpService - <-- HTTP FAILED: java.net.ConnectException: Failed to connect to /127.0.0.1:8545
04:58:06.738 [main] DEBUG org.web3j.protocol.http.HttpService - --> POST http://127.0.0.1:8545/ http/1.1
04:58:06.738 [main] DEBUG org.web3j.protocol.http.HttpService - Content-Type: application/json; charset=utf-8
04:58:06.738 [main] DEBUG org.web3j.protocol.http.HttpService - Content-Length: 125
04:58:06.738 [main] DEBUG org.web3j.protocol.http.HttpService - 
04:58:06.738 [main] DEBUG org.web3j.protocol.http.HttpService - {"jsonrpc":"2.0","method":"eth_getTransactionCount","params":["0x44fb31577305b7b6ed8ff05ee7c0f07b3cc99306","pending"],"id":1}
04:58:06.738 [main] DEBUG org.web3j.protocol.http.HttpService - --> END POST (125-byte body)
04:58:06.739 [main] DEBUG org.web3j.protocol.http.HttpService - <-- HTTP FAILED: java.net.ConnectException: Failed to connect to /127.0.0.1:8545
04:58:08.509 [main] DEBUG org.web3j.protocol.http.HttpService - --> POST http://127.0.0.1:8545/ http/1.1
04:58:08.509 [main] DEBUG org.web3j.protocol.http.HttpService - Content-Type: application/json; charset=utf-8
04:58:08.509 [main] DEBUG org.web3j.protocol.http.HttpService - Content-Length: 125
04:58:08.509 [main] DEBUG org.web3j.protocol.http.HttpService - 
04:58:08.509 [main] DEBUG org.web3j.protocol.http.HttpService - {"jsonrpc":"2.0","method":"eth_getTransactionCount","params":["0x44fb31577305b7b6ed8ff05ee7c0f07b3cc99306","pending"],"id":2}
04:58:08.509 [main] DEBUG org.web3j.protocol.http.HttpService - --> END POST (125-byte body)
04:58:08.510 [main] DEBUG org.web3j.protocol.http.HttpService - <-- HTTP FAILED: java.net.ConnectException: Failed to connect to /127.0.0.1:8545
[ERROR] Tests run: 3, Failures: 0, Errors: 3, Skipped: 0, Time elapsed: 26.294 s <<< FAILURE! - in org.eclipse.winery.accountability.AccountabilityManagerImplIntegrationTest
[ERROR] getHistoryWithoutAuthenticationData  Time elapsed: 2.924 s  <<< ERROR!
java.lang.RuntimeException: java.net.ConnectException: Failed to connect to /127.0.0.1:8545
	at org.eclipse.winery.accountability.AccountabilityManagerImplIntegrationTest.setUp(AccountabilityManagerImplIntegrationTest.java:79)
Caused by: java.net.ConnectException: Failed to connect to /127.0.0.1:8545
	at org.eclipse.winery.accountability.AccountabilityManagerImplIntegrationTest.setUp(AccountabilityManagerImplIntegrationTest.java:79)
Caused by: java.net.ConnectException: Connection refused (Connection refused)
	at org.eclipse.winery.accountability.AccountabilityManagerImplIntegrationTest.setUp(AccountabilityManagerImplIntegrationTest.java:79)

[ERROR] addParticipant  Time elapsed: 1.591 s  <<< ERROR!
java.lang.RuntimeException: java.net.ConnectException: Failed to connect to /127.0.0.1:8545
	at org.eclipse.winery.accountability.AccountabilityManagerImplIntegrationTest.setUp(AccountabilityManagerImplIntegrationTest.java:79)
Caused by: java.net.ConnectException: Failed to connect to /127.0.0.1:8545
	at org.eclipse.winery.accountability.AccountabilityManagerImplIntegrationTest.setUp(AccountabilityManagerImplIntegrationTest.java:79)
Caused by: java.net.ConnectException: Connection refused (Connection refused)
	at org.eclipse.winery.accountability.AccountabilityManagerImplIntegrationTest.setUp(AccountabilityManagerImplIntegrationTest.java:79)

[ERROR] getHistory  Time elapsed: 1.771 s  <<< ERROR!
java.lang.RuntimeException: java.net.ConnectException: Failed to connect to /127.0.0.1:8545
	at org.eclipse.winery.accountability.AccountabilityManagerImplIntegrationTest.setUp(AccountabilityManagerImplIntegrationTest.java:79)
Caused by: java.net.ConnectException: Failed to connect to /127.0.0.1:8545
	at org.eclipse.winery.accountability.AccountabilityManagerImplIntegrationTest.setUp(AccountabilityManagerImplIntegrationTest.java:79)
Caused by: java.net.ConnectException: Connection refused (Connection refused)
	at org.eclipse.winery.accountability.AccountabilityManagerImplIntegrationTest.setUp(AccountabilityManagerImplIntegrationTest.java:79)

[INFO] Running org.eclipse.winery.accountability.model.authorization.AuthorizationTreeTest
04:58:08.521 [main] DEBUG org.eclipse.winery.accountability.model.authorization.AuthorizationTree - Participant (0x1111) tried to re-authorize the participant: (0x3333) which was already authorized before!
04:58:08.521 [main] DEBUG org.eclipse.winery.accountability.model.authorization.AuthorizationTree - Unauthorized participant (0xffff) tried to authorize the participant: (0xeeee)
04:58:08.521 [main] DEBUG org.eclipse.winery.accountability.model.authorization.AuthorizationTree - Unauthorized participant (0xffff) tried to authorize the participant: (0x2222)
04:58:08.548 [main] DEBUG org.eclipse.winery.accountability.model.authorization.AuthorizationTree - Participant (0x1111) tried to re-authorize the participant: (0x3333) which was already authorized before!
04:58:08.548 [main] DEBUG org.eclipse.winery.accountability.model.authorization.AuthorizationTree - Unauthorized participant (0xffff) tried to authorize the participant: (0xeeee)
04:58:08.548 [main] DEBUG org.eclipse.winery.accountability.model.authorization.AuthorizationTree - Unauthorized participant (0xffff) tried to authorize the participant: (0x2222)
04:58:08.549 [main] ERROR org.eclipse.winery.accountability.model.authorization.AuthorizationTree - Failed to build tree-of-trust: Input is empty!
04:58:08.550 [main] DEBUG org.eclipse.winery.accountability.model.authorization.AuthorizationTree - Participant (0x1111) tried to re-authorize the participant: (0x3333) which was already authorized before!
04:58:08.550 [main] DEBUG org.eclipse.winery.accountability.model.authorization.AuthorizationTree - Unauthorized participant (0xffff) tried to authorize the participant: (0xeeee)
04:58:08.550 [main] DEBUG org.eclipse.winery.accountability.model.authorization.AuthorizationTree - Unauthorized participant (0xffff) tried to authorize the participant: (0x2222)
04:58:08.557 [main] DEBUG org.eclipse.winery.accountability.model.authorization.AuthorizationTree - Participant (0x1111) tried to re-authorize the participant: (0x3333) which was already authorized before!
04:58:08.558 [main] DEBUG org.eclipse.winery.accountability.model.authorization.AuthorizationTree - Unauthorized participant (0xffff) tried to authorize the participant: (0xeeee)
04:58:08.558 [main] DEBUG org.eclipse.winery.accountability.model.authorization.AuthorizationTree - Unauthorized participant (0xffff) tried to authorize the participant: (0x2222)
04:58:08.559 [main] DEBUG org.eclipse.winery.accountability.model.authorization.AuthorizationTree - Participant (0x1111) tried to re-authorize the participant: (0x3333) which was already authorized before!
04:58:08.559 [main] DEBUG org.eclipse.winery.accountability.model.authorization.AuthorizationTree - Unauthorized participant (0xffff) tried to authorize the participant: (0xeeee)
04:58:08.559 [main] DEBUG org.eclipse.winery.accountability.model.authorization.AuthorizationTree - Unauthorized participant (0xffff) tried to authorize the participant: (0x2222)
04:58:08.561 [main] DEBUG org.eclipse.winery.accountability.model.authorization.AuthorizationTree - Participant (0x1111) tried to re-authorize the participant: (0x3333) which was already authorized before!
04:58:08.561 [main] DEBUG org.eclipse.winery.accountability.model.authorization.AuthorizationTree - Unauthorized participant (0xffff) tried to authorize the participant: (0xeeee)
04:58:08.561 [main] DEBUG org.eclipse.winery.accountability.model.authorization.AuthorizationTree - Unauthorized participant (0xffff) tried to authorize the participant: (0x2222)
04:58:08.563 [main] DEBUG org.eclipse.winery.accountability.model.authorization.AuthorizationTree - Participant (0x1111) tried to re-authorize the participant: (0x3333) which was already authorized before!
04:58:08.563 [main] DEBUG org.eclipse.winery.accountability.model.authorization.AuthorizationTree - Unauthorized participant (0xffff) tried to authorize the participant: (0xeeee)
04:58:08.563 [main] DEBUG org.eclipse.winery.accountability.model.authorization.AuthorizationTree - Unauthorized participant (0xffff) tried to authorize the participant: (0x2222)
04:58:08.565 [main] DEBUG org.eclipse.winery.accountability.model.authorization.AuthorizationTree - Participant (0x1111) tried to re-authorize the participant: (0x3333) which was already authorized before!
04:58:08.565 [main] DEBUG org.eclipse.winery.accountability.model.authorization.AuthorizationTree - Unauthorized participant (0xffff) tried to authorize the participant: (0xeeee)
04:58:08.565 [main] DEBUG org.eclipse.winery.accountability.model.authorization.AuthorizationTree - Unauthorized participant (0xffff) tried to authorize the participant: (0x2222)
[INFO] Tests run: 8, Failures: 0, Errors: 0, Skipped: 0, Time elapsed: 0.005 s - in org.eclipse.winery.accountability.model.authorization.AuthorizationTreeTest
[INFO] Running org.eclipse.winery.accountability.AccountabilityManagerImplTest
04:58:08.594 [main] DEBUG org.eclipse.winery.accountability.model.authorization.AuthorizationTree - Participant (0x11111) tried to re-authorize the participant: (0x11111) which was already authorized before!
04:58:08.660 [main] INFO org.eclipse.winery.accountability.AccountabilityManagerImpl - Start validating files...
04:58:08.661 [main] INFO org.eclipse.winery.accountability.AccountabilityManagerImpl - Validating "myTestFile.tosca"
04:58:08.663 [main] INFO org.eclipse.winery.accountability.AccountabilityManagerImpl - "myTestFile.tosca" VERIFIED
04:58:08.663 [main] INFO org.eclipse.winery.accountability.AccountabilityManagerImpl - Validating "myTestFile2.tosca"
04:58:08.663 [main] INFO org.eclipse.winery.accountability.AccountabilityManagerImpl - "myTestFile2.tosca" VERIFIED
04:58:08.663 [main] INFO org.eclipse.winery.accountability.AccountabilityManagerImpl - Completed files validation.
04:58:08.666 [main] INFO org.eclipse.winery.accountability.AccountabilityManagerImpl - Start validating files...
04:58:08.666 [main] INFO org.eclipse.winery.accountability.AccountabilityManagerImpl - Validating "myTestFile.tosca"
04:58:08.666 [main] INFO org.eclipse.winery.accountability.AccountabilityManagerImpl - "myTestFile.tosca" VERIFIED
04:58:08.667 [main] INFO org.eclipse.winery.accountability.AccountabilityManagerImpl - Validating "myTestFile2.tosca"
04:58:08.667 [main] INFO org.eclipse.winery.accountability.AccountabilityManagerImpl - "myTestFile2.tosca" INVALID
04:58:08.667 [main] INFO org.eclipse.winery.accountability.AccountabilityManagerImpl - Completed files validation.
04:58:08.669 [main] INFO org.eclipse.winery.accountability.AccountabilityManagerImpl - Start validating files...
04:58:08.669 [main] INFO org.eclipse.winery.accountability.AccountabilityManagerImpl - Validating "myTestFile.tosca"
04:58:08.670 [main] INFO org.eclipse.winery.accountability.AccountabilityManagerImpl - "myTestFile.tosca" VERIFIED
04:58:08.670 [main] INFO org.eclipse.winery.accountability.AccountabilityManagerImpl - Validating "myTestFile2.tosca"
04:58:08.670 [main] INFO org.eclipse.winery.accountability.AccountabilityManagerImpl - "myTestFile2.tosca" NO_HASH_AVAILABLE
04:58:08.670 [main] INFO org.eclipse.winery.accountability.AccountabilityManagerImpl - Completed files validation.
04:58:08.672 [main] INFO org.eclipse.winery.accountability.AccountabilityManagerImpl - Start validating files...
04:58:08.672 [main] INFO org.eclipse.winery.accountability.AccountabilityManagerImpl - Validating "myTestFile.tosca"
04:58:08.673 [main] INFO org.eclipse.winery.accountability.AccountabilityManagerImpl - "myTestFile.tosca" VERIFIED
04:58:08.673 [main] INFO org.eclipse.winery.accountability.AccountabilityManagerImpl - Validating "myTestFile2.tosca"
04:58:08.674 [main] INFO org.eclipse.winery.accountability.AccountabilityManagerImpl - "myTestFile2.tosca" ID_NOT_FOUND
04:58:08.674 [main] INFO org.eclipse.winery.accountability.AccountabilityManagerImpl - Completed files validation.
04:58:09.001 [main] DEBUG org.eclipse.winery.accountability.model.authorization.AuthorizationTree - Participant (0x11111) tried to re-authorize the participant: (0x11111) which was already authorized before!
04:58:09.004 [main] INFO org.eclipse.winery.accountability.AccountabilityManagerImpl - Start validating manifest file...
04:58:09.004 [main] INFO org.eclipse.winery.accountability.AccountabilityManagerImpl - Manifest verification resulted in VERIFIED
04:58:09.006 [main] INFO org.eclipse.winery.accountability.AccountabilityManagerImpl - Start validating manifest file...
04:58:09.007 [main] INFO org.eclipse.winery.accountability.AccountabilityManagerImpl - Manifest verification resulted in INVALID
04:58:09.009 [main] INFO org.eclipse.winery.accountability.AccountabilityManagerImpl - Start validating manifest file...
04:58:09.009 [main] INFO org.eclipse.winery.accountability.AccountabilityManagerImpl - Manifest verification resulted in NO_MANIFEST_FILE_IN_PROVENANCE_LAYER
04:58:09.010 [main] INFO org.eclipse.winery.accountability.AccountabilityManagerImpl - Start validating manifest file...
04:58:09.011 [main] INFO org.eclipse.winery.accountability.AccountabilityManagerImpl - Manifest verification resulted in UNAUTHORIZED
04:58:09.013 [main] DEBUG org.eclipse.winery.accountability.model.authorization.AuthorizationTree - Participant (0x11111) tried to re-authorize the participant: (0x11111) which was already authorized before!
04:58:09.015 [main] INFO org.eclipse.winery.accountability.AccountabilityManagerImpl - Start validating...
04:58:09.016 [main] INFO org.eclipse.winery.accountability.AccountabilityManagerImpl - Start validating manifest file...
04:58:09.016 [main] INFO org.eclipse.winery.accountability.AccountabilityManagerImpl - Manifest verification resulted in VERIFIED
04:58:09.016 [main] INFO org.eclipse.winery.accountability.AccountabilityManagerImpl - Start validating files...
04:58:09.016 [main] INFO org.eclipse.winery.accountability.AccountabilityManagerImpl - Validating "myTestFile.tosca"
04:58:09.017 [main] INFO org.eclipse.winery.accountability.AccountabilityManagerImpl - "myTestFile.tosca" VERIFIED
04:58:09.017 [main] INFO org.eclipse.winery.accountability.AccountabilityManagerImpl - Validating "myTestFile2.tosca"
04:58:09.018 [main] INFO org.eclipse.winery.accountability.AccountabilityManagerImpl - "myTestFile2.tosca" VERIFIED
04:58:09.018 [main] INFO org.eclipse.winery.accountability.AccountabilityManagerImpl - Completed files validation.
04:58:09.018 [main] INFO org.eclipse.winery.accountability.AccountabilityManagerImpl - Completed validation.
[INFO] Tests run: 16, Failures: 0, Errors: 0, Skipped: 0, Time elapsed: 0.446 s - in org.eclipse.winery.accountability.AccountabilityManagerImplTest
[INFO] 
[INFO] Results:
[INFO] 
[ERROR] Errors: 
[ERROR]   AccountabilityManagerImplIntegrationTest.setUp:79 » Runtime java.net.ConnectEx...
[ERROR]   AccountabilityManagerImplIntegrationTest.setUp:79 » Runtime java.net.ConnectEx...
[ERROR]   AccountabilityManagerImplIntegrationTest.setUp:79 » Runtime java.net.ConnectEx...
[INFO] 
[ERROR] Tests run: 28, Failures: 0, Errors: 3, Skipped: 0
[INFO] 
[ERROR] There are test failures.

Please refer to /home/hudson/genie.winery/.jenkins/jobs/winery/workspace/org.eclipse.winery.accountability/target/surefire-reports for the individual test results.
Please refer to dump files (if any exist) [date]-jvmRun[N].dump, [date].dumpstream and [date]-jvmRun[N].dumpstream.
[JENKINS] Recording test results
[INFO] 
[INFO] --- jacoco-maven-plugin:0.7.9:report (report) @ org.eclipse.winery.accountability ---
[INFO] Loading execution data file /home/hudson/genie.winery/.jenkins/jobs/winery/workspace/org.eclipse.winery.accountability/target/jacoco.exec
[INFO] Analyzed bundle 'org.eclipse.winery.accountability' with 49 classes
[INFO] 
[INFO] --- maven-jar-plugin:2.4:jar (default-jar) @ org.eclipse.winery.accountability ---
[INFO] Building jar: /home/hudson/genie.winery/.jenkins/jobs/winery/workspace/org.eclipse.winery.accountability/target/org.eclipse.winery.accountability-2.0.0-SNAPSHOT.jar