SuccessConsole Output

[INFO] 
[INFO] ----------< org.eclipse.winery:org.eclipse.winery.repository >----------
[INFO] Building org.eclipse.winery.repository 2.0.0-SNAPSHOT             [9/23]
[INFO] --------------------------------[ jar ]---------------------------------
[INFO] 
[INFO] --- maven-checkstyle-plugin:2.17:check (checkstyle) @ org.eclipse.winery.repository ---
[INFO] 
[INFO] --- build-helper-maven-plugin:1.8:add-source (add-source) @ org.eclipse.winery.repository ---
[INFO] Source directory: /home/jenkins/agent/workspace/winery-pr/org.eclipse.winery.repository/target/generated-sources/java added.
[INFO] 
[INFO] --- maven-resources-plugin:2.6:resources (default-resources) @ org.eclipse.winery.repository ---
[INFO] Using 'UTF-8' encoding to copy filtered resources.
[INFO] Copying 1 resource
[INFO] Copying 1 resource
[INFO] skip non existing resourceDirectory /home/jenkins/agent/workspace/winery-pr/org.eclipse.winery.repository/src/main/templates
[INFO] 
[INFO] --- maven-compiler-plugin:3.1:compile (default-compile) @ org.eclipse.winery.repository ---
[INFO] Changes detected - recompiling the module!
[INFO] Compiling 188 source files to /home/jenkins/agent/workspace/winery-pr/org.eclipse.winery.repository/target/classes
[WARNING] /home/jenkins/agent/workspace/winery-pr/org.eclipse.winery.repository/src/main/java/org/eclipse/winery/repository/importing/CsarImporter.java: Some input files use or override a deprecated API.
[WARNING] /home/jenkins/agent/workspace/winery-pr/org.eclipse.winery.repository/src/main/java/org/eclipse/winery/repository/importing/CsarImporter.java: Recompile with -Xlint:deprecation for details.
[WARNING] /home/jenkins/agent/workspace/winery-pr/org.eclipse.winery.repository/src/main/java/org/eclipse/winery/repository/backend/IRepository.java: Some input files use unchecked or unsafe operations.
[WARNING] /home/jenkins/agent/workspace/winery-pr/org.eclipse.winery.repository/src/main/java/org/eclipse/winery/repository/backend/IRepository.java: Recompile with -Xlint:unchecked for details.
[INFO] 
[INFO] --- maven-resources-plugin:2.6:testResources (default-testResources) @ org.eclipse.winery.repository ---
[INFO] Using 'UTF-8' encoding to copy filtered resources.
[INFO] Copying 159 resources
[INFO] 
[INFO] --- maven-compiler-plugin:3.1:testCompile (default-testCompile) @ org.eclipse.winery.repository ---
[INFO] Changes detected - recompiling the module!
[INFO] Compiling 32 source files to /home/jenkins/agent/workspace/winery-pr/org.eclipse.winery.repository/target/test-classes
[WARNING] /home/jenkins/agent/workspace/winery-pr/org.eclipse.winery.repository/src/test/java/org/eclipse/winery/repository/backend/filebased/ConfigurationBasedNamespaceManagerTest.java: /home/jenkins/agent/workspace/winery-pr/org.eclipse.winery.repository/src/test/java/org/eclipse/winery/repository/backend/filebased/ConfigurationBasedNamespaceManagerTest.java uses or overrides a deprecated API.
[WARNING] /home/jenkins/agent/workspace/winery-pr/org.eclipse.winery.repository/src/test/java/org/eclipse/winery/repository/backend/filebased/ConfigurationBasedNamespaceManagerTest.java: Recompile with -Xlint:deprecation for details.
[INFO] 
[INFO] --- maven-surefire-plugin:3.0.0-M4:test (default-test) @ org.eclipse.winery.repository ---
[INFO] 
[INFO] -------------------------------------------------------
[INFO]  T E S T S
[INFO] -------------------------------------------------------
[INFO] Running org.eclipse.winery.repository.JAXBSupportTest
[INFO] Tests run: 3, Failures: 0, Errors: 0, Skipped: 0, Time elapsed: 0.834 s - in org.eclipse.winery.repository.JAXBSupportTest
[INFO] Running org.eclipse.winery.repository.backend.IRepositoryTest
07:57:51.557 [Thread-4] WARN  org.eclipse.jgit.util.FS:596 saveToConfig - locking FileBasedConfig[/home/jenkins/.gitconfig] failed after 5 retries
[INFO] Tests run: 2, Failures: 0, Errors: 0, Skipped: 0, Time elapsed: 3.442 s - in org.eclipse.winery.repository.backend.IRepositoryTest
[INFO] Running org.eclipse.winery.repository.backend.BackendUtilsTest
07:57:54.532 [main] INFO  o.e.w.common.json.JacksonProvider:36 <clinit> - Initializing json mapper...
07:57:54.533 [main] INFO  o.e.w.common.json.JacksonProvider:47 <clinit> - Initialized JasonMapper with VisibilityChecker [Visibility: getter=ANY,isGetter=ANY,setter=ANY,creator=ANY,field=PUBLIC_ONLY]
[INFO] Tests run: 9, Failures: 0, Errors: 0, Skipped: 0, Time elapsed: 1.197 s - in org.eclipse.winery.repository.backend.BackendUtilsTest
[INFO] Running org.eclipse.winery.repository.backend.filebased.MultiRepositoryManagerTest
07:57:55.730 [main] INFO  o.e.w.r.b.filebased.MultiRepository:245 readRepositoriesConfig - Found Repositories file
07:58:06.419 [main] INFO  o.e.w.r.b.filebased.MultiRepository:245 readRepositoriesConfig - Found Repositories file
07:58:08.143 [main] INFO  o.e.w.r.b.filebased.MultiRepository:245 readRepositoriesConfig - Found Repositories file
07:58:12.326 [main] INFO  o.e.w.r.b.filebased.MultiRepository:245 readRepositoriesConfig - Found Repositories file
07:58:15.340 [main] INFO  o.e.w.r.b.filebased.MultiRepository:245 readRepositoriesConfig - Found Repositories file
[INFO] Tests run: 5, Failures: 0, Errors: 0, Skipped: 0, Time elapsed: 19.948 s - in org.eclipse.winery.repository.backend.filebased.MultiRepositoryManagerTest
[INFO] Running org.eclipse.winery.repository.backend.filebased.JsonBasedEdmmManagerTest
[INFO] Tests run: 1, Failures: 0, Errors: 0, Skipped: 0, Time elapsed: 0.015 s - in org.eclipse.winery.repository.backend.filebased.JsonBasedEdmmManagerTest
[INFO] Running org.eclipse.winery.repository.backend.filebased.XMLRepositoryTest
[INFO] Tests run: 15, Failures: 0, Errors: 0, Skipped: 0, Time elapsed: 4.938 s - in org.eclipse.winery.repository.backend.filebased.XMLRepositoryTest
[INFO] Running org.eclipse.winery.repository.backend.filebased.management.RepositoryResolverTest
[INFO] Tests run: 7, Failures: 0, Errors: 0, Skipped: 0, Time elapsed: 0.986 s - in org.eclipse.winery.repository.backend.filebased.management.RepositoryResolverTest
[INFO] Running org.eclipse.winery.repository.backend.filebased.ConfigurationBasedNamespaceManagerTest
[INFO] Tests run: 11, Failures: 0, Errors: 0, Skipped: 0, Time elapsed: 0.012 s - in org.eclipse.winery.repository.backend.filebased.ConfigurationBasedNamespaceManagerTest
[INFO] Running org.eclipse.winery.repository.backend.filebased.JsonBasedNamespaceManagerTest
[INFO] Tests run: 1, Failures: 0, Errors: 0, Skipped: 0, Time elapsed: 0.001 s - in org.eclipse.winery.repository.backend.filebased.JsonBasedNamespaceManagerTest
[INFO] Running org.eclipse.winery.repository.backend.xsd.RepositoryBasedXsdImportManagerTest
[INFO] Tests run: 2, Failures: 0, Errors: 0, Skipped: 0, Time elapsed: 1.011 s - in org.eclipse.winery.repository.backend.xsd.RepositoryBasedXsdImportManagerTest
[INFO] Running org.eclipse.winery.repository.backend.consistencycheck.ConsistencyCheckerTest
07:58:25.155 [main] ERROR o.e.winery.common.ids.Namespace:28 <init> - Empty URI has been passed to Namespace constructor.
07:58:25.166 [main] ERROR o.e.w.r.export.ToscaExportUtil:151 processDefinitionsElement - Component instance RelationshipType RelationshipTypeWithoutProperties in namespace  does not exist.
07:58:25.200 [main] ERROR o.e.winery.common.ids.Namespace:28 <init> - Empty URI has been passed to Namespace constructor.
07:58:25.210 [main] ERROR o.e.w.r.export.ToscaExportUtil:151 processDefinitionsElement - Component instance RelationshipType RelationshipTypeWithoutProperties in namespace  does not exist.
07:58:25.227 [main] ERROR o.e.winery.common.ids.Namespace:28 <init> - Empty URI has been passed to Namespace constructor.
07:58:25.235 [main] ERROR o.e.w.r.export.ToscaExportUtil:151 processDefinitionsElement - Component instance RelationshipType RelationshipTypeWithoutProperties in namespace  does not exist.
[INFO] Tests run: 9, Failures: 0, Errors: 0, Skipped: 0, Time elapsed: 11.282 s - in org.eclipse.winery.repository.backend.consistencycheck.ConsistencyCheckerTest
[INFO] Running org.eclipse.winery.repository.targetallocation.criteria.minhosts.MinHostsTest
[INFO] Tests run: 8, Failures: 0, Errors: 0, Skipped: 0, Time elapsed: 3.569 s - in org.eclipse.winery.repository.targetallocation.criteria.minhosts.MinHostsTest
[INFO] Running org.eclipse.winery.repository.targetallocation.criteria.fulfillpolicies.FulfillPoliciesTest
[INFO] Tests run: 5, Failures: 0, Errors: 0, Skipped: 0, Time elapsed: 3.193 s - in org.eclipse.winery.repository.targetallocation.criteria.fulfillpolicies.FulfillPoliciesTest
[INFO] Running org.eclipse.winery.repository.targetallocation.criteria.minexternalconnections.ConnectsToGraphTest
[INFO] Tests run: 2, Failures: 0, Errors: 0, Skipped: 0, Time elapsed: 0.357 s - in org.eclipse.winery.repository.targetallocation.criteria.minexternalconnections.ConnectsToGraphTest
[INFO] Running org.eclipse.winery.repository.targetallocation.criteria.minexternalconnections.KargerMinCutVariationTest
[INFO] Tests run: 2, Failures: 0, Errors: 0, Skipped: 0, Time elapsed: 0.6 s - in org.eclipse.winery.repository.targetallocation.criteria.minexternalconnections.KargerMinCutVariationTest
[INFO] Running org.eclipse.winery.repository.targetallocation.criteria.minexternalconnections.MinExternalConnectionsTest
[INFO] Tests run: 3, Failures: 0, Errors: 0, Skipped: 0, Time elapsed: 2.124 s - in org.eclipse.winery.repository.targetallocation.criteria.minexternalconnections.MinExternalConnectionsTest
[INFO] Running org.eclipse.winery.repository.targetallocation.util.AllocationUtilsTest
[INFO] Tests run: 5, Failures: 0, Errors: 0, Skipped: 0, Time elapsed: 0.948 s - in org.eclipse.winery.repository.targetallocation.util.AllocationUtilsTest
[INFO] Running org.eclipse.winery.repository.targetallocation.util.TopologyMappingsWrapperTest
[INFO] Tests run: 21, Failures: 0, Errors: 0, Skipped: 0, Time elapsed: 4.431 s - in org.eclipse.winery.repository.targetallocation.util.TopologyMappingsWrapperTest
[INFO] Running org.eclipse.winery.repository.export.CsarExporterTest
[WARNING] Tests run: 7, Failures: 0, Errors: 0, Skipped: 3, Time elapsed: 1.705 s - in org.eclipse.winery.repository.export.CsarExporterTest
[INFO] Running org.eclipse.winery.repository.export.EdmmUtilsTest
[INFO] Tests run: 1, Failures: 0, Errors: 0, Skipped: 0, Time elapsed: 0.362 s - in org.eclipse.winery.repository.export.EdmmUtilsTest
[INFO] Running org.eclipse.winery.repository.driverspecificationandinjection.DriverInjectionTest
[INFO] Tests run: 2, Failures: 0, Errors: 0, Skipped: 0, Time elapsed: 0.584 s - in org.eclipse.winery.repository.driverspecificationandinjection.DriverInjectionTest
[INFO] Running org.eclipse.winery.repository.driverspecificationandinjection.DASpecificationTest
[INFO] Tests run: 5, Failures: 0, Errors: 0, Skipped: 0, Time elapsed: 1.758 s - in org.eclipse.winery.repository.driverspecificationandinjection.DASpecificationTest
[INFO] Running org.eclipse.winery.repository.converter.YamlReaderTest
[INFO] Tests run: 19, Failures: 0, Errors: 0, Skipped: 0, Time elapsed: 0.107 s - in org.eclipse.winery.repository.converter.YamlReaderTest
[INFO] Running org.eclipse.winery.repository.ImportUtilsTest
[INFO] Tests run: 1, Failures: 0, Errors: 0, Skipped: 0, Time elapsed: 0.581 s - in org.eclipse.winery.repository.ImportUtilsTest
[INFO] 
[INFO] Results:
[INFO] 
[WARNING] Tests run: 146, Failures: 0, Errors: 0, Skipped: 3
[INFO] 
[JENKINS] Recording test results
[INFO] 
[INFO] --- maven-jar-plugin:2.4:jar (default-jar) @ org.eclipse.winery.repository ---
[INFO] Building jar: /home/jenkins/agent/workspace/winery-pr/org.eclipse.winery.repository/target/winery.jar
[INFO] 
[INFO] >>> maven-source-plugin:3.0.1:jar (attach-sources) > generate-sources @ org.eclipse.winery.repository >>>
[INFO] 
[INFO] --- maven-checkstyle-plugin:2.17:check (checkstyle) @ org.eclipse.winery.repository ---
[INFO] 
[INFO] --- build-helper-maven-plugin:1.8:add-source (add-source) @ org.eclipse.winery.repository ---
[INFO] Source directory: /home/jenkins/agent/workspace/winery-pr/org.eclipse.winery.repository/target/generated-sources/java added.
[WARNING] Failed to getClass for org.apache.maven.plugins.source.SourceJarMojo
[INFO] 
[INFO] <<< maven-source-plugin:3.0.1:jar (attach-sources) < generate-sources @ org.eclipse.winery.repository <<<
[INFO] 
[INFO] 
[INFO] --- maven-source-plugin:3.0.1:jar (attach-sources) @ org.eclipse.winery.repository ---
[INFO] Building jar: /home/jenkins/agent/workspace/winery-pr/org.eclipse.winery.repository/target/winery-sources.jar
[INFO] 
[INFO] --- maven-javadoc-plugin:3.0.1:jar (attach-javadocs) @ org.eclipse.winery.repository ---
[INFO] The goal 'org.apache.maven.plugins:maven-javadoc-plugin:3.0.1:javadoc' has not been previously called for the module: 'org.eclipse.winery:org.eclipse.winery.model.selfservice:jar:2.0.0-SNAPSHOT'. Trying to invoke it...
[WARN] Maven will be executed in interactive mode, but no input stream has been configured for this MavenInvoker instance.
[ERROR] MavenInvocationException: Error when invoking Maven, consult the invoker log file: /home/jenkins/agent/workspace/winery-pr/org.eclipse.winery.repository/target/invoker/maven-javadoc-plugin1099692440.txt
[WARNING] Creating fake javadoc directory to prevent repeated invocations: /home/jenkins/agent/workspace/winery-pr/org.eclipse.winery.model.selfservice/target/apidocs
[INFO] The goal 'org.apache.maven.plugins:maven-javadoc-plugin:3.0.1:javadoc' has not been previously called for the module: 'org.eclipse.winery:org.eclipse.winery.accountability:jar:2.0.0-SNAPSHOT'. Trying to invoke it...
[WARN] Maven will be executed in interactive mode, but no input stream has been configured for this MavenInvoker instance.
[ERROR] MavenInvocationException: Error when invoking Maven, consult the invoker log file: /home/jenkins/agent/workspace/winery-pr/org.eclipse.winery.repository/target/invoker/maven-javadoc-plugin111341584.txt
[WARNING] Creating fake javadoc directory to prevent repeated invocations: /home/jenkins/agent/workspace/winery-pr/org.eclipse.winery.accountability/target/apidocs
[ERROR] Error fetching link: /home/jenkins/agent/workspace/winery-pr/org.eclipse.winery.model.selfservice/target/apidocs/package-list. Ignored it.
[ERROR] Error fetching link: /home/jenkins/agent/workspace/winery-pr/org.eclipse.winery.accountability/target/apidocs/package-list. Ignored it.
[INFO] 
Loading source files for package org.eclipse.winery.repository...
Constructing Javadoc information...
Standard Doclet version 1.8.0_202
Building tree for all the packages and classes...
Generating /home/jenkins/agent/workspace/winery-pr/org.eclipse.winery.repository/target/apidocs/org/eclipse/winery/repository/DateUtils.html...
Generating /home/jenkins/agent/workspace/winery-pr/org.eclipse.winery.repository/target/apidocs/org/eclipse/winery/repository/GitInfo.html...
Generating /home/jenkins/agent/workspace/winery-pr/org.eclipse.winery.repository/target/apidocs/org/eclipse/winery/repository/JAXBSupport.html...
Generating /home/jenkins/agent/workspace/winery-pr/org.eclipse.winery.repository/target/apidocs/org/eclipse/winery/repository/TestWithGitBackedRepository.html...
Generating /home/jenkins/agent/workspace/winery-pr/org.eclipse.winery.repository/target/apidocs/org/eclipse/winery/repository/package-frame.html...
Generating /home/jenkins/agent/workspace/winery-pr/org.eclipse.winery.repository/target/apidocs/org/eclipse/winery/repository/package-summary.html...
Generating /home/jenkins/agent/workspace/winery-pr/org.eclipse.winery.repository/target/apidocs/org/eclipse/winery/repository/package-tree.html...
Generating /home/jenkins/agent/workspace/winery-pr/org.eclipse.winery.repository/target/apidocs/constant-values.html...
Generating /home/jenkins/agent/workspace/winery-pr/org.eclipse.winery.repository/target/apidocs/org/eclipse/winery/repository/class-use/TestWithGitBackedRepository.html...
Generating /home/jenkins/agent/workspace/winery-pr/org.eclipse.winery.repository/target/apidocs/org/eclipse/winery/repository/class-use/GitInfo.html...
Generating /home/jenkins/agent/workspace/winery-pr/org.eclipse.winery.repository/target/apidocs/org/eclipse/winery/repository/class-use/JAXBSupport.html...
Generating /home/jenkins/agent/workspace/winery-pr/org.eclipse.winery.repository/target/apidocs/org/eclipse/winery/repository/class-use/DateUtils.html...
Generating /home/jenkins/agent/workspace/winery-pr/org.eclipse.winery.repository/target/apidocs/org/eclipse/winery/repository/package-use.html...
Building index for all the packages and classes...
Generating /home/jenkins/agent/workspace/winery-pr/org.eclipse.winery.repository/target/apidocs/overview-tree.html...
Generating /home/jenkins/agent/workspace/winery-pr/org.eclipse.winery.repository/target/apidocs/index-all.html...
Generating /home/jenkins/agent/workspace/winery-pr/org.eclipse.winery.repository/target/apidocs/deprecated-list.html...
Building index for all classes...
Generating /home/jenkins/agent/workspace/winery-pr/org.eclipse.winery.repository/target/apidocs/allclasses-frame.html...
Generating /home/jenkins/agent/workspace/winery-pr/org.eclipse.winery.repository/target/apidocs/allclasses-noframe.html...
Generating /home/jenkins/agent/workspace/winery-pr/org.eclipse.winery.repository/target/apidocs/index.html...
Generating /home/jenkins/agent/workspace/winery-pr/org.eclipse.winery.repository/target/apidocs/help-doc.html...
3 warnings
[WARNING] Javadoc Warnings
[WARNING] /home/jenkins/agent/workspace/winery-pr/org.eclipse.winery.repository/src/main/java/org/eclipse/winery/repository/JAXBSupport.java:117: warning: no @param for includeProcessingInstruction
[WARNING] public static Marshaller createMarshaller(boolean includeProcessingInstruction) {
[WARNING] ^
[WARNING] /home/jenkins/agent/workspace/winery-pr/org.eclipse.winery.repository/src/main/java/org/eclipse/winery/repository/JAXBSupport.java:117: warning: no @return
[WARNING] public static Marshaller createMarshaller(boolean includeProcessingInstruction) {
[WARNING] ^
[WARNING] /home/jenkins/agent/workspace/winery-pr/org.eclipse.winery.repository/src/main/java/org/eclipse/winery/repository/JAXBSupport.java:146: warning: no @return
[WARNING] public static Unmarshaller createUnmarshaller() {
[WARNING] ^
[INFO] Building jar: /home/jenkins/agent/workspace/winery-pr/org.eclipse.winery.repository/target/winery-javadoc.jar