UnstableConsole Output

[INFO] 
[INFO] ----------< org.eclipse.winery:org.eclipse.winery.repository >----------
[INFO] Building org.eclipse.winery.repository 3.0.0-SNAPSHOT            [12/27]
[INFO] --------------------------------[ jar ]---------------------------------
[INFO] Downloading from eclipse.maven.central.mirror: https://repo.eclipse.org/content/repositories/maven_central/org/apache/maven/plugins/maven-checkstyle-plugin/2.17/maven-checkstyle-plugin-2.17.pom
[INFO] Downloaded from eclipse.maven.central.mirror: https://repo.eclipse.org/content/repositories/maven_central/org/apache/maven/plugins/maven-checkstyle-plugin/2.17/maven-checkstyle-plugin-2.17.pom (13 kB at 290 kB/s)
[INFO] Downloading from eclipse.maven.central.mirror: https://repo.eclipse.org/content/repositories/maven_central/org/apache/maven/plugins/maven-checkstyle-plugin/2.17/maven-checkstyle-plugin-2.17.jar
[INFO] Downloaded from eclipse.maven.central.mirror: https://repo.eclipse.org/content/repositories/maven_central/org/apache/maven/plugins/maven-checkstyle-plugin/2.17/maven-checkstyle-plugin-2.17.jar (109 kB at 4.2 MB/s)
[INFO] Downloading from eclipse.maven.central.mirror: https://repo.eclipse.org/content/repositories/maven_central/org/codehaus/mojo/build-helper-maven-plugin/1.8/build-helper-maven-plugin-1.8.pom
[INFO] Downloaded from eclipse.maven.central.mirror: https://repo.eclipse.org/content/repositories/maven_central/org/codehaus/mojo/build-helper-maven-plugin/1.8/build-helper-maven-plugin-1.8.pom (6.7 kB at 87 kB/s)
[INFO] Downloading from eclipse.maven.central.mirror: https://repo.eclipse.org/content/repositories/maven_central/org/codehaus/mojo/build-helper-maven-plugin/1.8/build-helper-maven-plugin-1.8.jar
[INFO] Downloaded from eclipse.maven.central.mirror: https://repo.eclipse.org/content/repositories/maven_central/org/codehaus/mojo/build-helper-maven-plugin/1.8/build-helper-maven-plugin-1.8.jar (42 kB at 175 kB/s)
[INFO] Downloading from eclipse.maven.central.mirror: https://repo.eclipse.org/content/repositories/maven_central/com/sun/xml/bind/jaxb-impl/2.2.11/jaxb-impl-2.2.11.pom
[INFO] Downloaded from eclipse.maven.central.mirror: https://repo.eclipse.org/content/repositories/maven_central/com/sun/xml/bind/jaxb-impl/2.2.11/jaxb-impl-2.2.11.pom (14 kB at 319 kB/s)
[INFO] Downloading from eclipse.maven.central.mirror: https://repo.eclipse.org/content/repositories/maven_central/com/sun/xml/bind/mvn/jaxb-bundles/2.2.11/jaxb-bundles-2.2.11.pom
[INFO] Downloaded from eclipse.maven.central.mirror: https://repo.eclipse.org/content/repositories/maven_central/com/sun/xml/bind/mvn/jaxb-bundles/2.2.11/jaxb-bundles-2.2.11.pom (2.8 kB at 139 kB/s)
[INFO] Downloading from eclipse.maven.central.mirror: https://repo.eclipse.org/content/repositories/maven_central/com/sun/xml/bind/mvn/jaxb-parent/2.2.11/jaxb-parent-2.2.11.pom
[INFO] Downloaded from eclipse.maven.central.mirror: https://repo.eclipse.org/content/repositories/maven_central/com/sun/xml/bind/mvn/jaxb-parent/2.2.11/jaxb-parent-2.2.11.pom (35 kB at 1.1 MB/s)
[INFO] Downloading from eclipse.maven.central.mirror: https://repo.eclipse.org/content/repositories/maven_central/com/sun/xml/bind/jaxb-bom-ext/2.2.11/jaxb-bom-ext-2.2.11.pom
[INFO] Downloaded from eclipse.maven.central.mirror: https://repo.eclipse.org/content/repositories/maven_central/com/sun/xml/bind/jaxb-bom-ext/2.2.11/jaxb-bom-ext-2.2.11.pom (5.4 kB at 362 kB/s)
[INFO] Downloading from eclipse.maven.central.mirror: https://repo.eclipse.org/content/repositories/maven_central/org/glassfish/jaxb/jaxb-bom/2.2.11/jaxb-bom-2.2.11.pom
[INFO] Downloaded from eclipse.maven.central.mirror: https://repo.eclipse.org/content/repositories/maven_central/org/glassfish/jaxb/jaxb-bom/2.2.11/jaxb-bom-2.2.11.pom (9.9 kB at 548 kB/s)
[INFO] Downloading from eclipse.maven.central.mirror: https://repo.eclipse.org/content/repositories/maven_central/net/java/jvnet-parent/4/jvnet-parent-4.pom
[INFO] Downloaded from eclipse.maven.central.mirror: https://repo.eclipse.org/content/repositories/maven_central/net/java/jvnet-parent/4/jvnet-parent-4.pom (7.8 kB at 431 kB/s)
[INFO] Downloading from eclipse.maven.central.mirror: https://repo.eclipse.org/content/repositories/maven_central/com/sun/xml/bind/jaxb-core/2.2.11/jaxb-core-2.2.11.pom
[INFO] Downloaded from eclipse.maven.central.mirror: https://repo.eclipse.org/content/repositories/maven_central/com/sun/xml/bind/jaxb-core/2.2.11/jaxb-core-2.2.11.pom (15 kB at 768 kB/s)
[INFO] Downloading from eclipse.maven.central.mirror: https://repo.eclipse.org/content/repositories/maven_central/org/tukaani/xz/1.3/xz-1.3.pom
[INFO] Downloaded from eclipse.maven.central.mirror: https://repo.eclipse.org/content/repositories/maven_central/org/tukaani/xz/1.3/xz-1.3.pom (1.9 kB at 56 kB/s)
[INFO] Downloading from eclipse.maven.central.mirror: https://repo.eclipse.org/content/repositories/maven_central/org/apache/tika/tika-core/1.3/tika-core-1.3.pom
[INFO] Downloaded from eclipse.maven.central.mirror: https://repo.eclipse.org/content/repositories/maven_central/org/apache/tika/tika-core/1.3/tika-core-1.3.pom (5.0 kB at 155 kB/s)
[INFO] Downloading from eclipse.maven.central.mirror: https://repo.eclipse.org/content/repositories/maven_central/org/apache/tika/tika-parent/1.3/tika-parent-1.3.pom
[INFO] Downloaded from eclipse.maven.central.mirror: https://repo.eclipse.org/content/repositories/maven_central/org/apache/tika/tika-parent/1.3/tika-parent-1.3.pom (10 kB at 10 kB/s)
[INFO] Downloading from eclipse.maven.central.mirror: https://repo.eclipse.org/content/repositories/maven_central/com/fasterxml/jackson/jaxrs/jackson-jaxrs-json-provider/2.7.7/jackson-jaxrs-json-provider-2.7.7.pom
[INFO] Downloaded from eclipse.maven.central.mirror: https://repo.eclipse.org/content/repositories/maven_central/com/fasterxml/jackson/jaxrs/jackson-jaxrs-json-provider/2.7.7/jackson-jaxrs-json-provider-2.7.7.pom (3.8 kB at 84 kB/s)
[INFO] Downloading from eclipse.maven.central.mirror: https://repo.eclipse.org/content/repositories/maven_central/com/fasterxml/jackson/jaxrs/jackson-jaxrs-providers/2.7.7/jackson-jaxrs-providers-2.7.7.pom
[INFO] Downloaded from eclipse.maven.central.mirror: https://repo.eclipse.org/content/repositories/maven_central/com/fasterxml/jackson/jaxrs/jackson-jaxrs-providers/2.7.7/jackson-jaxrs-providers-2.7.7.pom (4.1 kB at 178 kB/s)
[INFO] Downloading from eclipse.maven.central.mirror: https://repo.eclipse.org/content/repositories/maven_central/com/fasterxml/jackson/jaxrs/jackson-jaxrs-base/2.7.7/jackson-jaxrs-base-2.7.7.pom
[INFO] Downloaded from eclipse.maven.central.mirror: https://repo.eclipse.org/content/repositories/maven_central/com/fasterxml/jackson/jaxrs/jackson-jaxrs-base/2.7.7/jackson-jaxrs-base-2.7.7.pom (1.6 kB at 34 kB/s)
[INFO] Downloading from eclipse.maven.central.mirror: https://repo.eclipse.org/content/repositories/maven_central/com/fasterxml/jackson/core/jackson-core/2.7.7/jackson-core-2.7.7.pom
[INFO] Downloaded from eclipse.maven.central.mirror: https://repo.eclipse.org/content/repositories/maven_central/com/fasterxml/jackson/core/jackson-core/2.7.7/jackson-core-2.7.7.pom (5.1 kB at 158 kB/s)
[INFO] Downloading from eclipse.maven.central.mirror: https://repo.eclipse.org/content/repositories/maven_central/com/fasterxml/jackson/core/jackson-databind/2.7.7/jackson-databind-2.7.7.pom
[INFO] Downloaded from eclipse.maven.central.mirror: https://repo.eclipse.org/content/repositories/maven_central/com/fasterxml/jackson/core/jackson-databind/2.7.7/jackson-databind-2.7.7.pom (5.2 kB at 144 kB/s)
[INFO] Downloading from eclipse.maven.central.mirror: https://repo.eclipse.org/content/repositories/maven_central/com/fasterxml/jackson/module/jackson-module-jaxb-annotations/2.7.7/jackson-module-jaxb-annotations-2.7.7.pom
[INFO] Downloaded from eclipse.maven.central.mirror: https://repo.eclipse.org/content/repositories/maven_central/com/fasterxml/jackson/module/jackson-module-jaxb-annotations/2.7.7/jackson-module-jaxb-annotations-2.7.7.pom (3.6 kB at 92 kB/s)
[INFO] Downloading from eclipse.maven.central.mirror: https://repo.eclipse.org/content/repositories/maven_central/org/eclipse/jgit/org.eclipse.jgit/5.7.0.202003110725-r/org.eclipse.jgit-5.7.0.202003110725-r.pom
[INFO] Downloaded from eclipse.maven.central.mirror: https://repo.eclipse.org/content/repositories/maven_central/org/eclipse/jgit/org.eclipse.jgit/5.7.0.202003110725-r/org.eclipse.jgit-5.7.0.202003110725-r.pom (8.1 kB at 107 kB/s)
[INFO] Downloading from eclipse.maven.central.mirror: https://repo.eclipse.org/content/repositories/maven_central/org/eclipse/jgit/org.eclipse.jgit-parent/5.7.0.202003110725-r/org.eclipse.jgit-parent-5.7.0.202003110725-r.pom
[INFO] Downloaded from eclipse.maven.central.mirror: https://repo.eclipse.org/content/repositories/maven_central/org/eclipse/jgit/org.eclipse.jgit-parent/5.7.0.202003110725-r/org.eclipse.jgit-parent-5.7.0.202003110725-r.pom (35 kB at 768 kB/s)
[INFO] Downloading from eclipse.maven.central.mirror: https://repo.eclipse.org/content/repositories/maven_central/com/jcraft/jsch/0.1.55/jsch-0.1.55.pom
[INFO] Downloaded from eclipse.maven.central.mirror: https://repo.eclipse.org/content/repositories/maven_central/com/jcraft/jsch/0.1.55/jsch-0.1.55.pom (3.2 kB at 180 kB/s)
[INFO] Downloading from eclipse.maven.central.mirror: https://repo.eclipse.org/content/repositories/maven_central/org/sonatype/oss/oss-parent/6/oss-parent-6.pom
[INFO] Downloaded from eclipse.maven.central.mirror: https://repo.eclipse.org/content/repositories/maven_central/org/sonatype/oss/oss-parent/6/oss-parent-6.pom (4.8 kB at 1.6 MB/s)
[INFO] Downloading from eclipse.maven.central.mirror: https://repo.eclipse.org/content/repositories/maven_central/com/jcraft/jzlib/1.1.1/jzlib-1.1.1.pom
[INFO] Downloaded from eclipse.maven.central.mirror: https://repo.eclipse.org/content/repositories/maven_central/com/jcraft/jzlib/1.1.1/jzlib-1.1.1.pom (3.1 kB at 181 kB/s)
[INFO] Downloading from eclipse.maven.central.mirror: https://repo.eclipse.org/content/repositories/maven_central/com/googlecode/javaewah/JavaEWAH/1.1.7/JavaEWAH-1.1.7.pom
[INFO] Downloaded from eclipse.maven.central.mirror: https://repo.eclipse.org/content/repositories/maven_central/com/googlecode/javaewah/JavaEWAH/1.1.7/JavaEWAH-1.1.7.pom (4.9 kB at 196 kB/s)
[INFO] Downloading from eclipse.maven.central.mirror: https://repo.eclipse.org/content/repositories/maven_central/org/sonatype/oss/oss-parent/5/oss-parent-5.pom
[INFO] Downloaded from eclipse.maven.central.mirror: https://repo.eclipse.org/content/repositories/maven_central/org/sonatype/oss/oss-parent/5/oss-parent-5.pom (4.1 kB at 227 kB/s)
[INFO] Downloading from eclipse.maven.central.mirror: https://repo.eclipse.org/content/repositories/maven_central/org/slf4j/slf4j-api/1.7.2/slf4j-api-1.7.2.pom
[INFO] Downloaded from eclipse.maven.central.mirror: https://repo.eclipse.org/content/repositories/maven_central/org/slf4j/slf4j-api/1.7.2/slf4j-api-1.7.2.pom (2.7 kB at 90 kB/s)
[INFO] Downloading from eclipse.maven.central.mirror: https://repo.eclipse.org/content/repositories/maven_central/org/slf4j/slf4j-parent/1.7.2/slf4j-parent-1.7.2.pom
[INFO] Downloaded from eclipse.maven.central.mirror: https://repo.eclipse.org/content/repositories/maven_central/org/slf4j/slf4j-parent/1.7.2/slf4j-parent-1.7.2.pom (12 kB at 454 kB/s)
[INFO] Downloading from eclipse.maven.central.mirror: https://repo.eclipse.org/content/repositories/maven_central/org/bouncycastle/bcpg-jdk15on/1.64/bcpg-jdk15on-1.64.pom
[INFO] Downloaded from eclipse.maven.central.mirror: https://repo.eclipse.org/content/repositories/maven_central/org/bouncycastle/bcpg-jdk15on/1.64/bcpg-jdk15on-1.64.pom (2.5 kB at 146 kB/s)
[INFO] Downloading from eclipse.maven.central.mirror: https://repo.eclipse.org/content/repositories/maven_central/org/bouncycastle/bcprov-jdk15on/1.64/bcprov-jdk15on-1.64.pom
[INFO] Downloaded from eclipse.maven.central.mirror: https://repo.eclipse.org/content/repositories/maven_central/org/bouncycastle/bcprov-jdk15on/1.64/bcprov-jdk15on-1.64.pom (1.2 kB at 77 kB/s)
[INFO] Downloading from eclipse.maven.central.mirror: https://repo.eclipse.org/content/repositories/maven_central/org/bouncycastle/bcpkix-jdk15on/1.64/bcpkix-jdk15on-1.64.pom
[INFO] Downloaded from eclipse.maven.central.mirror: https://repo.eclipse.org/content/repositories/maven_central/org/bouncycastle/bcpkix-jdk15on/1.64/bcpkix-jdk15on-1.64.pom (2.2 kB at 138 kB/s)
[INFO] Downloading from eclipse.maven.central.mirror: https://repo.eclipse.org/content/repositories/maven_central/com/google/guava/guava/23.4-jre/guava-23.4-jre.pom
[INFO] Downloaded from eclipse.maven.central.mirror: https://repo.eclipse.org/content/repositories/maven_central/com/google/guava/guava/23.4-jre/guava-23.4-jre.pom (6.8 kB at 180 kB/s)
[INFO] Downloading from eclipse.maven.central.mirror: https://repo.eclipse.org/content/repositories/maven_central/com/google/guava/guava-parent/23.4-jre/guava-parent-23.4-jre.pom
[INFO] Downloaded from eclipse.maven.central.mirror: https://repo.eclipse.org/content/repositories/maven_central/com/google/guava/guava-parent/23.4-jre/guava-parent-23.4-jre.pom (10.0 kB at 357 kB/s)
[INFO] Downloading from eclipse.maven.central.mirror: https://repo.eclipse.org/content/repositories/maven_central/org/xmlunit/xmlunit-core/2.3.0/xmlunit-core-2.3.0.pom
[INFO] Downloaded from eclipse.maven.central.mirror: https://repo.eclipse.org/content/repositories/maven_central/org/xmlunit/xmlunit-core/2.3.0/xmlunit-core-2.3.0.pom (1.8 kB at 67 kB/s)
[INFO] Downloading from eclipse.maven.central.mirror: https://repo.eclipse.org/content/repositories/maven_central/org/xmlunit/xmlunit-parent/2.3.0/xmlunit-parent-2.3.0.pom
[INFO] Downloaded from eclipse.maven.central.mirror: https://repo.eclipse.org/content/repositories/maven_central/org/xmlunit/xmlunit-parent/2.3.0/xmlunit-parent-2.3.0.pom (16 kB at 418 kB/s)
[INFO] Downloading from eclipse.maven.central.mirror: https://repo.eclipse.org/content/repositories/maven_central/org/xmlunit/xmlunit-matchers/2.3.0/xmlunit-matchers-2.3.0.pom
[INFO] Downloaded from eclipse.maven.central.mirror: https://repo.eclipse.org/content/repositories/maven_central/org/xmlunit/xmlunit-matchers/2.3.0/xmlunit-matchers-2.3.0.pom (2.1 kB at 61 kB/s)
[INFO] Downloading from eclipse.maven.central.mirror: https://repo.eclipse.org/content/repositories/maven_central/org/skyscreamer/jsonassert/1.4.0/jsonassert-1.4.0.pom
[INFO] Downloaded from eclipse.maven.central.mirror: https://repo.eclipse.org/content/repositories/maven_central/org/skyscreamer/jsonassert/1.4.0/jsonassert-1.4.0.pom (5.2 kB at 115 kB/s)
[INFO] Downloading from eclipse.maven.central.mirror: https://repo.eclipse.org/content/repositories/maven_central/com/vaadin/external/google/android-json/0.0.20131108.vaadin1/android-json-0.0.20131108.vaadin1.pom
[INFO] Downloaded from eclipse.maven.central.mirror: https://repo.eclipse.org/content/repositories/maven_central/com/vaadin/external/google/android-json/0.0.20131108.vaadin1/android-json-0.0.20131108.vaadin1.pom (2.8 kB at 155 kB/s)
[INFO] Downloading from eclipse.maven.central.mirror: https://repo.eclipse.org/content/repositories/maven_central/org/eclipse/collections/eclipse-collections/8.2.0/eclipse-collections-8.2.0.pom
[INFO] Downloaded from eclipse.maven.central.mirror: https://repo.eclipse.org/content/repositories/maven_central/org/eclipse/collections/eclipse-collections/8.2.0/eclipse-collections-8.2.0.pom (7.2 kB at 232 kB/s)
[INFO] Downloading from eclipse.maven.central.mirror: https://repo.eclipse.org/content/repositories/maven_central/org/eclipse/collections/eclipse-collections-parent/8.2.0/eclipse-collections-parent-8.2.0.pom
[INFO] Downloaded from eclipse.maven.central.mirror: https://repo.eclipse.org/content/repositories/maven_central/org/eclipse/collections/eclipse-collections-parent/8.2.0/eclipse-collections-parent-8.2.0.pom (28 kB at 1.3 MB/s)
[INFO] Downloading from eclipse.maven.central.mirror: https://repo.eclipse.org/content/repositories/maven_central/org/eclipse/collections/eclipse-collections-api/8.2.0/eclipse-collections-api-8.2.0.pom
[INFO] Downloaded from eclipse.maven.central.mirror: https://repo.eclipse.org/content/repositories/maven_central/org/eclipse/collections/eclipse-collections-api/8.2.0/eclipse-collections-api-8.2.0.pom (7.0 kB at 233 kB/s)
[INFO] Downloading from eclipse.maven.central.mirror: https://repo.eclipse.org/content/repositories/maven_central/net/jcip/jcip-annotations/1.0/jcip-annotations-1.0.pom
[INFO] Downloaded from eclipse.maven.central.mirror: https://repo.eclipse.org/content/repositories/maven_central/net/jcip/jcip-annotations/1.0/jcip-annotations-1.0.pom (491 B at 21 kB/s)
[INFO] Downloading from eclipse.maven.central.mirror: https://repo.eclipse.org/content/repositories/maven_central/commons-validator/commons-validator/1.6/commons-validator-1.6.pom
[INFO] Downloaded from eclipse.maven.central.mirror: https://repo.eclipse.org/content/repositories/maven_central/commons-validator/commons-validator/1.6/commons-validator-1.6.pom (12 kB at 547 kB/s)
[INFO] Downloading from eclipse.maven.central.mirror: https://repo.eclipse.org/content/repositories/maven_central/commons-beanutils/commons-beanutils/1.9.2/commons-beanutils-1.9.2.pom
[INFO] Downloaded from eclipse.maven.central.mirror: https://repo.eclipse.org/content/repositories/maven_central/commons-beanutils/commons-beanutils/1.9.2/commons-beanutils-1.9.2.pom (14 kB at 795 kB/s)
[INFO] Downloading from eclipse.maven.central.mirror: https://repo.eclipse.org/content/repositories/maven_central/org/apache/commons/commons-parent/33/commons-parent-33.pom
[INFO] Downloaded from eclipse.maven.central.mirror: https://repo.eclipse.org/content/repositories/maven_central/org/apache/commons/commons-parent/33/commons-parent-33.pom (53 kB at 1.4 MB/s)
[INFO] Downloading from eclipse.maven.central.mirror: https://repo.eclipse.org/content/repositories/maven_central/commons-digester/commons-digester/1.8.1/commons-digester-1.8.1.pom
[INFO] Downloaded from eclipse.maven.central.mirror: https://repo.eclipse.org/content/repositories/maven_central/commons-digester/commons-digester/1.8.1/commons-digester-1.8.1.pom (10 kB at 295 kB/s)
[INFO] Downloading from eclipse.maven.central.mirror: https://repo.eclipse.org/content/repositories/maven_central/org/apache/commons/commons-parent/11/commons-parent-11.pom
[INFO] Downloaded from eclipse.maven.central.mirror: https://repo.eclipse.org/content/repositories/maven_central/org/apache/commons/commons-parent/11/commons-parent-11.pom (25 kB at 4.9 MB/s)
[INFO] Downloading from eclipse.maven.central.mirror: https://repo.eclipse.org/content/repositories/maven_central/org/apache/sshd/sshd-core/2.6.0/sshd-core-2.6.0.pom
[INFO] Downloaded from eclipse.maven.central.mirror: https://repo.eclipse.org/content/repositories/maven_central/org/apache/sshd/sshd-core/2.6.0/sshd-core-2.6.0.pom (10 kB at 11 kB/s)
[INFO] Downloading from eclipse.maven.central.mirror: https://repo.eclipse.org/content/repositories/maven_central/org/apache/sshd/sshd/2.6.0/sshd-2.6.0.pom
[INFO] Downloaded from eclipse.maven.central.mirror: https://repo.eclipse.org/content/repositories/maven_central/org/apache/sshd/sshd/2.6.0/sshd-2.6.0.pom (73 kB at 1.5 MB/s)
[INFO] Downloading from eclipse.maven.central.mirror: https://repo.eclipse.org/content/repositories/maven_central/org/springframework/spring-framework-bom/5.3.1/spring-framework-bom-5.3.1.pom
[INFO] Downloaded from eclipse.maven.central.mirror: https://repo.eclipse.org/content/repositories/maven_central/org/springframework/spring-framework-bom/5.3.1/spring-framework-bom-5.3.1.pom (5.6 kB at 137 kB/s)
[INFO] Downloading from eclipse.maven.central.mirror: https://repo.eclipse.org/content/repositories/maven_central/org/apache/sshd/sshd-common/2.6.0/sshd-common-2.6.0.pom
[INFO] Downloaded from eclipse.maven.central.mirror: https://repo.eclipse.org/content/repositories/maven_central/org/apache/sshd/sshd-common/2.6.0/sshd-common-2.6.0.pom (5.3 kB at 152 kB/s)
[INFO] Downloading from eclipse.maven.central.mirror: https://repo.eclipse.org/content/repositories/maven_central/org/slf4j/slf4j-api/1.7.30/slf4j-api-1.7.30.pom
[INFO] Downloaded from eclipse.maven.central.mirror: https://repo.eclipse.org/content/repositories/maven_central/org/slf4j/slf4j-api/1.7.30/slf4j-api-1.7.30.pom (3.8 kB at 132 kB/s)
[INFO] Downloading from eclipse.maven.central.mirror: https://repo.eclipse.org/content/repositories/maven_central/org/slf4j/slf4j-parent/1.7.30/slf4j-parent-1.7.30.pom
[INFO] Downloaded from eclipse.maven.central.mirror: https://repo.eclipse.org/content/repositories/maven_central/org/slf4j/slf4j-parent/1.7.30/slf4j-parent-1.7.30.pom (14 kB at 476 kB/s)
[INFO] Downloading from eclipse.maven.central.mirror: https://repo.eclipse.org/content/repositories/maven_central/org/apache/commons/commons-compress/1.19/commons-compress-1.19.pom
[INFO] Downloaded from eclipse.maven.central.mirror: https://repo.eclipse.org/content/repositories/maven_central/org/apache/commons/commons-compress/1.19/commons-compress-1.19.pom (18 kB at 701 kB/s)
[INFO] Downloading from eclipse.maven.central.mirror: https://repo.eclipse.org/content/repositories/maven_central/org/apache/commons/commons-parent/48/commons-parent-48.pom
[INFO] Downloaded from eclipse.maven.central.mirror: https://repo.eclipse.org/content/repositories/maven_central/org/apache/commons/commons-parent/48/commons-parent-48.pom (72 kB at 18 MB/s)
[INFO] Downloading from eclipse.maven.central.mirror: https://repo.eclipse.org/content/repositories/maven_central/com/sun/xml/bind/jaxb-impl/2.2.11/jaxb-impl-2.2.11.jar
[INFO] Downloading from eclipse.maven.central.mirror: https://repo.eclipse.org/content/repositories/maven_central/com/sun/xml/bind/jaxb-core/2.2.11/jaxb-core-2.2.11.jar
[INFO] Downloading from eclipse.maven.central.mirror: https://repo.eclipse.org/content/repositories/maven_central/org/tukaani/xz/1.3/xz-1.3.jar
[INFO] Downloading from eclipse.maven.central.mirror: https://repo.eclipse.org/content/repositories/maven_central/org/apache/tika/tika-core/1.3/tika-core-1.3.jar
[INFO] Downloading from eclipse.maven.central.mirror: https://repo.eclipse.org/content/repositories/maven_central/com/fasterxml/jackson/jaxrs/jackson-jaxrs-json-provider/2.7.7/jackson-jaxrs-json-provider-2.7.7.jar
[INFO] Downloaded from eclipse.maven.central.mirror: https://repo.eclipse.org/content/repositories/maven_central/com/sun/xml/bind/jaxb-core/2.2.11/jaxb-core-2.2.11.jar (252 kB at 9.0 MB/s)
[INFO] Downloading from eclipse.maven.central.mirror: https://repo.eclipse.org/content/repositories/maven_central/com/fasterxml/jackson/jaxrs/jackson-jaxrs-base/2.7.7/jackson-jaxrs-base-2.7.7.jar
[INFO] Downloaded from eclipse.maven.central.mirror: https://repo.eclipse.org/content/repositories/maven_central/com/fasterxml/jackson/jaxrs/jackson-jaxrs-json-provider/2.7.7/jackson-jaxrs-json-provider-2.7.7.jar (17 kB at 271 kB/s)
[INFO] Downloading from eclipse.maven.central.mirror: https://repo.eclipse.org/content/repositories/maven_central/com/fasterxml/jackson/module/jackson-module-jaxb-annotations/2.7.7/jackson-module-jaxb-annotations-2.7.7.jar
[INFO] Downloaded from eclipse.maven.central.mirror: https://repo.eclipse.org/content/repositories/maven_central/com/sun/xml/bind/jaxb-impl/2.2.11/jaxb-impl-2.2.11.jar (1.0 MB at 15 MB/s)
[INFO] Downloading from eclipse.maven.central.mirror: https://repo.eclipse.org/content/repositories/maven_central/org/eclipse/jgit/org.eclipse.jgit/5.7.0.202003110725-r/org.eclipse.jgit-5.7.0.202003110725-r.jar
[INFO] Downloaded from eclipse.maven.central.mirror: https://repo.eclipse.org/content/repositories/maven_central/com/fasterxml/jackson/jaxrs/jackson-jaxrs-base/2.7.7/jackson-jaxrs-base-2.7.7.jar (30 kB at 365 kB/s)
[INFO] Downloading from eclipse.maven.central.mirror: https://repo.eclipse.org/content/repositories/maven_central/com/jcraft/jsch/0.1.55/jsch-0.1.55.jar
[INFO] Downloaded from eclipse.maven.central.mirror: https://repo.eclipse.org/content/repositories/maven_central/org/tukaani/xz/1.3/xz-1.3.jar (98 kB at 1.1 MB/s)
[INFO] Downloading from eclipse.maven.central.mirror: https://repo.eclipse.org/content/repositories/maven_central/com/jcraft/jzlib/1.1.1/jzlib-1.1.1.jar
[INFO] Downloaded from eclipse.maven.central.mirror: https://repo.eclipse.org/content/repositories/maven_central/com/fasterxml/jackson/module/jackson-module-jaxb-annotations/2.7.7/jackson-module-jaxb-annotations-2.7.7.jar (35 kB at 368 kB/s)
[INFO] Downloading from eclipse.maven.central.mirror: https://repo.eclipse.org/content/repositories/maven_central/com/googlecode/javaewah/JavaEWAH/1.1.7/JavaEWAH-1.1.7.jar
[INFO] Downloaded from eclipse.maven.central.mirror: https://repo.eclipse.org/content/repositories/maven_central/com/jcraft/jsch/0.1.55/jsch-0.1.55.jar (283 kB at 2.4 MB/s)
[INFO] Downloading from eclipse.maven.central.mirror: https://repo.eclipse.org/content/repositories/maven_central/org/bouncycastle/bcpg-jdk15on/1.64/bcpg-jdk15on-1.64.jar
[INFO] Downloaded from eclipse.maven.central.mirror: https://repo.eclipse.org/content/repositories/maven_central/com/jcraft/jzlib/1.1.1/jzlib-1.1.1.jar (70 kB at 600 kB/s)
[INFO] Downloading from eclipse.maven.central.mirror: https://repo.eclipse.org/content/repositories/maven_central/org/bouncycastle/bcprov-jdk15on/1.64/bcprov-jdk15on-1.64.jar
[INFO] Downloaded from eclipse.maven.central.mirror: https://repo.eclipse.org/content/repositories/maven_central/com/googlecode/javaewah/JavaEWAH/1.1.7/JavaEWAH-1.1.7.jar (166 kB at 1.4 MB/s)
[INFO] Downloading from eclipse.maven.central.mirror: https://repo.eclipse.org/content/repositories/maven_central/org/bouncycastle/bcpkix-jdk15on/1.64/bcpkix-jdk15on-1.64.jar
[INFO] Downloaded from eclipse.maven.central.mirror: https://repo.eclipse.org/content/repositories/maven_central/org/apache/tika/tika-core/1.3/tika-core-1.3.jar (476 kB at 3.0 MB/s)
[INFO] Downloading from eclipse.maven.central.mirror: https://repo.eclipse.org/content/repositories/maven_central/com/google/guava/guava/23.4-jre/guava-23.4-jre.jar
[INFO] Downloaded from eclipse.maven.central.mirror: https://repo.eclipse.org/content/repositories/maven_central/org/bouncycastle/bcpg-jdk15on/1.64/bcpg-jdk15on-1.64.jar (329 kB at 1.9 MB/s)
[INFO] Downloading from eclipse.maven.central.mirror: https://repo.eclipse.org/content/repositories/maven_central/org/xmlunit/xmlunit-core/2.3.0/xmlunit-core-2.3.0.jar
[INFO] Downloaded from eclipse.maven.central.mirror: https://repo.eclipse.org/content/repositories/maven_central/org/eclipse/jgit/org.eclipse.jgit/5.7.0.202003110725-r/org.eclipse.jgit-5.7.0.202003110725-r.jar (2.9 MB at 16 MB/s)
[INFO] Downloading from eclipse.maven.central.mirror: https://repo.eclipse.org/content/repositories/maven_central/org/xmlunit/xmlunit-matchers/2.3.0/xmlunit-matchers-2.3.0.jar
[INFO] Downloaded from eclipse.maven.central.mirror: https://repo.eclipse.org/content/repositories/maven_central/org/xmlunit/xmlunit-core/2.3.0/xmlunit-core-2.3.0.jar (156 kB at 752 kB/s)
[INFO] Downloading from eclipse.maven.central.mirror: https://repo.eclipse.org/content/repositories/maven_central/org/skyscreamer/jsonassert/1.4.0/jsonassert-1.4.0.jar
[INFO] Downloaded from eclipse.maven.central.mirror: https://repo.eclipse.org/content/repositories/maven_central/org/bouncycastle/bcpkix-jdk15on/1.64/bcpkix-jdk15on-1.64.jar (878 kB at 4.1 MB/s)
[INFO] Downloading from eclipse.maven.central.mirror: https://repo.eclipse.org/content/repositories/maven_central/com/vaadin/external/google/android-json/0.0.20131108.vaadin1/android-json-0.0.20131108.vaadin1.jar
[INFO] Downloaded from eclipse.maven.central.mirror: https://repo.eclipse.org/content/repositories/maven_central/com/vaadin/external/google/android-json/0.0.20131108.vaadin1/android-json-0.0.20131108.vaadin1.jar (18 kB at 74 kB/s)
[INFO] Downloading from eclipse.maven.central.mirror: https://repo.eclipse.org/content/repositories/maven_central/org/eclipse/collections/eclipse-collections/8.2.0/eclipse-collections-8.2.0.jar
[INFO] Downloaded from eclipse.maven.central.mirror: https://repo.eclipse.org/content/repositories/maven_central/org/skyscreamer/jsonassert/1.4.0/jsonassert-1.4.0.jar (29 kB at 109 kB/s)
[INFO] Downloading from eclipse.maven.central.mirror: https://repo.eclipse.org/content/repositories/maven_central/org/eclipse/collections/eclipse-collections-api/8.2.0/eclipse-collections-api-8.2.0.jar
[INFO] Downloaded from eclipse.maven.central.mirror: https://repo.eclipse.org/content/repositories/maven_central/com/google/guava/guava/23.4-jre/guava-23.4-jre.jar (2.7 MB at 8.5 MB/s)
[INFO] Downloading from eclipse.maven.central.mirror: https://repo.eclipse.org/content/repositories/maven_central/net/jcip/jcip-annotations/1.0/jcip-annotations-1.0.jar
[INFO] Downloaded from eclipse.maven.central.mirror: https://repo.eclipse.org/content/repositories/maven_central/org/bouncycastle/bcprov-jdk15on/1.64/bcprov-jdk15on-1.64.jar (4.8 MB at 14 MB/s)
[INFO] Downloaded from eclipse.maven.central.mirror: https://repo.eclipse.org/content/repositories/maven_central/net/jcip/jcip-annotations/1.0/jcip-annotations-1.0.jar (2.3 kB at 6.6 kB/s)
[INFO] Downloading from eclipse.maven.central.mirror: https://repo.eclipse.org/content/repositories/maven_central/commons-validator/commons-validator/1.6/commons-validator-1.6.jar
[INFO] Downloading from eclipse.maven.central.mirror: https://repo.eclipse.org/content/repositories/maven_central/commons-beanutils/commons-beanutils/1.9.2/commons-beanutils-1.9.2.jar
[INFO] Downloaded from eclipse.maven.central.mirror: https://repo.eclipse.org/content/repositories/maven_central/org/xmlunit/xmlunit-matchers/2.3.0/xmlunit-matchers-2.3.0.jar (14 kB at 39 kB/s)
[INFO] Downloading from eclipse.maven.central.mirror: https://repo.eclipse.org/content/repositories/maven_central/commons-digester/commons-digester/1.8.1/commons-digester-1.8.1.jar
[INFO] Downloaded from eclipse.maven.central.mirror: https://repo.eclipse.org/content/repositories/maven_central/org/eclipse/collections/eclipse-collections-api/8.2.0/eclipse-collections-api-8.2.0.jar (1.0 MB at 2.5 MB/s)
[INFO] Downloading from eclipse.maven.central.mirror: https://repo.eclipse.org/content/repositories/maven_central/org/apache/sshd/sshd-core/2.6.0/sshd-core-2.6.0.jar
[INFO] Downloaded from eclipse.maven.central.mirror: https://repo.eclipse.org/content/repositories/maven_central/commons-digester/commons-digester/1.8.1/commons-digester-1.8.1.jar (146 kB at 331 kB/s)
[INFO] Downloaded from eclipse.maven.central.mirror: https://repo.eclipse.org/content/repositories/maven_central/commons-validator/commons-validator/1.6/commons-validator-1.6.jar (186 kB at 422 kB/s)
[INFO] Downloaded from eclipse.maven.central.mirror: https://repo.eclipse.org/content/repositories/maven_central/commons-beanutils/commons-beanutils/1.9.2/commons-beanutils-1.9.2.jar (234 kB at 530 kB/s)
[INFO] Downloading from eclipse.maven.central.mirror: https://repo.eclipse.org/content/repositories/maven_central/org/apache/commons/commons-compress/1.19/commons-compress-1.19.jar
[INFO] Downloading from eclipse.maven.central.mirror: https://repo.eclipse.org/content/repositories/maven_central/org/apache/sshd/sshd-common/2.6.0/sshd-common-2.6.0.jar
[INFO] Downloaded from eclipse.maven.central.mirror: https://repo.eclipse.org/content/repositories/maven_central/org/apache/commons/commons-compress/1.19/commons-compress-1.19.jar (615 kB at 1.2 MB/s)
[INFO] Downloaded from eclipse.maven.central.mirror: https://repo.eclipse.org/content/repositories/maven_central/org/apache/sshd/sshd-core/2.6.0/sshd-core-2.6.0.jar (869 kB at 1.6 MB/s)
[INFO] Downloaded from eclipse.maven.central.mirror: https://repo.eclipse.org/content/repositories/maven_central/org/apache/sshd/sshd-common/2.6.0/sshd-common-2.6.0.jar (901 kB at 1.6 MB/s)
[INFO] Downloaded from eclipse.maven.central.mirror: https://repo.eclipse.org/content/repositories/maven_central/org/eclipse/collections/eclipse-collections/8.2.0/eclipse-collections-8.2.0.jar (9.5 MB at 12 MB/s)
[INFO] 
[INFO] --- maven-checkstyle-plugin:2.17:check (checkstyle) @ org.eclipse.winery.repository ---
[INFO] Downloading from eclipse.maven.central.mirror: https://repo.eclipse.org/content/repositories/maven_central/com/puppycrawl/tools/checkstyle/7.6/checkstyle-7.6.pom
[INFO] Downloaded from eclipse.maven.central.mirror: https://repo.eclipse.org/content/repositories/maven_central/com/puppycrawl/tools/checkstyle/7.6/checkstyle-7.6.pom (69 kB at 1.9 MB/s)
[INFO] Downloading from eclipse.maven.central.mirror: https://repo.eclipse.org/content/repositories/maven_central/org/antlr/antlr4-runtime/4.6/antlr4-runtime-4.6.pom
[INFO] Downloaded from eclipse.maven.central.mirror: https://repo.eclipse.org/content/repositories/maven_central/org/antlr/antlr4-runtime/4.6/antlr4-runtime-4.6.pom (3.5 kB at 106 kB/s)
[INFO] Downloading from eclipse.maven.central.mirror: https://repo.eclipse.org/content/repositories/maven_central/org/antlr/antlr4-master/4.6/antlr4-master-4.6.pom
[INFO] Downloaded from eclipse.maven.central.mirror: https://repo.eclipse.org/content/repositories/maven_central/org/antlr/antlr4-master/4.6/antlr4-master-4.6.pom (4.2 kB at 176 kB/s)
[INFO] Downloading from eclipse.maven.central.mirror: https://repo.eclipse.org/content/repositories/maven_central/commons-cli/commons-cli/1.3.1/commons-cli-1.3.1.pom
[INFO] Downloaded from eclipse.maven.central.mirror: https://repo.eclipse.org/content/repositories/maven_central/commons-cli/commons-cli/1.3.1/commons-cli-1.3.1.pom (10 kB at 577 kB/s)
[INFO] Downloading from eclipse.maven.central.mirror: https://repo.eclipse.org/content/repositories/maven_central/org/apache/commons/commons-parent/37/commons-parent-37.pom
[INFO] Downloaded from eclipse.maven.central.mirror: https://repo.eclipse.org/content/repositories/maven_central/org/apache/commons/commons-parent/37/commons-parent-37.pom (63 kB at 2.7 MB/s)
[INFO] Downloading from eclipse.maven.central.mirror: https://repo.eclipse.org/content/repositories/maven_central/com/google/guava/guava/19.0/guava-19.0.pom
[INFO] Downloaded from eclipse.maven.central.mirror: https://repo.eclipse.org/content/repositories/maven_central/com/google/guava/guava/19.0/guava-19.0.pom (6.8 kB at 3.4 MB/s)
[INFO] Downloading from eclipse.maven.central.mirror: https://repo.eclipse.org/content/repositories/maven_central/com/google/guava/guava-parent/19.0/guava-parent-19.0.pom
[INFO] Downloaded from eclipse.maven.central.mirror: https://repo.eclipse.org/content/repositories/maven_central/com/google/guava/guava-parent/19.0/guava-parent-19.0.pom (9.9 kB at 4.9 MB/s)
[INFO] Downloading from eclipse.maven.central.mirror: https://repo.eclipse.org/content/repositories/maven_central/com/thomasjensen/checkstyle/addons/checkstyle-addons/4.0.1/checkstyle-addons-4.0.1.pom
[INFO] Downloaded from eclipse.maven.central.mirror: https://repo.eclipse.org/content/repositories/maven_central/com/thomasjensen/checkstyle/addons/checkstyle-addons/4.0.1/checkstyle-addons-4.0.1.pom (1.9 kB at 79 kB/s)
[INFO] Downloading from eclipse.maven.central.mirror: https://repo.eclipse.org/content/repositories/maven_central/com/puppycrawl/tools/checkstyle/7.0/checkstyle-7.0.pom
[INFO] Downloaded from eclipse.maven.central.mirror: https://repo.eclipse.org/content/repositories/maven_central/com/puppycrawl/tools/checkstyle/7.0/checkstyle-7.0.pom (72 kB at 1.3 MB/s)
[INFO] Downloading from eclipse.maven.central.mirror: https://repo.eclipse.org/content/repositories/maven_central/org/antlr/antlr4-runtime/4.5.3/antlr4-runtime-4.5.3.pom
[INFO] Downloaded from eclipse.maven.central.mirror: https://repo.eclipse.org/content/repositories/maven_central/org/antlr/antlr4-runtime/4.5.3/antlr4-runtime-4.5.3.pom (2.3 kB at 96 kB/s)
[INFO] Downloading from eclipse.maven.central.mirror: https://repo.eclipse.org/content/repositories/maven_central/org/antlr/antlr4-master/4.5.3/antlr4-master-4.5.3.pom
[INFO] Downloaded from eclipse.maven.central.mirror: https://repo.eclipse.org/content/repositories/maven_central/org/antlr/antlr4-master/4.5.3/antlr4-master-4.5.3.pom (3.7 kB at 160 kB/s)
[INFO] Downloading from eclipse.maven.central.mirror: https://repo.eclipse.org/content/repositories/maven_central/org/apache/maven/reporting/maven-reporting-api/2.2.1/maven-reporting-api-2.2.1.pom
[INFO] Downloaded from eclipse.maven.central.mirror: https://repo.eclipse.org/content/repositories/maven_central/org/apache/maven/reporting/maven-reporting-api/2.2.1/maven-reporting-api-2.2.1.pom (1.9 kB at 926 kB/s)
[INFO] Downloading from eclipse.maven.central.mirror: https://repo.eclipse.org/content/repositories/maven_central/org/apache/maven/reporting/maven-reporting/2.2.1/maven-reporting-2.2.1.pom
[INFO] Downloaded from eclipse.maven.central.mirror: https://repo.eclipse.org/content/repositories/maven_central/org/apache/maven/reporting/maven-reporting/2.2.1/maven-reporting-2.2.1.pom (1.4 kB at 722 kB/s)
[INFO] Downloading from eclipse.maven.central.mirror: https://repo.eclipse.org/content/repositories/maven_central/org/apache/maven/doxia/doxia-sink-api/1.1/doxia-sink-api-1.1.pom
[INFO] Downloaded from eclipse.maven.central.mirror: https://repo.eclipse.org/content/repositories/maven_central/org/apache/maven/doxia/doxia-sink-api/1.1/doxia-sink-api-1.1.pom (2.0 kB at 1.0 MB/s)
[INFO] Downloading from eclipse.maven.central.mirror: https://repo.eclipse.org/content/repositories/maven_central/org/apache/maven/doxia/doxia/1.1/doxia-1.1.pom
[INFO] Downloaded from eclipse.maven.central.mirror: https://repo.eclipse.org/content/repositories/maven_central/org/apache/maven/doxia/doxia/1.1/doxia-1.1.pom (15 kB at 7.6 MB/s)
[INFO] Downloading from eclipse.maven.central.mirror: https://repo.eclipse.org/content/repositories/maven_central/org/apache/maven/doxia/doxia-logging-api/1.1/doxia-logging-api-1.1.pom
[INFO] Downloaded from eclipse.maven.central.mirror: https://repo.eclipse.org/content/repositories/maven_central/org/apache/maven/doxia/doxia-logging-api/1.1/doxia-logging-api-1.1.pom (1.6 kB at 788 kB/s)
[INFO] Downloading from eclipse.maven.central.mirror: https://repo.eclipse.org/content/repositories/maven_central/commons-cli/commons-cli/1.2/commons-cli-1.2.pom
[INFO] Downloaded from eclipse.maven.central.mirror: https://repo.eclipse.org/content/repositories/maven_central/commons-cli/commons-cli/1.2/commons-cli-1.2.pom (8.0 kB at 4.0 MB/s)
[INFO] Downloading from eclipse.maven.central.mirror: https://repo.eclipse.org/content/repositories/maven_central/org/codehaus/plexus/plexus-resources/1.0.1/plexus-resources-1.0.1.pom
[INFO] Downloaded from eclipse.maven.central.mirror: https://repo.eclipse.org/content/repositories/maven_central/org/codehaus/plexus/plexus-resources/1.0.1/plexus-resources-1.0.1.pom (1.3 kB at 73 kB/s)
[INFO] Downloading from eclipse.maven.central.mirror: https://repo.eclipse.org/content/repositories/maven_central/org/codehaus/plexus/plexus-utils/3.0.20/plexus-utils-3.0.20.pom
[INFO] Downloaded from eclipse.maven.central.mirror: https://repo.eclipse.org/content/repositories/maven_central/org/codehaus/plexus/plexus-utils/3.0.20/plexus-utils-3.0.20.pom (3.8 kB at 224 kB/s)
[INFO] Downloading from eclipse.maven.central.mirror: https://repo.eclipse.org/content/repositories/maven_central/org/codehaus/plexus/plexus-velocity/1.1.8/plexus-velocity-1.1.8.pom
[INFO] Downloaded from eclipse.maven.central.mirror: https://repo.eclipse.org/content/repositories/maven_central/org/codehaus/plexus/plexus-velocity/1.1.8/plexus-velocity-1.1.8.pom (1.9 kB at 128 kB/s)
[INFO] Downloading from eclipse.maven.central.mirror: https://repo.eclipse.org/content/repositories/maven_central/com/puppycrawl/tools/checkstyle/7.6/checkstyle-7.6.jar
[INFO] Downloading from eclipse.maven.central.mirror: https://repo.eclipse.org/content/repositories/maven_central/org/antlr/antlr4-runtime/4.6/antlr4-runtime-4.6.jar
[INFO] Downloading from eclipse.maven.central.mirror: https://repo.eclipse.org/content/repositories/maven_central/commons-beanutils/commons-beanutils/1.9.3/commons-beanutils-1.9.3.jar
[INFO] Downloading from eclipse.maven.central.mirror: https://repo.eclipse.org/content/repositories/maven_central/commons-cli/commons-cli/1.3.1/commons-cli-1.3.1.jar
[INFO] Downloading from eclipse.maven.central.mirror: https://repo.eclipse.org/content/repositories/maven_central/com/google/guava/guava/19.0/guava-19.0.jar
[INFO] Downloaded from eclipse.maven.central.mirror: https://repo.eclipse.org/content/repositories/maven_central/commons-cli/commons-cli/1.3.1/commons-cli-1.3.1.jar (53 kB at 1.8 MB/s)
[INFO] Downloading from eclipse.maven.central.mirror: https://repo.eclipse.org/content/repositories/maven_central/com/thomasjensen/checkstyle/addons/checkstyle-addons/4.0.1/checkstyle-addons-4.0.1.jar
[INFO] Downloaded from eclipse.maven.central.mirror: https://repo.eclipse.org/content/repositories/maven_central/commons-beanutils/commons-beanutils/1.9.3/commons-beanutils-1.9.3.jar (246 kB at 5.5 MB/s)
[INFO] Downloading from eclipse.maven.central.mirror: https://repo.eclipse.org/content/repositories/maven_central/org/apache/maven/maven-artifact/2.2.1/maven-artifact-2.2.1.jar
[INFO] Downloaded from eclipse.maven.central.mirror: https://repo.eclipse.org/content/repositories/maven_central/org/antlr/antlr4-runtime/4.6/antlr4-runtime-4.6.jar (308 kB at 5.8 MB/s)
[INFO] Downloading from eclipse.maven.central.mirror: https://repo.eclipse.org/content/repositories/maven_central/org/apache/maven/maven-core/2.2.1/maven-core-2.2.1.jar
[INFO] Downloaded from eclipse.maven.central.mirror: https://repo.eclipse.org/content/repositories/maven_central/org/apache/maven/maven-core/2.2.1/maven-core-2.2.1.jar (178 kB at 3.0 MB/s)
[INFO] Downloading from eclipse.maven.central.mirror: https://repo.eclipse.org/content/repositories/maven_central/org/apache/maven/maven-settings/2.2.1/maven-settings-2.2.1.jar
[INFO] Downloaded from eclipse.maven.central.mirror: https://repo.eclipse.org/content/repositories/maven_central/org/apache/maven/maven-artifact/2.2.1/maven-artifact-2.2.1.jar (80 kB at 1.3 MB/s)
[INFO] Downloading from eclipse.maven.central.mirror: https://repo.eclipse.org/content/repositories/maven_central/org/apache/maven/maven-plugin-parameter-documenter/2.2.1/maven-plugin-parameter-documenter-2.2.1.jar
[INFO] Downloaded from eclipse.maven.central.mirror: https://repo.eclipse.org/content/repositories/maven_central/com/google/guava/guava/19.0/guava-19.0.jar (2.3 MB at 36 MB/s)
[INFO] Downloading from eclipse.maven.central.mirror: https://repo.eclipse.org/content/repositories/maven_central/org/slf4j/slf4j-jdk14/1.5.6/slf4j-jdk14-1.5.6.jar
[INFO] Downloaded from eclipse.maven.central.mirror: https://repo.eclipse.org/content/repositories/maven_central/org/slf4j/slf4j-jdk14/1.5.6/slf4j-jdk14-1.5.6.jar (8.8 kB at 134 kB/s)
[INFO] Downloading from eclipse.maven.central.mirror: https://repo.eclipse.org/content/repositories/maven_central/org/slf4j/slf4j-api/1.5.6/slf4j-api-1.5.6.jar
[INFO] Downloaded from eclipse.maven.central.mirror: https://repo.eclipse.org/content/repositories/maven_central/org/apache/maven/maven-plugin-parameter-documenter/2.2.1/maven-plugin-parameter-documenter-2.2.1.jar (22 kB at 331 kB/s)
[INFO] Downloading from eclipse.maven.central.mirror: https://repo.eclipse.org/content/repositories/maven_central/org/slf4j/jcl-over-slf4j/1.5.6/jcl-over-slf4j-1.5.6.jar
[INFO] Downloaded from eclipse.maven.central.mirror: https://repo.eclipse.org/content/repositories/maven_central/org/slf4j/slf4j-api/1.5.6/slf4j-api-1.5.6.jar (22 kB at 328 kB/s)
[INFO] Downloading from eclipse.maven.central.mirror: https://repo.eclipse.org/content/repositories/maven_central/org/apache/maven/maven-profile/2.2.1/maven-profile-2.2.1.jar
[INFO] Downloaded from eclipse.maven.central.mirror: https://repo.eclipse.org/content/repositories/maven_central/org/slf4j/jcl-over-slf4j/1.5.6/jcl-over-slf4j-1.5.6.jar (17 kB at 214 kB/s)
[INFO] Downloading from eclipse.maven.central.mirror: https://repo.eclipse.org/content/repositories/maven_central/org/apache/maven/maven-repository-metadata/2.2.1/maven-repository-metadata-2.2.1.jar
[INFO] Downloaded from eclipse.maven.central.mirror: https://repo.eclipse.org/content/repositories/maven_central/org/apache/maven/maven-repository-metadata/2.2.1/maven-repository-metadata-2.2.1.jar (26 kB at 321 kB/s)
[INFO] Downloading from eclipse.maven.central.mirror: https://repo.eclipse.org/content/repositories/maven_central/org/apache/maven/maven-error-diagnostics/2.2.1/maven-error-diagnostics-2.2.1.jar
[INFO] Downloaded from eclipse.maven.central.mirror: https://repo.eclipse.org/content/repositories/maven_central/org/apache/maven/maven-error-diagnostics/2.2.1/maven-error-diagnostics-2.2.1.jar (13 kB at 157 kB/s)
[INFO] Downloading from eclipse.maven.central.mirror: https://repo.eclipse.org/content/repositories/maven_central/org/apache/maven/maven-artifact-manager/2.2.1/maven-artifact-manager-2.2.1.jar
[INFO] Downloaded from eclipse.maven.central.mirror: https://repo.eclipse.org/content/repositories/maven_central/org/apache/maven/maven-profile/2.2.1/maven-profile-2.2.1.jar (35 kB at 411 kB/s)
[INFO] Downloading from eclipse.maven.central.mirror: https://repo.eclipse.org/content/repositories/maven_central/backport-util-concurrent/backport-util-concurrent/3.1/backport-util-concurrent-3.1.jar
[INFO] Downloaded from eclipse.maven.central.mirror: https://repo.eclipse.org/content/repositories/maven_central/org/apache/maven/maven-artifact-manager/2.2.1/maven-artifact-manager-2.2.1.jar (68 kB at 777 kB/s)
[INFO] Downloading from eclipse.maven.central.mirror: https://repo.eclipse.org/content/repositories/maven_central/org/apache/maven/maven-monitor/2.2.1/maven-monitor-2.2.1.jar
[INFO] Downloaded from eclipse.maven.central.mirror: https://repo.eclipse.org/content/repositories/maven_central/org/apache/maven/maven-settings/2.2.1/maven-settings-2.2.1.jar (49 kB at 516 kB/s)
[INFO] Downloading from eclipse.maven.central.mirror: https://repo.eclipse.org/content/repositories/maven_central/org/apache/maven/maven-model/2.2.1/maven-model-2.2.1.jar
[INFO] Downloaded from eclipse.maven.central.mirror: https://repo.eclipse.org/content/repositories/maven_central/com/thomasjensen/checkstyle/addons/checkstyle-addons/4.0.1/checkstyle-addons-4.0.1.jar (79 kB at 819 kB/s)
[INFO] Downloading from eclipse.maven.central.mirror: https://repo.eclipse.org/content/repositories/maven_central/org/apache/maven/maven-plugin-api/2.2.1/maven-plugin-api-2.2.1.jar
[INFO] Downloaded from eclipse.maven.central.mirror: https://repo.eclipse.org/content/repositories/maven_central/backport-util-concurrent/backport-util-concurrent/3.1/backport-util-concurrent-3.1.jar (332 kB at 3.5 MB/s)
[INFO] Downloading from eclipse.maven.central.mirror: https://repo.eclipse.org/content/repositories/maven_central/org/apache/maven/maven-plugin-descriptor/2.2.1/maven-plugin-descriptor-2.2.1.jar
[INFO] Downloaded from eclipse.maven.central.mirror: https://repo.eclipse.org/content/repositories/maven_central/org/apache/maven/maven-plugin-descriptor/2.2.1/maven-plugin-descriptor-2.2.1.jar (39 kB at 401 kB/s)
[INFO] Downloading from eclipse.maven.central.mirror: https://repo.eclipse.org/content/repositories/maven_central/org/apache/maven/maven-project/2.2.1/maven-project-2.2.1.jar
[INFO] Downloaded from eclipse.maven.central.mirror: https://repo.eclipse.org/content/repositories/maven_central/org/apache/maven/maven-model/2.2.1/maven-model-2.2.1.jar (88 kB at 885 kB/s)
[INFO] Downloading from eclipse.maven.central.mirror: https://repo.eclipse.org/content/repositories/maven_central/org/apache/maven/maven-plugin-registry/2.2.1/maven-plugin-registry-2.2.1.jar
[INFO] Downloaded from eclipse.maven.central.mirror: https://repo.eclipse.org/content/repositories/maven_central/org/apache/maven/maven-monitor/2.2.1/maven-monitor-2.2.1.jar (10 kB at 102 kB/s)
[INFO] Downloading from eclipse.maven.central.mirror: https://repo.eclipse.org/content/repositories/maven_central/org/codehaus/plexus/plexus-resources/1.0.1/plexus-resources-1.0.1.jar
[INFO] Downloaded from eclipse.maven.central.mirror: https://repo.eclipse.org/content/repositories/maven_central/org/apache/maven/maven-project/2.2.1/maven-project-2.2.1.jar (156 kB at 1.3 MB/s)
[INFO] Downloading from eclipse.maven.central.mirror: https://repo.eclipse.org/content/repositories/maven_central/org/codehaus/plexus/plexus-utils/3.0.20/plexus-utils-3.0.20.jar
[INFO] Downloaded from eclipse.maven.central.mirror: https://repo.eclipse.org/content/repositories/maven_central/org/apache/maven/maven-plugin-registry/2.2.1/maven-plugin-registry-2.2.1.jar (30 kB at 242 kB/s)
[INFO] Downloading from eclipse.maven.central.mirror: https://repo.eclipse.org/content/repositories/maven_central/org/codehaus/plexus/plexus-interpolation/1.21/plexus-interpolation-1.21.jar
[INFO] Downloaded from eclipse.maven.central.mirror: https://repo.eclipse.org/content/repositories/maven_central/org/apache/maven/maven-plugin-api/2.2.1/maven-plugin-api-2.2.1.jar (12 kB at 97 kB/s)
[INFO] Downloading from eclipse.maven.central.mirror: https://repo.eclipse.org/content/repositories/maven_central/org/codehaus/plexus/plexus-velocity/1.1.8/plexus-velocity-1.1.8.jar
[INFO] Downloaded from eclipse.maven.central.mirror: https://repo.eclipse.org/content/repositories/maven_central/com/puppycrawl/tools/checkstyle/7.6/checkstyle-7.6.jar (1.2 MB at 7.6 MB/s)
[INFO] Downloaded from eclipse.maven.central.mirror: https://repo.eclipse.org/content/repositories/maven_central/org/codehaus/plexus/plexus-interpolation/1.21/plexus-interpolation-1.21.jar (62 kB at 386 kB/s)
[INFO] Downloaded from eclipse.maven.central.mirror: https://repo.eclipse.org/content/repositories/maven_central/org/codehaus/plexus/plexus-velocity/1.1.8/plexus-velocity-1.1.8.jar (7.9 kB at 46 kB/s)
[INFO] Downloaded from eclipse.maven.central.mirror: https://repo.eclipse.org/content/repositories/maven_central/org/codehaus/plexus/plexus-utils/3.0.20/plexus-utils-3.0.20.jar (243 kB at 1.4 MB/s)
[INFO] Downloaded from eclipse.maven.central.mirror: https://repo.eclipse.org/content/repositories/maven_central/org/codehaus/plexus/plexus-resources/1.0.1/plexus-resources-1.0.1.jar (22 kB at 19 kB/s)
[INFO] 
[INFO] --- jacoco-maven-plugin:0.8.6:prepare-agent (jacoco-initialize) @ org.eclipse.winery.repository ---
[INFO] argLine set to -javaagent:/home/jenkins/.m2/repository/org/jacoco/org.jacoco.agent/0.8.6/org.jacoco.agent-0.8.6-runtime.jar=destfile=/home/jenkins/agent/workspace/winery-pr/org.eclipse.winery.repository/target/jacoco.exec,append=false
[INFO] 
[INFO] --- build-helper-maven-plugin:1.8:add-source (add-source) @ org.eclipse.winery.repository ---
[INFO] Downloading from eclipse.maven.central.mirror: https://repo.eclipse.org/content/repositories/maven_central/org/codehaus/plexus/plexus-utils/1.5.8/plexus-utils-1.5.8.jar
[INFO] Downloaded from eclipse.maven.central.mirror: https://repo.eclipse.org/content/repositories/maven_central/org/codehaus/plexus/plexus-utils/1.5.8/plexus-utils-1.5.8.jar (268 kB at 24 MB/s)
[INFO] Source directory: /home/jenkins/agent/workspace/winery-pr/org.eclipse.winery.repository/target/generated-sources/java added.
[INFO] 
[INFO] --- maven-resources-plugin:2.6:resources (default-resources) @ org.eclipse.winery.repository ---
[INFO] Using 'UTF-8' encoding to copy filtered resources.
[INFO] Copying 0 resource
[INFO] Copying 1 resource
[INFO] skip non existing resourceDirectory /home/jenkins/agent/workspace/winery-pr/org.eclipse.winery.repository/src/main/templates
[INFO] 
[INFO] --- maven-compiler-plugin:3.1:compile (default-compile) @ org.eclipse.winery.repository ---
[INFO] Changes detected - recompiling the module!
[INFO] Compiling 176 source files to /home/jenkins/agent/workspace/winery-pr/org.eclipse.winery.repository/target/classes
[WARNING] /home/jenkins/agent/workspace/winery-pr/org.eclipse.winery.repository/src/main/java/org/eclipse/winery/repository/yaml/export/YamlExportAdjustmentsBuilder.java: Some input files use or override a deprecated API.
[WARNING] /home/jenkins/agent/workspace/winery-pr/org.eclipse.winery.repository/src/main/java/org/eclipse/winery/repository/yaml/export/YamlExportAdjustmentsBuilder.java: Recompile with -Xlint:deprecation for details.
[WARNING] /home/jenkins/agent/workspace/winery-pr/org.eclipse.winery.repository/src/main/java/org/eclipse/winery/repository/backend/IWineryRepositoryCommon.java: Some input files use unchecked or unsafe operations.
[WARNING] /home/jenkins/agent/workspace/winery-pr/org.eclipse.winery.repository/src/main/java/org/eclipse/winery/repository/backend/IWineryRepositoryCommon.java: Recompile with -Xlint:unchecked for details.
[INFO] 
[INFO] --- maven-resources-plugin:2.6:testResources (default-testResources) @ org.eclipse.winery.repository ---
[INFO] Using 'UTF-8' encoding to copy filtered resources.
[INFO] Copying 161 resources
[INFO] 
[INFO] --- maven-compiler-plugin:3.1:testCompile (default-testCompile) @ org.eclipse.winery.repository ---
[INFO] Changes detected - recompiling the module!
[INFO] Compiling 36 source files to /home/jenkins/agent/workspace/winery-pr/org.eclipse.winery.repository/target/test-classes
[WARNING] /home/jenkins/agent/workspace/winery-pr/org.eclipse.winery.repository/src/test/java/org/eclipse/winery/repository/xml/XmlRepositoryIntegrationTests.java: Some input files use or override a deprecated API.
[WARNING] /home/jenkins/agent/workspace/winery-pr/org.eclipse.winery.repository/src/test/java/org/eclipse/winery/repository/xml/XmlRepositoryIntegrationTests.java: Recompile with -Xlint:deprecation for details.
[INFO] 
[INFO] --- maven-surefire-plugin:3.0.0-M5:test (default-test) @ org.eclipse.winery.repository ---
[INFO] 
[INFO] -------------------------------------------------------
[INFO]  T E S T S
[INFO] -------------------------------------------------------
[INFO] Running org.eclipse.winery.repository.driverspecificationandinjection.DriverInjectionTest
15:51:45.141 [FileStoreAttributeReader-2] WARN  org.eclipse.jgit.util.FS:606 saveToConfig - locking FileBasedConfig[/home/jenkins/.config/jgit/config] failed after 5 retries
[INFO] Tests run: 2, Failures: 0, Errors: 0, Skipped: 0, Time elapsed: 13.66 s - in org.eclipse.winery.repository.driverspecificationandinjection.DriverInjectionTest
[INFO] Running org.eclipse.winery.repository.driverspecificationandinjection.DASpecificationTest
[INFO] Tests run: 5, Failures: 0, Errors: 0, Skipped: 0, Time elapsed: 0.736 s - in org.eclipse.winery.repository.driverspecificationandinjection.DASpecificationTest
[INFO] Running org.eclipse.winery.repository.yaml.YamlReaderTest
[INFO] Tests run: 25, Failures: 0, Errors: 0, Skipped: 0, Time elapsed: 0.344 s - in org.eclipse.winery.repository.yaml.YamlReaderTest
[INFO] Running org.eclipse.winery.repository.yaml.YamlWriterTests
[INFO] Tests run: 20, Failures: 0, Errors: 0, Skipped: 0, Time elapsed: 0.079 s - in org.eclipse.winery.repository.yaml.YamlWriterTests
[INFO] Running org.eclipse.winery.repository.yaml.YamlRepositoryIntegrationTests
15:51:59.690 [main] INFO  o.e.w.common.json.JacksonProvider:36 <clinit> - Initializing json mapper...
15:51:59.691 [main] INFO  o.e.w.common.json.JacksonProvider:47 <clinit> - Initialized JsonMapper with VisibilityChecker [Visibility: getter=ANY,isGetter=ANY,setter=ANY,creator=ANY,field=PUBLIC_ONLY]
[WARNING] Tests run: 4, Failures: 0, Errors: 0, Skipped: 1, Time elapsed: 1.074 s - in org.eclipse.winery.repository.yaml.YamlRepositoryIntegrationTests
[INFO] Running org.eclipse.winery.repository.backend.xsd.RepositoryBasedXsdImportManagerTest
[INFO] Tests run: 2, Failures: 0, Errors: 0, Skipped: 0, Time elapsed: 0.635 s - in org.eclipse.winery.repository.backend.xsd.RepositoryBasedXsdImportManagerTest
[INFO] Running org.eclipse.winery.repository.backend.BackendUtilsTest
[INFO] Tests run: 9, Failures: 0, Errors: 0, Skipped: 0, Time elapsed: 0.682 s - in org.eclipse.winery.repository.backend.BackendUtilsTest
[INFO] Running org.eclipse.winery.repository.backend.selfcontainmentpackager.ScriptPluginTest
15:52:01.961 [main] INFO  o.e.w.r.b.s.ScriptPlugin:205 createDeploymentArtifact - Executing command: "apt download $(apt-cache depends --recurse --no-recommends --no-suggests --no-conflicts --no-breaks --no-replaces --no-enhances --no-pre-depends mysql-server-5.7 | grep "^\w")"
15:52:01.972 [main] ERROR o.e.w.r.b.s.ScriptPlugin:228 createDeploymentArtifact - Error while downloading artifacts...
java.io.IOException: Cannot run program "apt download $(apt-cache depends --recurse --no-recommends --no-suggests --no-conflicts --no-breaks --no-replaces --no-enhances --no-pre-depends mysql-server-5.7 | grep "^\w")" (in directory "/tmp/MySQL-DBMS_5.7-Install-w1-mysql-server-5.7-DA-w1-wip15600929962203635602"): error=2, No such file or directory
	at java.lang.ProcessBuilder.start(ProcessBuilder.java:1048)
	at org.eclipse.winery.repository.converter.support.Utils.execute(Utils.java:209)
	at org.eclipse.winery.repository.backend.selfcontainmentpackager.ScriptPlugin.createDeploymentArtifact(ScriptPlugin.java:213)
	at org.eclipse.winery.repository.backend.selfcontainmentpackager.ScriptPlugin.lambda$downloadDependenciesBasedOnArtifact$0(ScriptPlugin.java:162)
	at java.util.Iterator.forEachRemaining(Iterator.java:116)
	at org.eclipse.winery.repository.backend.selfcontainmentpackager.ScriptPlugin.downloadDependenciesBasedOnArtifact(ScriptPlugin.java:161)
	at org.eclipse.winery.repository.backend.selfcontainmentpackager.ScriptPluginTest.downloadDeps(ScriptPluginTest.java:42)
	at sun.reflect.NativeMethodAccessorImpl.invoke0(Native Method)
	at sun.reflect.NativeMethodAccessorImpl.invoke(NativeMethodAccessorImpl.java:62)
	at sun.reflect.DelegatingMethodAccessorImpl.invoke(DelegatingMethodAccessorImpl.java:43)
	at java.lang.reflect.Method.invoke(Method.java:498)
	at org.junit.platform.commons.util.ReflectionUtils.invokeMethod(ReflectionUtils.java:686)
	at org.junit.jupiter.engine.execution.MethodInvocation.proceed(MethodInvocation.java:60)
	at org.junit.jupiter.engine.execution.InvocationInterceptorChain$ValidatingInvocation.proceed(InvocationInterceptorChain.java:131)
	at org.junit.jupiter.engine.extension.TimeoutExtension.intercept(TimeoutExtension.java:149)
	at org.junit.jupiter.engine.extension.TimeoutExtension.interceptTestableMethod(TimeoutExtension.java:140)
	at org.junit.jupiter.engine.extension.TimeoutExtension.interceptTestMethod(TimeoutExtension.java:84)
	at org.junit.jupiter.engine.execution.ExecutableInvoker$ReflectiveInterceptorCall.lambda$ofVoidMethod$0(ExecutableInvoker.java:115)
	at org.junit.jupiter.engine.execution.ExecutableInvoker.lambda$invoke$0(ExecutableInvoker.java:105)
	at org.junit.jupiter.engine.execution.InvocationInterceptorChain$InterceptedInvocation.proceed(InvocationInterceptorChain.java:106)
	at org.junit.jupiter.engine.execution.InvocationInterceptorChain.proceed(InvocationInterceptorChain.java:64)
	at org.junit.jupiter.engine.execution.InvocationInterceptorChain.chainAndInvoke(InvocationInterceptorChain.java:45)
	at org.junit.jupiter.engine.execution.InvocationInterceptorChain.invoke(InvocationInterceptorChain.java:37)
	at org.junit.jupiter.engine.execution.ExecutableInvoker.invoke(ExecutableInvoker.java:104)
	at org.junit.jupiter.engine.execution.ExecutableInvoker.invoke(ExecutableInvoker.java:98)
	at org.junit.jupiter.engine.descriptor.TestMethodTestDescriptor.lambda$invokeTestMethod$6(TestMethodTestDescriptor.java:205)
	at org.junit.platform.engine.support.hierarchical.ThrowableCollector.execute(ThrowableCollector.java:73)
	at org.junit.jupiter.engine.descriptor.TestMethodTestDescriptor.invokeTestMethod(TestMethodTestDescriptor.java:201)
	at org.junit.jupiter.engine.descriptor.TestMethodTestDescriptor.execute(TestMethodTestDescriptor.java:137)
	at org.junit.jupiter.engine.descriptor.TestMethodTestDescriptor.execute(TestMethodTestDescriptor.java:71)
	at org.junit.platform.engine.support.hierarchical.NodeTestTask.lambda$executeRecursively$5(NodeTestTask.java:135)
	at org.junit.platform.engine.support.hierarchical.ThrowableCollector.execute(ThrowableCollector.java:73)
	at org.junit.platform.engine.support.hierarchical.NodeTestTask.lambda$executeRecursively$7(NodeTestTask.java:125)
	at org.junit.platform.engine.support.hierarchical.Node.around(Node.java:135)
	at org.junit.platform.engine.support.hierarchical.NodeTestTask.lambda$executeRecursively$8(NodeTestTask.java:123)
	at org.junit.platform.engine.support.hierarchical.ThrowableCollector.execute(ThrowableCollector.java:73)
	at org.junit.platform.engine.support.hierarchical.NodeTestTask.executeRecursively(NodeTestTask.java:122)
	at org.junit.platform.engine.support.hierarchical.NodeTestTask.execute(NodeTestTask.java:80)
	at java.util.ArrayList.forEach(ArrayList.java:1257)
	at org.junit.platform.engine.support.hierarchical.SameThreadHierarchicalTestExecutorService.invokeAll(SameThreadHierarchicalTestExecutorService.java:38)
	at org.junit.platform.engine.support.hierarchical.NodeTestTask.lambda$executeRecursively$5(NodeTestTask.java:139)
	at org.junit.platform.engine.support.hierarchical.ThrowableCollector.execute(ThrowableCollector.java:73)
	at org.junit.platform.engine.support.hierarchical.NodeTestTask.lambda$executeRecursively$7(NodeTestTask.java:125)
	at org.junit.platform.engine.support.hierarchical.Node.around(Node.java:135)
	at org.junit.platform.engine.support.hierarchical.NodeTestTask.lambda$executeRecursively$8(NodeTestTask.java:123)
	at org.junit.platform.engine.support.hierarchical.ThrowableCollector.execute(ThrowableCollector.java:73)
	at org.junit.platform.engine.support.hierarchical.NodeTestTask.executeRecursively(NodeTestTask.java:122)
	at org.junit.platform.engine.support.hierarchical.NodeTestTask.execute(NodeTestTask.java:80)
	at java.util.ArrayList.forEach(ArrayList.java:1257)
	at org.junit.platform.engine.support.hierarchical.SameThreadHierarchicalTestExecutorService.invokeAll(SameThreadHierarchicalTestExecutorService.java:38)
	at org.junit.platform.engine.support.hierarchical.NodeTestTask.lambda$executeRecursively$5(NodeTestTask.java:139)
	at org.junit.platform.engine.support.hierarchical.ThrowableCollector.execute(ThrowableCollector.java:73)
	at org.junit.platform.engine.support.hierarchical.NodeTestTask.lambda$executeRecursively$7(NodeTestTask.java:125)
	at org.junit.platform.engine.support.hierarchical.Node.around(Node.java:135)
	at org.junit.platform.engine.support.hierarchical.NodeTestTask.lambda$executeRecursively$8(NodeTestTask.java:123)
	at org.junit.platform.engine.support.hierarchical.ThrowableCollector.execute(ThrowableCollector.java:73)
	at org.junit.platform.engine.support.hierarchical.NodeTestTask.executeRecursively(NodeTestTask.java:122)
	at org.junit.platform.engine.support.hierarchical.NodeTestTask.execute(NodeTestTask.java:80)
	at org.junit.platform.engine.support.hierarchical.SameThreadHierarchicalTestExecutorService.submit(SameThreadHierarchicalTestExecutorService.java:32)
	at org.junit.platform.engine.support.hierarchical.HierarchicalTestExecutor.execute(HierarchicalTestExecutor.java:57)
	at org.junit.platform.engine.support.hierarchical.HierarchicalTestEngine.execute(HierarchicalTestEngine.java:51)
	at org.junit.platform.launcher.core.DefaultLauncher.execute(DefaultLauncher.java:248)
	at org.junit.platform.launcher.core.DefaultLauncher.lambda$execute$5(DefaultLauncher.java:211)
	at org.junit.platform.launcher.core.DefaultLauncher.withInterceptedStreams(DefaultLauncher.java:226)
	at org.junit.platform.launcher.core.DefaultLauncher.execute(DefaultLauncher.java:199)
	at org.junit.platform.launcher.core.DefaultLauncher.execute(DefaultLauncher.java:132)
	at org.apache.maven.surefire.junitplatform.JUnitPlatformProvider.execute(JUnitPlatformProvider.java:188)
	at org.apache.maven.surefire.junitplatform.JUnitPlatformProvider.invokeAllTests(JUnitPlatformProvider.java:154)
	at org.apache.maven.surefire.junitplatform.JUnitPlatformProvider.invoke(JUnitPlatformProvider.java:128)
	at org.apache.maven.surefire.booter.ForkedBooter.runSuitesInProcess(ForkedBooter.java:428)
	at org.apache.maven.surefire.booter.ForkedBooter.execute(ForkedBooter.java:162)
	at org.apache.maven.surefire.booter.ForkedBooter.run(ForkedBooter.java:562)
	at org.apache.maven.surefire.booter.ForkedBooter.main(ForkedBooter.java:548)
Caused by: java.io.IOException: error=2, No such file or directory
	at java.lang.UNIXProcess.forkAndExec(Native Method)
	at java.lang.UNIXProcess.<init>(UNIXProcess.java:247)
	at java.lang.ProcessImpl.start(ProcessImpl.java:134)
	at java.lang.ProcessBuilder.start(ProcessBuilder.java:1029)
	... 72 common frames omitted
[ERROR] Tests run: 1, Failures: 1, Errors: 0, Skipped: 0, Time elapsed: 0.48 s <<< FAILURE! - in org.eclipse.winery.repository.backend.selfcontainmentpackager.ScriptPluginTest
[ERROR] org.eclipse.winery.repository.backend.selfcontainmentpackager.ScriptPluginTest.downloadDeps  Time elapsed: 0.295 s  <<< FAILURE!
org.opentest4j.AssertionFailedError: expected: <true> but was: <false>
	at org.eclipse.winery.repository.backend.selfcontainmentpackager.ScriptPluginTest.downloadDeps(ScriptPluginTest.java:65)

[INFO] Running org.eclipse.winery.repository.backend.consistencycheck.ConsistencyCheckerTest
15:52:04.134 [main] INFO  o.e.w.c.configuration.Environment:147 getConfigFromFile - Winery config file: /home/jenkins/.winery/winery.yml
15:52:05.852 [main] ERROR o.eclipse.winery.model.ids.Namespace:26 <init> - Empty URI has been passed to Namespace constructor.
15:52:05.870 [main] ERROR o.e.w.r.export.ToscaExportUtil:161 processDefinitionsElement - Component instance RelationshipType RelationshipTypeWithoutProperties in namespace  does not exist.
15:52:05.877 [main] ERROR o.eclipse.winery.model.ids.Namespace:26 <init> - Empty URI has been passed to Namespace constructor.
15:52:05.880 [main] ERROR o.e.w.r.export.ToscaExportUtil:161 processDefinitionsElement - Component instance RelationshipType RelationshlpTypeWithValidSourceAndTarget_w1-wip1 in namespace  does not exist.
15:52:05.889 [main] ERROR o.eclipse.winery.model.ids.Namespace:26 <init> - Empty URI has been passed to Namespace constructor.
15:52:05.893 [main] ERROR o.e.w.r.export.ToscaExportUtil:161 processDefinitionsElement - Component instance RelationshipType RelationshipTypeWithoutProperties in namespace  does not exist.
15:52:05.902 [main] ERROR o.eclipse.winery.model.ids.Namespace:26 <init> - Empty URI has been passed to Namespace constructor.
15:52:05.906 [main] ERROR o.e.w.r.export.ToscaExportUtil:161 processDefinitionsElement - Component instance RelationshipType RelationshipTypeWithoutProperties in namespace  does not exist.
[INFO] Tests run: 9, Failures: 0, Errors: 0, Skipped: 0, Time elapsed: 11.659 s - in org.eclipse.winery.repository.backend.consistencycheck.ConsistencyCheckerTest
[INFO] Running org.eclipse.winery.repository.backend.filebased.JsonBasedNamespaceManagerTest
[INFO] Tests run: 1, Failures: 0, Errors: 0, Skipped: 0, Time elapsed: 0.001 s - in org.eclipse.winery.repository.backend.filebased.JsonBasedNamespaceManagerTest
[INFO] Running org.eclipse.winery.repository.backend.filebased.ConfigurationBasedNamespaceManagerTest
[INFO] Tests run: 11, Failures: 0, Errors: 0, Skipped: 0, Time elapsed: 0.006 s - in org.eclipse.winery.repository.backend.filebased.ConfigurationBasedNamespaceManagerTest
[INFO] Running org.eclipse.winery.repository.backend.IRepositoryTest
[INFO] Tests run: 2, Failures: 0, Errors: 0, Skipped: 0, Time elapsed: 0.723 s - in org.eclipse.winery.repository.backend.IRepositoryTest
[INFO] Running org.eclipse.winery.repository.JAXBSupportTest
15:52:14.382 [main] WARN  o.e.winery.repository.JAXBSupport:93 createMarshaller - No Prefix Mapper was passed for Marshaller creation!
[INFO] Tests run: 3, Failures: 0, Errors: 0, Skipped: 0, Time elapsed: 0.001 s - in org.eclipse.winery.repository.JAXBSupportTest
[INFO] Running org.eclipse.winery.repository.targetallocation.util.TopologyMappingsWrapperTest
[INFO] Tests run: 21, Failures: 0, Errors: 0, Skipped: 0, Time elapsed: 3.445 s - in org.eclipse.winery.repository.targetallocation.util.TopologyMappingsWrapperTest
[INFO] Running org.eclipse.winery.repository.targetallocation.util.AllocationUtilsTest
[INFO] Tests run: 5, Failures: 0, Errors: 0, Skipped: 0, Time elapsed: 0.794 s - in org.eclipse.winery.repository.targetallocation.util.AllocationUtilsTest
[INFO] Running org.eclipse.winery.repository.targetallocation.criteria.minhosts.MinHostsTest
[INFO] Tests run: 8, Failures: 0, Errors: 0, Skipped: 0, Time elapsed: 2.129 s - in org.eclipse.winery.repository.targetallocation.criteria.minhosts.MinHostsTest
[INFO] Running org.eclipse.winery.repository.targetallocation.criteria.fulfilpolicies.FulfillPoliciesTest
[INFO] Tests run: 5, Failures: 0, Errors: 0, Skipped: 0, Time elapsed: 1.926 s - in org.eclipse.winery.repository.targetallocation.criteria.fulfilpolicies.FulfillPoliciesTest
[INFO] Running org.eclipse.winery.repository.targetallocation.criteria.minexternalconnections.KargerMinCutVariationTest
[INFO] Tests run: 2, Failures: 0, Errors: 0, Skipped: 0, Time elapsed: 0.36 s - in org.eclipse.winery.repository.targetallocation.criteria.minexternalconnections.KargerMinCutVariationTest
[INFO] Running org.eclipse.winery.repository.targetallocation.criteria.minexternalconnections.ConnectsToGraphTest
[INFO] Tests run: 2, Failures: 0, Errors: 0, Skipped: 0, Time elapsed: 0.35 s - in org.eclipse.winery.repository.targetallocation.criteria.minexternalconnections.ConnectsToGraphTest
[INFO] Running org.eclipse.winery.repository.targetallocation.criteria.minexternalconnections.MinExternalConnectionsTest
[INFO] Tests run: 3, Failures: 0, Errors: 0, Skipped: 0, Time elapsed: 1.701 s - in org.eclipse.winery.repository.targetallocation.criteria.minexternalconnections.MinExternalConnectionsTest
[INFO] Running org.eclipse.winery.repository.xml.XmlRepositoryIntegrationTests
[WARNING] Tests run: 2, Failures: 0, Errors: 0, Skipped: 1, Time elapsed: 0.538 s - in org.eclipse.winery.repository.xml.XmlRepositoryIntegrationTests
[INFO] Running org.eclipse.winery.repository.xml.export.XmlModelJAXBSupportTests
15:52:25.634 [main] WARN  o.e.winery.repository.JAXBSupport:88 createMarshaller - No Prefix Mapper was passed for Marshaller creation!
[INFO] Tests run: 3, Failures: 0, Errors: 0, Skipped: 0, Time elapsed: 0.001 s - in org.eclipse.winery.repository.xml.export.XmlModelJAXBSupportTests
[INFO] Running org.eclipse.winery.repository.ImportUtilsTest
[INFO] Tests run: 1, Failures: 0, Errors: 0, Skipped: 0, Time elapsed: 0.337 s - in org.eclipse.winery.repository.ImportUtilsTest
[INFO] Running org.eclipse.winery.repository.filebased.MultiRepositoryManagerTest
15:52:25.998 [main] INFO  o.e.w.c.configuration.Environment:147 getConfigFromFile - Winery config file: /home/jenkins/.winery/winery.yml
15:52:26.008 [main] INFO  o.e.w.c.configuration.Environment:147 getConfigFromFile - Winery config file: /home/jenkins/.winery/winery.yml
15:52:26.059 [main] INFO  o.e.w.r.filebased.MultiRepository:271 readRepositoriesConfig - Found Repositories file
15:52:26.775 [main] INFO  o.e.w.r.filebased.MultiRepository:271 readRepositoriesConfig - Found Repositories file
15:52:27.093 [main] INFO  o.e.w.c.configuration.Environment:147 getConfigFromFile - Winery config file: /home/jenkins/.winery/winery.yml
15:52:27.294 [main] INFO  o.e.w.r.filebased.MultiRepository:271 readRepositoriesConfig - Found Repositories file
15:52:30.688 [main] INFO  o.e.w.c.configuration.Environment:147 getConfigFromFile - Winery config file: /home/jenkins/.winery/winery.yml
15:52:30.807 [main] INFO  o.e.w.r.filebased.MultiRepository:271 readRepositoriesConfig - Found Repositories file
15:52:33.532 [main] INFO  o.e.w.r.filebased.MultiRepository:271 readRepositoriesConfig - Found Repositories file
15:52:33.538 [main] INFO  o.e.w.c.configuration.Environment:147 getConfigFromFile - Winery config file: /home/jenkins/.winery/winery.yml
[WARNING] Tests run: 6, Failures: 0, Errors: 0, Skipped: 1, Time elapsed: 7.656 s - in org.eclipse.winery.repository.filebased.MultiRepositoryManagerTest
[INFO] Running org.eclipse.winery.repository.filebased.management.RepositoryResolverTest
[INFO] Tests run: 7, Failures: 0, Errors: 0, Skipped: 0, Time elapsed: 1.301 s - in org.eclipse.winery.repository.filebased.management.RepositoryResolverTest
[INFO] Running org.eclipse.winery.repository.filebased.XmlRepositoryTest
[INFO] Tests run: 15, Failures: 0, Errors: 0, Skipped: 0, Time elapsed: 4.09 s - in org.eclipse.winery.repository.filebased.XmlRepositoryTest
[INFO] Running org.eclipse.winery.repository.export.CsarExporterTest
[WARNING] Tests run: 8, Failures: 0, Errors: 0, Skipped: 4, Time elapsed: 1.546 s - in org.eclipse.winery.repository.export.CsarExporterTest
[INFO] Running org.eclipse.winery.repository.common.UtilTests
[INFO] Tests run: 6, Failures: 0, Errors: 0, Skipped: 0, Time elapsed: 0.002 s - in org.eclipse.winery.repository.common.UtilTests
[INFO] 
[INFO] Results:
[INFO] 
[ERROR] Failures: 
[ERROR]   ScriptPluginTest.downloadDeps:65 expected: <true> but was: <false>
[INFO] 
[ERROR] Tests run: 188, Failures: 1, Errors: 0, Skipped: 7
[INFO] 
[ERROR] There are test failures.

Please refer to /home/jenkins/agent/workspace/winery-pr/org.eclipse.winery.repository/target/surefire-reports for the individual test results.
Please refer to dump files (if any exist) [date].dump, [date]-jvmRun[N].dump and [date].dumpstream.
[JENKINS] Recording test results
[INFO] 
[INFO] --- maven-jar-plugin:2.4:jar (default-jar) @ org.eclipse.winery.repository ---
[INFO] Building jar: /home/jenkins/agent/workspace/winery-pr/org.eclipse.winery.repository/target/winery.jar
[INFO] 
[INFO] >>> maven-source-plugin:3.0.1:jar (attach-sources) > generate-sources @ org.eclipse.winery.repository >>>
[INFO] 
[INFO] --- maven-checkstyle-plugin:2.17:check (checkstyle) @ org.eclipse.winery.repository ---
[INFO] 
[INFO] --- jacoco-maven-plugin:0.8.6:prepare-agent (jacoco-initialize) @ org.eclipse.winery.repository ---
[INFO] argLine set to -javaagent:/home/jenkins/.m2/repository/org/jacoco/org.jacoco.agent/0.8.6/org.jacoco.agent-0.8.6-runtime.jar=destfile=/home/jenkins/agent/workspace/winery-pr/org.eclipse.winery.repository/target/jacoco.exec,append=false
[INFO] 
[INFO] --- build-helper-maven-plugin:1.8:add-source (add-source) @ org.eclipse.winery.repository ---
[INFO] Source directory: /home/jenkins/agent/workspace/winery-pr/org.eclipse.winery.repository/target/generated-sources/java added.
[WARNING] Failed to getClass for org.apache.maven.plugins.source.SourceJarMojo
[INFO] 
[INFO] <<< maven-source-plugin:3.0.1:jar (attach-sources) < generate-sources @ org.eclipse.winery.repository <<<
[INFO] 
[INFO] 
[INFO] --- maven-source-plugin:3.0.1:jar (attach-sources) @ org.eclipse.winery.repository ---
[INFO] Building jar: /home/jenkins/agent/workspace/winery-pr/org.eclipse.winery.repository/target/winery-sources.jar
[INFO] 
[INFO] --- maven-javadoc-plugin:3.0.1:jar (attach-javadocs) @ org.eclipse.winery.repository ---
[INFO] The goal 'org.apache.maven.plugins:maven-javadoc-plugin:3.0.1:javadoc' has not been previously called for the module: 'org.eclipse.winery:org.eclipse.winery.accountability:jar:3.0.0-SNAPSHOT'. Trying to invoke it...
[WARN] Maven will be executed in interactive mode, but no input stream has been configured for this MavenInvoker instance.
[ERROR] MavenInvocationException: Error when invoking Maven, consult the invoker log file: /home/jenkins/agent/workspace/winery-pr/org.eclipse.winery.repository/target/invoker/maven-javadoc-plugin615085002.txt
[WARNING] Creating fake javadoc directory to prevent repeated invocations: /home/jenkins/agent/workspace/winery-pr/org.eclipse.winery.accountability/target/apidocs
[INFO] The goal 'org.apache.maven.plugins:maven-javadoc-plugin:3.0.1:javadoc' has not been previously called for the module: 'org.eclipse.winery:org.eclipse.winery.model.selfservice:jar:3.0.0-SNAPSHOT'. Trying to invoke it...
[WARN] Maven will be executed in interactive mode, but no input stream has been configured for this MavenInvoker instance.
[ERROR] MavenInvocationException: Error when invoking Maven, consult the invoker log file: /home/jenkins/agent/workspace/winery-pr/org.eclipse.winery.repository/target/invoker/maven-javadoc-plugin1215110983.txt
[WARNING] Creating fake javadoc directory to prevent repeated invocations: /home/jenkins/agent/workspace/winery-pr/org.eclipse.winery.model.selfservice/target/apidocs
[INFO] The goal 'org.apache.maven.plugins:maven-javadoc-plugin:3.0.1:javadoc' has not been previously called for the module: 'org.eclipse.winery:org.eclipse.winery.model.tosca.xml:jar:3.0.0-SNAPSHOT'. Trying to invoke it...
[WARN] Maven will be executed in interactive mode, but no input stream has been configured for this MavenInvoker instance.
[ERROR] MavenInvocationException: Error when invoking Maven, consult the invoker log file: /home/jenkins/agent/workspace/winery-pr/org.eclipse.winery.repository/target/invoker/maven-javadoc-plugin698700307.txt
[WARNING] Creating fake javadoc directory to prevent repeated invocations: /home/jenkins/agent/workspace/winery-pr/org.eclipse.winery.model/org.eclipse.winery.model.tosca.xml/target/apidocs
[ERROR] Error fetching link: /home/jenkins/agent/workspace/winery-pr/org.eclipse.winery.accountability/target/apidocs/package-list. Ignored it.
[ERROR] Error fetching link: /home/jenkins/agent/workspace/winery-pr/org.eclipse.winery.model.selfservice/target/apidocs/package-list. Ignored it.
[ERROR] Error fetching link: /home/jenkins/agent/workspace/winery-pr/org.eclipse.winery.model/org.eclipse.winery.model.tosca.canonical/target/apidocs/package-list. Ignored it.
[ERROR] Error fetching link: /home/jenkins/agent/workspace/winery-pr/org.eclipse.winery.model/org.eclipse.winery.model.tosca.xml/target/apidocs/package-list. Ignored it.
[INFO] 
Loading source files for package org.eclipse.winery.repository...
Constructing Javadoc information...
Standard Doclet version 1.8.0_202
Building tree for all the packages and classes...
Generating /home/jenkins/agent/workspace/winery-pr/org.eclipse.winery.repository/target/apidocs/org/eclipse/winery/repository/DateUtils.html...
Generating /home/jenkins/agent/workspace/winery-pr/org.eclipse.winery.repository/target/apidocs/org/eclipse/winery/repository/GitInfo.html...
Generating /home/jenkins/agent/workspace/winery-pr/org.eclipse.winery.repository/target/apidocs/org/eclipse/winery/repository/JAXBSupport.html...
Generating /home/jenkins/agent/workspace/winery-pr/org.eclipse.winery.repository/target/apidocs/org/eclipse/winery/repository/TestWithGitBackedRepository.html...
Generating /home/jenkins/agent/workspace/winery-pr/org.eclipse.winery.repository/target/apidocs/org/eclipse/winery/repository/TestWithGitRepoAndSshServer.html...
Generating /home/jenkins/agent/workspace/winery-pr/org.eclipse.winery.repository/target/apidocs/org/eclipse/winery/repository/TestWithGitRepoAndSshServer.SupportCommand.html...
Generating /home/jenkins/agent/workspace/winery-pr/org.eclipse.winery.repository/target/apidocs/org/eclipse/winery/repository/TestWithGitRepoAndSshServer.SupportErrorCommand.html...
Generating /home/jenkins/agent/workspace/winery-pr/org.eclipse.winery.repository/target/apidocs/org/eclipse/winery/repository/TestWithGitRepoAndSshServer.SupportSuccessCommand.html...
Generating /home/jenkins/agent/workspace/winery-pr/org.eclipse.winery.repository/target/apidocs/org/eclipse/winery/repository/package-frame.html...
Generating /home/jenkins/agent/workspace/winery-pr/org.eclipse.winery.repository/target/apidocs/org/eclipse/winery/repository/package-summary.html...
Generating /home/jenkins/agent/workspace/winery-pr/org.eclipse.winery.repository/target/apidocs/org/eclipse/winery/repository/package-tree.html...
Generating /home/jenkins/agent/workspace/winery-pr/org.eclipse.winery.repository/target/apidocs/constant-values.html...
Generating /home/jenkins/agent/workspace/winery-pr/org.eclipse.winery.repository/target/apidocs/org/eclipse/winery/repository/class-use/TestWithGitRepoAndSshServer.html...
Generating /home/jenkins/agent/workspace/winery-pr/org.eclipse.winery.repository/target/apidocs/org/eclipse/winery/repository/class-use/TestWithGitRepoAndSshServer.SupportCommand.html...
Generating /home/jenkins/agent/workspace/winery-pr/org.eclipse.winery.repository/target/apidocs/org/eclipse/winery/repository/class-use/TestWithGitRepoAndSshServer.SupportSuccessCommand.html...
Generating /home/jenkins/agent/workspace/winery-pr/org.eclipse.winery.repository/target/apidocs/org/eclipse/winery/repository/class-use/TestWithGitRepoAndSshServer.SupportErrorCommand.html...
Generating /home/jenkins/agent/workspace/winery-pr/org.eclipse.winery.repository/target/apidocs/org/eclipse/winery/repository/class-use/TestWithGitBackedRepository.html...
Generating /home/jenkins/agent/workspace/winery-pr/org.eclipse.winery.repository/target/apidocs/org/eclipse/winery/repository/class-use/JAXBSupport.html...
Generating /home/jenkins/agent/workspace/winery-pr/org.eclipse.winery.repository/target/apidocs/org/eclipse/winery/repository/class-use/GitInfo.html...
Generating /home/jenkins/agent/workspace/winery-pr/org.eclipse.winery.repository/target/apidocs/org/eclipse/winery/repository/class-use/DateUtils.html...
Generating /home/jenkins/agent/workspace/winery-pr/org.eclipse.winery.repository/target/apidocs/org/eclipse/winery/repository/package-use.html...
Building index for all the packages and classes...
Generating /home/jenkins/agent/workspace/winery-pr/org.eclipse.winery.repository/target/apidocs/overview-tree.html...
Generating /home/jenkins/agent/workspace/winery-pr/org.eclipse.winery.repository/target/apidocs/index-all.html...
Generating /home/jenkins/agent/workspace/winery-pr/org.eclipse.winery.repository/target/apidocs/deprecated-list.html...
Building index for all classes...
Generating /home/jenkins/agent/workspace/winery-pr/org.eclipse.winery.repository/target/apidocs/allclasses-frame.html...
Generating /home/jenkins/agent/workspace/winery-pr/org.eclipse.winery.repository/target/apidocs/allclasses-noframe.html...
Generating /home/jenkins/agent/workspace/winery-pr/org.eclipse.winery.repository/target/apidocs/index.html...
Generating /home/jenkins/agent/workspace/winery-pr/org.eclipse.winery.repository/target/apidocs/help-doc.html...
4 warnings
[WARNING] Javadoc Warnings
[WARNING] /home/jenkins/agent/workspace/winery-pr/org.eclipse.winery.repository/src/main/java/org/eclipse/winery/repository/JAXBSupport.java:82: warning: no @param for includeProcessingInstruction
[WARNING] public static Marshaller createMarshaller(boolean includeProcessingInstruction, NamespacePrefixMapper prefixMapper) {
[WARNING] ^
[WARNING] /home/jenkins/agent/workspace/winery-pr/org.eclipse.winery.repository/src/main/java/org/eclipse/winery/repository/JAXBSupport.java:82: warning: no @param for prefixMapper
[WARNING] public static Marshaller createMarshaller(boolean includeProcessingInstruction, NamespacePrefixMapper prefixMapper) {
[WARNING] ^
[WARNING] /home/jenkins/agent/workspace/winery-pr/org.eclipse.winery.repository/src/main/java/org/eclipse/winery/repository/JAXBSupport.java:82: warning: no @return
[WARNING] public static Marshaller createMarshaller(boolean includeProcessingInstruction, NamespacePrefixMapper prefixMapper) {
[WARNING] ^
[WARNING] /home/jenkins/agent/workspace/winery-pr/org.eclipse.winery.repository/src/main/java/org/eclipse/winery/repository/JAXBSupport.java:116: warning: no @return
[WARNING] public static Unmarshaller createUnmarshaller() {
[WARNING] ^
[INFO] Building jar: /home/jenkins/agent/workspace/winery-pr/org.eclipse.winery.repository/target/winery-javadoc.jar