UnstableConsole Output

[INFO] 
[INFO] -------< org.eclipse.winery:org.eclipse.winery.repository.rest >--------
[INFO] Building org.eclipse.winery.repository.rest 2.0.0-SNAPSHOT       [19/23]
[INFO] --------------------------------[ war ]---------------------------------
[INFO] 
[INFO] --- maven-checkstyle-plugin:2.17:check (checkstyle) @ org.eclipse.winery.repository.rest ---
[INFO] 
[INFO] --- build-helper-maven-plugin:1.8:add-source (add-source) @ org.eclipse.winery.repository.rest ---
[INFO] Source directory: /home/jenkins/agent/workspace/winery-pr/org.eclipse.winery.repository.rest/target/generated-sources/java added.
[INFO] 
[INFO] --- maven-resources-plugin:2.6:resources (default-resources) @ org.eclipse.winery.repository.rest ---
[INFO] Using 'UTF-8' encoding to copy filtered resources.
[INFO] Copying 1 resource
[INFO] Copying 2 resources
[INFO] 
[INFO] --- maven-compiler-plugin:3.1:compile (default-compile) @ org.eclipse.winery.repository.rest ---
[INFO] Changes detected - recompiling the module!
[INFO] Compiling 242 source files to /home/jenkins/agent/workspace/winery-pr/org.eclipse.winery.repository.rest/target/classes
[WARNING] /home/jenkins/agent/workspace/winery-pr/org.eclipse.winery.repository.rest/src/main/java/org/eclipse/winery/repository/rest/resources/servicetemplates/boundarydefinitions/BoundaryDefinitionsJSPData.java: /home/jenkins/agent/workspace/winery-pr/org.eclipse.winery.repository.rest/src/main/java/org/eclipse/winery/repository/rest/resources/servicetemplates/boundarydefinitions/BoundaryDefinitionsJSPData.java uses or overrides a deprecated API.
[WARNING] /home/jenkins/agent/workspace/winery-pr/org.eclipse.winery.repository.rest/src/main/java/org/eclipse/winery/repository/rest/resources/servicetemplates/boundarydefinitions/BoundaryDefinitionsJSPData.java: Recompile with -Xlint:deprecation for details.
[WARNING] /home/jenkins/agent/workspace/winery-pr/org.eclipse.winery.repository.rest/src/main/java/org/eclipse/winery/repository/rest/resources/entitytypes/nodetypes/reqandcapdefs/RequirementOrCapabilityDefinitionsResource.java: Some input files use unchecked or unsafe operations.
[WARNING] /home/jenkins/agent/workspace/winery-pr/org.eclipse.winery.repository.rest/src/main/java/org/eclipse/winery/repository/rest/resources/entitytypes/nodetypes/reqandcapdefs/RequirementOrCapabilityDefinitionsResource.java: Recompile with -Xlint:unchecked for details.
[INFO] 
[INFO] --- maven-resources-plugin:2.6:testResources (default-testResources) @ org.eclipse.winery.repository.rest ---
[INFO] Using 'UTF-8' encoding to copy filtered resources.
[INFO] Copying 218 resources
[INFO] 
[INFO] --- maven-compiler-plugin:3.1:testCompile (default-testCompile) @ org.eclipse.winery.repository.rest ---
[INFO] Changes detected - recompiling the module!
[INFO] Compiling 41 source files to /home/jenkins/agent/workspace/winery-pr/org.eclipse.winery.repository.rest/target/test-classes
[INFO] 
[INFO] --- maven-surefire-plugin:3.0.0-M4:test (default-test) @ org.eclipse.winery.repository.rest ---
[INFO] 
[INFO] -------------------------------------------------------
[INFO]  T E S T S
[INFO] -------------------------------------------------------
[INFO] Running org.eclipse.winery.repository.rest.resources.interfaces.InterfacesResourceTest
08:03:26.789 [main] INFO  o.e.w.common.json.JacksonProvider:36 <clinit> - Initializing json mapper...
08:03:26.794 [main] INFO  o.e.w.common.json.JacksonProvider:47 <clinit> - Initialized JasonMapper with VisibilityChecker [Visibility: getter=ANY,isGetter=ANY,setter=ANY,creator=ANY,field=PUBLIC_ONLY]
08:03:28.051 [main] INFO  o.e.w.c.configuration.Environment:146 getConfigFromFile - Winery config file: /home/jenkins/.winery/winery.yml
08:03:32.744 [qtp542365801-14] WARN  org.glassfish.jersey.internal.Errors:168 logErrors - The following warnings have been detected: WARNING: Return type, java.util.List<?>, of method, public java.util.List<?> org.eclipse.winery.repository.rest.resources.interfaces.InterfacesResource.onGet(java.lang.String), is not resolvable to a concrete type.

[INFO] Tests run: 1, Failures: 0, Errors: 0, Skipped: 0, Time elapsed: 8.68 s - in org.eclipse.winery.repository.rest.resources.interfaces.InterfacesResourceTest
[INFO] Running org.eclipse.winery.repository.rest.resources.entitytemplates.policytemplates.PolicyTemplatesResourceTest
[INFO] Tests run: 1, Failures: 0, Errors: 0, Skipped: 0, Time elapsed: 0.958 s - in org.eclipse.winery.repository.rest.resources.entitytemplates.policytemplates.PolicyTemplatesResourceTest
[INFO] Running org.eclipse.winery.repository.rest.resources.entitytemplates.policytemplates.PolicyTemplateResourceTest
[INFO] Tests run: 2, Failures: 0, Errors: 0, Skipped: 0, Time elapsed: 1.394 s - in org.eclipse.winery.repository.rest.resources.entitytemplates.policytemplates.PolicyTemplateResourceTest
[INFO] Running org.eclipse.winery.repository.rest.resources.entitytemplates.artifacttemplates.FilesResourceTest
[INFO] Tests run: 4, Failures: 0, Errors: 0, Skipped: 0, Time elapsed: 1.424 s - in org.eclipse.winery.repository.rest.resources.entitytemplates.artifacttemplates.FilesResourceTest
[INFO] Running org.eclipse.winery.repository.rest.resources.entitytemplates.artifacttemplates.ArtifactTemplateResourceTest
[WARNING] Tests run: 9, Failures: 0, Errors: 0, Skipped: 1, Time elapsed: 6.222 s - in org.eclipse.winery.repository.rest.resources.entitytemplates.artifacttemplates.ArtifactTemplateResourceTest
[INFO] Running org.eclipse.winery.repository.rest.resources.entitytemplates.PropertiesResourceTest
[INFO] Tests run: 6, Failures: 0, Errors: 0, Skipped: 0, Time elapsed: 4.403 s - in org.eclipse.winery.repository.rest.resources.entitytemplates.PropertiesResourceTest
[INFO] Running org.eclipse.winery.repository.rest.resources.imports.xsdimports.XSDImportResourceTest
08:03:49.660 [qtp362463583-104] WARN  org.glassfish.jersey.internal.Errors:168 logErrors - The following warnings have been detected: WARNING: Return type, java.util.List<?>, of method, public java.util.List<?> org.eclipse.winery.repository.rest.resources.imports.ImportsResource.getAllImportTypes(), is not resolvable to a concrete type.
WARNING: The resource (or sub resource) Resource{"{namespace}/", 0 child resources, 4 resource methods, 1 sub-resource locator, 4 method handler classes, 0 method handler instances} with path "{namespace}/" contains (sub) resource method(s) and sub resource locator. The resource cannot have both, methods and locator, defined on same path. The locator will be ignored.

[INFO] Tests run: 2, Failures: 0, Errors: 0, Skipped: 0, Time elapsed: 2.103 s - in org.eclipse.winery.repository.rest.resources.imports.xsdimports.XSDImportResourceTest
[INFO] Running org.eclipse.winery.repository.rest.resources.servicetemplates.boundarydefinitions.policies.PoliciesResourceTest
[INFO] Tests run: 3, Failures: 0, Errors: 0, Skipped: 0, Time elapsed: 1.935 s - in org.eclipse.winery.repository.rest.resources.servicetemplates.boundarydefinitions.policies.PoliciesResourceTest
[INFO] Running org.eclipse.winery.repository.rest.resources.servicetemplates.boundarydefinitions.interfaces.InterfacesResourceTest
[INFO] Tests run: 5, Failures: 0, Errors: 0, Skipped: 0, Time elapsed: 3.089 s - in org.eclipse.winery.repository.rest.resources.servicetemplates.boundarydefinitions.interfaces.InterfacesResourceTest
[INFO] Running org.eclipse.winery.repository.rest.resources.servicetemplates.boundarydefinitions.properties.PropertiesResourceTest
[INFO] Tests run: 1, Failures: 0, Errors: 0, Skipped: 0, Time elapsed: 0.682 s - in org.eclipse.winery.repository.rest.resources.servicetemplates.boundarydefinitions.properties.PropertiesResourceTest
[INFO] Running org.eclipse.winery.repository.rest.resources.servicetemplates.boundarydefinitions.propertymappings.PropertyMappingsTest
[INFO] Tests run: 2, Failures: 0, Errors: 0, Skipped: 0, Time elapsed: 0.895 s - in org.eclipse.winery.repository.rest.resources.servicetemplates.boundarydefinitions.propertymappings.PropertyMappingsTest
[INFO] Running org.eclipse.winery.repository.rest.resources.servicetemplates.boundarydefinitions.propertyconstraints.PropertyConstraintsResourceTest
[INFO] Tests run: 1, Failures: 0, Errors: 0, Skipped: 0, Time elapsed: 0.532 s - in org.eclipse.winery.repository.rest.resources.servicetemplates.boundarydefinitions.propertyconstraints.PropertyConstraintsResourceTest
[INFO] Running org.eclipse.winery.repository.rest.resources.servicetemplates.plans.PlansResourceTest
[INFO] Tests run: 5, Failures: 0, Errors: 0, Skipped: 0, Time elapsed: 4.604 s - in org.eclipse.winery.repository.rest.resources.servicetemplates.plans.PlansResourceTest
[INFO] Running org.eclipse.winery.repository.rest.resources.servicetemplates.topologytemplates.TopologyTemplateResourceTest
[INFO] Tests run: 20, Failures: 0, Errors: 0, Skipped: 0, Time elapsed: 15.02 s - in org.eclipse.winery.repository.rest.resources.servicetemplates.topologytemplates.TopologyTemplateResourceTest
[INFO] Running org.eclipse.winery.repository.rest.resources.servicetemplates.topologytemplates.NodeTemplateResourceTest
[INFO] Tests run: 2, Failures: 0, Errors: 0, Skipped: 0, Time elapsed: 2.782 s - in org.eclipse.winery.repository.rest.resources.servicetemplates.topologytemplates.NodeTemplateResourceTest
[INFO] Running org.eclipse.winery.repository.rest.resources.servicetemplates.ServiceTemplateResourceTest
open Requirement: requiresDryFood
matchingBasisType: Endpoint
open Requirement: requiresWarmFloor
matchingBasisType: Container
open Requirement: ReqEquipment
matchingBasisType: Container
open Requirement: requiresDryFood
matchingbasisType: Endpoint
open Requirement: requiresWarmFloor
matchingbasisType: Container
open Requirement: ReqEquipment
matchingbasisType: Container
[INFO] Tests run: 19, Failures: 0, Errors: 0, Skipped: 0, Time elapsed: 15.29 s - in org.eclipse.winery.repository.rest.resources.servicetemplates.ServiceTemplateResourceTest
[INFO] Running org.eclipse.winery.repository.rest.resources.servicetemplates.selfserviceportal.XMLTest
[INFO] Tests run: 2, Failures: 0, Errors: 0, Skipped: 0, Time elapsed: 1.105 s - in org.eclipse.winery.repository.rest.resources.servicetemplates.selfserviceportal.XMLTest
[INFO] Running org.eclipse.winery.repository.rest.resources.servicetemplates.selfserviceportal.FilesTest
[INFO] Tests run: 3, Failures: 0, Errors: 0, Skipped: 0, Time elapsed: 1.441 s - in org.eclipse.winery.repository.rest.resources.servicetemplates.selfserviceportal.FilesTest
[INFO] Running org.eclipse.winery.repository.rest.resources.entitytypes.policytypes.PolicyTypesResourceTest
[INFO] Tests run: 1, Failures: 0, Errors: 0, Skipped: 0, Time elapsed: 0.481 s - in org.eclipse.winery.repository.rest.resources.entitytypes.policytypes.PolicyTypesResourceTest
[INFO] Running org.eclipse.winery.repository.rest.resources.entitytypes.policytypes.PolicyTypeResourceTest
[INFO] Tests run: 4, Failures: 0, Errors: 0, Skipped: 0, Time elapsed: 1.807 s - in org.eclipse.winery.repository.rest.resources.entitytypes.policytypes.PolicyTypeResourceTest
[INFO] Running org.eclipse.winery.repository.rest.resources.entitytypes.policytypes.TemplatesOfOnePolicyTypeResourceTest
[INFO] Tests run: 1, Failures: 0, Errors: 0, Skipped: 0, Time elapsed: 0.555 s - in org.eclipse.winery.repository.rest.resources.entitytypes.policytypes.TemplatesOfOnePolicyTypeResourceTest
[INFO] Running org.eclipse.winery.repository.rest.resources.entitytypes.relationshiptypes.RelationshipTypeResourceTest
[INFO] Tests run: 7, Failures: 0, Errors: 0, Skipped: 0, Time elapsed: 2.549 s - in org.eclipse.winery.repository.rest.resources.entitytypes.relationshiptypes.RelationshipTypeResourceTest
[INFO] Running org.eclipse.winery.repository.rest.resources.entitytypes.artifacttypes.ArtifactTypeResourceTest
[INFO] Tests run: 6, Failures: 0, Errors: 0, Skipped: 0, Time elapsed: 4.566 s - in org.eclipse.winery.repository.rest.resources.entitytypes.artifacttypes.ArtifactTypeResourceTest
[INFO] Running org.eclipse.winery.repository.rest.resources.entitytypes.artifacttypes.TemplatesOfOneArtifactTypeResourceTest
[INFO] Tests run: 1, Failures: 0, Errors: 0, Skipped: 0, Time elapsed: 0.411 s - in org.eclipse.winery.repository.rest.resources.entitytypes.artifacttypes.TemplatesOfOneArtifactTypeResourceTest
[INFO] Running org.eclipse.winery.repository.rest.resources.entitytypes.requirementtypes.RequirementTypeResourceTest
[INFO] Tests run: 5, Failures: 0, Errors: 0, Skipped: 0, Time elapsed: 2.511 s - in org.eclipse.winery.repository.rest.resources.entitytypes.requirementtypes.RequirementTypeResourceTest
[INFO] Running org.eclipse.winery.repository.rest.resources.entitytypes.nodetypes.NodeTypeResourceTest
08:04:57.318 [qtp72223805-395] WARN  org.glassfish.jersey.internal.Errors:168 logErrors - The following warnings have been detected: WARNING: Return type, java.util.List<?>, of method, public java.util.List<?> org.eclipse.winery.repository.rest.resources.interfaces.InterfacesResource.onGet(java.lang.String), is not resolvable to a concrete type.

[INFO] Tests run: 22, Failures: 0, Errors: 0, Skipped: 0, Time elapsed: 10.558 s - in org.eclipse.winery.repository.rest.resources.entitytypes.nodetypes.NodeTypeResourceTest
[INFO] Running org.eclipse.winery.repository.rest.resources.entitytypes.nodetypes.NodeTypesResourceTest
[INFO] Tests run: 3, Failures: 0, Errors: 0, Skipped: 0, Time elapsed: 2.5 s - in org.eclipse.winery.repository.rest.resources.entitytypes.nodetypes.NodeTypesResourceTest
[INFO] Running org.eclipse.winery.repository.rest.resources.admin.NamespaceResourceTest
[INFO] Tests run: 2, Failures: 0, Errors: 0, Skipped: 0, Time elapsed: 1.462 s - in org.eclipse.winery.repository.rest.resources.admin.NamespaceResourceTest
[INFO] Running org.eclipse.winery.repository.rest.resources.artifacts.GenericArtifactsResourceTest
08:05:05.922 [qtp51432525-453] WARN  org.glassfish.jersey.internal.Errors:168 logErrors - The following warnings have been detected: WARNING: Return type, java.util.List<?>, of method, public java.util.List<?> org.eclipse.winery.repository.rest.resources.artifacts.ImplementationArtifactsResource.getInterfacesOfAssociatedType(), is not resolvable to a concrete type.

[INFO] Tests run: 1, Failures: 0, Errors: 0, Skipped: 0, Time elapsed: 1.084 s - in org.eclipse.winery.repository.rest.resources.artifacts.GenericArtifactsResourceTest
[INFO] Running org.eclipse.winery.repository.rest.resources.testrefinementmodels.TestRefinementModelsResourceTest
[ERROR] Tests run: 1, Failures: 1, Errors: 0, Skipped: 0, Time elapsed: 0.501 s <<< FAILURE! - in org.eclipse.winery.repository.rest.resources.testrefinementmodels.TestRefinementModelsResourceTest
[ERROR] org.eclipse.winery.repository.rest.resources.testrefinementmodels.TestRefinementModelsResourceTest.createPatternRefinementModel  Time elapsed: 0.188 s  <<< FAILURE!
java.lang.AssertionError: 
serviceTemplateOrNodeTypeOrNodeTypeImplementation[name=MyCoolTRM_w1-wip1]
Unexpected: relationMappings

	at org.eclipse.winery.repository.rest.resources.testrefinementmodels.TestRefinementModelsResourceTest.createPatternRefinementModel(TestRefinementModelsResourceTest.java:27)

[INFO] Running org.eclipse.winery.repository.rest.resources.placementmodels.PlacementModelsResourceTest
[INFO] Tests run: 4, Failures: 0, Errors: 0, Skipped: 0, Time elapsed: 7.595 s - in org.eclipse.winery.repository.rest.resources.placementmodels.PlacementModelsResourceTest
[INFO] Running org.eclipse.winery.repository.rest.resources.InheritanceResourceTest
[INFO] Tests run: 4, Failures: 0, Errors: 0, Skipped: 0, Time elapsed: 2.325 s - in org.eclipse.winery.repository.rest.resources.InheritanceResourceTest
[INFO] Running org.eclipse.winery.repository.rest.resources.refinementmodels.PatternRefinementModelResourceTest
[WARNING] Tests run: 3, Failures: 0, Errors: 0, Skipped: 1, Time elapsed: 1.463 s - in org.eclipse.winery.repository.rest.resources.refinementmodels.PatternRefinementModelResourceTest
[INFO] Running org.eclipse.winery.repository.rest.resources.refinementmodels.PatternRefinementModelsResourceTest
[ERROR] Tests run: 2, Failures: 1, Errors: 0, Skipped: 0, Time elapsed: 1.261 s <<< FAILURE! - in org.eclipse.winery.repository.rest.resources.refinementmodels.PatternRefinementModelsResourceTest
[ERROR] org.eclipse.winery.repository.rest.resources.refinementmodels.PatternRefinementModelsResourceTest.createPatternRefinementModel  Time elapsed: 0.437 s  <<< FAILURE!
java.lang.AssertionError: 
serviceTemplateOrNodeTypeOrNodeTypeImplementation[name=MyCoolPRM_w1-wip1]
Unexpected: relationMappings

	at org.eclipse.winery.repository.rest.resources.refinementmodels.PatternRefinementModelsResourceTest.createPatternRefinementModel(PatternRefinementModelsResourceTest.java:27)

[INFO] Running org.eclipse.winery.repository.rest.resources.entitytypeimplementations.relationshiptypeimplementations.RelationshipTypeImplementationResourceTest
[INFO] Tests run: 5, Failures: 0, Errors: 0, Skipped: 0, Time elapsed: 2.654 s - in org.eclipse.winery.repository.rest.resources.entitytypeimplementations.relationshiptypeimplementations.RelationshipTypeImplementationResourceTest
[INFO] Running org.eclipse.winery.repository.rest.resources.entitytypeimplementations.nodetypeimplementations.NodeTypeImplementationResourceTest
08:05:22.271 [qtp412191417-543] WARN  org.glassfish.jersey.internal.Errors:168 logErrors - The following warnings have been detected: WARNING: Return type, java.util.List<?>, of method, public java.util.List<?> org.eclipse.winery.repository.rest.resources.artifacts.ImplementationArtifactsResource.getInterfacesOfAssociatedType(), is not resolvable to a concrete type.

[INFO] Tests run: 6, Failures: 0, Errors: 0, Skipped: 0, Time elapsed: 3.636 s - in org.eclipse.winery.repository.rest.resources.entitytypeimplementations.nodetypeimplementations.NodeTypeImplementationResourceTest
[INFO] Running org.eclipse.winery.repository.rest.resources.MainResourceTest
[WARNING] Tests run: 1, Failures: 0, Errors: 0, Skipped: 1, Time elapsed: 0.309 s - in org.eclipse.winery.repository.rest.resources.MainResourceTest
[INFO] Running org.eclipse.winery.repository.rest.RestUtilsTest
[INFO] Tests run: 1, Failures: 0, Errors: 0, Skipped: 0, Time elapsed: 0.001 s - in org.eclipse.winery.repository.rest.RestUtilsTest
[INFO] Running org.eclipse.winery.repository.rest.RestUtilsWithGitBackendTest
[INFO] Tests run: 11, Failures: 0, Errors: 0, Skipped: 0, Time elapsed: 15.712 s - in org.eclipse.winery.repository.rest.RestUtilsWithGitBackendTest
[INFO] 
[INFO] Results:
[INFO] 
[ERROR] Failures: 
[ERROR]   PatternRefinementModelsResourceTest.createPatternRefinementModel:27->AbstractResourceTest.assertGet:142 serviceTemplateOrNodeTypeOrNodeTypeImplementation[name=MyCoolPRM_w1-wip1]
Unexpected: relationMappings

[ERROR]   TestRefinementModelsResourceTest.createPatternRefinementModel:27->AbstractResourceTest.assertGet:142 serviceTemplateOrNodeTypeOrNodeTypeImplementation[name=MyCoolTRM_w1-wip1]
Unexpected: relationMappings

[INFO] 
[ERROR] Tests run: 179, Failures: 2, Errors: 0, Skipped: 3
[INFO] 
[ERROR] There are test failures.

Please refer to /home/jenkins/agent/workspace/winery-pr/org.eclipse.winery.repository.rest/target/surefire-reports for the individual test results.
Please refer to dump files (if any exist) [date].dump, [date]-jvmRun[N].dump and [date].dumpstream.
[JENKINS] Recording test results
[INFO] 
[INFO] --- maven-war-plugin:3.2.0:war (default-war) @ org.eclipse.winery.repository.rest ---
[INFO] Packaging webapp
[INFO] Assembling webapp [org.eclipse.winery.repository.rest] in [/home/jenkins/agent/workspace/winery-pr/org.eclipse.winery.repository.rest/target/winery]
[INFO] Processing war project
[INFO] Copying webapp webResources [/home/jenkins/agent/workspace/winery-pr/org.eclipse.winery.repository.rest/src/main/webapp/WEB-INF] to [/home/jenkins/agent/workspace/winery-pr/org.eclipse.winery.repository.rest/target/winery]
[INFO] Copying webapp resources [/home/jenkins/agent/workspace/winery-pr/org.eclipse.winery.repository.rest/src/main/webapp]
[INFO] Webapp assembled in [966 msecs]
[INFO] Building war: /home/jenkins/agent/workspace/winery-pr/org.eclipse.winery.repository.rest/target/winery.war
[INFO] Packaging classes
[INFO] Building jar: /home/jenkins/agent/workspace/winery-pr/org.eclipse.winery.repository.rest/target/winery-classes.jar
[INFO] 
[INFO] --- maven-war-plugin:3.2.0:war (default) @ org.eclipse.winery.repository.rest ---
[INFO] Packaging webapp
[INFO] Assembling webapp [org.eclipse.winery.repository.rest] in [/home/jenkins/agent/workspace/winery-pr/org.eclipse.winery.repository.rest/target/winery]
[INFO] Processing war project
[INFO] Copying webapp webResources [/home/jenkins/agent/workspace/winery-pr/org.eclipse.winery.repository.rest/src/main/webapp/WEB-INF] to [/home/jenkins/agent/workspace/winery-pr/org.eclipse.winery.repository.rest/target/winery]
[INFO] Copying webapp resources [/home/jenkins/agent/workspace/winery-pr/org.eclipse.winery.repository.rest/src/main/webapp]
[INFO] Webapp assembled in [2581 msecs]
[INFO] Building war: /home/jenkins/agent/workspace/winery-pr/org.eclipse.winery.repository.rest/target/winery.war
[INFO] Packaging classes
[INFO] Building jar: /home/jenkins/agent/workspace/winery-pr/org.eclipse.winery.repository.rest/target/winery-classes.jar
[INFO] 
[INFO] >>> maven-source-plugin:3.0.1:jar (attach-sources) > generate-sources @ org.eclipse.winery.repository.rest >>>
[INFO] 
[INFO] --- maven-checkstyle-plugin:2.17:check (checkstyle) @ org.eclipse.winery.repository.rest ---
[INFO] 
[INFO] --- build-helper-maven-plugin:1.8:add-source (add-source) @ org.eclipse.winery.repository.rest ---
[INFO] Source directory: /home/jenkins/agent/workspace/winery-pr/org.eclipse.winery.repository.rest/target/generated-sources/java added.
[WARNING] Failed to getClass for org.apache.maven.plugins.source.SourceJarMojo
[INFO] 
[INFO] <<< maven-source-plugin:3.0.1:jar (attach-sources) < generate-sources @ org.eclipse.winery.repository.rest <<<
[INFO] 
[INFO] 
[INFO] --- maven-source-plugin:3.0.1:jar (attach-sources) @ org.eclipse.winery.repository.rest ---
[INFO] Building jar: /home/jenkins/agent/workspace/winery-pr/org.eclipse.winery.repository.rest/target/winery-sources.jar
[INFO] 
[INFO] --- maven-javadoc-plugin:3.0.1:jar (attach-javadocs) @ org.eclipse.winery.repository.rest ---