Console Output

[INFO] 
[INFO] -------< org.eclipse.winery:org.eclipse.winery.repository.rest >--------
[INFO] Building org.eclipse.winery.repository.rest 3.0.0-SNAPSHOT       [24/27]
[INFO] --------------------------------[ war ]---------------------------------
[INFO] Downloading from eclipse.maven.central.mirror: https://repo.eclipse.org/content/repositories/maven_central/org/apache/maven/plugins/maven-war-plugin/3.2.0/maven-war-plugin-3.2.0.pom
[INFO] Downloaded from eclipse.maven.central.mirror: https://repo.eclipse.org/content/repositories/maven_central/org/apache/maven/plugins/maven-war-plugin/3.2.0/maven-war-plugin-3.2.0.pom (9.3 kB at 150 kB/s)
[INFO] Downloading from eclipse.maven.central.mirror: https://repo.eclipse.org/content/repositories/maven_central/org/apache/maven/plugins/maven-war-plugin/3.2.0/maven-war-plugin-3.2.0.jar
[INFO] Downloaded from eclipse.maven.central.mirror: https://repo.eclipse.org/content/repositories/maven_central/org/apache/maven/plugins/maven-war-plugin/3.2.0/maven-war-plugin-3.2.0.jar (91 kB at 576 kB/s)
[INFO] Downloading from eclipse.maven.central.mirror: https://repo.eclipse.org/content/repositories/maven_central/org/slf4j/jul-to-slf4j/1.7.25/jul-to-slf4j-1.7.25.pom
[INFO] Downloaded from eclipse.maven.central.mirror: https://repo.eclipse.org/content/repositories/maven_central/org/slf4j/jul-to-slf4j/1.7.25/jul-to-slf4j-1.7.25.pom (986 B at 9.9 kB/s)
[INFO] Downloading from eclipse.maven.central.mirror: https://repo.eclipse.org/content/repositories/maven_central/org/glassfish/jersey/containers/jersey-container-servlet/2.30.1/jersey-container-servlet-2.30.1.pom
[INFO] Downloaded from eclipse.maven.central.mirror: https://repo.eclipse.org/content/repositories/maven_central/org/glassfish/jersey/containers/jersey-container-servlet/2.30.1/jersey-container-servlet-2.30.1.pom (3.5 kB at 55 kB/s)
[INFO] Downloading from eclipse.maven.central.mirror: https://repo.eclipse.org/content/repositories/maven_central/org/glassfish/jersey/containers/project/2.30.1/project-2.30.1.pom
[INFO] Downloaded from eclipse.maven.central.mirror: https://repo.eclipse.org/content/repositories/maven_central/org/glassfish/jersey/containers/project/2.30.1/project-2.30.1.pom (2.8 kB at 31 kB/s)
[INFO] Downloading from eclipse.maven.central.mirror: https://repo.eclipse.org/content/repositories/maven_central/org/glassfish/jersey/containers/jersey-container-servlet-core/2.30.1/jersey-container-servlet-core-2.30.1.pom
[INFO] Downloaded from eclipse.maven.central.mirror: https://repo.eclipse.org/content/repositories/maven_central/org/glassfish/jersey/containers/jersey-container-servlet-core/2.30.1/jersey-container-servlet-core-2.30.1.pom (3.4 kB at 47 kB/s)
[INFO] Downloading from eclipse.maven.central.mirror: https://repo.eclipse.org/content/repositories/maven_central/org/glassfish/jersey/core/jersey-server/2.30.1/jersey-server-2.30.1.pom
[INFO] Downloaded from eclipse.maven.central.mirror: https://repo.eclipse.org/content/repositories/maven_central/org/glassfish/jersey/core/jersey-server/2.30.1/jersey-server-2.30.1.pom (12 kB at 207 kB/s)
[INFO] Downloading from eclipse.maven.central.mirror: https://repo.eclipse.org/content/repositories/maven_central/org/glassfish/jersey/media/jersey-media-jaxb/2.30.1/jersey-media-jaxb-2.30.1.pom
[INFO] Downloaded from eclipse.maven.central.mirror: https://repo.eclipse.org/content/repositories/maven_central/org/glassfish/jersey/media/jersey-media-jaxb/2.30.1/jersey-media-jaxb-2.30.1.pom (6.0 kB at 123 kB/s)
[INFO] Downloading from eclipse.maven.central.mirror: https://repo.eclipse.org/content/repositories/maven_central/jakarta/validation/jakarta.validation-api/2.0.2/jakarta.validation-api-2.0.2.pom
[INFO] Downloaded from eclipse.maven.central.mirror: https://repo.eclipse.org/content/repositories/maven_central/jakarta/validation/jakarta.validation-api/2.0.2/jakarta.validation-api-2.0.2.pom (11 kB at 145 kB/s)
[INFO] Downloading from eclipse.maven.central.mirror: https://repo.eclipse.org/content/repositories/maven_central/org/glassfish/jersey/media/jersey-media-multipart/2.30.1/jersey-media-multipart-2.30.1.pom
[INFO] Downloaded from eclipse.maven.central.mirror: https://repo.eclipse.org/content/repositories/maven_central/org/glassfish/jersey/media/jersey-media-multipart/2.30.1/jersey-media-multipart-2.30.1.pom (3.9 kB at 109 kB/s)
[INFO] Downloading from eclipse.maven.central.mirror: https://repo.eclipse.org/content/repositories/maven_central/org/jvnet/mimepull/mimepull/1.9.11/mimepull-1.9.11.pom
[INFO] Downloaded from eclipse.maven.central.mirror: https://repo.eclipse.org/content/repositories/maven_central/org/jvnet/mimepull/mimepull/1.9.11/mimepull-1.9.11.pom (15 kB at 373 kB/s)
[INFO] Downloading from eclipse.maven.central.mirror: https://repo.eclipse.org/content/repositories/maven_central/xerces/xercesImpl/2.12.0/xercesImpl-2.12.0.pom
[INFO] Downloaded from eclipse.maven.central.mirror: https://repo.eclipse.org/content/repositories/maven_central/xerces/xercesImpl/2.12.0/xercesImpl-2.12.0.pom (3.4 kB at 23 kB/s)
[INFO] Downloading from eclipse.maven.central.mirror: https://repo.eclipse.org/content/repositories/maven_central/xml-apis/xml-apis/1.4.01/xml-apis-1.4.01.pom
[INFO] Downloaded from eclipse.maven.central.mirror: https://repo.eclipse.org/content/repositories/maven_central/xml-apis/xml-apis/1.4.01/xml-apis-1.4.01.pom (2.7 kB at 333 kB/s)
[INFO] Downloading from eclipse.maven.central.mirror: https://repo.eclipse.org/content/repositories/maven_central/javax/websocket/javax.websocket-api/1.1/javax.websocket-api-1.1.pom
[INFO] Downloaded from eclipse.maven.central.mirror: https://repo.eclipse.org/content/repositories/maven_central/javax/websocket/javax.websocket-api/1.1/javax.websocket-api-1.1.pom (8.4 kB at 133 kB/s)
[INFO] Downloading from eclipse.maven.central.mirror: https://repo.eclipse.org/content/repositories/maven_central/javax/websocket/javax.websocket-all/1.1/javax.websocket-all-1.1.pom
[INFO] Downloaded from eclipse.maven.central.mirror: https://repo.eclipse.org/content/repositories/maven_central/javax/websocket/javax.websocket-all/1.1/javax.websocket-all-1.1.pom (9.5 kB at 145 kB/s)
[INFO] Downloading from eclipse.maven.central.mirror: https://repo.eclipse.org/content/repositories/maven_central/io/swagger/swagger-jersey2-jaxrs/1.5.17/swagger-jersey2-jaxrs-1.5.17.pom
[INFO] Downloaded from eclipse.maven.central.mirror: https://repo.eclipse.org/content/repositories/maven_central/io/swagger/swagger-jersey2-jaxrs/1.5.17/swagger-jersey2-jaxrs-1.5.17.pom (3.6 kB at 57 kB/s)
[INFO] Downloading from eclipse.maven.central.mirror: https://repo.eclipse.org/content/repositories/maven_central/io/swagger/swagger-project/1.5.17/swagger-project-1.5.17.pom
[INFO] Downloaded from eclipse.maven.central.mirror: https://repo.eclipse.org/content/repositories/maven_central/io/swagger/swagger-project/1.5.17/swagger-project-1.5.17.pom (22 kB at 20 kB/s)
[INFO] Downloading from eclipse.maven.central.mirror: https://repo.eclipse.org/content/repositories/maven_central/io/swagger/swagger-jaxrs/1.5.17/swagger-jaxrs-1.5.17.pom
[INFO] Downloaded from eclipse.maven.central.mirror: https://repo.eclipse.org/content/repositories/maven_central/io/swagger/swagger-jaxrs/1.5.17/swagger-jaxrs-1.5.17.pom (8.3 kB at 151 kB/s)
[INFO] Downloading from eclipse.maven.central.mirror: https://repo.eclipse.org/content/repositories/maven_central/com/fasterxml/jackson/core/jackson-databind/2.8.9/jackson-databind-2.8.9.pom
[INFO] Downloaded from eclipse.maven.central.mirror: https://repo.eclipse.org/content/repositories/maven_central/com/fasterxml/jackson/core/jackson-databind/2.8.9/jackson-databind-2.8.9.pom (5.4 kB at 85 kB/s)
[INFO] Downloading from eclipse.maven.central.mirror: https://repo.eclipse.org/content/repositories/maven_central/com/fasterxml/jackson/core/jackson-core/2.8.9/jackson-core-2.8.9.pom
[INFO] Downloaded from eclipse.maven.central.mirror: https://repo.eclipse.org/content/repositories/maven_central/com/fasterxml/jackson/core/jackson-core/2.8.9/jackson-core-2.8.9.pom (5.4 kB at 111 kB/s)
[INFO] Downloading from eclipse.maven.central.mirror: https://repo.eclipse.org/content/repositories/maven_central/io/swagger/swagger-core/1.5.17/swagger-core-1.5.17.pom
[INFO] Downloaded from eclipse.maven.central.mirror: https://repo.eclipse.org/content/repositories/maven_central/io/swagger/swagger-core/1.5.17/swagger-core-1.5.17.pom (6.3 kB at 75 kB/s)
[INFO] Downloading from eclipse.maven.central.mirror: https://repo.eclipse.org/content/repositories/maven_central/org/apache/commons/commons-lang3/3.2.1/commons-lang3-3.2.1.pom
[INFO] Downloaded from eclipse.maven.central.mirror: https://repo.eclipse.org/content/repositories/maven_central/org/apache/commons/commons-lang3/3.2.1/commons-lang3-3.2.1.pom (20 kB at 139 kB/s)
[INFO] Downloading from eclipse.maven.central.mirror: https://repo.eclipse.org/content/repositories/maven_central/com/fasterxml/jackson/core/jackson-annotations/2.8.9/jackson-annotations-2.8.9.pom
[INFO] Downloaded from eclipse.maven.central.mirror: https://repo.eclipse.org/content/repositories/maven_central/com/fasterxml/jackson/core/jackson-annotations/2.8.9/jackson-annotations-2.8.9.pom (1.8 kB at 22 kB/s)
[INFO] Downloading from eclipse.maven.central.mirror: https://repo.eclipse.org/content/repositories/maven_central/com/fasterxml/jackson/dataformat/jackson-dataformat-yaml/2.8.9/jackson-dataformat-yaml-2.8.9.pom
[INFO] Downloaded from eclipse.maven.central.mirror: https://repo.eclipse.org/content/repositories/maven_central/com/fasterxml/jackson/dataformat/jackson-dataformat-yaml/2.8.9/jackson-dataformat-yaml-2.8.9.pom (6.2 kB at 123 kB/s)
[INFO] Downloading from eclipse.maven.central.mirror: https://repo.eclipse.org/content/repositories/maven_central/org/yaml/snakeyaml/1.17/snakeyaml-1.17.pom
[INFO] Downloaded from eclipse.maven.central.mirror: https://repo.eclipse.org/content/repositories/maven_central/org/yaml/snakeyaml/1.17/snakeyaml-1.17.pom (28 kB at 1.4 MB/s)
[INFO] Downloading from eclipse.maven.central.mirror: https://repo.eclipse.org/content/repositories/maven_central/io/swagger/swagger-models/1.5.17/swagger-models-1.5.17.pom
[INFO] Downloaded from eclipse.maven.central.mirror: https://repo.eclipse.org/content/repositories/maven_central/io/swagger/swagger-models/1.5.17/swagger-models-1.5.17.pom (4.9 kB at 32 kB/s)
[INFO] Downloading from eclipse.maven.central.mirror: https://repo.eclipse.org/content/repositories/maven_central/io/swagger/swagger-annotations/1.5.17/swagger-annotations-1.5.17.pom
[INFO] Downloaded from eclipse.maven.central.mirror: https://repo.eclipse.org/content/repositories/maven_central/io/swagger/swagger-annotations/1.5.17/swagger-annotations-1.5.17.pom (6.2 kB at 86 kB/s)
[INFO] Downloading from eclipse.maven.central.mirror: https://repo.eclipse.org/content/repositories/maven_central/javax/validation/validation-api/1.1.0.Final/validation-api-1.1.0.Final.pom
[INFO] Downloaded from eclipse.maven.central.mirror: https://repo.eclipse.org/content/repositories/maven_central/javax/validation/validation-api/1.1.0.Final/validation-api-1.1.0.Final.pom (7.9 kB at 2.6 MB/s)
[INFO] Downloading from eclipse.maven.central.mirror: https://repo.eclipse.org/content/repositories/maven_central/org/glassfish/jersey/containers/jersey-container-servlet-core/2.25.1/jersey-container-servlet-core-2.25.1.pom
[INFO] Downloaded from eclipse.maven.central.mirror: https://repo.eclipse.org/content/repositories/maven_central/org/glassfish/jersey/containers/jersey-container-servlet-core/2.25.1/jersey-container-servlet-core-2.25.1.pom (4.7 kB at 233 kB/s)
[INFO] Downloading from eclipse.maven.central.mirror: https://repo.eclipse.org/content/repositories/maven_central/org/glassfish/jersey/containers/project/2.25.1/project-2.25.1.pom
[INFO] Downloaded from eclipse.maven.central.mirror: https://repo.eclipse.org/content/repositories/maven_central/org/glassfish/jersey/containers/project/2.25.1/project-2.25.1.pom (3.8 kB at 183 kB/s)
[INFO] Downloading from eclipse.maven.central.mirror: https://repo.eclipse.org/content/repositories/maven_central/org/glassfish/jersey/project/2.25.1/project-2.25.1.pom
[INFO] Downloaded from eclipse.maven.central.mirror: https://repo.eclipse.org/content/repositories/maven_central/org/glassfish/jersey/project/2.25.1/project-2.25.1.pom (87 kB at 3.1 MB/s)
[INFO] Downloading from eclipse.maven.central.mirror: https://repo.eclipse.org/content/repositories/maven_central/org/glassfish/hk2/hk2-bom/2.5.0-b32/hk2-bom-2.5.0-b32.pom
[INFO] Downloaded from eclipse.maven.central.mirror: https://repo.eclipse.org/content/repositories/maven_central/org/glassfish/hk2/hk2-bom/2.5.0-b32/hk2-bom-2.5.0-b32.pom (19 kB at 463 kB/s)
[INFO] Downloading from eclipse.maven.central.mirror: https://repo.eclipse.org/content/repositories/maven_central/org/glassfish/hk2/external/javax.inject/2.5.0-b32/javax.inject-2.5.0-b32.pom
[INFO] Downloaded from eclipse.maven.central.mirror: https://repo.eclipse.org/content/repositories/maven_central/org/glassfish/hk2/external/javax.inject/2.5.0-b32/javax.inject-2.5.0-b32.pom (6.5 kB at 76 kB/s)
[INFO] Downloading from eclipse.maven.central.mirror: https://repo.eclipse.org/content/repositories/maven_central/org/glassfish/hk2/external/2.5.0-b32/external-2.5.0-b32.pom
[INFO] Downloaded from eclipse.maven.central.mirror: https://repo.eclipse.org/content/repositories/maven_central/org/glassfish/hk2/external/2.5.0-b32/external-2.5.0-b32.pom (2.8 kB at 98 kB/s)
[INFO] Downloading from eclipse.maven.central.mirror: https://repo.eclipse.org/content/repositories/maven_central/org/glassfish/hk2/hk2-parent/2.5.0-b32/hk2-parent-2.5.0-b32.pom
[INFO] Downloaded from eclipse.maven.central.mirror: https://repo.eclipse.org/content/repositories/maven_central/org/glassfish/hk2/hk2-parent/2.5.0-b32/hk2-parent-2.5.0-b32.pom (51 kB at 1.1 MB/s)
[INFO] Downloading from eclipse.maven.central.mirror: https://repo.eclipse.org/content/repositories/maven_central/org/glassfish/jersey/core/jersey-common/2.25.1/jersey-common-2.25.1.pom
[INFO] Downloaded from eclipse.maven.central.mirror: https://repo.eclipse.org/content/repositories/maven_central/org/glassfish/jersey/core/jersey-common/2.25.1/jersey-common-2.25.1.pom (10 kB at 212 kB/s)
[INFO] Downloading from eclipse.maven.central.mirror: https://repo.eclipse.org/content/repositories/maven_central/javax/ws/rs/javax.ws.rs-api/2.0.1/javax.ws.rs-api-2.0.1.pom
[INFO] Downloaded from eclipse.maven.central.mirror: https://repo.eclipse.org/content/repositories/maven_central/javax/ws/rs/javax.ws.rs-api/2.0.1/javax.ws.rs-api-2.0.1.pom (21 kB at 498 kB/s)
[INFO] Downloading from eclipse.maven.central.mirror: https://repo.eclipse.org/content/repositories/maven_central/javax/annotation/javax.annotation-api/1.2/javax.annotation-api-1.2.pom
[INFO] Downloaded from eclipse.maven.central.mirror: https://repo.eclipse.org/content/repositories/maven_central/javax/annotation/javax.annotation-api/1.2/javax.annotation-api-1.2.pom (13 kB at 353 kB/s)
[INFO] Downloading from eclipse.maven.central.mirror: https://repo.eclipse.org/content/repositories/maven_central/org/glassfish/jersey/bundles/repackaged/jersey-guava/2.25.1/jersey-guava-2.25.1.pom
[INFO] Downloaded from eclipse.maven.central.mirror: https://repo.eclipse.org/content/repositories/maven_central/org/glassfish/jersey/bundles/repackaged/jersey-guava/2.25.1/jersey-guava-2.25.1.pom (13 kB at 173 kB/s)
[INFO] Downloading from eclipse.maven.central.mirror: https://repo.eclipse.org/content/repositories/maven_central/org/glassfish/jersey/bundles/repackaged/project/2.25.1/project-2.25.1.pom
[INFO] Downloaded from eclipse.maven.central.mirror: https://repo.eclipse.org/content/repositories/maven_central/org/glassfish/jersey/bundles/repackaged/project/2.25.1/project-2.25.1.pom (2.8 kB at 78 kB/s)
[INFO] Downloading from eclipse.maven.central.mirror: https://repo.eclipse.org/content/repositories/maven_central/org/glassfish/jersey/bundles/project/2.25.1/project-2.25.1.pom
[INFO] Downloaded from eclipse.maven.central.mirror: https://repo.eclipse.org/content/repositories/maven_central/org/glassfish/jersey/bundles/project/2.25.1/project-2.25.1.pom (3.1 kB at 78 kB/s)
[INFO] Downloading from eclipse.maven.central.mirror: https://repo.eclipse.org/content/repositories/maven_central/org/glassfish/hk2/hk2-api/2.5.0-b32/hk2-api-2.5.0-b32.pom
[INFO] Downloaded from eclipse.maven.central.mirror: https://repo.eclipse.org/content/repositories/maven_central/org/glassfish/hk2/hk2-api/2.5.0-b32/hk2-api-2.5.0-b32.pom (4.6 kB at 142 kB/s)
[INFO] Downloading from eclipse.maven.central.mirror: https://repo.eclipse.org/content/repositories/maven_central/org/glassfish/hk2/hk2-utils/2.5.0-b32/hk2-utils-2.5.0-b32.pom
[INFO] Downloaded from eclipse.maven.central.mirror: https://repo.eclipse.org/content/repositories/maven_central/org/glassfish/hk2/hk2-utils/2.5.0-b32/hk2-utils-2.5.0-b32.pom (5.8 kB at 167 kB/s)
[INFO] Downloading from eclipse.maven.central.mirror: https://repo.eclipse.org/content/repositories/maven_central/org/glassfish/hk2/external/aopalliance-repackaged/2.5.0-b32/aopalliance-repackaged-2.5.0-b32.pom
[INFO] Downloaded from eclipse.maven.central.mirror: https://repo.eclipse.org/content/repositories/maven_central/org/glassfish/hk2/external/aopalliance-repackaged/2.5.0-b32/aopalliance-repackaged-2.5.0-b32.pom (6.8 kB at 141 kB/s)
[INFO] Downloading from eclipse.maven.central.mirror: https://repo.eclipse.org/content/repositories/maven_central/org/glassfish/hk2/hk2-locator/2.5.0-b32/hk2-locator-2.5.0-b32.pom
[INFO] Downloaded from eclipse.maven.central.mirror: https://repo.eclipse.org/content/repositories/maven_central/org/glassfish/hk2/hk2-locator/2.5.0-b32/hk2-locator-2.5.0-b32.pom (7.5 kB at 443 kB/s)
[INFO] Downloading from eclipse.maven.central.mirror: https://repo.eclipse.org/content/repositories/maven_central/org/glassfish/hk2/osgi-resource-locator/1.0.1/osgi-resource-locator-1.0.1.pom
[INFO] Downloaded from eclipse.maven.central.mirror: https://repo.eclipse.org/content/repositories/maven_central/org/glassfish/hk2/osgi-resource-locator/1.0.1/osgi-resource-locator-1.0.1.pom (6.2 kB at 109 kB/s)
[INFO] Downloading from eclipse.maven.central.mirror: https://repo.eclipse.org/content/repositories/maven_central/org/glassfish/pom/8/pom-8.pom
[INFO] Downloaded from eclipse.maven.central.mirror: https://repo.eclipse.org/content/repositories/maven_central/org/glassfish/pom/8/pom-8.pom (11 kB at 301 kB/s)
[INFO] Downloading from eclipse.maven.central.mirror: https://repo.eclipse.org/content/repositories/maven_central/org/glassfish/jersey/core/jersey-server/2.25.1/jersey-server-2.25.1.pom
[INFO] Downloaded from eclipse.maven.central.mirror: https://repo.eclipse.org/content/repositories/maven_central/org/glassfish/jersey/core/jersey-server/2.25.1/jersey-server-2.25.1.pom (11 kB at 194 kB/s)
[INFO] Downloading from eclipse.maven.central.mirror: https://repo.eclipse.org/content/repositories/maven_central/org/glassfish/jersey/core/jersey-client/2.25.1/jersey-client-2.25.1.pom
[INFO] Downloaded from eclipse.maven.central.mirror: https://repo.eclipse.org/content/repositories/maven_central/org/glassfish/jersey/core/jersey-client/2.25.1/jersey-client-2.25.1.pom (7.6 kB at 420 kB/s)
[INFO] Downloading from eclipse.maven.central.mirror: https://repo.eclipse.org/content/repositories/maven_central/org/glassfish/jersey/media/jersey-media-jaxb/2.25.1/jersey-media-jaxb-2.25.1.pom
[INFO] Downloaded from eclipse.maven.central.mirror: https://repo.eclipse.org/content/repositories/maven_central/org/glassfish/jersey/media/jersey-media-jaxb/2.25.1/jersey-media-jaxb-2.25.1.pom (7.1 kB at 325 kB/s)
[INFO] Downloading from eclipse.maven.central.mirror: https://repo.eclipse.org/content/repositories/maven_central/org/glassfish/jersey/media/project/2.25.1/project-2.25.1.pom
[INFO] Downloaded from eclipse.maven.central.mirror: https://repo.eclipse.org/content/repositories/maven_central/org/glassfish/jersey/media/project/2.25.1/project-2.25.1.pom (3.0 kB at 176 kB/s)
[INFO] Downloading from eclipse.maven.central.mirror: https://repo.eclipse.org/content/repositories/maven_central/org/glassfish/jersey/media/jersey-media-multipart/2.25.1/jersey-media-multipart-2.25.1.pom
[INFO] Downloaded from eclipse.maven.central.mirror: https://repo.eclipse.org/content/repositories/maven_central/org/glassfish/jersey/media/jersey-media-multipart/2.25.1/jersey-media-multipart-2.25.1.pom (5.3 kB at 72 kB/s)
[INFO] Downloading from eclipse.maven.central.mirror: https://repo.eclipse.org/content/repositories/maven_central/org/jvnet/mimepull/mimepull/1.9.6/mimepull-1.9.6.pom
[INFO] Downloaded from eclipse.maven.central.mirror: https://repo.eclipse.org/content/repositories/maven_central/org/jvnet/mimepull/mimepull/1.9.6/mimepull-1.9.6.pom (14 kB at 193 kB/s)
[INFO] Downloading from eclipse.maven.central.mirror: https://repo.eclipse.org/content/repositories/maven_central/org/javassist/javassist/3.22.0-GA/javassist-3.22.0-GA.pom
[INFO] Downloaded from eclipse.maven.central.mirror: https://repo.eclipse.org/content/repositories/maven_central/org/javassist/javassist/3.22.0-GA/javassist-3.22.0-GA.pom (9.7 kB at 232 kB/s)
[INFO] Downloading from eclipse.maven.central.mirror: https://repo.eclipse.org/content/repositories/maven_central/org/jvnet/mimepull/mimepull/1.9.4/mimepull-1.9.4.pom
[INFO] Downloaded from eclipse.maven.central.mirror: https://repo.eclipse.org/content/repositories/maven_central/org/jvnet/mimepull/mimepull/1.9.4/mimepull-1.9.4.pom (14 kB at 13 kB/s)
[INFO] Downloading from eclipse.maven.central.mirror: https://repo.eclipse.org/content/repositories/maven_central/javax/servlet/javax.servlet-api/3.1.0/javax.servlet-api-3.1.0.pom
[INFO] Downloaded from eclipse.maven.central.mirror: https://repo.eclipse.org/content/repositories/maven_central/javax/servlet/javax.servlet-api/3.1.0/javax.servlet-api-3.1.0.pom (14 kB at 233 kB/s)
[INFO] Downloading from eclipse.maven.central.mirror: https://repo.eclipse.org/content/repositories/maven_central/org/eclipse/jetty/jetty-servlet/9.4.2.v20170220/jetty-servlet-9.4.2.v20170220.pom
[INFO] Downloaded from eclipse.maven.central.mirror: https://repo.eclipse.org/content/repositories/maven_central/org/eclipse/jetty/jetty-servlet/9.4.2.v20170220/jetty-servlet-9.4.2.v20170220.pom (2.1 kB at 477 B/s)
[INFO] Downloading from eclipse.maven.central.mirror: https://repo.eclipse.org/content/repositories/maven_central/org/eclipse/jetty/jetty-project/9.4.2.v20170220/jetty-project-9.4.2.v20170220.pom
[INFO] Downloaded from eclipse.maven.central.mirror: https://repo.eclipse.org/content/repositories/maven_central/org/eclipse/jetty/jetty-project/9.4.2.v20170220/jetty-project-9.4.2.v20170220.pom (53 kB at 103 kB/s)
[INFO] Downloading from eclipse.maven.central.mirror: https://repo.eclipse.org/content/repositories/maven_central/org/eclipse/jetty/jetty-security/9.4.2.v20170220/jetty-security-9.4.2.v20170220.pom
[INFO] Downloaded from eclipse.maven.central.mirror: https://repo.eclipse.org/content/repositories/maven_central/org/eclipse/jetty/jetty-security/9.4.2.v20170220/jetty-security-9.4.2.v20170220.pom (2.0 kB at 30 kB/s)
[INFO] Downloading from eclipse.maven.central.mirror: https://repo.eclipse.org/content/repositories/maven_central/org/eclipse/jetty/jetty-server/9.4.2.v20170220/jetty-server-9.4.2.v20170220.pom
[INFO] Downloaded from eclipse.maven.central.mirror: https://repo.eclipse.org/content/repositories/maven_central/org/eclipse/jetty/jetty-server/9.4.2.v20170220/jetty-server-9.4.2.v20170220.pom (2.6 kB at 25 kB/s)
[INFO] Downloading from eclipse.maven.central.mirror: https://repo.eclipse.org/content/repositories/maven_central/org/eclipse/jetty/jetty-http/9.4.2.v20170220/jetty-http-9.4.2.v20170220.pom
[INFO] Downloaded from eclipse.maven.central.mirror: https://repo.eclipse.org/content/repositories/maven_central/org/eclipse/jetty/jetty-http/9.4.2.v20170220/jetty-http-9.4.2.v20170220.pom (2.7 kB at 7.8 kB/s)
[INFO] Downloading from eclipse.maven.central.mirror: https://repo.eclipse.org/content/repositories/maven_central/org/eclipse/jetty/jetty-util/9.4.2.v20170220/jetty-util-9.4.2.v20170220.pom
[INFO] Downloaded from eclipse.maven.central.mirror: https://repo.eclipse.org/content/repositories/maven_central/org/eclipse/jetty/jetty-util/9.4.2.v20170220/jetty-util-9.4.2.v20170220.pom (2.1 kB at 7.4 kB/s)
[INFO] Downloading from eclipse.maven.central.mirror: https://repo.eclipse.org/content/repositories/maven_central/org/eclipse/jetty/jetty-io/9.4.2.v20170220/jetty-io-9.4.2.v20170220.pom
[INFO] Downloaded from eclipse.maven.central.mirror: https://repo.eclipse.org/content/repositories/maven_central/org/eclipse/jetty/jetty-io/9.4.2.v20170220/jetty-io-9.4.2.v20170220.pom (1.3 kB at 7.2 kB/s)
[INFO] Downloading from eclipse.maven.central.mirror: https://repo.eclipse.org/content/repositories/maven_central/org/eclipse/jetty/jetty-servlets/9.4.2.v20170220/jetty-servlets-9.4.2.v20170220.pom
[INFO] Downloaded from eclipse.maven.central.mirror: https://repo.eclipse.org/content/repositories/maven_central/org/eclipse/jetty/jetty-servlets/9.4.2.v20170220/jetty-servlets-9.4.2.v20170220.pom (2.9 kB at 9.7 kB/s)
[INFO] Downloading from eclipse.maven.central.mirror: https://repo.eclipse.org/content/repositories/maven_central/org/eclipse/jetty/jetty-continuation/9.4.2.v20170220/jetty-continuation-9.4.2.v20170220.pom
[INFO] Downloaded from eclipse.maven.central.mirror: https://repo.eclipse.org/content/repositories/maven_central/org/eclipse/jetty/jetty-continuation/9.4.2.v20170220/jetty-continuation-9.4.2.v20170220.pom (1.2 kB at 6.1 kB/s)
[INFO] Downloading from eclipse.maven.central.mirror: https://repo.eclipse.org/content/repositories/maven_central/org/eclipse/jetty/toolchain/jetty-test-helper/4.2/jetty-test-helper-4.2.pom
[INFO] Downloaded from eclipse.maven.central.mirror: https://repo.eclipse.org/content/repositories/maven_central/org/eclipse/jetty/toolchain/jetty-test-helper/4.2/jetty-test-helper-4.2.pom (4.3 kB at 3.8 kB/s)
[INFO] Downloading from eclipse.maven.central.mirror: https://repo.eclipse.org/content/repositories/maven_central/org/eclipse/jetty/toolchain/jetty-toolchain/1.5/jetty-toolchain-1.5.pom
[INFO] Downloaded from eclipse.maven.central.mirror: https://repo.eclipse.org/content/repositories/maven_central/org/eclipse/jetty/toolchain/jetty-toolchain/1.5/jetty-toolchain-1.5.pom (1.5 kB at 43 kB/s)
[INFO] Downloading from eclipse.maven.central.mirror: https://repo.eclipse.org/content/repositories/maven_central/org/eclipse/jetty/jetty-parent/18/jetty-parent-18.pom
[INFO] Downloaded from eclipse.maven.central.mirror: https://repo.eclipse.org/content/repositories/maven_central/org/eclipse/jetty/jetty-parent/18/jetty-parent-18.pom (16 kB at 717 kB/s)
[INFO] Downloading from eclipse.maven.central.mirror: https://repo.eclipse.org/content/repositories/maven_central/org/xmlunit/xmlunit-core/2.6.4/xmlunit-core-2.6.4.pom
[INFO] Downloaded from eclipse.maven.central.mirror: https://repo.eclipse.org/content/repositories/maven_central/org/xmlunit/xmlunit-core/2.6.4/xmlunit-core-2.6.4.pom (2.7 kB at 51 kB/s)
[INFO] Downloading from eclipse.maven.central.mirror: https://repo.eclipse.org/content/repositories/maven_central/org/xmlunit/xmlunit-parent/2.6.4/xmlunit-parent-2.6.4.pom
[INFO] Downloaded from eclipse.maven.central.mirror: https://repo.eclipse.org/content/repositories/maven_central/org/xmlunit/xmlunit-parent/2.6.4/xmlunit-parent-2.6.4.pom (19 kB at 59 kB/s)
[INFO] Downloading from eclipse.maven.central.mirror: https://repo.eclipse.org/content/repositories/maven_central/org/xmlunit/xmlunit-matchers/2.6.4/xmlunit-matchers-2.6.4.pom
[INFO] Downloaded from eclipse.maven.central.mirror: https://repo.eclipse.org/content/repositories/maven_central/org/xmlunit/xmlunit-matchers/2.6.4/xmlunit-matchers-2.6.4.pom (2.2 kB at 38 kB/s)
[INFO] Downloading from eclipse.maven.central.mirror: https://repo.eclipse.org/content/repositories/maven_central/org/skyscreamer/jsonassert/1.5.0/jsonassert-1.5.0.pom
[INFO] Downloaded from eclipse.maven.central.mirror: https://repo.eclipse.org/content/repositories/maven_central/org/skyscreamer/jsonassert/1.5.0/jsonassert-1.5.0.pom (5.2 kB at 92 kB/s)
[INFO] Downloading from eclipse.maven.central.mirror: https://repo.eclipse.org/content/repositories/maven_central/io/rest-assured/rest-assured/3.0.2/rest-assured-3.0.2.pom
[INFO] Downloaded from eclipse.maven.central.mirror: https://repo.eclipse.org/content/repositories/maven_central/io/rest-assured/rest-assured/3.0.2/rest-assured-3.0.2.pom (4.8 kB at 64 kB/s)
[INFO] Downloading from eclipse.maven.central.mirror: https://repo.eclipse.org/content/repositories/maven_central/io/rest-assured/rest-assured-parent/3.0.2/rest-assured-parent-3.0.2.pom
[INFO] Downloaded from eclipse.maven.central.mirror: https://repo.eclipse.org/content/repositories/maven_central/io/rest-assured/rest-assured-parent/3.0.2/rest-assured-parent-3.0.2.pom (13 kB at 225 kB/s)
[INFO] Downloading from eclipse.maven.central.mirror: https://repo.eclipse.org/content/repositories/maven_central/org/codehaus/groovy/groovy/2.4.6/groovy-2.4.6.pom
[INFO] Downloaded from eclipse.maven.central.mirror: https://repo.eclipse.org/content/repositories/maven_central/org/codehaus/groovy/groovy/2.4.6/groovy-2.4.6.pom (17 kB at 277 kB/s)
[INFO] Downloading from eclipse.maven.central.mirror: https://repo.eclipse.org/content/repositories/maven_central/org/codehaus/groovy/groovy-xml/2.4.6/groovy-xml-2.4.6.pom
[INFO] Downloaded from eclipse.maven.central.mirror: https://repo.eclipse.org/content/repositories/maven_central/org/codehaus/groovy/groovy-xml/2.4.6/groovy-xml-2.4.6.pom (15 kB at 95 kB/s)
[INFO] Downloading from eclipse.maven.central.mirror: https://repo.eclipse.org/content/repositories/maven_central/org/apache/httpcomponents/httpmime/4.5.1/httpmime-4.5.1.pom
[INFO] Downloaded from eclipse.maven.central.mirror: https://repo.eclipse.org/content/repositories/maven_central/org/apache/httpcomponents/httpmime/4.5.1/httpmime-4.5.1.pom (4.8 kB at 39 kB/s)
[INFO] Downloading from eclipse.maven.central.mirror: https://repo.eclipse.org/content/repositories/maven_central/org/ccil/cowan/tagsoup/tagsoup/1.2.1/tagsoup-1.2.1.pom
[INFO] Downloaded from eclipse.maven.central.mirror: https://repo.eclipse.org/content/repositories/maven_central/org/ccil/cowan/tagsoup/tagsoup/1.2.1/tagsoup-1.2.1.pom (1.2 kB at 14 kB/s)
[INFO] Downloading from eclipse.maven.central.mirror: https://repo.eclipse.org/content/repositories/maven_central/io/rest-assured/json-path/3.0.2/json-path-3.0.2.pom
[INFO] Downloaded from eclipse.maven.central.mirror: https://repo.eclipse.org/content/repositories/maven_central/io/rest-assured/json-path/3.0.2/json-path-3.0.2.pom (3.5 kB at 53 kB/s)
[INFO] Downloading from eclipse.maven.central.mirror: https://repo.eclipse.org/content/repositories/maven_central/org/codehaus/groovy/groovy-json/2.4.6/groovy-json-2.4.6.pom
[INFO] Downloaded from eclipse.maven.central.mirror: https://repo.eclipse.org/content/repositories/maven_central/org/codehaus/groovy/groovy-json/2.4.6/groovy-json-2.4.6.pom (15 kB at 191 kB/s)
[INFO] Downloading from eclipse.maven.central.mirror: https://repo.eclipse.org/content/repositories/maven_central/io/rest-assured/rest-assured-common/3.0.2/rest-assured-common-3.0.2.pom
[INFO] Downloaded from eclipse.maven.central.mirror: https://repo.eclipse.org/content/repositories/maven_central/io/rest-assured/rest-assured-common/3.0.2/rest-assured-common-3.0.2.pom (2.1 kB at 27 kB/s)
[INFO] Downloading from eclipse.maven.central.mirror: https://repo.eclipse.org/content/repositories/maven_central/org/apache/commons/commons-lang3/3.4/commons-lang3-3.4.pom
[INFO] Downloaded from eclipse.maven.central.mirror: https://repo.eclipse.org/content/repositories/maven_central/org/apache/commons/commons-lang3/3.4/commons-lang3-3.4.pom (22 kB at 887 kB/s)
[INFO] Downloading from eclipse.maven.central.mirror: https://repo.eclipse.org/content/repositories/maven_central/io/rest-assured/xml-path/3.0.2/xml-path-3.0.2.pom
[INFO] Downloaded from eclipse.maven.central.mirror: https://repo.eclipse.org/content/repositories/maven_central/io/rest-assured/xml-path/3.0.2/xml-path-3.0.2.pom (2.7 kB at 31 kB/s)
[INFO] Downloading from eclipse.maven.central.mirror: https://repo.eclipse.org/content/repositories/maven_central/org/slf4j/jul-to-slf4j/1.7.25/jul-to-slf4j-1.7.25.jar
[INFO] Downloading from eclipse.maven.central.mirror: https://repo.eclipse.org/content/repositories/maven_central/org/glassfish/jersey/containers/jersey-container-servlet/2.30.1/jersey-container-servlet-2.30.1.jar
[INFO] Downloading from eclipse.maven.central.mirror: https://repo.eclipse.org/content/repositories/maven_central/org/glassfish/jersey/containers/jersey-container-servlet-core/2.30.1/jersey-container-servlet-core-2.30.1.jar
[INFO] Downloading from eclipse.maven.central.mirror: https://repo.eclipse.org/content/repositories/maven_central/org/glassfish/jersey/media/jersey-media-jaxb/2.30.1/jersey-media-jaxb-2.30.1.jar
[INFO] Downloading from eclipse.maven.central.mirror: https://repo.eclipse.org/content/repositories/maven_central/org/glassfish/jersey/core/jersey-server/2.30.1/jersey-server-2.30.1.jar
[INFO] Downloaded from eclipse.maven.central.mirror: https://repo.eclipse.org/content/repositories/maven_central/org/slf4j/jul-to-slf4j/1.7.25/jul-to-slf4j-1.7.25.jar (4.6 kB at 242 kB/s)
[INFO] Downloading from eclipse.maven.central.mirror: https://repo.eclipse.org/content/repositories/maven_central/jakarta/validation/jakarta.validation-api/2.0.2/jakarta.validation-api-2.0.2.jar
[INFO] Downloaded from eclipse.maven.central.mirror: https://repo.eclipse.org/content/repositories/maven_central/jakarta/validation/jakarta.validation-api/2.0.2/jakarta.validation-api-2.0.2.jar (92 kB at 1.8 MB/s)
[INFO] Downloading from eclipse.maven.central.mirror: https://repo.eclipse.org/content/repositories/maven_central/org/glassfish/jersey/media/jersey-media-multipart/2.30.1/jersey-media-multipart-2.30.1.jar
[INFO] Downloaded from eclipse.maven.central.mirror: https://repo.eclipse.org/content/repositories/maven_central/org/glassfish/jersey/containers/jersey-container-servlet-core/2.30.1/jersey-container-servlet-core-2.30.1.jar (73 kB at 1.4 MB/s)
[INFO] Downloading from eclipse.maven.central.mirror: https://repo.eclipse.org/content/repositories/maven_central/xerces/xercesImpl/2.12.0/xercesImpl-2.12.0.jar
[INFO] Downloaded from eclipse.maven.central.mirror: https://repo.eclipse.org/content/repositories/maven_central/org/glassfish/jersey/containers/jersey-container-servlet/2.30.1/jersey-container-servlet-2.30.1.jar (32 kB at 584 kB/s)
[INFO] Downloading from eclipse.maven.central.mirror: https://repo.eclipse.org/content/repositories/maven_central/xml-apis/xml-apis/1.4.01/xml-apis-1.4.01.jar
[INFO] Downloaded from eclipse.maven.central.mirror: https://repo.eclipse.org/content/repositories/maven_central/xml-apis/xml-apis/1.4.01/xml-apis-1.4.01.jar (221 kB at 3.7 MB/s)
[INFO] Downloading from eclipse.maven.central.mirror: https://repo.eclipse.org/content/repositories/maven_central/javax/websocket/javax.websocket-api/1.1/javax.websocket-api-1.1.jar
[INFO] Downloaded from eclipse.maven.central.mirror: https://repo.eclipse.org/content/repositories/maven_central/org/glassfish/jersey/media/jersey-media-multipart/2.30.1/jersey-media-multipart-2.30.1.jar (80 kB at 1.2 MB/s)
[INFO] Downloading from eclipse.maven.central.mirror: https://repo.eclipse.org/content/repositories/maven_central/io/swagger/swagger-jersey2-jaxrs/1.5.17/swagger-jersey2-jaxrs-1.5.17.jar
[INFO] Downloaded from eclipse.maven.central.mirror: https://repo.eclipse.org/content/repositories/maven_central/org/glassfish/jersey/media/jersey-media-jaxb/2.30.1/jersey-media-jaxb-2.30.1.jar (86 kB at 850 kB/s)
[INFO] Downloading from eclipse.maven.central.mirror: https://repo.eclipse.org/content/repositories/maven_central/io/swagger/swagger-jaxrs/1.5.17/swagger-jaxrs-1.5.17.jar
[INFO] Downloaded from eclipse.maven.central.mirror: https://repo.eclipse.org/content/repositories/maven_central/io/swagger/swagger-jersey2-jaxrs/1.5.17/swagger-jersey2-jaxrs-1.5.17.jar (6.7 kB at 54 kB/s)
[INFO] Downloading from eclipse.maven.central.mirror: https://repo.eclipse.org/content/repositories/maven_central/io/swagger/swagger-core/1.5.17/swagger-core-1.5.17.jar
[INFO] Downloaded from eclipse.maven.central.mirror: https://repo.eclipse.org/content/repositories/maven_central/javax/websocket/javax.websocket-api/1.1/javax.websocket-api-1.1.jar (37 kB at 264 kB/s)
[INFO] Downloading from eclipse.maven.central.mirror: https://repo.eclipse.org/content/repositories/maven_central/io/swagger/swagger-models/1.5.17/swagger-models-1.5.17.jar
[INFO] Downloaded from eclipse.maven.central.mirror: https://repo.eclipse.org/content/repositories/maven_central/xerces/xercesImpl/2.12.0/xercesImpl-2.12.0.jar (1.4 MB at 9.2 MB/s)
[INFO] Downloading from eclipse.maven.central.mirror: https://repo.eclipse.org/content/repositories/maven_central/io/swagger/swagger-annotations/1.5.17/swagger-annotations-1.5.17.jar
[INFO] Downloaded from eclipse.maven.central.mirror: https://repo.eclipse.org/content/repositories/maven_central/io/swagger/swagger-jaxrs/1.5.17/swagger-jaxrs-1.5.17.jar (70 kB at 443 kB/s)
[INFO] Downloading from eclipse.maven.central.mirror: https://repo.eclipse.org/content/repositories/maven_central/javax/validation/validation-api/1.1.0.Final/validation-api-1.1.0.Final.jar
[INFO] Downloaded from eclipse.maven.central.mirror: https://repo.eclipse.org/content/repositories/maven_central/javax/validation/validation-api/1.1.0.Final/validation-api-1.1.0.Final.jar (64 kB at 396 kB/s)
[INFO] Downloading from eclipse.maven.central.mirror: https://repo.eclipse.org/content/repositories/maven_central/org/javassist/javassist/3.22.0-GA/javassist-3.22.0-GA.jar
[INFO] Downloaded from eclipse.maven.central.mirror: https://repo.eclipse.org/content/repositories/maven_central/org/glassfish/jersey/core/jersey-server/2.30.1/jersey-server-2.30.1.jar (928 kB at 5.0 MB/s)
[INFO] Downloading from eclipse.maven.central.mirror: https://repo.eclipse.org/content/repositories/maven_central/org/jvnet/mimepull/mimepull/1.9.4/mimepull-1.9.4.jar
[INFO] Downloaded from eclipse.maven.central.mirror: https://repo.eclipse.org/content/repositories/maven_central/io/swagger/swagger-annotations/1.5.17/swagger-annotations-1.5.17.jar (21 kB at 103 kB/s)
[INFO] Downloading from eclipse.maven.central.mirror: https://repo.eclipse.org/content/repositories/maven_central/javax/servlet/javax.servlet-api/3.1.0/javax.servlet-api-3.1.0.jar
[INFO] Downloaded from eclipse.maven.central.mirror: https://repo.eclipse.org/content/repositories/maven_central/javax/servlet/javax.servlet-api/3.1.0/javax.servlet-api-3.1.0.jar (96 kB at 424 kB/s)
[INFO] Downloading from eclipse.maven.central.mirror: https://repo.eclipse.org/content/repositories/maven_central/org/eclipse/jetty/jetty-servlet/9.4.2.v20170220/jetty-servlet-9.4.2.v20170220.jar
[INFO] Downloaded from eclipse.maven.central.mirror: https://repo.eclipse.org/content/repositories/maven_central/org/jvnet/mimepull/mimepull/1.9.4/mimepull-1.9.4.jar (63 kB at 257 kB/s)
[INFO] Downloading from eclipse.maven.central.mirror: https://repo.eclipse.org/content/repositories/maven_central/org/eclipse/jetty/jetty-security/9.4.2.v20170220/jetty-security-9.4.2.v20170220.jar
[INFO] Downloaded from eclipse.maven.central.mirror: https://repo.eclipse.org/content/repositories/maven_central/org/javassist/javassist/3.22.0-GA/javassist-3.22.0-GA.jar (740 kB at 2.8 MB/s)
[INFO] Downloading from eclipse.maven.central.mirror: https://repo.eclipse.org/content/repositories/maven_central/org/eclipse/jetty/jetty-server/9.4.2.v20170220/jetty-server-9.4.2.v20170220.jar
[INFO] Downloaded from eclipse.maven.central.mirror: https://repo.eclipse.org/content/repositories/maven_central/org/eclipse/jetty/jetty-servlet/9.4.2.v20170220/jetty-servlet-9.4.2.v20170220.jar (110 kB at 377 kB/s)
[INFO] Downloading from eclipse.maven.central.mirror: https://repo.eclipse.org/content/repositories/maven_central/org/eclipse/jetty/jetty-servlets/9.4.2.v20170220/jetty-servlets-9.4.2.v20170220.jar
[INFO] Downloaded from eclipse.maven.central.mirror: https://repo.eclipse.org/content/repositories/maven_central/org/eclipse/jetty/jetty-security/9.4.2.v20170220/jetty-security-9.4.2.v20170220.jar (91 kB at 274 kB/s)
[INFO] Downloading from eclipse.maven.central.mirror: https://repo.eclipse.org/content/repositories/maven_central/org/eclipse/jetty/jetty-continuation/9.4.2.v20170220/jetty-continuation-9.4.2.v20170220.jar
[INFO] Downloaded from eclipse.maven.central.mirror: https://repo.eclipse.org/content/repositories/maven_central/org/eclipse/jetty/jetty-continuation/9.4.2.v20170220/jetty-continuation-9.4.2.v20170220.jar (16 kB at 44 kB/s)
[INFO] Downloading from eclipse.maven.central.mirror: https://repo.eclipse.org/content/repositories/maven_central/org/eclipse/jetty/jetty-http/9.4.2.v20170220/jetty-http-9.4.2.v20170220.jar
[INFO] Downloaded from eclipse.maven.central.mirror: https://repo.eclipse.org/content/repositories/maven_central/org/eclipse/jetty/jetty-servlets/9.4.2.v20170220/jetty-servlets-9.4.2.v20170220.jar (87 kB at 213 kB/s)
[INFO] Downloading from eclipse.maven.central.mirror: https://repo.eclipse.org/content/repositories/maven_central/org/eclipse/jetty/jetty-util/9.4.2.v20170220/jetty-util-9.4.2.v20170220.jar
[INFO] Downloaded from eclipse.maven.central.mirror: https://repo.eclipse.org/content/repositories/maven_central/org/eclipse/jetty/jetty-server/9.4.2.v20170220/jetty-server-9.4.2.v20170220.jar (571 kB at 1.3 MB/s)
[INFO] Downloading from eclipse.maven.central.mirror: https://repo.eclipse.org/content/repositories/maven_central/org/eclipse/jetty/jetty-io/9.4.2.v20170220/jetty-io-9.4.2.v20170220.jar
[INFO] Downloaded from eclipse.maven.central.mirror: https://repo.eclipse.org/content/repositories/maven_central/org/eclipse/jetty/jetty-http/9.4.2.v20170220/jetty-http-9.4.2.v20170220.jar (161 kB at 372 kB/s)
[INFO] Downloading from eclipse.maven.central.mirror: https://repo.eclipse.org/content/repositories/maven_central/org/eclipse/jetty/toolchain/jetty-test-helper/4.2/jetty-test-helper-4.2.jar
[INFO] Downloaded from eclipse.maven.central.mirror: https://repo.eclipse.org/content/repositories/maven_central/io/swagger/swagger-models/1.5.17/swagger-models-1.5.17.jar (143 kB at 319 kB/s)
[INFO] Downloading from eclipse.maven.central.mirror: https://repo.eclipse.org/content/repositories/maven_central/junit/junit/4.12/junit-4.12.jar
[INFO] Downloaded from eclipse.maven.central.mirror: https://repo.eclipse.org/content/repositories/maven_central/org/eclipse/jetty/toolchain/jetty-test-helper/4.2/jetty-test-helper-4.2.jar (43 kB at 88 kB/s)
[INFO] Downloading from eclipse.maven.central.mirror: https://repo.eclipse.org/content/repositories/maven_central/org/hamcrest/hamcrest-library/1.3/hamcrest-library-1.3.jar
[INFO] Downloaded from eclipse.maven.central.mirror: https://repo.eclipse.org/content/repositories/maven_central/junit/junit/4.12/junit-4.12.jar (315 kB at 643 kB/s)
[INFO] Downloading from eclipse.maven.central.mirror: https://repo.eclipse.org/content/repositories/maven_central/org/xmlunit/xmlunit-core/2.6.4/xmlunit-core-2.6.4.jar
[INFO] Downloaded from eclipse.maven.central.mirror: https://repo.eclipse.org/content/repositories/maven_central/org/eclipse/jetty/jetty-io/9.4.2.v20170220/jetty-io-9.4.2.v20170220.jar (131 kB at 258 kB/s)
[INFO] Downloading from eclipse.maven.central.mirror: https://repo.eclipse.org/content/repositories/maven_central/org/xmlunit/xmlunit-matchers/2.6.4/xmlunit-matchers-2.6.4.jar
[INFO] Downloaded from eclipse.maven.central.mirror: https://repo.eclipse.org/content/repositories/maven_central/org/eclipse/jetty/jetty-util/9.4.2.v20170220/jetty-util-9.4.2.v20170220.jar (453 kB at 867 kB/s)
[INFO] Downloading from eclipse.maven.central.mirror: https://repo.eclipse.org/content/repositories/maven_central/org/skyscreamer/jsonassert/1.5.0/jsonassert-1.5.0.jar
[INFO] Downloaded from eclipse.maven.central.mirror: https://repo.eclipse.org/content/repositories/maven_central/org/skyscreamer/jsonassert/1.5.0/jsonassert-1.5.0.jar (30 kB at 53 kB/s)
[INFO] Downloading from eclipse.maven.central.mirror: https://repo.eclipse.org/content/repositories/maven_central/io/rest-assured/rest-assured/3.0.2/rest-assured-3.0.2.jar
[INFO] Downloaded from eclipse.maven.central.mirror: https://repo.eclipse.org/content/repositories/maven_central/org/xmlunit/xmlunit-core/2.6.4/xmlunit-core-2.6.4.jar (168 kB at 285 kB/s)
[INFO] Downloading from eclipse.maven.central.mirror: https://repo.eclipse.org/content/repositories/maven_central/org/codehaus/groovy/groovy/2.4.6/groovy-2.4.6.jar
[INFO] Downloaded from eclipse.maven.central.mirror: https://repo.eclipse.org/content/repositories/maven_central/org/xmlunit/xmlunit-matchers/2.6.4/xmlunit-matchers-2.6.4.jar (20 kB at 34 kB/s)
[INFO] Downloading from eclipse.maven.central.mirror: https://repo.eclipse.org/content/repositories/maven_central/org/codehaus/groovy/groovy-xml/2.4.6/groovy-xml-2.4.6.jar
[INFO] Downloaded from eclipse.maven.central.mirror: https://repo.eclipse.org/content/repositories/maven_central/org/hamcrest/hamcrest-library/1.3/hamcrest-library-1.3.jar (53 kB at 79 kB/s)
[INFO] Downloading from eclipse.maven.central.mirror: https://repo.eclipse.org/content/repositories/maven_central/org/apache/httpcomponents/httpmime/4.5.1/httpmime-4.5.1.jar
[INFO] Downloaded from eclipse.maven.central.mirror: https://repo.eclipse.org/content/repositories/maven_central/org/codehaus/groovy/groovy-xml/2.4.6/groovy-xml-2.4.6.jar (215 kB at 319 kB/s)
[INFO] Downloading from eclipse.maven.central.mirror: https://repo.eclipse.org/content/repositories/maven_central/org/ccil/cowan/tagsoup/tagsoup/1.2.1/tagsoup-1.2.1.jar
[INFO] Downloaded from eclipse.maven.central.mirror: https://repo.eclipse.org/content/repositories/maven_central/io/rest-assured/rest-assured/3.0.2/rest-assured-3.0.2.jar (610 kB at 896 kB/s)
[INFO] Downloading from eclipse.maven.central.mirror: https://repo.eclipse.org/content/repositories/maven_central/io/rest-assured/json-path/3.0.2/json-path-3.0.2.jar
[INFO] Downloaded from eclipse.maven.central.mirror: https://repo.eclipse.org/content/repositories/maven_central/org/apache/httpcomponents/httpmime/4.5.1/httpmime-4.5.1.jar (41 kB at 55 kB/s)
[INFO] Downloading from eclipse.maven.central.mirror: https://repo.eclipse.org/content/repositories/maven_central/org/codehaus/groovy/groovy-json/2.4.6/groovy-json-2.4.6.jar
[INFO] Downloaded from eclipse.maven.central.mirror: https://repo.eclipse.org/content/repositories/maven_central/io/rest-assured/json-path/3.0.2/json-path-3.0.2.jar (53 kB at 70 kB/s)
[INFO] Downloading from eclipse.maven.central.mirror: https://repo.eclipse.org/content/repositories/maven_central/io/rest-assured/rest-assured-common/3.0.2/rest-assured-common-3.0.2.jar
[INFO] Downloaded from eclipse.maven.central.mirror: https://repo.eclipse.org/content/repositories/maven_central/org/codehaus/groovy/groovy-json/2.4.6/groovy-json-2.4.6.jar (130 kB at 166 kB/s)
[INFO] Downloading from eclipse.maven.central.mirror: https://repo.eclipse.org/content/repositories/maven_central/io/rest-assured/xml-path/3.0.2/xml-path-3.0.2.jar
[INFO] Downloaded from eclipse.maven.central.mirror: https://repo.eclipse.org/content/repositories/maven_central/io/rest-assured/rest-assured-common/3.0.2/rest-assured-common-3.0.2.jar (39 kB at 47 kB/s)
[INFO] Downloaded from eclipse.maven.central.mirror: https://repo.eclipse.org/content/repositories/maven_central/io/rest-assured/xml-path/3.0.2/xml-path-3.0.2.jar (71 kB at 81 kB/s)
[INFO] Downloaded from eclipse.maven.central.mirror: https://repo.eclipse.org/content/repositories/maven_central/org/codehaus/groovy/groovy/2.4.6/groovy-2.4.6.jar (4.6 MB at 5.2 MB/s)
[INFO] Downloaded from eclipse.maven.central.mirror: https://repo.eclipse.org/content/repositories/maven_central/org/ccil/cowan/tagsoup/tagsoup/1.2.1/tagsoup-1.2.1.jar (91 kB at 102 kB/s)
[INFO] Downloaded from eclipse.maven.central.mirror: https://repo.eclipse.org/content/repositories/maven_central/io/swagger/swagger-core/1.5.17/swagger-core-1.5.17.jar (111 kB at 90 kB/s)
[INFO] 
[INFO] --- maven-checkstyle-plugin:3.1.1:check (checkstyle) @ org.eclipse.winery.repository.rest ---
[INFO] You have 0 Checkstyle violations.
[INFO] 
[INFO] --- jacoco-maven-plugin:0.8.6:prepare-agent (jacoco-initialize) @ org.eclipse.winery.repository.rest ---
[INFO] argLine set to -javaagent:/home/jenkins/.m2/repository/org/jacoco/org.jacoco.agent/0.8.6/org.jacoco.agent-0.8.6-runtime.jar=destfile=/home/jenkins/agent/workspace/winery-jdk12/org.eclipse.winery.repository.rest/target/jacoco.exec,append=false
[INFO] 
[INFO] --- build-helper-maven-plugin:1.8:add-source (add-source) @ org.eclipse.winery.repository.rest ---
[INFO] Source directory: /home/jenkins/agent/workspace/winery-jdk12/org.eclipse.winery.repository.rest/target/generated-sources/java added.
[INFO] 
[INFO] --- maven-resources-plugin:2.6:resources (default-resources) @ org.eclipse.winery.repository.rest ---
[INFO] Using 'UTF-8' encoding to copy filtered resources.
[INFO] Copying 0 resource
[INFO] Copying 2 resources
[INFO] 
[INFO] --- maven-compiler-plugin:3.1:compile (default-compile) @ org.eclipse.winery.repository.rest ---
[INFO] Changes detected - recompiling the module!
[INFO] Compiling 258 source files to /home/jenkins/agent/workspace/winery-jdk12/org.eclipse.winery.repository.rest/target/classes
[WARNING] /home/jenkins/agent/workspace/winery-jdk12/org.eclipse.winery.repository.rest/src/main/java/org/eclipse/winery/repository/rest/resources/servicetemplates/boundarydefinitions/BoundaryDefinitionsJSPData.java: Some input files use or override a deprecated API.
[WARNING] /home/jenkins/agent/workspace/winery-jdk12/org.eclipse.winery.repository.rest/src/main/java/org/eclipse/winery/repository/rest/resources/servicetemplates/boundarydefinitions/BoundaryDefinitionsJSPData.java: Recompile with -Xlint:deprecation for details.
[WARNING] /home/jenkins/agent/workspace/winery-jdk12/org.eclipse.winery.repository.rest/src/main/java/org/eclipse/winery/repository/rest/websockets/GitWebSocket.java: /home/jenkins/agent/workspace/winery-jdk12/org.eclipse.winery.repository.rest/src/main/java/org/eclipse/winery/repository/rest/websockets/GitWebSocket.java uses unchecked or unsafe operations.
[WARNING] /home/jenkins/agent/workspace/winery-jdk12/org.eclipse.winery.repository.rest/src/main/java/org/eclipse/winery/repository/rest/websockets/GitWebSocket.java: Recompile with -Xlint:unchecked for details.
[INFO] 
[INFO] --- maven-resources-plugin:2.6:testResources (default-testResources) @ org.eclipse.winery.repository.rest ---
[INFO] Using 'UTF-8' encoding to copy filtered resources.
[INFO] Copying 239 resources
[INFO] 
[INFO] --- maven-compiler-plugin:3.1:testCompile (default-testCompile) @ org.eclipse.winery.repository.rest ---
[INFO] Changes detected - recompiling the module!
[INFO] Compiling 44 source files to /home/jenkins/agent/workspace/winery-jdk12/org.eclipse.winery.repository.rest/target/test-classes
[INFO] 
[INFO] --- maven-surefire-plugin:3.0.0-M5:test (default-test) @ org.eclipse.winery.repository.rest ---
[INFO] 
[INFO] -------------------------------------------------------
[INFO]  T E S T S
[INFO] -------------------------------------------------------
[INFO] Running org.eclipse.winery.repository.rest.resources.refinementmodels.PatternRefinementModelResourceTest
05:58:35.868 [main] INFO  o.e.w.common.json.JacksonProvider:36 <clinit> - Initializing json mapper...
05:58:35.870 [main] INFO  o.e.w.common.json.JacksonProvider:47 <clinit> - Initialized JsonMapper with VisibilityChecker [Visibility: getter=ANY,isGetter=ANY,setter=ANY,creator=ANY,field=PUBLIC_ONLY]
05:58:36.656 [main] INFO  o.e.w.c.configuration.Environment:147 getConfigFromFile - Winery config file: /home/jenkins/.winery/winery.yml
[ERROR] WARNING: An illegal reflective access operation has occurred
[ERROR] WARNING: Illegal reflective access by org.codehaus.groovy.vmplugin.v7.Java7$1 (file:/home/jenkins/.m2/repository/org/codehaus/groovy/groovy/2.4.6/groovy-2.4.6.jar) to constructor java.lang.invoke.MethodHandles$Lookup(java.lang.Class,int)
[ERROR] WARNING: Please consider reporting this to the maintainers of org.codehaus.groovy.vmplugin.v7.Java7$1
[ERROR] WARNING: Use --illegal-access=warn to enable warnings of further illegal reflective access operations
[ERROR] WARNING: All illegal access operations will be denied in a future release
[WARNING] Tests run: 5, Failures: 0, Errors: 0, Skipped: 2, Time elapsed: 7.046 s - in org.eclipse.winery.repository.rest.resources.refinementmodels.PatternRefinementModelResourceTest
[INFO] Running org.eclipse.winery.repository.rest.resources.refinementmodels.PatternRefinementModelsResourceTest
[WARNING] Tests run: 2, Failures: 0, Errors: 0, Skipped: 2, Time elapsed: 0.422 s - in org.eclipse.winery.repository.rest.resources.refinementmodels.PatternRefinementModelsResourceTest
[INFO] Running org.eclipse.winery.repository.rest.resources.servicetemplates.topologytemplates.NodeTemplateResourceTest
[INFO] Tests run: 2, Failures: 0, Errors: 0, Skipped: 0, Time elapsed: 1.277 s - in org.eclipse.winery.repository.rest.resources.servicetemplates.topologytemplates.NodeTemplateResourceTest
[INFO] Running org.eclipse.winery.repository.rest.resources.servicetemplates.topologytemplates.TopologyTemplateResourceTest
[INFO] Tests run: 24, Failures: 0, Errors: 0, Skipped: 0, Time elapsed: 6.51 s - in org.eclipse.winery.repository.rest.resources.servicetemplates.topologytemplates.TopologyTemplateResourceTest
[INFO] Running org.eclipse.winery.repository.rest.resources.servicetemplates.ServiceTemplateResourceTest
open Requirement: requiresDryFood
matchingBasisType: Endpoint
open Requirement: requiresWarmFloor
matchingBasisType: Container
open Requirement: ReqEquipment
matchingBasisType: Container
open Requirement: requiresDryFood
matchingbasisType: Endpoint
open Requirement: requiresWarmFloor
matchingbasisType: Container
open Requirement: ReqEquipment
matchingbasisType: Container
[INFO] Tests run: 19, Failures: 0, Errors: 0, Skipped: 0, Time elapsed: 4.402 s - in org.eclipse.winery.repository.rest.resources.servicetemplates.ServiceTemplateResourceTest
[INFO] Running org.eclipse.winery.repository.rest.resources.servicetemplates.boundarydefinitions.propertymappings.PropertyMappingsTest
[INFO] Tests run: 2, Failures: 0, Errors: 0, Skipped: 0, Time elapsed: 0.392 s - in org.eclipse.winery.repository.rest.resources.servicetemplates.boundarydefinitions.propertymappings.PropertyMappingsTest
[INFO] Running org.eclipse.winery.repository.rest.resources.servicetemplates.boundarydefinitions.interfaces.InterfacesResourceTest
[INFO] Tests run: 5, Failures: 0, Errors: 0, Skipped: 0, Time elapsed: 0.971 s - in org.eclipse.winery.repository.rest.resources.servicetemplates.boundarydefinitions.interfaces.InterfacesResourceTest
[INFO] Running org.eclipse.winery.repository.rest.resources.servicetemplates.boundarydefinitions.properties.PropertiesResourceTest
[INFO] Tests run: 1, Failures: 0, Errors: 0, Skipped: 0, Time elapsed: 0.28 s - in org.eclipse.winery.repository.rest.resources.servicetemplates.boundarydefinitions.properties.PropertiesResourceTest
[INFO] Running org.eclipse.winery.repository.rest.resources.servicetemplates.boundarydefinitions.propertyconstraints.PropertyConstraintsResourceTest
[INFO] Tests run: 1, Failures: 0, Errors: 0, Skipped: 0, Time elapsed: 0.305 s - in org.eclipse.winery.repository.rest.resources.servicetemplates.boundarydefinitions.propertyconstraints.PropertyConstraintsResourceTest
[INFO] Running org.eclipse.winery.repository.rest.resources.servicetemplates.boundarydefinitions.policies.PoliciesResourceTest
[INFO] Tests run: 3, Failures: 0, Errors: 0, Skipped: 0, Time elapsed: 0.725 s - in org.eclipse.winery.repository.rest.resources.servicetemplates.boundarydefinitions.policies.PoliciesResourceTest
[INFO] Running org.eclipse.winery.repository.rest.resources.servicetemplates.selfserviceportal.XMLTest
[INFO] Tests run: 2, Failures: 0, Errors: 0, Skipped: 0, Time elapsed: 0.467 s - in org.eclipse.winery.repository.rest.resources.servicetemplates.selfserviceportal.XMLTest
[INFO] Running org.eclipse.winery.repository.rest.resources.servicetemplates.selfserviceportal.FilesTest
[INFO] Tests run: 3, Failures: 0, Errors: 0, Skipped: 0, Time elapsed: 0.53 s - in org.eclipse.winery.repository.rest.resources.servicetemplates.selfserviceportal.FilesTest
[INFO] Running org.eclipse.winery.repository.rest.resources.servicetemplates.plans.PlansResourceTest
[INFO] Tests run: 5, Failures: 0, Errors: 0, Skipped: 0, Time elapsed: 1.368 s - in org.eclipse.winery.repository.rest.resources.servicetemplates.plans.PlansResourceTest
[INFO] Running org.eclipse.winery.repository.rest.resources.entitytypes.requirementtypes.RequirementTypeResourceTest
[INFO] Tests run: 5, Failures: 0, Errors: 0, Skipped: 0, Time elapsed: 0.854 s - in org.eclipse.winery.repository.rest.resources.entitytypes.requirementtypes.RequirementTypeResourceTest
[INFO] Running org.eclipse.winery.repository.rest.resources.entitytypes.policytypes.PolicyTypesResourceTest
[INFO] Tests run: 1, Failures: 0, Errors: 0, Skipped: 0, Time elapsed: 0.243 s - in org.eclipse.winery.repository.rest.resources.entitytypes.policytypes.PolicyTypesResourceTest
[INFO] Running org.eclipse.winery.repository.rest.resources.entitytypes.policytypes.TemplatesOfOnePolicyTypeResourceTest
[INFO] Tests run: 1, Failures: 0, Errors: 0, Skipped: 0, Time elapsed: 0.303 s - in org.eclipse.winery.repository.rest.resources.entitytypes.policytypes.TemplatesOfOnePolicyTypeResourceTest
[INFO] Running org.eclipse.winery.repository.rest.resources.entitytypes.policytypes.PolicyTypeResourceTest
[INFO] Tests run: 4, Failures: 0, Errors: 0, Skipped: 0, Time elapsed: 0.693 s - in org.eclipse.winery.repository.rest.resources.entitytypes.policytypes.PolicyTypeResourceTest
[INFO] Running org.eclipse.winery.repository.rest.resources.entitytypes.nodetypes.YamlNodeTypesResourceTest
[INFO] Tests run: 1, Failures: 0, Errors: 0, Skipped: 0, Time elapsed: 0.643 s - in org.eclipse.winery.repository.rest.resources.entitytypes.nodetypes.YamlNodeTypesResourceTest
[INFO] Running org.eclipse.winery.repository.rest.resources.entitytypes.nodetypes.NodeTypesResourceTest
[INFO] Tests run: 3, Failures: 0, Errors: 0, Skipped: 0, Time elapsed: 0.891 s - in org.eclipse.winery.repository.rest.resources.entitytypes.nodetypes.NodeTypesResourceTest
[INFO] Running org.eclipse.winery.repository.rest.resources.entitytypes.nodetypes.NodeTypeResourceTest
05:59:06.158 [qtp1805154945-262] WARN  org.glassfish.jersey.internal.Errors:168 logErrors - The following warnings have been detected: WARNING: Return type, java.util.List<?>, of method, public java.util.List<?> org.eclipse.winery.repository.rest.resources.interfaces.InterfacesResource.onGet(java.lang.String), is not resolvable to a concrete type.

[INFO] Tests run: 22, Failures: 0, Errors: 0, Skipped: 0, Time elapsed: 4.411 s - in org.eclipse.winery.repository.rest.resources.entitytypes.nodetypes.NodeTypeResourceTest
[INFO] Running org.eclipse.winery.repository.rest.resources.entitytypes.relationshiptypes.RelationshipTypeResourceTest
[INFO] Tests run: 7, Failures: 0, Errors: 0, Skipped: 0, Time elapsed: 1.377 s - in org.eclipse.winery.repository.rest.resources.entitytypes.relationshiptypes.RelationshipTypeResourceTest
[INFO] Running org.eclipse.winery.repository.rest.resources.entitytypes.artifacttypes.ArtifactTypeResourceTest
[INFO] Tests run: 6, Failures: 0, Errors: 0, Skipped: 0, Time elapsed: 1.189 s - in org.eclipse.winery.repository.rest.resources.entitytypes.artifacttypes.ArtifactTypeResourceTest
[INFO] Running org.eclipse.winery.repository.rest.resources.entitytypes.artifacttypes.TemplatesOfOneArtifactTypeResourceTest
[INFO] Tests run: 1, Failures: 0, Errors: 0, Skipped: 0, Time elapsed: 0.242 s - in org.eclipse.winery.repository.rest.resources.entitytypes.artifacttypes.TemplatesOfOneArtifactTypeResourceTest
[INFO] Running org.eclipse.winery.repository.rest.resources.entitytypeimplementations.nodetypeimplementations.NodeTypeImplementationResourceTest
05:59:10.339 [qtp1762258178-336] WARN  org.glassfish.jersey.internal.Errors:168 logErrors - The following warnings have been detected: WARNING: Return type, java.util.List<?>, of method, public java.util.List<?> org.eclipse.winery.repository.rest.resources.artifacts.ImplementationArtifactsResource.getInterfacesOfAssociatedType(), is not resolvable to a concrete type.

[INFO] Tests run: 6, Failures: 0, Errors: 0, Skipped: 0, Time elapsed: 1.938 s - in org.eclipse.winery.repository.rest.resources.entitytypeimplementations.nodetypeimplementations.NodeTypeImplementationResourceTest
[INFO] Running org.eclipse.winery.repository.rest.resources.entitytypeimplementations.relationshiptypeimplementations.RelationshipTypeImplementationResourceTest
[INFO] Tests run: 5, Failures: 0, Errors: 0, Skipped: 0, Time elapsed: 0.786 s - in org.eclipse.winery.repository.rest.resources.entitytypeimplementations.relationshiptypeimplementations.RelationshipTypeImplementationResourceTest
[INFO] Running org.eclipse.winery.repository.rest.resources.TenantRepositoryTest
05:59:13.000 [main] INFO  o.e.w.c.configuration.Environment:147 getConfigFromFile - Winery config file: /home/jenkins/.winery/winery.yml
[ERROR] Tests run: 1, Failures: 0, Errors: 1, Skipped: 0, Time elapsed: 0.257 s <<< FAILURE! - in org.eclipse.winery.repository.rest.resources.TenantRepositoryTest
[ERROR] org.eclipse.winery.repository.rest.resources.TenantRepositoryTest.testTenantRepository  Time elapsed: 0.006 s  <<< ERROR!
org.eclipse.jgit.api.errors.JGitInternalException: Missing unknown 313f40a0a42111d3d36aef0fa36a9ec82a997e14
	at org.eclipse.winery.repository.rest.resources.TenantRepositoryTest.testTenantRepository(TenantRepositoryTest.java:46)
Caused by: org.eclipse.jgit.errors.MissingObjectException: Missing unknown 313f40a0a42111d3d36aef0fa36a9ec82a997e14
	at org.eclipse.winery.repository.rest.resources.TenantRepositoryTest.testTenantRepository(TenantRepositoryTest.java:46)

[INFO] Running org.eclipse.winery.repository.rest.resources.edmm.EdmmResourceTest
05:59:13.223 [main] INFO  o.e.w.c.configuration.Environment:147 getConfigFromFile - Winery config file: /home/jenkins/.winery/winery.yml
[ERROR] Tests run: 3, Failures: 0, Errors: 2, Skipped: 1, Time elapsed: 0.32 s <<< FAILURE! - in org.eclipse.winery.repository.rest.resources.edmm.EdmmResourceTest
[ERROR] org.eclipse.winery.repository.rest.resources.edmm.EdmmResourceTest.testSupportForPetclinicCloud  Time elapsed: 0.004 s  <<< ERROR!
org.eclipse.jgit.api.errors.JGitInternalException: Missing unknown 313f40a0a42111d3d36aef0fa36a9ec82a997e14
	at org.eclipse.winery.repository.rest.resources.edmm.EdmmResourceTest.testSupportForPetclinicCloud(EdmmResourceTest.java:34)
Caused by: org.eclipse.jgit.errors.MissingObjectException: Missing unknown 313f40a0a42111d3d36aef0fa36a9ec82a997e14
	at org.eclipse.winery.repository.rest.resources.edmm.EdmmResourceTest.testSupportForPetclinicCloud(EdmmResourceTest.java:34)

[ERROR] org.eclipse.winery.repository.rest.resources.edmm.EdmmResourceTest.testOneToOneMapForPetclinicIaas  Time elapsed: 0.003 s  <<< ERROR!
org.eclipse.jgit.api.errors.JGitInternalException: Missing unknown 313f40a0a42111d3d36aef0fa36a9ec82a997e14
	at org.eclipse.winery.repository.rest.resources.edmm.EdmmResourceTest.testOneToOneMapForPetclinicIaas(EdmmResourceTest.java:47)
Caused by: org.eclipse.jgit.errors.MissingObjectException: Missing unknown 313f40a0a42111d3d36aef0fa36a9ec82a997e14
	at org.eclipse.winery.repository.rest.resources.edmm.EdmmResourceTest.testOneToOneMapForPetclinicIaas(EdmmResourceTest.java:47)

[INFO] Running org.eclipse.winery.repository.rest.resources.MainResourceTest
[WARNING] Tests run: 1, Failures: 0, Errors: 0, Skipped: 1, Time elapsed: 0.119 s - in org.eclipse.winery.repository.rest.resources.MainResourceTest
[INFO] Running org.eclipse.winery.repository.rest.resources.artifacts.GenericArtifactsResourceTest
[ERROR] Tests run: 1, Failures: 0, Errors: 1, Skipped: 0, Time elapsed: 0.129 s <<< FAILURE! - in org.eclipse.winery.repository.rest.resources.artifacts.GenericArtifactsResourceTest
[ERROR] org.eclipse.winery.repository.rest.resources.artifacts.GenericArtifactsResourceTest.generateArtifactAutoGenereatatesWarType  Time elapsed: 0.004 s  <<< ERROR!
org.eclipse.jgit.api.errors.JGitInternalException: Missing unknown 313f40a0a42111d3d36aef0fa36a9ec82a997e14
	at org.eclipse.winery.repository.rest.resources.artifacts.GenericArtifactsResourceTest.generateArtifactAutoGenereatatesWarType(GenericArtifactsResourceTest.java:23)
Caused by: org.eclipse.jgit.errors.MissingObjectException: Missing unknown 313f40a0a42111d3d36aef0fa36a9ec82a997e14
	at org.eclipse.winery.repository.rest.resources.artifacts.GenericArtifactsResourceTest.generateArtifactAutoGenereatatesWarType(GenericArtifactsResourceTest.java:23)

[INFO] Running org.eclipse.winery.repository.rest.resources.entitytemplates.policytemplates.PolicyTemplatesResourceTest
[ERROR] Tests run: 1, Failures: 0, Errors: 1, Skipped: 0, Time elapsed: 0.176 s <<< FAILURE! - in org.eclipse.winery.repository.rest.resources.entitytemplates.policytemplates.PolicyTemplatesResourceTest
[ERROR] org.eclipse.winery.repository.rest.resources.entitytemplates.policytemplates.PolicyTemplatesResourceTest.getAllVisualAppearanceData  Time elapsed: 0.006 s  <<< ERROR!
org.eclipse.jgit.api.errors.JGitInternalException: Missing unknown 313f40a0a42111d3d36aef0fa36a9ec82a997e14
	at org.eclipse.winery.repository.rest.resources.entitytemplates.policytemplates.PolicyTemplatesResourceTest.getAllVisualAppearanceData(PolicyTemplatesResourceTest.java:25)
Caused by: org.eclipse.jgit.errors.MissingObjectException: Missing unknown 313f40a0a42111d3d36aef0fa36a9ec82a997e14
	at org.eclipse.winery.repository.rest.resources.entitytemplates.policytemplates.PolicyTemplatesResourceTest.getAllVisualAppearanceData(PolicyTemplatesResourceTest.java:25)

[INFO] Running org.eclipse.winery.repository.rest.resources.entitytemplates.policytemplates.PolicyTemplateResourceTest
[ERROR] Tests run: 2, Failures: 0, Errors: 2, Skipped: 0, Time elapsed: 0.339 s <<< FAILURE! - in org.eclipse.winery.repository.rest.resources.entitytemplates.policytemplates.PolicyTemplateResourceTest
[ERROR] org.eclipse.winery.repository.rest.resources.entitytemplates.policytemplates.PolicyTemplateResourceTest.getVisualAppearanceData  Time elapsed: 0.003 s  <<< ERROR!
org.eclipse.jgit.api.errors.JGitInternalException: Missing unknown 313f40a0a42111d3d36aef0fa36a9ec82a997e14
	at org.eclipse.winery.repository.rest.resources.entitytemplates.policytemplates.PolicyTemplateResourceTest.getVisualAppearanceData(PolicyTemplateResourceTest.java:25)
Caused by: org.eclipse.jgit.errors.MissingObjectException: Missing unknown 313f40a0a42111d3d36aef0fa36a9ec82a997e14
	at org.eclipse.winery.repository.rest.resources.entitytemplates.policytemplates.PolicyTemplateResourceTest.getVisualAppearanceData(PolicyTemplateResourceTest.java:25)

[ERROR] org.eclipse.winery.repository.rest.resources.entitytemplates.policytemplates.PolicyTemplateResourceTest.getIcon  Time elapsed: 0.003 s  <<< ERROR!
org.eclipse.jgit.api.errors.JGitInternalException: Missing unknown 313f40a0a42111d3d36aef0fa36a9ec82a997e14
	at org.eclipse.winery.repository.rest.resources.entitytemplates.policytemplates.PolicyTemplateResourceTest.getIcon(PolicyTemplateResourceTest.java:32)
Caused by: org.eclipse.jgit.errors.MissingObjectException: Missing unknown 313f40a0a42111d3d36aef0fa36a9ec82a997e14
	at org.eclipse.winery.repository.rest.resources.entitytemplates.policytemplates.PolicyTemplateResourceTest.getIcon(PolicyTemplateResourceTest.java:32)

[INFO] Running org.eclipse.winery.repository.rest.resources.entitytemplates.artifacttemplates.FilesResourceTest
[ERROR] Tests run: 4, Failures: 0, Errors: 4, Skipped: 0, Time elapsed: 0.66 s <<< FAILURE! - in org.eclipse.winery.repository.rest.resources.entitytemplates.artifacttemplates.FilesResourceTest
[ERROR] org.eclipse.winery.repository.rest.resources.entitytemplates.artifacttemplates.FilesResourceTest.getEmptyFiles  Time elapsed: 0.004 s  <<< ERROR!
org.eclipse.jgit.api.errors.JGitInternalException: Missing unknown 313f40a0a42111d3d36aef0fa36a9ec82a997e14
	at org.eclipse.winery.repository.rest.resources.entitytemplates.artifacttemplates.FilesResourceTest.getEmptyFiles(FilesResourceTest.java:23)
Caused by: org.eclipse.jgit.errors.MissingObjectException: Missing unknown 313f40a0a42111d3d36aef0fa36a9ec82a997e14
	at org.eclipse.winery.repository.rest.resources.entitytemplates.artifacttemplates.FilesResourceTest.getEmptyFiles(FilesResourceTest.java:23)

[ERROR] org.eclipse.winery.repository.rest.resources.entitytemplates.artifacttemplates.FilesResourceTest.getOneFileElement  Time elapsed: 0.003 s  <<< ERROR!
org.eclipse.jgit.api.errors.JGitInternalException: Missing unknown 313f40a0a42111d3d36aef0fa36a9ec82a997e14
	at org.eclipse.winery.repository.rest.resources.entitytemplates.artifacttemplates.FilesResourceTest.getOneFileElement(FilesResourceTest.java:44)
Caused by: org.eclipse.jgit.errors.MissingObjectException: Missing unknown 313f40a0a42111d3d36aef0fa36a9ec82a997e14
	at org.eclipse.winery.repository.rest.resources.entitytemplates.artifacttemplates.FilesResourceTest.getOneFileElement(FilesResourceTest.java:44)

[ERROR] org.eclipse.winery.repository.rest.resources.entitytemplates.artifacttemplates.FilesResourceTest.getEmptySources  Time elapsed: 0.003 s  <<< ERROR!
org.eclipse.jgit.api.errors.JGitInternalException: Missing unknown 313f40a0a42111d3d36aef0fa36a9ec82a997e14
	at org.eclipse.winery.repository.rest.resources.entitytemplates.artifacttemplates.FilesResourceTest.getEmptySources(FilesResourceTest.java:30)
Caused by: org.eclipse.jgit.errors.MissingObjectException: Missing unknown 313f40a0a42111d3d36aef0fa36a9ec82a997e14
	at org.eclipse.winery.repository.rest.resources.entitytemplates.artifacttemplates.FilesResourceTest.getEmptySources(FilesResourceTest.java:30)

[ERROR] org.eclipse.winery.repository.rest.resources.entitytemplates.artifacttemplates.FilesResourceTest.getOneSourceElement  Time elapsed: 0.003 s  <<< ERROR!
org.eclipse.jgit.api.errors.JGitInternalException: Missing unknown 313f40a0a42111d3d36aef0fa36a9ec82a997e14
	at org.eclipse.winery.repository.rest.resources.entitytemplates.artifacttemplates.FilesResourceTest.getOneSourceElement(FilesResourceTest.java:37)
Caused by: org.eclipse.jgit.errors.MissingObjectException: Missing unknown 313f40a0a42111d3d36aef0fa36a9ec82a997e14
	at org.eclipse.winery.repository.rest.resources.entitytemplates.artifacttemplates.FilesResourceTest.getOneSourceElement(FilesResourceTest.java:37)

[INFO] Running org.eclipse.winery.repository.rest.resources.entitytemplates.artifacttemplates.ArtifactTemplateResourceTest
[ERROR] Tests run: 9, Failures: 0, Errors: 8, Skipped: 1, Time elapsed: 1.409 s <<< FAILURE! - in org.eclipse.winery.repository.rest.resources.entitytemplates.artifacttemplates.ArtifactTemplateResourceTest
[ERROR] org.eclipse.winery.repository.rest.resources.entitytemplates.artifacttemplates.ArtifactTemplateResourceTest.getSourceZip  Time elapsed: 0.003 s  <<< ERROR!
org.eclipse.jgit.api.errors.JGitInternalException: Missing unknown 313f40a0a42111d3d36aef0fa36a9ec82a997e14
	at org.eclipse.winery.repository.rest.resources.entitytemplates.artifacttemplates.ArtifactTemplateResourceTest.getSourceZip(ArtifactTemplateResourceTest.java:34)
Caused by: org.eclipse.jgit.errors.MissingObjectException: Missing unknown 313f40a0a42111d3d36aef0fa36a9ec82a997e14
	at org.eclipse.winery.repository.rest.resources.entitytemplates.artifacttemplates.ArtifactTemplateResourceTest.getSourceZip(ArtifactTemplateResourceTest.java:34)

[ERROR] org.eclipse.winery.repository.rest.resources.entitytemplates.artifacttemplates.ArtifactTemplateResourceTest.copySourcesToFilesWithSelection  Time elapsed: 0.003 s  <<< ERROR!
org.eclipse.jgit.api.errors.JGitInternalException: Missing unknown 313f40a0a42111d3d36aef0fa36a9ec82a997e14
	at org.eclipse.winery.repository.rest.resources.entitytemplates.artifacttemplates.ArtifactTemplateResourceTest.copySourcesToFilesWithSelection(ArtifactTemplateResourceTest.java:57)
Caused by: org.eclipse.jgit.errors.MissingObjectException: Missing unknown 313f40a0a42111d3d36aef0fa36a9ec82a997e14
	at org.eclipse.winery.repository.rest.resources.entitytemplates.artifacttemplates.ArtifactTemplateResourceTest.copySourcesToFilesWithSelection(ArtifactTemplateResourceTest.java:57)

[ERROR] org.eclipse.winery.repository.rest.resources.entitytemplates.artifacttemplates.ArtifactTemplateResourceTest.copyFilesToSource  Time elapsed: 0.003 s  <<< ERROR!
org.eclipse.jgit.api.errors.JGitInternalException: Missing unknown 313f40a0a42111d3d36aef0fa36a9ec82a997e14
	at org.eclipse.winery.repository.rest.resources.entitytemplates.artifacttemplates.ArtifactTemplateResourceTest.copyFilesToSource(ArtifactTemplateResourceTest.java:64)
Caused by: org.eclipse.jgit.errors.MissingObjectException: Missing unknown 313f40a0a42111d3d36aef0fa36a9ec82a997e14
	at org.eclipse.winery.repository.rest.resources.entitytemplates.artifacttemplates.ArtifactTemplateResourceTest.copyFilesToSource(ArtifactTemplateResourceTest.java:64)

[ERROR] org.eclipse.winery.repository.rest.resources.entitytemplates.artifacttemplates.ArtifactTemplateResourceTest.artifactTemplateContainsFileReferenceInJson  Time elapsed: 0.003 s  <<< ERROR!
org.eclipse.jgit.api.errors.JGitInternalException: Missing unknown 313f40a0a42111d3d36aef0fa36a9ec82a997e14
	at org.eclipse.winery.repository.rest.resources.entitytemplates.artifacttemplates.ArtifactTemplateResourceTest.artifactTemplateContainsFileReferenceInJson(ArtifactTemplateResourceTest.java:70)
Caused by: org.eclipse.jgit.errors.MissingObjectException: Missing unknown 313f40a0a42111d3d36aef0fa36a9ec82a997e14
	at org.eclipse.winery.repository.rest.resources.entitytemplates.artifacttemplates.ArtifactTemplateResourceTest.artifactTemplateContainsFileReferenceInJson(ArtifactTemplateResourceTest.java:70)

[ERROR] org.eclipse.winery.repository.rest.resources.entitytemplates.artifacttemplates.ArtifactTemplateResourceTest.copySourcesToFilesWithoutSelection  Time elapsed: 0.003 s  <<< ERROR!
org.eclipse.jgit.api.errors.JGitInternalException: Missing unknown 313f40a0a42111d3d36aef0fa36a9ec82a997e14
	at org.eclipse.winery.repository.rest.resources.entitytemplates.artifacttemplates.ArtifactTemplateResourceTest.copySourcesToFilesWithoutSelection(ArtifactTemplateResourceTest.java:50)
Caused by: org.eclipse.jgit.errors.MissingObjectException: Missing unknown 313f40a0a42111d3d36aef0fa36a9ec82a997e14
	at org.eclipse.winery.repository.rest.resources.entitytemplates.artifacttemplates.ArtifactTemplateResourceTest.copySourcesToFilesWithoutSelection(ArtifactTemplateResourceTest.java:50)

[ERROR] org.eclipse.winery.repository.rest.resources.entitytemplates.artifacttemplates.ArtifactTemplateResourceTest.artifactTemplateContainsFileReferenceInXml  Time elapsed: 0.003 s  <<< ERROR!
org.eclipse.jgit.api.errors.JGitInternalException: Missing unknown 313f40a0a42111d3d36aef0fa36a9ec82a997e14
	at org.eclipse.winery.repository.rest.resources.entitytemplates.artifacttemplates.ArtifactTemplateResourceTest.artifactTemplateContainsFileReferenceInXml(ArtifactTemplateResourceTest.java:77)
Caused by: org.eclipse.jgit.errors.MissingObjectException: Missing unknown 313f40a0a42111d3d36aef0fa36a9ec82a997e14
	at org.eclipse.winery.repository.rest.resources.entitytemplates.artifacttemplates.ArtifactTemplateResourceTest.artifactTemplateContainsFileReferenceInXml(ArtifactTemplateResourceTest.java:77)

[ERROR] org.eclipse.winery.repository.rest.resources.entitytemplates.artifacttemplates.ArtifactTemplateResourceTest.getFilesZip  Time elapsed: 0.004 s  <<< ERROR!
org.eclipse.jgit.api.errors.JGitInternalException: Missing unknown 313f40a0a42111d3d36aef0fa36a9ec82a997e14
	at org.eclipse.winery.repository.rest.resources.entitytemplates.artifacttemplates.ArtifactTemplateResourceTest.getFilesZip(ArtifactTemplateResourceTest.java:28)
Caused by: org.eclipse.jgit.errors.MissingObjectException: Missing unknown 313f40a0a42111d3d36aef0fa36a9ec82a997e14
	at org.eclipse.winery.repository.rest.resources.entitytemplates.artifacttemplates.ArtifactTemplateResourceTest.getFilesZip(ArtifactTemplateResourceTest.java:28)

[ERROR] org.eclipse.winery.repository.rest.resources.entitytemplates.artifacttemplates.ArtifactTemplateResourceTest.artifactTemplateContainsUpdatedFileReferenceInJson  Time elapsed: 0.003 s  <<< ERROR!
org.eclipse.jgit.api.errors.JGitInternalException: Missing unknown 313f40a0a42111d3d36aef0fa36a9ec82a997e14
	at org.eclipse.winery.repository.rest.resources.entitytemplates.artifacttemplates.ArtifactTemplateResourceTest.artifactTemplateContainsUpdatedFileReferenceInJson(ArtifactTemplateResourceTest.java:84)
Caused by: org.eclipse.jgit.errors.MissingObjectException: Missing unknown 313f40a0a42111d3d36aef0fa36a9ec82a997e14
	at org.eclipse.winery.repository.rest.resources.entitytemplates.artifacttemplates.ArtifactTemplateResourceTest.artifactTemplateContainsUpdatedFileReferenceInJson(ArtifactTemplateResourceTest.java:84)

[INFO] Running org.eclipse.winery.repository.rest.resources.entitytemplates.PropertiesResourceTest
[ERROR] Tests run: 6, Failures: 0, Errors: 6, Skipped: 0, Time elapsed: 1.182 s <<< FAILURE! - in org.eclipse.winery.repository.rest.resources.entitytemplates.PropertiesResourceTest
[ERROR] org.eclipse.winery.repository.rest.resources.entitytemplates.PropertiesResourceTest.getPropertiesJsonList  Time elapsed: 0.004 s  <<< ERROR!
org.eclipse.jgit.api.errors.JGitInternalException: Missing unknown 313f40a0a42111d3d36aef0fa36a9ec82a997e14
	at org.eclipse.winery.repository.rest.resources.entitytemplates.PropertiesResourceTest.getPropertiesJsonList(PropertiesResourceTest.java:30)
Caused by: org.eclipse.jgit.errors.MissingObjectException: Missing unknown 313f40a0a42111d3d36aef0fa36a9ec82a997e14
	at org.eclipse.winery.repository.rest.resources.entitytemplates.PropertiesResourceTest.getPropertiesJsonList(PropertiesResourceTest.java:30)

[ERROR] org.eclipse.winery.repository.rest.resources.entitytemplates.PropertiesResourceTest.getOfNonExistingProperties  Time elapsed: 0.003 s  <<< ERROR!
org.eclipse.jgit.api.errors.JGitInternalException: Missing unknown 313f40a0a42111d3d36aef0fa36a9ec82a997e14
	at org.eclipse.winery.repository.rest.resources.entitytemplates.PropertiesResourceTest.getOfNonExistingProperties(PropertiesResourceTest.java:24)
Caused by: org.eclipse.jgit.errors.MissingObjectException: Missing unknown 313f40a0a42111d3d36aef0fa36a9ec82a997e14
	at org.eclipse.winery.repository.rest.resources.entitytemplates.PropertiesResourceTest.getOfNonExistingProperties(PropertiesResourceTest.java:24)

[ERROR] org.eclipse.winery.repository.rest.resources.entitytemplates.PropertiesResourceTest.postXMLProperties  Time elapsed: 0.006 s  <<< ERROR!
org.eclipse.jgit.api.errors.JGitInternalException: Missing unknown 313f40a0a42111d3d36aef0fa36a9ec82a997e14
	at org.eclipse.winery.repository.rest.resources.entitytemplates.PropertiesResourceTest.postXMLProperties(PropertiesResourceTest.java:53)
Caused by: org.eclipse.jgit.errors.MissingObjectException: Missing unknown 313f40a0a42111d3d36aef0fa36a9ec82a997e14
	at org.eclipse.winery.repository.rest.resources.entitytemplates.PropertiesResourceTest.postXMLProperties(PropertiesResourceTest.java:53)

[ERROR] org.eclipse.winery.repository.rest.resources.entitytemplates.PropertiesResourceTest.postXMLPropertiesToArtifact  Time elapsed: 0.004 s  <<< ERROR!
org.eclipse.jgit.api.errors.JGitInternalException: Missing unknown 313f40a0a42111d3d36aef0fa36a9ec82a997e14
	at org.eclipse.winery.repository.rest.resources.entitytemplates.PropertiesResourceTest.postXMLPropertiesToArtifact(PropertiesResourceTest.java:62)
Caused by: org.eclipse.jgit.errors.MissingObjectException: Missing unknown 313f40a0a42111d3d36aef0fa36a9ec82a997e14
	at org.eclipse.winery.repository.rest.resources.entitytemplates.PropertiesResourceTest.postXMLPropertiesToArtifact(PropertiesResourceTest.java:62)

[ERROR] org.eclipse.winery.repository.rest.resources.entitytemplates.PropertiesResourceTest.postJsonProperties  Time elapsed: 0.003 s  <<< ERROR!
org.eclipse.jgit.api.errors.JGitInternalException: Missing unknown 313f40a0a42111d3d36aef0fa36a9ec82a997e14
	at org.eclipse.winery.repository.rest.resources.entitytemplates.PropertiesResourceTest.postJsonProperties(PropertiesResourceTest.java:44)
Caused by: org.eclipse.jgit.errors.MissingObjectException: Missing unknown 313f40a0a42111d3d36aef0fa36a9ec82a997e14
	at org.eclipse.winery.repository.rest.resources.entitytemplates.PropertiesResourceTest.postJsonProperties(PropertiesResourceTest.java:44)

[ERROR] org.eclipse.winery.repository.rest.resources.entitytemplates.PropertiesResourceTest.getPropertiesXml  Time elapsed: 0.003 s  <<< ERROR!
org.eclipse.jgit.api.errors.JGitInternalException: Missing unknown 313f40a0a42111d3d36aef0fa36a9ec82a997e14
	at org.eclipse.winery.repository.rest.resources.entitytemplates.PropertiesResourceTest.getPropertiesXml(PropertiesResourceTest.java:37)
Caused by: org.eclipse.jgit.errors.MissingObjectException: Missing unknown 313f40a0a42111d3d36aef0fa36a9ec82a997e14
	at org.eclipse.winery.repository.rest.resources.entitytemplates.PropertiesResourceTest.getPropertiesXml(PropertiesResourceTest.java:37)

[INFO] Running org.eclipse.winery.repository.rest.resources.placementmodels.PlacementModelsResourceTest
[ERROR] Tests run: 4, Failures: 0, Errors: 4, Skipped: 0, Time elapsed: 0.673 s <<< FAILURE! - in org.eclipse.winery.repository.rest.resources.placementmodels.PlacementModelsResourceTest
[ERROR] org.eclipse.winery.repository.rest.resources.placementmodels.PlacementModelsResourceTest.placementAndCompletionOfServiceTemplate1  Time elapsed: 0.003 s  <<< ERROR!
org.eclipse.jgit.api.errors.JGitInternalException: Missing unknown 313f40a0a42111d3d36aef0fa36a9ec82a997e14
	at org.eclipse.winery.repository.rest.resources.placementmodels.PlacementModelsResourceTest.placementAndCompletionOfServiceTemplate1(PlacementModelsResourceTest.java:36)
Caused by: org.eclipse.jgit.errors.MissingObjectException: Missing unknown 313f40a0a42111d3d36aef0fa36a9ec82a997e14
	at org.eclipse.winery.repository.rest.resources.placementmodels.PlacementModelsResourceTest.placementAndCompletionOfServiceTemplate1(PlacementModelsResourceTest.java:36)

[ERROR] org.eclipse.winery.repository.rest.resources.placementmodels.PlacementModelsResourceTest.placementAndCompletionOfServiceTemplate2  Time elapsed: 0.003 s  <<< ERROR!
org.eclipse.jgit.api.errors.JGitInternalException: Missing unknown 313f40a0a42111d3d36aef0fa36a9ec82a997e14
	at org.eclipse.winery.repository.rest.resources.placementmodels.PlacementModelsResourceTest.placementAndCompletionOfServiceTemplate2(PlacementModelsResourceTest.java:56)
Caused by: org.eclipse.jgit.errors.MissingObjectException: Missing unknown 313f40a0a42111d3d36aef0fa36a9ec82a997e14
	at org.eclipse.winery.repository.rest.resources.placementmodels.PlacementModelsResourceTest.placementAndCompletionOfServiceTemplate2(PlacementModelsResourceTest.java:56)

[ERROR] org.eclipse.winery.repository.rest.resources.placementmodels.PlacementModelsResourceTest.createDataFlowBasedServiceTemplate1  Time elapsed: 0.003 s  <<< ERROR!
org.eclipse.jgit.api.errors.JGitInternalException: Missing unknown 313f40a0a42111d3d36aef0fa36a9ec82a997e14
	at org.eclipse.winery.repository.rest.resources.placementmodels.PlacementModelsResourceTest.createDataFlowBasedServiceTemplate1(PlacementModelsResourceTest.java:28)
Caused by: org.eclipse.jgit.errors.MissingObjectException: Missing unknown 313f40a0a42111d3d36aef0fa36a9ec82a997e14
	at org.eclipse.winery.repository.rest.resources.placementmodels.PlacementModelsResourceTest.createDataFlowBasedServiceTemplate1(PlacementModelsResourceTest.java:28)

[ERROR] org.eclipse.winery.repository.rest.resources.placementmodels.PlacementModelsResourceTest.createDataFlowBasedServiceTemplate2  Time elapsed: 0.003 s  <<< ERROR!
org.eclipse.jgit.api.errors.JGitInternalException: Missing unknown 313f40a0a42111d3d36aef0fa36a9ec82a997e14
	at org.eclipse.winery.repository.rest.resources.placementmodels.PlacementModelsResourceTest.createDataFlowBasedServiceTemplate2(PlacementModelsResourceTest.java:48)
Caused by: org.eclipse.jgit.errors.MissingObjectException: Missing unknown 313f40a0a42111d3d36aef0fa36a9ec82a997e14
	at org.eclipse.winery.repository.rest.resources.placementmodels.PlacementModelsResourceTest.createDataFlowBasedServiceTemplate2(PlacementModelsResourceTest.java:48)

[INFO] Running org.eclipse.winery.repository.rest.resources.InheritanceResourceTest
[ERROR] Tests run: 4, Failures: 0, Errors: 4, Skipped: 0, Time elapsed: 0.856 s <<< FAILURE! - in org.eclipse.winery.repository.rest.resources.InheritanceResourceTest
[ERROR] org.eclipse.winery.repository.rest.resources.InheritanceResourceTest.addInheritanceToNodeType  Time elapsed: 0.004 s  <<< ERROR!
org.eclipse.jgit.api.errors.JGitInternalException: Missing unknown 313f40a0a42111d3d36aef0fa36a9ec82a997e14
	at org.eclipse.winery.repository.rest.resources.InheritanceResourceTest.addInheritanceToNodeType(InheritanceResourceTest.java:23)
Caused by: org.eclipse.jgit.errors.MissingObjectException: Missing unknown 313f40a0a42111d3d36aef0fa36a9ec82a997e14
	at org.eclipse.winery.repository.rest.resources.InheritanceResourceTest.addInheritanceToNodeType(InheritanceResourceTest.java:23)

[ERROR] org.eclipse.winery.repository.rest.resources.InheritanceResourceTest.xmlStillValidAfterAddingDerivedFromNoneInheritanceToOneNodeType  Time elapsed: 0.003 s  <<< ERROR!
org.eclipse.jgit.api.errors.JGitInternalException: Missing unknown 313f40a0a42111d3d36aef0fa36a9ec82a997e14
	at org.eclipse.winery.repository.rest.resources.InheritanceResourceTest.xmlStillValidAfterAddingDerivedFromNoneInheritanceToOneNodeType(InheritanceResourceTest.java:32)
Caused by: org.eclipse.jgit.errors.MissingObjectException: Missing unknown 313f40a0a42111d3d36aef0fa36a9ec82a997e14
	at org.eclipse.winery.repository.rest.resources.InheritanceResourceTest.xmlStillValidAfterAddingDerivedFromNoneInheritanceToOneNodeType(InheritanceResourceTest.java:32)

[ERROR] org.eclipse.winery.repository.rest.resources.InheritanceResourceTest.xmlStillValidAfterAddingDerivedFromNoneInheritanceToOnePolicyType  Time elapsed: 0.003 s  <<< ERROR!
org.eclipse.jgit.api.errors.JGitInternalException: Missing unknown 313f40a0a42111d3d36aef0fa36a9ec82a997e14
	at org.eclipse.winery.repository.rest.resources.InheritanceResourceTest.xmlStillValidAfterAddingDerivedFromNoneInheritanceToOnePolicyType(InheritanceResourceTest.java:48)
Caused by: org.eclipse.jgit.errors.MissingObjectException: Missing unknown 313f40a0a42111d3d36aef0fa36a9ec82a997e14
	at org.eclipse.winery.repository.rest.resources.InheritanceResourceTest.xmlStillValidAfterAddingDerivedFromNoneInheritanceToOnePolicyType(InheritanceResourceTest.java:48)

[ERROR] org.eclipse.winery.repository.rest.resources.InheritanceResourceTest.addInheritanceToPolicyType  Time elapsed: 0.004 s  <<< ERROR!
org.eclipse.jgit.api.errors.JGitInternalException: Missing unknown 313f40a0a42111d3d36aef0fa36a9ec82a997e14
	at org.eclipse.winery.repository.rest.resources.InheritanceResourceTest.addInheritanceToPolicyType(InheritanceResourceTest.java:39)
Caused by: org.eclipse.jgit.errors.MissingObjectException: Missing unknown 313f40a0a42111d3d36aef0fa36a9ec82a997e14
	at org.eclipse.winery.repository.rest.resources.InheritanceResourceTest.addInheritanceToPolicyType(InheritanceResourceTest.java:39)

[INFO] Running org.eclipse.winery.repository.rest.resources.admin.NamespaceResourceTest
[ERROR] Tests run: 2, Failures: 0, Errors: 2, Skipped: 0, Time elapsed: 0.283 s <<< FAILURE! - in org.eclipse.winery.repository.rest.resources.admin.NamespaceResourceTest
[ERROR] org.eclipse.winery.repository.rest.resources.admin.NamespaceResourceTest.getNamespaceList  Time elapsed: 0.003 s  <<< ERROR!
org.eclipse.jgit.api.errors.JGitInternalException: Missing unknown 313f40a0a42111d3d36aef0fa36a9ec82a997e14
	at org.eclipse.winery.repository.rest.resources.admin.NamespaceResourceTest.getNamespaceList(NamespaceResourceTest.java:24)
Caused by: org.eclipse.jgit.errors.MissingObjectException: Missing unknown 313f40a0a42111d3d36aef0fa36a9ec82a997e14
	at org.eclipse.winery.repository.rest.resources.admin.NamespaceResourceTest.getNamespaceList(NamespaceResourceTest.java:24)

[ERROR] org.eclipse.winery.repository.rest.resources.admin.NamespaceResourceTest.getNamespaceListWithoutRestrictedNamespaces  Time elapsed: 0.003 s  <<< ERROR!
org.eclipse.jgit.api.errors.JGitInternalException: Missing unknown 313f40a0a42111d3d36aef0fa36a9ec82a997e14
	at org.eclipse.winery.repository.rest.resources.admin.NamespaceResourceTest.getNamespaceListWithoutRestrictedNamespaces(NamespaceResourceTest.java:30)
Caused by: org.eclipse.jgit.errors.MissingObjectException: Missing unknown 313f40a0a42111d3d36aef0fa36a9ec82a997e14
	at org.eclipse.winery.repository.rest.resources.admin.NamespaceResourceTest.getNamespaceListWithoutRestrictedNamespaces(NamespaceResourceTest.java:30)

[INFO] Running org.eclipse.winery.repository.rest.resources.imports.xsdimports.XSDImportResourceTest
[ERROR] Tests run: 2, Failures: 0, Errors: 2, Skipped: 0, Time elapsed: 0.342 s <<< FAILURE! - in org.eclipse.winery.repository.rest.resources.imports.xsdimports.XSDImportResourceTest
[ERROR] org.eclipse.winery.repository.rest.resources.imports.xsdimports.XSDImportResourceTest.getAllDefinedTypesLocalNames  Time elapsed: 0.003 s  <<< ERROR!
org.eclipse.jgit.api.errors.JGitInternalException: Missing unknown 313f40a0a42111d3d36aef0fa36a9ec82a997e14
	at org.eclipse.winery.repository.rest.resources.imports.xsdimports.XSDImportResourceTest.getAllDefinedTypesLocalNames(XSDImportResourceTest.java:29)
Caused by: org.eclipse.jgit.errors.MissingObjectException: Missing unknown 313f40a0a42111d3d36aef0fa36a9ec82a997e14
	at org.eclipse.winery.repository.rest.resources.imports.xsdimports.XSDImportResourceTest.getAllDefinedTypesLocalNames(XSDImportResourceTest.java:29)

[ERROR] org.eclipse.winery.repository.rest.resources.imports.xsdimports.XSDImportResourceTest.getAllDeclaredElementsLocalNames  Time elapsed: 0.003 s  <<< ERROR!
org.eclipse.jgit.api.errors.JGitInternalException: Missing unknown 313f40a0a42111d3d36aef0fa36a9ec82a997e14
	at org.eclipse.winery.repository.rest.resources.imports.xsdimports.XSDImportResourceTest.getAllDeclaredElementsLocalNames(XSDImportResourceTest.java:23)
Caused by: org.eclipse.jgit.errors.MissingObjectException: Missing unknown 313f40a0a42111d3d36aef0fa36a9ec82a997e14
	at org.eclipse.winery.repository.rest.resources.imports.xsdimports.XSDImportResourceTest.getAllDeclaredElementsLocalNames(XSDImportResourceTest.java:23)

[INFO] Running org.eclipse.winery.repository.rest.resources.testrefinementmodels.TestRefinementModelsResourceTest
[ERROR] Tests run: 1, Failures: 0, Errors: 1, Skipped: 0, Time elapsed: 0.115 s <<< FAILURE! - in org.eclipse.winery.repository.rest.resources.testrefinementmodels.TestRefinementModelsResourceTest
[ERROR] org.eclipse.winery.repository.rest.resources.testrefinementmodels.TestRefinementModelsResourceTest.createPatternRefinementModel  Time elapsed: 0.003 s  <<< ERROR!
org.eclipse.jgit.api.errors.JGitInternalException: Missing unknown 313f40a0a42111d3d36aef0fa36a9ec82a997e14
	at org.eclipse.winery.repository.rest.resources.testrefinementmodels.TestRefinementModelsResourceTest.createPatternRefinementModel(TestRefinementModelsResourceTest.java:25)
Caused by: org.eclipse.jgit.errors.MissingObjectException: Missing unknown 313f40a0a42111d3d36aef0fa36a9ec82a997e14
	at org.eclipse.winery.repository.rest.resources.testrefinementmodels.TestRefinementModelsResourceTest.createPatternRefinementModel(TestRefinementModelsResourceTest.java:25)

[INFO] Running org.eclipse.winery.repository.rest.resources.interfaces.InterfacesResourceTest
[ERROR] Tests run: 2, Failures: 0, Errors: 2, Skipped: 0, Time elapsed: 0.288 s <<< FAILURE! - in org.eclipse.winery.repository.rest.resources.interfaces.InterfacesResourceTest
[ERROR] org.eclipse.winery.repository.rest.resources.interfaces.InterfacesResourceTest.addInputParameters  Time elapsed: 0.003 s  <<< ERROR!
org.eclipse.jgit.api.errors.JGitInternalException: Missing unknown 313f40a0a42111d3d36aef0fa36a9ec82a997e14
	at org.eclipse.winery.repository.rest.resources.interfaces.InterfacesResourceTest.addInputParameters(InterfacesResourceTest.java:38)
Caused by: org.eclipse.jgit.errors.MissingObjectException: Missing unknown 313f40a0a42111d3d36aef0fa36a9ec82a997e14
	at org.eclipse.winery.repository.rest.resources.interfaces.InterfacesResourceTest.addInputParameters(InterfacesResourceTest.java:38)

[ERROR] org.eclipse.winery.repository.rest.resources.interfaces.InterfacesResourceTest.createConfigureInterface  Time elapsed: 0.003 s  <<< ERROR!
org.eclipse.jgit.api.errors.JGitInternalException: Missing unknown 313f40a0a42111d3d36aef0fa36a9ec82a997e14
	at org.eclipse.winery.repository.rest.resources.interfaces.InterfacesResourceTest.createConfigureInterface(InterfacesResourceTest.java:25)
Caused by: org.eclipse.jgit.errors.MissingObjectException: Missing unknown 313f40a0a42111d3d36aef0fa36a9ec82a997e14
	at org.eclipse.winery.repository.rest.resources.interfaces.InterfacesResourceTest.createConfigureInterface(InterfacesResourceTest.java:25)

[INFO] Running org.eclipse.winery.repository.rest.RestUtilsWithGitBackendTest
[ERROR] Tests run: 11, Failures: 0, Errors: 11, Skipped: 0, Time elapsed: 1.771 s <<< FAILURE! - in org.eclipse.winery.repository.rest.RestUtilsWithGitBackendTest
[ERROR] org.eclipse.winery.repository.rest.RestUtilsWithGitBackendTest.renameSingleDefinitionNamespaceWithVersion  Time elapsed: 0.003 s  <<< ERROR!
org.eclipse.jgit.api.errors.JGitInternalException: Missing unknown 313f40a0a42111d3d36aef0fa36a9ec82a997e14
	at org.eclipse.winery.repository.rest.RestUtilsWithGitBackendTest.renameSingleDefinitionNamespaceWithVersion(RestUtilsWithGitBackendTest.java:92)
Caused by: org.eclipse.jgit.errors.MissingObjectException: Missing unknown 313f40a0a42111d3d36aef0fa36a9ec82a997e14
	at org.eclipse.winery.repository.rest.RestUtilsWithGitBackendTest.renameSingleDefinitionNamespaceWithVersion(RestUtilsWithGitBackendTest.java:92)

[ERROR] org.eclipse.winery.repository.rest.RestUtilsWithGitBackendTest.getFlagsOfAReleasableVersion  Time elapsed: 0.003 s  <<< ERROR!
org.eclipse.jgit.api.errors.JGitInternalException: Missing unknown 313f40a0a42111d3d36aef0fa36a9ec82a997e14
	at org.eclipse.winery.repository.rest.RestUtilsWithGitBackendTest.getFlagsOfAReleasableVersion(RestUtilsWithGitBackendTest.java:193)
Caused by: org.eclipse.jgit.errors.MissingObjectException: Missing unknown 313f40a0a42111d3d36aef0fa36a9ec82a997e14
	at org.eclipse.winery.repository.rest.RestUtilsWithGitBackendTest.getFlagsOfAReleasableVersion(RestUtilsWithGitBackendTest.java:193)

[ERROR] org.eclipse.winery.repository.rest.RestUtilsWithGitBackendTest.renameDefinitionNamespaceWithoutVersion  Time elapsed: 0.003 s  <<< ERROR!
org.eclipse.jgit.api.errors.JGitInternalException: Missing unknown 313f40a0a42111d3d36aef0fa36a9ec82a997e14
	at org.eclipse.winery.repository.rest.RestUtilsWithGitBackendTest.renameDefinitionNamespaceWithoutVersion(RestUtilsWithGitBackendTest.java:53)
Caused by: org.eclipse.jgit.errors.MissingObjectException: Missing unknown 313f40a0a42111d3d36aef0fa36a9ec82a997e14
	at org.eclipse.winery.repository.rest.RestUtilsWithGitBackendTest.renameDefinitionNamespaceWithoutVersion(RestUtilsWithGitBackendTest.java:53)

[ERROR] org.eclipse.winery.repository.rest.RestUtilsWithGitBackendTest.releaseComponentWhichDoesNotHaveChanges  Time elapsed: 0.003 s  <<< ERROR!
org.eclipse.jgit.api.errors.JGitInternalException: Missing unknown 313f40a0a42111d3d36aef0fa36a9ec82a997e14
	at org.eclipse.winery.repository.rest.RestUtilsWithGitBackendTest.releaseComponentWhichDoesNotHaveChanges(RestUtilsWithGitBackendTest.java:206)
Caused by: org.eclipse.jgit.errors.MissingObjectException: Missing unknown 313f40a0a42111d3d36aef0fa36a9ec82a997e14
	at org.eclipse.winery.repository.rest.RestUtilsWithGitBackendTest.releaseComponentWhichDoesNotHaveChanges(RestUtilsWithGitBackendTest.java:206)

[ERROR] org.eclipse.winery.repository.rest.RestUtilsWithGitBackendTest.renameSingleDefinitionWithVersion  Time elapsed: 0.004 s  <<< ERROR!
org.eclipse.jgit.api.errors.JGitInternalException: Missing unknown 313f40a0a42111d3d36aef0fa36a9ec82a997e14
	at org.eclipse.winery.repository.rest.RestUtilsWithGitBackendTest.renameSingleDefinitionWithVersion(RestUtilsWithGitBackendTest.java:71)
Caused by: org.eclipse.jgit.errors.MissingObjectException: Missing unknown 313f40a0a42111d3d36aef0fa36a9ec82a997e14
	at org.eclipse.winery.repository.rest.RestUtilsWithGitBackendTest.renameSingleDefinitionWithVersion(RestUtilsWithGitBackendTest.java:71)

[ERROR] org.eclipse.winery.repository.rest.RestUtilsWithGitBackendTest.getFlagsOfAReleasedVersion  Time elapsed: 0.003 s  <<< ERROR!
org.eclipse.jgit.api.errors.JGitInternalException: Missing unknown 313f40a0a42111d3d36aef0fa36a9ec82a997e14
	at org.eclipse.winery.repository.rest.RestUtilsWithGitBackendTest.getFlagsOfAReleasedVersion(RestUtilsWithGitBackendTest.java:180)
Caused by: org.eclipse.jgit.errors.MissingObjectException: Missing unknown 313f40a0a42111d3d36aef0fa36a9ec82a997e14
	at org.eclipse.winery.repository.rest.RestUtilsWithGitBackendTest.getFlagsOfAReleasedVersion(RestUtilsWithGitBackendTest.java:180)

[ERROR] org.eclipse.winery.repository.rest.RestUtilsWithGitBackendTest.renameDefinitionWithoutVersion  Time elapsed: 0.003 s  <<< ERROR!
org.eclipse.jgit.api.errors.JGitInternalException: Missing unknown 313f40a0a42111d3d36aef0fa36a9ec82a997e14
	at org.eclipse.winery.repository.rest.RestUtilsWithGitBackendTest.renameDefinitionWithoutVersion(RestUtilsWithGitBackendTest.java:35)
Caused by: org.eclipse.jgit.errors.MissingObjectException: Missing unknown 313f40a0a42111d3d36aef0fa36a9ec82a997e14
	at org.eclipse.winery.repository.rest.RestUtilsWithGitBackendTest.renameDefinitionWithoutVersion(RestUtilsWithGitBackendTest.java:35)

[ERROR] org.eclipse.winery.repository.rest.RestUtilsWithGitBackendTest.renameAllVersionNamesOfOneComponent  Time elapsed: 0.003 s  <<< ERROR!
org.eclipse.jgit.api.errors.JGitInternalException: Missing unknown 313f40a0a42111d3d36aef0fa36a9ec82a997e14
	at org.eclipse.winery.repository.rest.RestUtilsWithGitBackendTest.renameAllVersionNamesOfOneComponent(RestUtilsWithGitBackendTest.java:138)
Caused by: org.eclipse.jgit.errors.MissingObjectException: Missing unknown 313f40a0a42111d3d36aef0fa36a9ec82a997e14
	at org.eclipse.winery.repository.rest.RestUtilsWithGitBackendTest.renameAllVersionNamesOfOneComponent(RestUtilsWithGitBackendTest.java:138)

[ERROR] org.eclipse.winery.repository.rest.RestUtilsWithGitBackendTest.renameSingleDefinitionWhichHasChanges  Time elapsed: 0.003 s  <<< ERROR!
org.eclipse.jgit.api.errors.JGitInternalException: Missing unknown 313f40a0a42111d3d36aef0fa36a9ec82a997e14
	at org.eclipse.winery.repository.rest.RestUtilsWithGitBackendTest.renameSingleDefinitionWhichHasChanges(RestUtilsWithGitBackendTest.java:113)
Caused by: org.eclipse.jgit.errors.MissingObjectException: Missing unknown 313f40a0a42111d3d36aef0fa36a9ec82a997e14
	at org.eclipse.winery.repository.rest.RestUtilsWithGitBackendTest.renameSingleDefinitionWhichHasChanges(RestUtilsWithGitBackendTest.java:113)

[ERROR] org.eclipse.winery.repository.rest.RestUtilsWithGitBackendTest.releaseComponentWhichHasNotBeenCommitted  Time elapsed: 0.003 s  <<< ERROR!
org.eclipse.jgit.api.errors.JGitInternalException: Missing unknown 313f40a0a42111d3d36aef0fa36a9ec82a997e14
	at org.eclipse.winery.repository.rest.RestUtilsWithGitBackendTest.releaseComponentWhichHasNotBeenCommitted(RestUtilsWithGitBackendTest.java:225)
Caused by: org.eclipse.jgit.errors.MissingObjectException: Missing unknown 313f40a0a42111d3d36aef0fa36a9ec82a997e14
	at org.eclipse.winery.repository.rest.RestUtilsWithGitBackendTest.releaseComponentWhichHasNotBeenCommitted(RestUtilsWithGitBackendTest.java:225)

[ERROR] org.eclipse.winery.repository.rest.RestUtilsWithGitBackendTest.renameAllVersionNamespacesOfOneComponent  Time elapsed: 0.003 s  <<< ERROR!
org.eclipse.jgit.api.errors.JGitInternalException: Missing unknown 313f40a0a42111d3d36aef0fa36a9ec82a997e14
	at org.eclipse.winery.repository.rest.RestUtilsWithGitBackendTest.renameAllVersionNamespacesOfOneComponent(RestUtilsWithGitBackendTest.java:159)
Caused by: org.eclipse.jgit.errors.MissingObjectException: Missing unknown 313f40a0a42111d3d36aef0fa36a9ec82a997e14
	at org.eclipse.winery.repository.rest.RestUtilsWithGitBackendTest.renameAllVersionNamespacesOfOneComponent(RestUtilsWithGitBackendTest.java:159)

[INFO] Running org.eclipse.winery.repository.rest.RestUtilsTest
[INFO] Tests run: 1, Failures: 0, Errors: 0, Skipped: 0, Time elapsed: 0 s - in org.eclipse.winery.repository.rest.RestUtilsTest
[INFO] 
[INFO] Results:
[INFO] 
[ERROR] Errors: 
[ERROR]   RestUtilsWithGitBackendTest.getFlagsOfAReleasableVersion:193->TestWithGitBackedRepository.setRevisionTo:111 » JGitInternal
[ERROR]   RestUtilsWithGitBackendTest.getFlagsOfAReleasedVersion:180->TestWithGitBackedRepository.setRevisionTo:111 » JGitInternal
[ERROR]   RestUtilsWithGitBackendTest.releaseComponentWhichDoesNotHaveChanges:206->TestWithGitBackedRepository.setRevisionTo:111 » JGitInternal
[ERROR]   RestUtilsWithGitBackendTest.releaseComponentWhichHasNotBeenCommitted:225->TestWithGitBackedRepository.setRevisionTo:111 » JGitInternal
[ERROR]   RestUtilsWithGitBackendTest.renameAllVersionNamesOfOneComponent:138->TestWithGitBackedRepository.setRevisionTo:111 » JGitInternal
[ERROR]   RestUtilsWithGitBackendTest.renameAllVersionNamespacesOfOneComponent:159->TestWithGitBackedRepository.setRevisionTo:111 » JGitInternal
[ERROR]   RestUtilsWithGitBackendTest.renameDefinitionNamespaceWithoutVersion:53->TestWithGitBackedRepository.setRevisionTo:111 » JGitInternal
[ERROR]   RestUtilsWithGitBackendTest.renameDefinitionWithoutVersion:35->TestWithGitBackedRepository.setRevisionTo:111 » JGitInternal
[ERROR]   RestUtilsWithGitBackendTest.renameSingleDefinitionNamespaceWithVersion:92->TestWithGitBackedRepository.setRevisionTo:111 » JGitInternal
[ERROR]   RestUtilsWithGitBackendTest.renameSingleDefinitionWhichHasChanges:113->TestWithGitBackedRepository.setRevisionTo:111 » JGitInternal
[ERROR]   RestUtilsWithGitBackendTest.renameSingleDefinitionWithVersion:71->TestWithGitBackedRepository.setRevisionTo:111 » JGitInternal
[ERROR]   InheritanceResourceTest.addInheritanceToNodeType:23->TestWithGitBackedRepository.setRevisionTo:111 » JGitInternal
[ERROR]   InheritanceResourceTest.addInheritanceToPolicyType:39->TestWithGitBackedRepository.setRevisionTo:111 » JGitInternal
[ERROR]   InheritanceResourceTest.xmlStillValidAfterAddingDerivedFromNoneInheritanceToOneNodeType:32->TestWithGitBackedRepository.setRevisionTo:111 » JGitInternal
[ERROR]   InheritanceResourceTest.xmlStillValidAfterAddingDerivedFromNoneInheritanceToOnePolicyType:48->TestWithGitBackedRepository.setRevisionTo:111 » JGitInternal
[ERROR]   TenantRepositoryTest.testTenantRepository:46->TestWithGitBackedRepository.setRevisionTo:111 » JGitInternal
[ERROR]   NamespaceResourceTest.getNamespaceList:24->TestWithGitBackedRepository.setRevisionTo:111 » JGitInternal
[ERROR]   NamespaceResourceTest.getNamespaceListWithoutRestrictedNamespaces:30->TestWithGitBackedRepository.setRevisionTo:111 » JGitInternal
[ERROR]   GenericArtifactsResourceTest.generateArtifactAutoGenereatatesWarType:23->TestWithGitBackedRepository.setRevisionTo:111 » JGitInternal
[ERROR]   EdmmResourceTest.testOneToOneMapForPetclinicIaas:47->TestWithGitBackedRepository.setRevisionTo:111 » JGitInternal
[ERROR]   EdmmResourceTest.testSupportForPetclinicCloud:34->TestWithGitBackedRepository.setRevisionTo:111 » JGitInternal
[ERROR]   PropertiesResourceTest.getOfNonExistingProperties:24->TestWithGitBackedRepository.setRevisionTo:111 » JGitInternal
[ERROR]   PropertiesResourceTest.getPropertiesJsonList:30->TestWithGitBackedRepository.setRevisionTo:111 » JGitInternal
[ERROR]   PropertiesResourceTest.getPropertiesXml:37->TestWithGitBackedRepository.setRevisionTo:111 » JGitInternal
[ERROR]   PropertiesResourceTest.postJsonProperties:44->TestWithGitBackedRepository.setRevisionTo:111 » JGitInternal
[ERROR]   PropertiesResourceTest.postXMLProperties:53->TestWithGitBackedRepository.setRevisionTo:111 » JGitInternal
[ERROR]   PropertiesResourceTest.postXMLPropertiesToArtifact:62->TestWithGitBackedRepository.setRevisionTo:111 » JGitInternal
[ERROR]   ArtifactTemplateResourceTest.artifactTemplateContainsFileReferenceInJson:70->TestWithGitBackedRepository.setRevisionTo:111 » JGitInternal
[ERROR]   ArtifactTemplateResourceTest.artifactTemplateContainsFileReferenceInXml:77->TestWithGitBackedRepository.setRevisionTo:111 » JGitInternal
[ERROR]   ArtifactTemplateResourceTest.artifactTemplateContainsUpdatedFileReferenceInJson:84->TestWithGitBackedRepository.setRevisionTo:111 » JGitInternal
[ERROR]   ArtifactTemplateResourceTest.copyFilesToSource:64->TestWithGitBackedRepository.setRevisionTo:111 » JGitInternal
[ERROR]   ArtifactTemplateResourceTest.copySourcesToFilesWithSelection:57->TestWithGitBackedRepository.setRevisionTo:111 » JGitInternal
[ERROR]   ArtifactTemplateResourceTest.copySourcesToFilesWithoutSelection:50->TestWithGitBackedRepository.setRevisionTo:111 » JGitInternal
[ERROR]   ArtifactTemplateResourceTest.getFilesZip:28->TestWithGitBackedRepository.setRevisionTo:111 » JGitInternal
[ERROR]   ArtifactTemplateResourceTest.getSourceZip:34->TestWithGitBackedRepository.setRevisionTo:111 » JGitInternal
[ERROR]   FilesResourceTest.getEmptyFiles:23->TestWithGitBackedRepository.setRevisionTo:111 » JGitInternal
[ERROR]   FilesResourceTest.getEmptySources:30->TestWithGitBackedRepository.setRevisionTo:111 » JGitInternal
[ERROR]   FilesResourceTest.getOneFileElement:44->TestWithGitBackedRepository.setRevisionTo:111 » JGitInternal
[ERROR]   FilesResourceTest.getOneSourceElement:37->TestWithGitBackedRepository.setRevisionTo:111 » JGitInternal
[ERROR]   PolicyTemplateResourceTest.getIcon:32->TestWithGitBackedRepository.setRevisionTo:111 » JGitInternal
[ERROR]   PolicyTemplateResourceTest.getVisualAppearanceData:25->TestWithGitBackedRepository.setRevisionTo:111 » JGitInternal
[ERROR]   PolicyTemplatesResourceTest.getAllVisualAppearanceData:25->TestWithGitBackedRepository.setRevisionTo:111 » JGitInternal
[ERROR]   XSDImportResourceTest.getAllDeclaredElementsLocalNames:23->TestWithGitBackedRepository.setRevisionTo:111 » JGitInternal
[ERROR]   XSDImportResourceTest.getAllDefinedTypesLocalNames:29->TestWithGitBackedRepository.setRevisionTo:111 » JGitInternal
[ERROR]   InterfacesResourceTest.addInputParameters:38->TestWithGitBackedRepository.setRevisionTo:111 » JGitInternal
[ERROR]   InterfacesResourceTest.createConfigureInterface:25->TestWithGitBackedRepository.setRevisionTo:111 » JGitInternal
[ERROR]   PlacementModelsResourceTest.createDataFlowBasedServiceTemplate1:28->TestWithGitBackedRepository.setRevisionTo:111 » JGitInternal
[ERROR]   PlacementModelsResourceTest.createDataFlowBasedServiceTemplate2:48->TestWithGitBackedRepository.setRevisionTo:111 » JGitInternal
[ERROR]   PlacementModelsResourceTest.placementAndCompletionOfServiceTemplate1:36->TestWithGitBackedRepository.setRevisionTo:111 » JGitInternal
[ERROR]   PlacementModelsResourceTest.placementAndCompletionOfServiceTemplate2:56->TestWithGitBackedRepository.setRevisionTo:111 » JGitInternal
[ERROR]   TestRefinementModelsResourceTest.createPatternRefinementModel:25->TestWithGitBackedRepository.setRevisionTo:111 » JGitInternal
[INFO] 
[ERROR] Tests run: 191, Failures: 0, Errors: 51, Skipped: 7
[INFO] 
[ERROR] There are test failures.

Please refer to /home/jenkins/agent/workspace/winery-jdk12/org.eclipse.winery.repository.rest/target/surefire-reports for the individual test results.
Please refer to dump files (if any exist) [date].dump, [date]-jvmRun[N].dump and [date].dumpstream.
[JENKINS] Recording test results
[INFO] 
[INFO] --- maven-war-plugin:3.2.0:war (default-war) @ org.eclipse.winery.repository.rest ---
[INFO] Downloading from eclipse.maven.central.mirror: https://repo.eclipse.org/content/repositories/maven_central/com/thoughtworks/xstream/xstream/1.4.9/xstream-1.4.9.pom
[INFO] Downloaded from eclipse.maven.central.mirror: https://repo.eclipse.org/content/repositories/maven_central/com/thoughtworks/xstream/xstream/1.4.9/xstream-1.4.9.pom (14 kB at 173 kB/s)
[INFO] Downloading from eclipse.maven.central.mirror: https://repo.eclipse.org/content/repositories/maven_central/com/thoughtworks/xstream/xstream-parent/1.4.9/xstream-parent-1.4.9.pom
[INFO] Downloaded from eclipse.maven.central.mirror: https://repo.eclipse.org/content/repositories/maven_central/com/thoughtworks/xstream/xstream-parent/1.4.9/xstream-parent-1.4.9.pom (34 kB at 726 kB/s)
[INFO] Downloading from eclipse.maven.central.mirror: https://repo.eclipse.org/content/repositories/maven_central/xmlpull/xmlpull/1.1.3.1/xmlpull-1.1.3.1.pom
[INFO] Downloaded from eclipse.maven.central.mirror: https://repo.eclipse.org/content/repositories/maven_central/xmlpull/xmlpull/1.1.3.1/xmlpull-1.1.3.1.pom (386 B at 193 kB/s)
[INFO] Downloading from eclipse.maven.central.mirror: https://repo.eclipse.org/content/repositories/maven_central/xpp3/xpp3_min/1.1.4c/xpp3_min-1.1.4c.pom
[INFO] Downloaded from eclipse.maven.central.mirror: https://repo.eclipse.org/content/repositories/maven_central/xpp3/xpp3_min/1.1.4c/xpp3_min-1.1.4c.pom (1.6 kB at 805 kB/s)
[INFO] Downloading from eclipse.maven.central.mirror: https://repo.eclipse.org/content/repositories/maven_central/org/apache/maven/shared/maven-mapping/3.0.0/maven-mapping-3.0.0.pom
[INFO] Downloaded from eclipse.maven.central.mirror: https://repo.eclipse.org/content/repositories/maven_central/org/apache/maven/shared/maven-mapping/3.0.0/maven-mapping-3.0.0.pom (4.1 kB at 18 kB/s)
[INFO] Downloading from eclipse.maven.central.mirror: https://repo.eclipse.org/content/repositories/maven_central/org/codehaus/plexus/plexus-archiver/3.5/plexus-archiver-3.5.jar
[INFO] Downloading from eclipse.maven.central.mirror: https://repo.eclipse.org/content/repositories/maven_central/org/codehaus/plexus/plexus-io/3.0.0/plexus-io-3.0.0.jar
[INFO] Downloading from eclipse.maven.central.mirror: https://repo.eclipse.org/content/repositories/maven_central/org/apache/commons/commons-compress/1.14/commons-compress-1.14.jar
[INFO] Downloading from eclipse.maven.central.mirror: https://repo.eclipse.org/content/repositories/maven_central/org/tukaani/xz/1.6/xz-1.6.jar
[INFO] Downloading from eclipse.maven.central.mirror: https://repo.eclipse.org/content/repositories/maven_central/com/thoughtworks/xstream/xstream/1.4.9/xstream-1.4.9.jar
[INFO] Downloaded from eclipse.maven.central.mirror: https://repo.eclipse.org/content/repositories/maven_central/org/codehaus/plexus/plexus-archiver/3.5/plexus-archiver-3.5.jar (187 kB at 5.7 MB/s)
[INFO] Downloaded from eclipse.maven.central.mirror: https://repo.eclipse.org/content/repositories/maven_central/org/tukaani/xz/1.6/xz-1.6.jar (103 kB at 3.2 MB/s)
[INFO] Downloading from eclipse.maven.central.mirror: https://repo.eclipse.org/content/repositories/maven_central/xmlpull/xmlpull/1.1.3.1/xmlpull-1.1.3.1.jar
[INFO] Downloading from eclipse.maven.central.mirror: https://repo.eclipse.org/content/repositories/maven_central/xpp3/xpp3_min/1.1.4c/xpp3_min-1.1.4c.jar
[INFO] Downloaded from eclipse.maven.central.mirror: https://repo.eclipse.org/content/repositories/maven_central/xmlpull/xmlpull/1.1.3.1/xmlpull-1.1.3.1.jar (7.2 kB at 211 kB/s)
[INFO] Downloading from eclipse.maven.central.mirror: https://repo.eclipse.org/content/repositories/maven_central/org/apache/maven/shared/maven-mapping/3.0.0/maven-mapping-3.0.0.jar
[INFO] Downloaded from eclipse.maven.central.mirror: https://repo.eclipse.org/content/repositories/maven_central/xpp3/xpp3_min/1.1.4c/xpp3_min-1.1.4c.jar (25 kB at 734 kB/s)
[INFO] Downloaded from eclipse.maven.central.mirror: https://repo.eclipse.org/content/repositories/maven_central/org/codehaus/plexus/plexus-io/3.0.0/plexus-io-3.0.0.jar (74 kB at 1.9 MB/s)
[INFO] Downloaded from eclipse.maven.central.mirror: https://repo.eclipse.org/content/repositories/maven_central/org/apache/commons/commons-compress/1.14/commons-compress-1.14.jar (530 kB at 13 MB/s)
[INFO] Downloaded from eclipse.maven.central.mirror: https://repo.eclipse.org/content/repositories/maven_central/org/apache/maven/shared/maven-mapping/3.0.0/maven-mapping-3.0.0.jar (11 kB at 217 kB/s)
[INFO] Downloaded from eclipse.maven.central.mirror: https://repo.eclipse.org/content/repositories/maven_central/com/thoughtworks/xstream/xstream/1.4.9/xstream-1.4.9.jar (549 kB at 5.0 MB/s)
[INFO] Packaging webapp
[INFO] Assembling webapp [org.eclipse.winery.repository.rest] in [/home/jenkins/agent/workspace/winery-jdk12/org.eclipse.winery.repository.rest/target/winery]
[INFO] Processing war project
[INFO] Copying webapp webResources [/home/jenkins/agent/workspace/winery-jdk12/org.eclipse.winery.repository.rest/src/main/webapp/WEB-INF] to [/home/jenkins/agent/workspace/winery-jdk12/org.eclipse.winery.repository.rest/target/winery]
[INFO] Copying webapp resources [/home/jenkins/agent/workspace/winery-jdk12/org.eclipse.winery.repository.rest/src/main/webapp]
[INFO] Webapp assembled in [246 msecs]
[INFO] Building war: /home/jenkins/agent/workspace/winery-jdk12/org.eclipse.winery.repository.rest/target/winery.war
[INFO] Packaging classes
[INFO] Building jar: /home/jenkins/agent/workspace/winery-jdk12/org.eclipse.winery.repository.rest/target/winery-classes.jar
[INFO] 
[INFO] --- maven-war-plugin:3.2.0:war (default) @ org.eclipse.winery.repository.rest ---
[INFO] Packaging webapp
[INFO] Assembling webapp [org.eclipse.winery.repository.rest] in [/home/jenkins/agent/workspace/winery-jdk12/org.eclipse.winery.repository.rest/target/winery]
[INFO] Processing war project
[INFO] Copying webapp webResources [/home/jenkins/agent/workspace/winery-jdk12/org.eclipse.winery.repository.rest/src/main/webapp/WEB-INF] to [/home/jenkins/agent/workspace/winery-jdk12/org.eclipse.winery.repository.rest/target/winery]
[INFO] Copying webapp resources [/home/jenkins/agent/workspace/winery-jdk12/org.eclipse.winery.repository.rest/src/main/webapp]
[INFO] Webapp assembled in [175 msecs]
[INFO] Building war: /home/jenkins/agent/workspace/winery-jdk12/org.eclipse.winery.repository.rest/target/winery.war
[INFO] Packaging classes
[INFO] Building jar: /home/jenkins/agent/workspace/winery-jdk12/org.eclipse.winery.repository.rest/target/winery-classes.jar
[INFO] 
[INFO] >>> maven-source-plugin:3.0.1:jar (attach-sources) > generate-sources @ org.eclipse.winery.repository.rest >>>
[INFO] 
[INFO] --- maven-checkstyle-plugin:3.1.1:check (checkstyle) @ org.eclipse.winery.repository.rest ---
[INFO] You have 0 Checkstyle violations.
[INFO] 
[INFO] --- jacoco-maven-plugin:0.8.6:prepare-agent (jacoco-initialize) @ org.eclipse.winery.repository.rest ---
[INFO] argLine set to -javaagent:/home/jenkins/.m2/repository/org/jacoco/org.jacoco.agent/0.8.6/org.jacoco.agent-0.8.6-runtime.jar=destfile=/home/jenkins/agent/workspace/winery-jdk12/org.eclipse.winery.repository.rest/target/jacoco.exec,append=false
[INFO] 
[INFO] --- build-helper-maven-plugin:1.8:add-source (add-source) @ org.eclipse.winery.repository.rest ---
[INFO] Source directory: /home/jenkins/agent/workspace/winery-jdk12/org.eclipse.winery.repository.rest/target/generated-sources/java added.
[WARNING] Failed to getClass for org.apache.maven.plugins.source.SourceJarMojo
[INFO] 
[INFO] <<< maven-source-plugin:3.0.1:jar (attach-sources) < generate-sources @ org.eclipse.winery.repository.rest <<<
[INFO] 
[INFO] 
[INFO] --- maven-source-plugin:3.0.1:jar (attach-sources) @ org.eclipse.winery.repository.rest ---
[INFO] Building jar: /home/jenkins/agent/workspace/winery-jdk12/org.eclipse.winery.repository.rest/target/winery-sources.jar
[INFO] 
[INFO] --- maven-javadoc-plugin:3.0.1:jar (attach-javadocs) @ org.eclipse.winery.repository.rest ---