FailedConsole Output

Skipping 10,637 KB.. Full Log
GzauYGBgqihikoFqS8/OK83NS9ZwhNEghAwQwghQWAACwxA+XYgAAAA==[WARNING] /jobs/genie.webtools/webtools-jsf-gerrit_master/workspace/jsf/tests/org.eclipse.jst.jsf.validation.el.tests/src/org/eclipse/jst/jsf/validation/el/tests/jsp/LoadBundleResolutionTestCase.java:[151] 
	assertEquals(IJSFConstants.ATTR_BASENAME, attr.getLocalName());
	                           ^^^^^^^^^^^^^
Discouraged access: The field 'IJSFConstants.ATTR_BASENAME' is not API (restriction on classpath entry '/jobs/genie.webtools/webtools-jsf-gerrit_master/workspace/jsf/plugins/org.eclipse.jst.jsf.core/target/classes')
[WARNING] /jobs/genie.webtools/webtools-jsf-gerrit_master/workspace/jsf/tests/org.eclipse.jst.jsf.validation.el.tests/src/org/eclipse/jst/jsf/validation/el/tests/jsp/LoadBundleResolutionTestCase.java:[157] 
	(IValidValues.class, context, ITLDConstants.URI_JSF_CORE
	                              ^^^^^^^^^^^^^^^^^^^^^^^^^^
Discouraged access: The type 'ITLDConstants' is not API (restriction on classpath entry '/jobs/genie.webtools/webtools-jsf-gerrit_master/workspace/jsf/plugins/org.eclipse.jst.jsf.core/target/classes')
[WARNING] /jobs/genie.webtools/webtools-jsf-gerrit_master/workspace/jsf/tests/org.eclipse.jst.jsf.validation.el.tests/src/org/eclipse/jst/jsf/validation/el/tests/jsp/LoadBundleResolutionTestCase.java:[157] 
	(IValidValues.class, context, ITLDConstants.URI_JSF_CORE
	                                            ^^^^^^^^^^^^
Discouraged access: The field 'ITLDConstants.URI_JSF_CORE' is not API (restriction on classpath entry '/jobs/genie.webtools/webtools-jsf-gerrit_master/workspace/jsf/plugins/org.eclipse.jst.jsf.core/target/classes')
[WARNING] /jobs/genie.webtools/webtools-jsf-gerrit_master/workspace/jsf/tests/org.eclipse.jst.jsf.validation.el.tests/src/org/eclipse/jst/jsf/validation/el/tests/jsp/LoadBundleResolutionTestCase.java:[158] 
	, IJSFConstants.TAG_LOADBUNDLE, IJSFConstants.ATTR_BASENAME);
	  ^^^^^^^^^^^^^^^^^^^^^^^^^^^^
Discouraged access: The type 'IJSFConstants' is not API (restriction on classpath entry '/jobs/genie.webtools/webtools-jsf-gerrit_master/workspace/jsf/plugins/org.eclipse.jst.jsf.core/target/classes')
[WARNING] /jobs/genie.webtools/webtools-jsf-gerrit_master/workspace/jsf/tests/org.eclipse.jst.jsf.validation.el.tests/src/org/eclipse/jst/jsf/validation/el/tests/jsp/LoadBundleResolutionTestCase.java:[158] 
	, IJSFConstants.TAG_LOADBUNDLE, IJSFConstants.ATTR_BASENAME);
	                ^^^^^^^^^^^^^^
Discouraged access: The field 'IJSFConstants.TAG_LOADBUNDLE' is not API (restriction on classpath entry '/jobs/genie.webtools/webtools-jsf-gerrit_master/workspace/jsf/plugins/org.eclipse.jst.jsf.core/target/classes')
[WARNING] /jobs/genie.webtools/webtools-jsf-gerrit_master/workspace/jsf/tests/org.eclipse.jst.jsf.validation.el.tests/src/org/eclipse/jst/jsf/validation/el/tests/jsp/LoadBundleResolutionTestCase.java:[158] 
	, IJSFConstants.TAG_LOADBUNDLE, IJSFConstants.ATTR_BASENAME);
	                                ^^^^^^^^^^^^^^^^^^^^^^^^^^^
Discouraged access: The type 'IJSFConstants' is not API (restriction on classpath entry '/jobs/genie.webtools/webtools-jsf-gerrit_master/workspace/jsf/plugins/org.eclipse.jst.jsf.core/target/classes')
[WARNING] /jobs/genie.webtools/webtools-jsf-gerrit_master/workspace/jsf/tests/org.eclipse.jst.jsf.validation.el.tests/src/org/eclipse/jst/jsf/validation/el/tests/jsp/LoadBundleResolutionTestCase.java:[158] 
	, IJSFConstants.TAG_LOADBUNDLE, IJSFConstants.ATTR_BASENAME);
	                                              ^^^^^^^^^^^^^
Discouraged access: The field 'IJSFConstants.ATTR_BASENAME' is not API (restriction on classpath entry '/jobs/genie.webtools/webtools-jsf-gerrit_master/workspace/jsf/plugins/org.eclipse.jst.jsf.core/target/classes')
[WARNING] /jobs/genie.webtools/webtools-jsf-gerrit_master/workspace/jsf/tests/org.eclipse.jst.jsf.validation.el.tests/src/org/eclipse/jst/jsf/validation/el/tests/preferences/PrefTestUtil.java:[18] 
	import org.eclipse.jst.jsf.validation.internal.ELValidationPreferences;
	       ^^^^^^^^^^^^^^^^^^^^^^^^^^^^^^^^^^^^^^^^^^^^^^^^^^^^^^^^^^^^^^^
Discouraged access: The type 'ELValidationPreferences' is not API (restriction on classpath entry '/jobs/genie.webtools/webtools-jsf-gerrit_master/workspace/jsf/plugins/org.eclipse.jst.jsf.core/target/classes')
[WARNING] /jobs/genie.webtools/webtools-jsf-gerrit_master/workspace/jsf/tests/org.eclipse.jst.jsf.validation.el.tests/src/org/eclipse/jst/jsf/validation/el/tests/preferences/PrefTestUtil.java:[19] 
	import org.eclipse.jst.jsf.validation.internal.Severity;
	       ^^^^^^^^^^^^^^^^^^^^^^^^^^^^^^^^^^^^^^^^^^^^^^^^
Discouraged access: The type 'Severity' is not API (restriction on classpath entry '/jobs/genie.webtools/webtools-jsf-gerrit_master/workspace/jsf/plugins/org.eclipse.jst.jsf.core/target/classes')
[WARNING] /jobs/genie.webtools/webtools-jsf-gerrit_master/workspace/jsf/tests/org.eclipse.jst.jsf.validation.el.tests/src/org/eclipse/jst/jsf/validation/el/tests/preferences/PrefTestUtil.java:[25] 
	static void assertSeverityLevel(ELValidationPreferences prefs, int diagnosticId, int value)
	                                ^^^^^^^^^^^^^^^^^^^^^^^
Discouraged access: The type 'ELValidationPreferences' is not API (restriction on classpath entry '/jobs/genie.webtools/webtools-jsf-gerrit_master/workspace/jsf/plugins/org.eclipse.jst.jsf.core/target/classes')
[WARNING] /jobs/genie.webtools/webtools-jsf-gerrit_master/workspace/jsf/tests/org.eclipse.jst.jsf.validation.el.tests/src/org/eclipse/jst/jsf/validation/el/tests/preferences/PrefTestUtil.java:[27] 
	final String key = ELValidationPreferences.getKeyById(diagnosticId);
	                   ^^^^^^^^^^^^^^^^^^^^^^^^^^^^^^^^^^^^^^^^^^^^^^^^
Discouraged access: The method 'ELValidationPreferences.getKeyById(int)' is not API (restriction on classpath entry '/jobs/genie.webtools/webtools-jsf-gerrit_master/workspace/jsf/plugins/org.eclipse.jst.jsf.core/target/classes')
[WARNING] /jobs/genie.webtools/webtools-jsf-gerrit_master/workspace/jsf/tests/org.eclipse.jst.jsf.validation.el.tests/src/org/eclipse/jst/jsf/validation/el/tests/preferences/PrefTestUtil.java:[27] 
	final String key = ELValidationPreferences.getKeyById(diagnosticId);
	                   ^^^^^^^^^^^^^^^^^^^^^^^
Discouraged access: The type 'ELValidationPreferences' is not API (restriction on classpath entry '/jobs/genie.webtools/webtools-jsf-gerrit_master/workspace/jsf/plugins/org.eclipse.jst.jsf.core/target/classes')
[WARNING] /jobs/genie.webtools/webtools-jsf-gerrit_master/workspace/jsf/tests/org.eclipse.jst.jsf.validation.el.tests/src/org/eclipse/jst/jsf/validation/el/tests/preferences/PrefTestUtil.java:[28] 
	final Severity sev = prefs.getSeverity(key);
	      ^^^^^^^^
Discouraged access: The type 'Severity' is not API (restriction on classpath entry '/jobs/genie.webtools/webtools-jsf-gerrit_master/workspace/jsf/plugins/org.eclipse.jst.jsf.core/target/classes')
[WARNING] /jobs/genie.webtools/webtools-jsf-gerrit_master/workspace/jsf/tests/org.eclipse.jst.jsf.validation.el.tests/src/org/eclipse/jst/jsf/validation/el/tests/preferences/PrefTestUtil.java:[28] 
	final Severity sev = prefs.getSeverity(key);
	                     ^^^^^^^^^^^^^^^^^^^^^^
Discouraged access: The method 'ELValidationPreferences.getSeverity(String)' is not API (restriction on classpath entry '/jobs/genie.webtools/webtools-jsf-gerrit_master/workspace/jsf/plugins/org.eclipse.jst.jsf.core/target/classes')
[WARNING] /jobs/genie.webtools/webtools-jsf-gerrit_master/workspace/jsf/tests/org.eclipse.jst.jsf.validation.el.tests/src/org/eclipse/jst/jsf/validation/el/tests/preferences/PrefTestUtil.java:[30] 
	ELValidationPreferences.mapSeverityToDiag(sev.toString());
	^^^^^^^^^^^^^^^^^^^^^^^^^^^^^^^^^^^^^^^^^^^^^^^^^^^^^^^^^
Discouraged access: The method 'ELValidationPreferences.mapSeverityToDiag(String)' is not API (restriction on classpath entry '/jobs/genie.webtools/webtools-jsf-gerrit_master/workspace/jsf/plugins/org.eclipse.jst.jsf.core/target/classes')
[WARNING] /jobs/genie.webtools/webtools-jsf-gerrit_master/workspace/jsf/tests/org.eclipse.jst.jsf.validation.el.tests/src/org/eclipse/jst/jsf/validation/el/tests/preferences/PrefTestUtil.java:[30] 
	ELValidationPreferences.mapSeverityToDiag(sev.toString());
	^^^^^^^^^^^^^^^^^^^^^^^
Discouraged access: The type 'ELValidationPreferences' is not API (restriction on classpath entry '/jobs/genie.webtools/webtools-jsf-gerrit_master/workspace/jsf/plugins/org.eclipse.jst.jsf.core/target/classes')
[WARNING] /jobs/genie.webtools/webtools-jsf-gerrit_master/workspace/jsf/tests/org.eclipse.jst.jsf.validation.el.tests/src/org/eclipse/jst/jsf/validation/el/tests/preferences/PrefTestUtil.java:[34] 
	static void setByKey(Severity severity, ELValidationPreferences prefs)
	                     ^^^^^^^^
Discouraged access: The type 'Severity' is not API (restriction on classpath entry '/jobs/genie.webtools/webtools-jsf-gerrit_master/workspace/jsf/plugins/org.eclipse.jst.jsf.core/target/classes')
[WARNING] /jobs/genie.webtools/webtools-jsf-gerrit_master/workspace/jsf/tests/org.eclipse.jst.jsf.validation.el.tests/src/org/eclipse/jst/jsf/validation/el/tests/preferences/PrefTestUtil.java:[34] 
	static void setByKey(Severity severity, ELValidationPreferences prefs)
	                                        ^^^^^^^^^^^^^^^^^^^^^^^
Discouraged access: The type 'ELValidationPreferences' is not API (restriction on classpath entry '/jobs/genie.webtools/webtools-jsf-gerrit_master/workspace/jsf/plugins/org.eclipse.jst.jsf.core/target/classes')
[WARNING] /jobs/genie.webtools/webtools-jsf-gerrit_master/workspace/jsf/tests/org.eclipse.jst.jsf.validation.el.tests/src/org/eclipse/jst/jsf/validation/el/tests/preferences/PrefTestUtil.java:[36] 
	prefs.setSeverity(ELValidationPreferences.BINARY_OP_BOTH_OPERANDS_NULL, severity);
	^^^^^^^^^^^^^^^^^^^^^^^^^^^^^^^^^^^^^^^^^^^^^^^^^^^^^^^^^^^^^^^^^^^^^^^^^^^^^^^^^
Discouraged access: The method 'ELValidationPreferences.setSeverity(String, Severity)' is not API (restriction on classpath entry '/jobs/genie.webtools/webtools-jsf-gerrit_master/workspace/jsf/plugins/org.eclipse.jst.jsf.core/target/classes')
[WARNING] /jobs/genie.webtools/webtools-jsf-gerrit_master/workspace/jsf/tests/org.eclipse.jst.jsf.validation.el.tests/src/org/eclipse/jst/jsf/validation/el/tests/preferences/PrefTestUtil.java:[36] 
	prefs.setSeverity(ELValidationPreferences.BINARY_OP_BOTH_OPERANDS_NULL, severity);
	                  ^^^^^^^^^^^^^^^^^^^^^^^^^^^^^^^^^^^^^^^^^^^^^^^^^^^^
Discouraged access: The type 'ELValidationPreferences' is not API (restriction on classpath entry '/jobs/genie.webtools/webtools-jsf-gerrit_master/workspace/jsf/plugins/org.eclipse.jst.jsf.core/target/classes')
[WARNING] /jobs/genie.webtools/webtools-jsf-gerrit_master/workspace/jsf/tests/org.eclipse.jst.jsf.validation.el.tests/src/org/eclipse/jst/jsf/validation/el/tests/preferences/PrefTestUtil.java:[36] 
	prefs.setSeverity(ELValidationPreferences.BINARY_OP_BOTH_OPERANDS_NULL, severity);
	                                          ^^^^^^^^^^^^^^^^^^^^^^^^^^^^
Discouraged access: The field 'ELValidationPreferences.BINARY_OP_BOTH_OPERANDS_NULL' is not API (restriction on classpath entry '/jobs/genie.webtools/webtools-jsf-gerrit_master/workspace/jsf/plugins/org.eclipse.jst.jsf.core/target/classes')
[WARNING] /jobs/genie.webtools/webtools-jsf-gerrit_master/workspace/jsf/tests/org.eclipse.jst.jsf.validation.el.tests/src/org/eclipse/jst/jsf/validation/el/tests/preferences/PrefTestUtil.java:[37] 
	prefs.setSeverity(ELValidationPreferences.BINARY_OP_POSSIBLE_DIVISION_BY_ZERO, severity);
	^^^^^^^^^^^^^^^^^^^^^^^^^^^^^^^^^^^^^^^^^^^^^^^^^^^^^^^^^^^^^^^^^^^^^^^^^^^^^^^^^^^^^^^^
Discouraged access: The method 'ELValidationPreferences.setSeverity(String, Severity)' is not API (restriction on classpath entry '/jobs/genie.webtools/webtools-jsf-gerrit_master/workspace/jsf/plugins/org.eclipse.jst.jsf.core/target/classes')
[WARNING] /jobs/genie.webtools/webtools-jsf-gerrit_master/workspace/jsf/tests/org.eclipse.jst.jsf.validation.el.tests/src/org/eclipse/jst/jsf/validation/el/tests/preferences/PrefTestUtil.java:[37] 
	prefs.setSeverity(ELValidationPreferences.BINARY_OP_POSSIBLE_DIVISION_BY_ZERO, severity);
	                  ^^^^^^^^^^^^^^^^^^^^^^^^^^^^^^^^^^^^^^^^^^^^^^^^^^^^^^^^^^^
Discouraged access: The type 'ELValidationPreferences' is not API (restriction on classpath entry '/jobs/genie.webtools/webtools-jsf-gerrit_master/workspace/jsf/plugins/org.eclipse.jst.jsf.core/target/classes')
[WARNING] /jobs/genie.webtools/webtools-jsf-gerrit_master/workspace/jsf/tests/org.eclipse.jst.jsf.validation.el.tests/src/org/eclipse/jst/jsf/validation/el/tests/preferences/PrefTestUtil.java:[37] 
	prefs.setSeverity(ELValidationPreferences.BINARY_OP_POSSIBLE_DIVISION_BY_ZERO, severity);
	                                          ^^^^^^^^^^^^^^^^^^^^^^^^^^^^^^^^^^^
Discouraged access: The field 'ELValidationPreferences.BINARY_OP_POSSIBLE_DIVISION_BY_ZERO' is not API (restriction on classpath entry '/jobs/genie.webtools/webtools-jsf-gerrit_master/workspace/jsf/plugins/org.eclipse.jst.jsf.core/target/classes')
[WARNING] /jobs/genie.webtools/webtools-jsf-gerrit_master/workspace/jsf/tests/org.eclipse.jst.jsf.validation.el.tests/src/org/eclipse/jst/jsf/validation/el/tests/preferences/PrefTestUtil.java:[38] 
	prefs.setSeverity(ELValidationPreferences.BINARY_OP_COULD_NOT_MAKE_NUMERIC_COERCION, severity);
	^^^^^^^^^^^^^^^^^^^^^^^^^^^^^^^^^^^^^^^^^^^^^^^^^^^^^^^^^^^^^^^^^^^^^^^^^^^^^^^^^^^^^^^^^^^^^^
Discouraged access: The method 'ELValidationPreferences.setSeverity(String, Severity)' is not API (restriction on classpath entry '/jobs/genie.webtools/webtools-jsf-gerrit_master/workspace/jsf/plugins/org.eclipse.jst.jsf.core/target/classes')
[WARNING] /jobs/genie.webtools/webtools-jsf-gerrit_master/workspace/jsf/tests/org.eclipse.jst.jsf.validation.el.tests/src/org/eclipse/jst/jsf/validation/el/tests/preferences/PrefTestUtil.java:[38] 
	prefs.setSeverity(ELValidationPreferences.BINARY_OP_COULD_NOT_MAKE_NUMERIC_COERCION, severity);
	                  ^^^^^^^^^^^^^^^^^^^^^^^^^^^^^^^^^^^^^^^^^^^^^^^^^^^^^^^^^^^^^^^^^
Discouraged access: The type 'ELValidationPreferences' is not API (restriction on classpath entry '/jobs/genie.webtools/webtools-jsf-gerrit_master/workspace/jsf/plugins/org.eclipse.jst.jsf.core/target/classes')
[WARNING] /jobs/genie.webtools/webtools-jsf-gerrit_master/workspace/jsf/tests/org.eclipse.jst.jsf.validation.el.tests/src/org/eclipse/jst/jsf/validation/el/tests/preferences/PrefTestUtil.java:[38] 
	prefs.setSeverity(ELValidationPreferences.BINARY_OP_COULD_NOT_MAKE_NUMERIC_COERCION, severity);
	                                          ^^^^^^^^^^^^^^^^^^^^^^^^^^^^^^^^^^^^^^^^^
Discouraged access: The field 'ELValidationPreferences.BINARY_OP_COULD_NOT_MAKE_NUMERIC_COERCION' is not API (restriction on classpath entry '/jobs/genie.webtools/webtools-jsf-gerrit_master/workspace/jsf/plugins/org.eclipse.jst.jsf.core/target/classes')
[WARNING] /jobs/genie.webtools/webtools-jsf-gerrit_master/workspace/jsf/tests/org.eclipse.jst.jsf.validation.el.tests/src/org/eclipse/jst/jsf/validation/el/tests/preferences/PrefTestUtil.java:[39] 
	prefs.setSeverity(ELValidationPreferences.BINARY_OP_CONSTANT_EXPRESSION_ALWAYS_EVAL_SAME, severity);
	^^^^^^^^^^^^^^^^^^^^^^^^^^^^^^^^^^^^^^^^^^^^^^^^^^^^^^^^^^^^^^^^^^^^^^^^^^^^^^^^^^^^^^^^^^^^^^^^^^^
Discouraged access: The method 'ELValidationPreferences.setSeverity(String, Severity)' is not API (restriction on classpath entry '/jobs/genie.webtools/webtools-jsf-gerrit_master/workspace/jsf/plugins/org.eclipse.jst.jsf.core/target/classes')
[WARNING] /jobs/genie.webtools/webtools-jsf-gerrit_master/workspace/jsf/tests/org.eclipse.jst.jsf.validation.el.tests/src/org/eclipse/jst/jsf/validation/el/tests/preferences/PrefTestUtil.java:[39] 
	prefs.setSeverity(ELValidationPreferences.BINARY_OP_CONSTANT_EXPRESSION_ALWAYS_EVAL_SAME, severity);
	                  ^^^^^^^^^^^^^^^^^^^^^^^^^^^^^^^^^^^^^^^^^^^^^^^^^^^^^^^^^^^^^^^^^^^^^^
Discouraged access: The type 'ELValidationPreferences' is not API (restriction on classpath entry '/jobs/genie.webtools/webtools-jsf-gerrit_master/workspace/jsf/plugins/org.eclipse.jst.jsf.core/target/classes')
[WARNING] /jobs/genie.webtools/webtools-jsf-gerrit_master/workspace/jsf/tests/org.eclipse.jst.jsf.validation.el.tests/src/org/eclipse/jst/jsf/validation/el/tests/preferences/PrefTestUtil.java:[39] 
	prefs.setSeverity(ELValidationPreferences.BINARY_OP_CONSTANT_EXPRESSION_ALWAYS_EVAL_SAME, severity);
	                                          ^^^^^^^^^^^^^^^^^^^^^^^^^^^^^^^^^^^^^^^^^^^^^^
Discouraged access: The field 'ELValidationPreferences.BINARY_OP_CONSTANT_EXPRESSION_ALWAYS_EVAL_SAME' is not API (restriction on classpath entry '/jobs/genie.webtools/webtools-jsf-gerrit_master/workspace/jsf/plugins/org.eclipse.jst.jsf.core/target/classes')
[WARNING] /jobs/genie.webtools/webtools-jsf-gerrit_master/workspace/jsf/tests/org.eclipse.jst.jsf.validation.el.tests/src/org/eclipse/jst/jsf/validation/el/tests/preferences/PrefTestUtil.java:[40] 
	prefs.setSeverity(ELValidationPreferences.BINARY_OP_EQUALITY_COMP_WITH_NULL_ALWAYS_EVAL_SAME, severity);
	^^^^^^^^^^^^^^^^^^^^^^^^^^^^^^^^^^^^^^^^^^^^^^^^^^^^^^^^^^^^^^^^^^^^^^^^^^^^^^^^^^^^^^^^^^^^^^^^^^^^^^^
Discouraged access: The method 'ELValidationPreferences.setSeverity(String, Severity)' is not API (restriction on classpath entry '/jobs/genie.webtools/webtools-jsf-gerrit_master/workspace/jsf/plugins/org.eclipse.jst.jsf.core/target/classes')
[WARNING] /jobs/genie.webtools/webtools-jsf-gerrit_master/workspace/jsf/tests/org.eclipse.jst.jsf.validation.el.tests/src/org/eclipse/jst/jsf/validation/el/tests/preferences/PrefTestUtil.java:[40] 
	prefs.setSeverity(ELValidationPreferences.BINARY_OP_EQUALITY_COMP_WITH_NULL_ALWAYS_EVAL_SAME, severity);
	                  ^^^^^^^^^^^^^^^^^^^^^^^^^^^^^^^^^^^^^^^^^^^^^^^^^^^^^^^^^^^^^^^^^^^^^^^^^^
Discouraged access: The type 'ELValidationPreferences' is not API (restriction on classpath entry '/jobs/genie.webtools/webtools-jsf-gerrit_master/workspace/jsf/plugins/org.eclipse.jst.jsf.core/target/classes')
[WARNING] /jobs/genie.webtools/webtools-jsf-gerrit_master/workspace/jsf/tests/org.eclipse.jst.jsf.validation.el.tests/src/org/eclipse/jst/jsf/validation/el/tests/preferences/PrefTestUtil.java:[40] 
	prefs.setSeverity(ELValidationPreferences.BINARY_OP_EQUALITY_COMP_WITH_NULL_ALWAYS_EVAL_SAME, severity);
	                                          ^^^^^^^^^^^^^^^^^^^^^^^^^^^^^^^^^^^^^^^^^^^^^^^^^^
Discouraged access: The field 'ELValidationPreferences.BINARY_OP_EQUALITY_COMP_WITH_NULL_ALWAYS_EVAL_SAME' is not API (restriction on classpath entry '/jobs/genie.webtools/webtools-jsf-gerrit_master/workspace/jsf/plugins/org.eclipse.jst.jsf.core/target/classes')
[WARNING] /jobs/genie.webtools/webtools-jsf-gerrit_master/workspace/jsf/tests/org.eclipse.jst.jsf.validation.el.tests/src/org/eclipse/jst/jsf/validation/el/tests/preferences/PrefTestUtil.java:[41] 
	prefs.setSeverity(ELValidationPreferences.BINARY_OP_CANNOT_COERCE_ARGUMENT_TO_BOOLEAN, severity);
	^^^^^^^^^^^^^^^^^^^^^^^^^^^^^^^^^^^^^^^^^^^^^^^^^^^^^^^^^^^^^^^^^^^^^^^^^^^^^^^^^^^^^^^^^^^^^^^^
Discouraged access: The method 'ELValidationPreferences.setSeverity(String, Severity)' is not API (restriction on classpath entry '/jobs/genie.webtools/webtools-jsf-gerrit_master/workspace/jsf/plugins/org.eclipse.jst.jsf.core/target/classes')
[WARNING] /jobs/genie.webtools/webtools-jsf-gerrit_master/workspace/jsf/tests/org.eclipse.jst.jsf.validation.el.tests/src/org/eclipse/jst/jsf/validation/el/tests/preferences/PrefTestUtil.java:[41] 
	prefs.setSeverity(ELValidationPreferences.BINARY_OP_CANNOT_COERCE_ARGUMENT_TO_BOOLEAN, severity);
	                  ^^^^^^^^^^^^^^^^^^^^^^^^^^^^^^^^^^^^^^^^^^^^^^^^^^^^^^^^^^^^^^^^^^^
Discouraged access: The type 'ELValidationPreferences' is not API (restriction on classpath entry '/jobs/genie.webtools/webtools-jsf-gerrit_master/workspace/jsf/plugins/org.eclipse.jst.jsf.core/target/classes')
[WARNING] /jobs/genie.webtools/webtools-jsf-gerrit_master/workspace/jsf/tests/org.eclipse.jst.jsf.validation.el.tests/src/org/eclipse/jst/jsf/validation/el/tests/preferences/PrefTestUtil.java:[41] 
	prefs.setSeverity(ELValidationPreferences.BINARY_OP_CANNOT_COERCE_ARGUMENT_TO_BOOLEAN, severity);
	                                          ^^^^^^^^^^^^^^^^^^^^^^^^^^^^^^^^^^^^^^^^^^^
Discouraged access: The field 'ELValidationPreferences.BINARY_OP_CANNOT_COERCE_ARGUMENT_TO_BOOLEAN' is not API (restriction on classpath entry '/jobs/genie.webtools/webtools-jsf-gerrit_master/workspace/jsf/plugins/org.eclipse.jst.jsf.core/target/classes')
[WARNING] /jobs/genie.webtools/webtools-jsf-gerrit_master/workspace/jsf/tests/org.eclipse.jst.jsf.validation.el.tests/src/org/eclipse/jst/jsf/validation/el/tests/preferences/PrefTestUtil.java:[42] 
	prefs.setSeverity(ELValidationPreferences.BINARY_OP_FIRST_ARGUMENT_SHORT_CIRCUITS, severity);
	^^^^^^^^^^^^^^^^^^^^^^^^^^^^^^^^^^^^^^^^^^^^^^^^^^^^^^^^^^^^^^^^^^^^^^^^^^^^^^^^^^^^^^^^^^^^
Discouraged access: The method 'ELValidationPreferences.setSeverity(String, Severity)' is not API (restriction on classpath entry '/jobs/genie.webtools/webtools-jsf-gerrit_master/workspace/jsf/plugins/org.eclipse.jst.jsf.core/target/classes')
[WARNING] /jobs/genie.webtools/webtools-jsf-gerrit_master/workspace/jsf/tests/org.eclipse.jst.jsf.validation.el.tests/src/org/eclipse/jst/jsf/validation/el/tests/preferences/PrefTestUtil.java:[42] 
	prefs.setSeverity(ELValidationPreferences.BINARY_OP_FIRST_ARGUMENT_SHORT_CIRCUITS, severity);
	                  ^^^^^^^^^^^^^^^^^^^^^^^^^^^^^^^^^^^^^^^^^^^^^^^^^^^^^^^^^^^^^^^
Discouraged access: The type 'ELValidationPreferences' is not API (restriction on classpath entry '/jobs/genie.webtools/webtools-jsf-gerrit_master/workspace/jsf/plugins/org.eclipse.jst.jsf.core/target/classes')
[WARNING] /jobs/genie.webtools/webtools-jsf-gerrit_master/workspace/jsf/tests/org.eclipse.jst.jsf.validation.el.tests/src/org/eclipse/jst/jsf/validation/el/tests/preferences/PrefTestUtil.java:[42] 
	prefs.setSeverity(ELValidationPreferences.BINARY_OP_FIRST_ARGUMENT_SHORT_CIRCUITS, severity);
	                                          ^^^^^^^^^^^^^^^^^^^^^^^^^^^^^^^^^^^^^^^
Discouraged access: The field 'ELValidationPreferences.BINARY_OP_FIRST_ARGUMENT_SHORT_CIRCUITS' is not API (restriction on classpath entry '/jobs/genie.webtools/webtools-jsf-gerrit_master/workspace/jsf/plugins/org.eclipse.jst.jsf.core/target/classes')
[WARNING] /jobs/genie.webtools/webtools-jsf-gerrit_master/workspace/jsf/tests/org.eclipse.jst.jsf.validation.el.tests/src/org/eclipse/jst/jsf/validation/el/tests/preferences/PrefTestUtil.java:[43] 
	prefs.setSeverity(ELValidationPreferences.BINARY_OP_SECOND_ARGUMENT_ALWAYS_EVAL_SAME, severity);
	^^^^^^^^^^^^^^^^^^^^^^^^^^^^^^^^^^^^^^^^^^^^^^^^^^^^^^^^^^^^^^^^^^^^^^^^^^^^^^^^^^^^^^^^^^^^^^^
Discouraged access: The method 'ELValidationPreferences.setSeverity(String, Severity)' is not API (restriction on classpath entry '/jobs/genie.webtools/webtools-jsf-gerrit_master/workspace/jsf/plugins/org.eclipse.jst.jsf.core/target/classes')
[WARNING] /jobs/genie.webtools/webtools-jsf-gerrit_master/workspace/jsf/tests/org.eclipse.jst.jsf.validation.el.tests/src/org/eclipse/jst/jsf/validation/el/tests/preferences/PrefTestUtil.java:[43] 
	prefs.setSeverity(ELValidationPreferences.BINARY_OP_SECOND_ARGUMENT_ALWAYS_EVAL_SAME, severity);
	                  ^^^^^^^^^^^^^^^^^^^^^^^^^^^^^^^^^^^^^^^^^^^^^^^^^^^^^^^^^^^^^^^^^^
Discouraged access: The type 'ELValidationPreferences' is not API (restriction on classpath entry '/jobs/genie.webtools/webtools-jsf-gerrit_master/workspace/jsf/plugins/org.eclipse.jst.jsf.core/target/classes')
[WARNING] /jobs/genie.webtools/webtools-jsf-gerrit_master/workspace/jsf/tests/org.eclipse.jst.jsf.validation.el.tests/src/org/eclipse/jst/jsf/validation/el/tests/preferences/PrefTestUtil.java:[43] 
	prefs.setSeverity(ELValidationPreferences.BINARY_OP_SECOND_ARGUMENT_ALWAYS_EVAL_SAME, severity);
	                                          ^^^^^^^^^^^^^^^^^^^^^^^^^^^^^^^^^^^^^^^^^^
Discouraged access: The field 'ELValidationPreferences.BINARY_OP_SECOND_ARGUMENT_ALWAYS_EVAL_SAME' is not API (restriction on classpath entry '/jobs/genie.webtools/webtools-jsf-gerrit_master/workspace/jsf/plugins/org.eclipse.jst.jsf.core/target/classes')
[WARNING] /jobs/genie.webtools/webtools-jsf-gerrit_master/workspace/jsf/tests/org.eclipse.jst.jsf.validation.el.tests/src/org/eclipse/jst/jsf/validation/el/tests/preferences/PrefTestUtil.java:[44] 
	prefs.setSeverity(ELValidationPreferences.BINARY_OP_NO_AVAILABLE_TYPE_COERCION, severity);
	^^^^^^^^^^^^^^^^^^^^^^^^^^^^^^^^^^^^^^^^^^^^^^^^^^^^^^^^^^^^^^^^^^^^^^^^^^^^^^^^^^^^^^^^^
Discouraged access: The method 'ELValidationPreferences.setSeverity(String, Severity)' is not API (restriction on classpath entry '/jobs/genie.webtools/webtools-jsf-gerrit_master/workspace/jsf/plugins/org.eclipse.jst.jsf.core/target/classes')
[WARNING] /jobs/genie.webtools/webtools-jsf-gerrit_master/workspace/jsf/tests/org.eclipse.jst.jsf.validation.el.tests/src/org/eclipse/jst/jsf/validation/el/tests/preferences/PrefTestUtil.java:[44] 
	prefs.setSeverity(ELValidationPreferences.BINARY_OP_NO_AVAILABLE_TYPE_COERCION, severity);
	                  ^^^^^^^^^^^^^^^^^^^^^^^^^^^^^^^^^^^^^^^^^^^^^^^^^^^^^^^^^^^^
Discouraged access: The type 'ELValidationPreferences' is not API (restriction on classpath entry '/jobs/genie.webtools/webtools-jsf-gerrit_master/workspace/jsf/plugins/org.eclipse.jst.jsf.core/target/classes')
[WARNING] /jobs/genie.webtools/webtools-jsf-gerrit_master/workspace/jsf/tests/org.eclipse.jst.jsf.validation.el.tests/src/org/eclipse/jst/jsf/validation/el/tests/preferences/PrefTestUtil.java:[44] 
	prefs.setSeverity(ELValidationPreferences.BINARY_OP_NO_AVAILABLE_TYPE_COERCION, severity);
	                                          ^^^^^^^^^^^^^^^^^^^^^^^^^^^^^^^^^^^^
Discouraged access: The field 'ELValidationPreferences.BINARY_OP_NO_AVAILABLE_TYPE_COERCION' is not API (restriction on classpath entry '/jobs/genie.webtools/webtools-jsf-gerrit_master/workspace/jsf/plugins/org.eclipse.jst.jsf.core/target/classes')
[WARNING] /jobs/genie.webtools/webtools-jsf-gerrit_master/workspace/jsf/tests/org.eclipse.jst.jsf.validation.el.tests/src/org/eclipse/jst/jsf/validation/el/tests/preferences/PrefTestUtil.java:[45] 
	prefs.setSeverity(ELValidationPreferences.BINARY_OP_COULD_NOT_COERCE_LITERALS_TO_NUMBERS, severity);
	^^^^^^^^^^^^^^^^^^^^^^^^^^^^^^^^^^^^^^^^^^^^^^^^^^^^^^^^^^^^^^^^^^^^^^^^^^^^^^^^^^^^^^^^^^^^^^^^^^^
Discouraged access: The method 'ELValidationPreferences.setSeverity(String, Severity)' is not API (restriction on classpath entry '/jobs/genie.webtools/webtools-jsf-gerrit_master/workspace/jsf/plugins/org.eclipse.jst.jsf.core/target/classes')
[WARNING] /jobs/genie.webtools/webtools-jsf-gerrit_master/workspace/jsf/tests/org.eclipse.jst.jsf.validation.el.tests/src/org/eclipse/jst/jsf/validation/el/tests/preferences/PrefTestUtil.java:[45] 
	prefs.setSeverity(ELValidationPreferences.BINARY_OP_COULD_NOT_COERCE_LITERALS_TO_NUMBERS, severity);
	                  ^^^^^^^^^^^^^^^^^^^^^^^^^^^^^^^^^^^^^^^^^^^^^^^^^^^^^^^^^^^^^^^^^^^^^^
Discouraged access: The type 'ELValidationPreferences' is not API (restriction on classpath entry '/jobs/genie.webtools/webtools-jsf-gerrit_master/workspace/jsf/plugins/org.eclipse.jst.jsf.core/target/classes')
[WARNING] /jobs/genie.webtools/webtools-jsf-gerrit_master/workspace/jsf/tests/org.eclipse.jst.jsf.validation.el.tests/src/org/eclipse/jst/jsf/validation/el/tests/preferences/PrefTestUtil.java:[45] 
	prefs.setSeverity(ELValidationPreferences.BINARY_OP_COULD_NOT_COERCE_LITERALS_TO_NUMBERS, severity);
	                                          ^^^^^^^^^^^^^^^^^^^^^^^^^^^^^^^^^^^^^^^^^^^^^^
Discouraged access: The field 'ELValidationPreferences.BINARY_OP_COULD_NOT_COERCE_LITERALS_TO_NUMBERS' is not API (restriction on classpath entry '/jobs/genie.webtools/webtools-jsf-gerrit_master/workspace/jsf/plugins/org.eclipse.jst.jsf.core/target/classes')
[WARNING] /jobs/genie.webtools/webtools-jsf-gerrit_master/workspace/jsf/tests/org.eclipse.jst.jsf.validation.el.tests/src/org/eclipse/jst/jsf/validation/el/tests/preferences/PrefTestUtil.java:[46] 
	prefs.setSeverity(ELValidationPreferences.UNARY_OP_CONSTANT_EXPRESSION_EVAL_SAME, severity);
	^^^^^^^^^^^^^^^^^^^^^^^^^^^^^^^^^^^^^^^^^^^^^^^^^^^^^^^^^^^^^^^^^^^^^^^^^^^^^^^^^^^^^^^^^^^
Discouraged access: The method 'ELValidationPreferences.setSeverity(String, Severity)' is not API (restriction on classpath entry '/jobs/genie.webtools/webtools-jsf-gerrit_master/workspace/jsf/plugins/org.eclipse.jst.jsf.core/target/classes')
[WARNING] /jobs/genie.webtools/webtools-jsf-gerrit_master/workspace/jsf/tests/org.eclipse.jst.jsf.validation.el.tests/src/org/eclipse/jst/jsf/validation/el/tests/preferences/PrefTestUtil.java:[46] 
	prefs.setSeverity(ELValidationPreferences.UNARY_OP_CONSTANT_EXPRESSION_EVAL_SAME, severity);
	                  ^^^^^^^^^^^^^^^^^^^^^^^^^^^^^^^^^^^^^^^^^^^^^^^^^^^^^^^^^^^^^^
Discouraged access: The type 'ELValidationPreferences' is not API (restriction on classpath entry '/jobs/genie.webtools/webtools-jsf-gerrit_master/workspace/jsf/plugins/org.eclipse.jst.jsf.core/target/classes')
[WARNING] /jobs/genie.webtools/webtools-jsf-gerrit_master/workspace/jsf/tests/org.eclipse.jst.jsf.validation.el.tests/src/org/eclipse/jst/jsf/validation/el/tests/preferences/PrefTestUtil.java:[46] 
	prefs.setSeverity(ELValidationPreferences.UNARY_OP_CONSTANT_EXPRESSION_EVAL_SAME, severity);
	                                          ^^^^^^^^^^^^^^^^^^^^^^^^^^^^^^^^^^^^^^
Discouraged access: The field 'ELValidationPreferences.UNARY_OP_CONSTANT_EXPRESSION_EVAL_SAME' is not API (restriction on classpath entry '/jobs/genie.webtools/webtools-jsf-gerrit_master/workspace/jsf/plugins/org.eclipse.jst.jsf.core/target/classes')
[WARNING] /jobs/genie.webtools/webtools-jsf-gerrit_master/workspace/jsf/tests/org.eclipse.jst.jsf.validation.el.tests/src/org/eclipse/jst/jsf/validation/el/tests/preferences/PrefTestUtil.java:[47] 
	prefs.setSeverity(ELValidationPreferences.UNARY_OP_EMPTY_ALWAYS_FALSE_ON_TYPE, severity);
	^^^^^^^^^^^^^^^^^^^^^^^^^^^^^^^^^^^^^^^^^^^^^^^^^^^^^^^^^^^^^^^^^^^^^^^^^^^^^^^^^^^^^^^^
Discouraged access: The method 'ELValidationPreferences.setSeverity(String, Severity)' is not API (restriction on classpath entry '/jobs/genie.webtools/webtools-jsf-gerrit_master/workspace/jsf/plugins/org.eclipse.jst.jsf.core/target/classes')
[WARNING] /jobs/genie.webtools/webtools-jsf-gerrit_master/workspace/jsf/tests/org.eclipse.jst.jsf.validation.el.tests/src/org/eclipse/jst/jsf/validation/el/tests/preferences/PrefTestUtil.java:[47] 
	prefs.setSeverity(ELValidationPreferences.UNARY_OP_EMPTY_ALWAYS_FALSE_ON_TYPE, severity);
	                  ^^^^^^^^^^^^^^^^^^^^^^^^^^^^^^^^^^^^^^^^^^^^^^^^^^^^^^^^^^^
Discouraged access: The type 'ELValidationPreferences' is not API (restriction on classpath entry '/jobs/genie.webtools/webtools-jsf-gerrit_master/workspace/jsf/plugins/org.eclipse.jst.jsf.core/target/classes')
[WARNING] /jobs/genie.webtools/webtools-jsf-gerrit_master/workspace/jsf/tests/org.eclipse.jst.jsf.validation.el.tests/src/org/eclipse/jst/jsf/validation/el/tests/preferences/PrefTestUtil.java:[47] 
	prefs.setSeverity(ELValidationPreferences.UNARY_OP_EMPTY_ALWAYS_FALSE_ON_TYPE, severity);
	                                          ^^^^^^^^^^^^^^^^^^^^^^^^^^^^^^^^^^^
Discouraged access: The field 'ELValidationPreferences.UNARY_OP_EMPTY_ALWAYS_FALSE_ON_TYPE' is not API (restriction on classpath entry '/jobs/genie.webtools/webtools-jsf-gerrit_master/workspace/jsf/plugins/org.eclipse.jst.jsf.core/target/classes')
[WARNING] /jobs/genie.webtools/webtools-jsf-gerrit_master/workspace/jsf/tests/org.eclipse.jst.jsf.validation.el.tests/src/org/eclipse/jst/jsf/validation/el/tests/preferences/PrefTestUtil.java:[48] 
	prefs.setSeverity(ELValidationPreferences.UNARY_OP_MINUS_ON_NULL_ALWAYS_ZERO, severity);
	^^^^^^^^^^^^^^^^^^^^^^^^^^^^^^^^^^^^^^^^^^^^^^^^^^^^^^^^^^^^^^^^^^^^^^^^^^^^^^^^^^^^^^^
Discouraged access: The method 'ELValidationPreferences.setSeverity(String, Severity)' is not API (restriction on classpath entry '/jobs/genie.webtools/webtools-jsf-gerrit_master/workspace/jsf/plugins/org.eclipse.jst.jsf.core/target/classes')
[WARNING] /jobs/genie.webtools/webtools-jsf-gerrit_master/workspace/jsf/tests/org.eclipse.jst.jsf.validation.el.tests/src/org/eclipse/jst/jsf/validation/el/tests/preferences/PrefTestUtil.java:[48] 
	prefs.setSeverity(ELValidationPreferences.UNARY_OP_MINUS_ON_NULL_ALWAYS_ZERO, severity);
	                  ^^^^^^^^^^^^^^^^^^^^^^^^^^^^^^^^^^^^^^^^^^^^^^^^^^^^^^^^^^
Discouraged access: The type 'ELValidationPreferences' is not API (restriction on classpath entry '/jobs/genie.webtools/webtools-jsf-gerrit_master/workspace/jsf/plugins/org.eclipse.jst.jsf.core/target/classes')
[WARNING] /jobs/genie.webtools/webtools-jsf-gerrit_master/workspace/jsf/tests/org.eclipse.jst.jsf.validation.el.tests/src/org/eclipse/jst/jsf/validation/el/tests/preferences/PrefTestUtil.java:[48] 
	prefs.setSeverity(ELValidationPreferences.UNARY_OP_MINUS_ON_NULL_ALWAYS_ZERO, severity);
	                                          ^^^^^^^^^^^^^^^^^^^^^^^^^^^^^^^^^^
Discouraged access: The field 'ELValidationPreferences.UNARY_OP_MINUS_ON_NULL_ALWAYS_ZERO' is not API (restriction on classpath entry '/jobs/genie.webtools/webtools-jsf-gerrit_master/workspace/jsf/plugins/org.eclipse.jst.jsf.core/target/classes')
[WARNING] /jobs/genie.webtools/webtools-jsf-gerrit_master/workspace/jsf/tests/org.eclipse.jst.jsf.validation.el.tests/src/org/eclipse/jst/jsf/validation/el/tests/preferences/PrefTestUtil.java:[49] 
	prefs.setSeverity(ELValidationPreferences.UNARY_OP_COULD_NOT_MAKE_NUMERIC_COERCION, severity);
	^^^^^^^^^^^^^^^^^^^^^^^^^^^^^^^^^^^^^^^^^^^^^^^^^^^^^^^^^^^^^^^^^^^^^^^^^^^^^^^^^^^^^^^^^^^^^
Discouraged access: The method 'ELValidationPreferences.setSeverity(String, Severity)' is not API (restriction on classpath entry '/jobs/genie.webtools/webtools-jsf-gerrit_master/workspace/jsf/plugins/org.eclipse.jst.jsf.core/target/classes')
[WARNING] /jobs/genie.webtools/webtools-jsf-gerrit_master/workspace/jsf/tests/org.eclipse.jst.jsf.validation.el.tests/src/org/eclipse/jst/jsf/validation/el/tests/preferences/PrefTestUtil.java:[49] 
	prefs.setSeverity(ELValidationPreferences.UNARY_OP_COULD_NOT_MAKE_NUMERIC_COERCION, severity);
	                  ^^^^^^^^^^^^^^^^^^^^^^^^^^^^^^^^^^^^^^^^^^^^^^^^^^^^^^^^^^^^^^^^
Discouraged access: The type 'ELValidationPreferences' is not API (restriction on classpath entry '/jobs/genie.webtools/webtools-jsf-gerrit_master/workspace/jsf/plugins/org.eclipse.jst.jsf.core/target/classes')
[WARNING] /jobs/genie.webtools/webtools-jsf-gerrit_master/workspace/jsf/tests/org.eclipse.jst.jsf.validation.el.tests/src/org/eclipse/jst/jsf/validation/el/tests/preferences/PrefTestUtil.java:[49] 
	prefs.setSeverity(ELValidationPreferences.UNARY_OP_COULD_NOT_MAKE_NUMERIC_COERCION, severity);
	                                          ^^^^^^^^^^^^^^^^^^^^^^^^^^^^^^^^^^^^^^^^
Discouraged access: The field 'ELValidationPreferences.UNARY_OP_COULD_NOT_MAKE_NUMERIC_COERCION' is not API (restriction on classpath entry '/jobs/genie.webtools/webtools-jsf-gerrit_master/workspace/jsf/plugins/org.eclipse.jst.jsf.core/target/classes')
[WARNING] /jobs/genie.webtools/webtools-jsf-gerrit_master/workspace/jsf/tests/org.eclipse.jst.jsf.validation.el.tests/src/org/eclipse/jst/jsf/validation/el/tests/preferences/PrefTestUtil.java:[50] 
	prefs.setSeverity(ELValidationPreferences.UNARY_OP_CANNOT_COERCE_ARGUMENT_TO_BOOLEAN, severity);
	^^^^^^^^^^^^^^^^^^^^^^^^^^^^^^^^^^^^^^^^^^^^^^^^^^^^^^^^^^^^^^^^^^^^^^^^^^^^^^^^^^^^^^^^^^^^^^^
Discouraged access: The method 'ELValidationPreferences.setSeverity(String, Severity)' is not API (restriction on classpath entry '/jobs/genie.webtools/webtools-jsf-gerrit_master/workspace/jsf/plugins/org.eclipse.jst.jsf.core/target/classes')
[WARNING] /jobs/genie.webtools/webtools-jsf-gerrit_master/workspace/jsf/tests/org.eclipse.jst.jsf.validation.el.tests/src/org/eclipse/jst/jsf/validation/el/tests/preferences/PrefTestUtil.java:[50] 
	prefs.setSeverity(ELValidationPreferences.UNARY_OP_CANNOT_COERCE_ARGUMENT_TO_BOOLEAN, severity);
	                  ^^^^^^^^^^^^^^^^^^^^^^^^^^^^^^^^^^^^^^^^^^^^^^^^^^^^^^^^^^^^^^^^^^
Discouraged access: The type 'ELValidationPreferences' is not API (restriction on classpath entry '/jobs/genie.webtools/webtools-jsf-gerrit_master/workspace/jsf/plugins/org.eclipse.jst.jsf.core/target/classes')
[WARNING] /jobs/genie.webtools/webtools-jsf-gerrit_master/workspace/jsf/tests/org.eclipse.jst.jsf.validation.el.tests/src/org/eclipse/jst/jsf/validation/el/tests/preferences/PrefTestUtil.java:[50] 
	prefs.setSeverity(ELValidationPreferences.UNARY_OP_CANNOT_COERCE_ARGUMENT_TO_BOOLEAN, severity);
	                                          ^^^^^^^^^^^^^^^^^^^^^^^^^^^^^^^^^^^^^^^^^^
Discouraged access: The field 'ELValidationPreferences.UNARY_OP_CANNOT_COERCE_ARGUMENT_TO_BOOLEAN' is not API (restriction on classpath entry '/jobs/genie.webtools/webtools-jsf-gerrit_master/workspace/jsf/plugins/org.eclipse.jst.jsf.core/target/classes')
[WARNING] /jobs/genie.webtools/webtools-jsf-gerrit_master/workspace/jsf/tests/org.eclipse.jst.jsf.validation.el.tests/src/org/eclipse/jst/jsf/validation/el/tests/preferences/PrefTestUtil.java:[51] 
	prefs.setSeverity(ELValidationPreferences.TERNARY_OP_CHOICE_IS_ALWAYS_SAME, severity);
	^^^^^^^^^^^^^^^^^^^^^^^^^^^^^^^^^^^^^^^^^^^^^^^^^^^^^^^^^^^^^^^^^^^^^^^^^^^^^^^^^^^^^
Discouraged access: The method 'ELValidationPreferences.setSeverity(String, Severity)' is not API (restriction on classpath entry '/jobs/genie.webtools/webtools-jsf-gerrit_master/workspace/jsf/plugins/org.eclipse.jst.jsf.core/target/classes')
[WARNING] /jobs/genie.webtools/webtools-jsf-gerrit_master/workspace/jsf/tests/org.eclipse.jst.jsf.validation.el.tests/src/org/eclipse/jst/jsf/validation/el/tests/preferences/PrefTestUtil.java:[51] 
	prefs.setSeverity(ELValidationPreferences.TERNARY_OP_CHOICE_IS_ALWAYS_SAME, severity);
	                  ^^^^^^^^^^^^^^^^^^^^^^^^^^^^^^^^^^^^^^^^^^^^^^^^^^^^^^^^
Discouraged access: The type 'ELValidationPreferences' is not API (restriction on classpath entry '/jobs/genie.webtools/webtools-jsf-gerrit_master/workspace/jsf/plugins/org.eclipse.jst.jsf.core/target/classes')
[WARNING] /jobs/genie.webtools/webtools-jsf-gerrit_master/workspace/jsf/tests/org.eclipse.jst.jsf.validation.el.tests/src/org/eclipse/jst/jsf/validation/el/tests/preferences/PrefTestUtil.java:[51] 
	prefs.setSeverity(ELValidationPreferences.TERNARY_OP_CHOICE_IS_ALWAYS_SAME, severity);
	                                          ^^^^^^^^^^^^^^^^^^^^^^^^^^^^^^^^
Discouraged access: The field 'ELValidationPreferences.TERNARY_OP_CHOICE_IS_ALWAYS_SAME' is not API (restriction on classpath entry '/jobs/genie.webtools/webtools-jsf-gerrit_master/workspace/jsf/plugins/org.eclipse.jst.jsf.core/target/classes')
[WARNING] /jobs/genie.webtools/webtools-jsf-gerrit_master/workspace/jsf/tests/org.eclipse.jst.jsf.validation.el.tests/src/org/eclipse/jst/jsf/validation/el/tests/preferences/PrefTestUtil.java:[52] 
	prefs.setSeverity(ELValidationPreferences.TERNARY_OP_CANNOT_COERCE_CHOICE_TO_BOOLEAN, severity);
	^^^^^^^^^^^^^^^^^^^^^^^^^^^^^^^^^^^^^^^^^^^^^^^^^^^^^^^^^^^^^^^^^^^^^^^^^^^^^^^^^^^^^^^^^^^^^^^
Discouraged access: The method 'ELValidationPreferences.setSeverity(String, Severity)' is not API (restriction on classpath entry '/jobs/genie.webtools/webtools-jsf-gerrit_master/workspace/jsf/plugins/org.eclipse.jst.jsf.core/target/classes')
[WARNING] /jobs/genie.webtools/webtools-jsf-gerrit_master/workspace/jsf/tests/org.eclipse.jst.jsf.validation.el.tests/src/org/eclipse/jst/jsf/validation/el/tests/preferences/PrefTestUtil.java:[52] 
	prefs.setSeverity(ELValidationPreferences.TERNARY_OP_CANNOT_COERCE_CHOICE_TO_BOOLEAN, severity);
	                  ^^^^^^^^^^^^^^^^^^^^^^^^^^^^^^^^^^^^^^^^^^^^^^^^^^^^^^^^^^^^^^^^^^
Discouraged access: The type 'ELValidationPreferences' is not API (restriction on classpath entry '/jobs/genie.webtools/webtools-jsf-gerrit_master/workspace/jsf/plugins/org.eclipse.jst.jsf.core/target/classes')
[WARNING] /jobs/genie.webtools/webtools-jsf-gerrit_master/workspace/jsf/tests/org.eclipse.jst.jsf.validation.el.tests/src/org/eclipse/jst/jsf/validation/el/tests/preferences/PrefTestUtil.java:[52] 
	prefs.setSeverity(ELValidationPreferences.TERNARY_OP_CANNOT_COERCE_CHOICE_TO_BOOLEAN, severity);
	                                          ^^^^^^^^^^^^^^^^^^^^^^^^^^^^^^^^^^^^^^^^^^
Discouraged access: The field 'ELValidationPreferences.TERNARY_OP_CANNOT_COERCE_CHOICE_TO_BOOLEAN' is not API (restriction on classpath entry '/jobs/genie.webtools/webtools-jsf-gerrit_master/workspace/jsf/plugins/org.eclipse.jst.jsf.core/target/classes')
[WARNING] /jobs/genie.webtools/webtools-jsf-gerrit_master/workspace/jsf/tests/org.eclipse.jst.jsf.validation.el.tests/src/org/eclipse/jst/jsf/validation/el/tests/preferences/PrefTestUtil.java:[53] 
	prefs.setSeverity(ELValidationPreferences.UNARY_OP_STRING_CONVERSION_NOT_GUARANTEED, severity);
	^^^^^^^^^^^^^^^^^^^^^^^^^^^^^^^^^^^^^^^^^^^^^^^^^^^^^^^^^^^^^^^^^^^^^^^^^^^^^^^^^^^^^^^^^^^^^^
Discouraged access: The method 'ELValidationPreferences.setSeverity(String, Severity)' is not API (restriction on classpath entry '/jobs/genie.webtools/webtools-jsf-gerrit_master/workspace/jsf/plugins/org.eclipse.jst.jsf.core/target/classes')
[WARNING] /jobs/genie.webtools/webtools-jsf-gerrit_master/workspace/jsf/tests/org.eclipse.jst.jsf.validation.el.tests/src/org/eclipse/jst/jsf/validation/el/tests/preferences/PrefTestUtil.java:[53] 
	prefs.setSeverity(ELValidationPreferences.UNARY_OP_STRING_CONVERSION_NOT_GUARANTEED, severity);
	                  ^^^^^^^^^^^^^^^^^^^^^^^^^^^^^^^^^^^^^^^^^^^^^^^^^^^^^^^^^^^^^^^^^
Discouraged access: The type 'ELValidationPreferences' is not API (restriction on classpath entry '/jobs/genie.webtools/webtools-jsf-gerrit_master/workspace/jsf/plugins/org.eclipse.jst.jsf.core/target/classes')
[WARNING] /jobs/genie.webtools/webtools-jsf-gerrit_master/workspace/jsf/tests/org.eclipse.jst.jsf.validation.el.tests/src/org/eclipse/jst/jsf/validation/el/tests/preferences/PrefTestUtil.java:[53] 
	prefs.setSeverity(ELValidationPreferences.UNARY_OP_STRING_CONVERSION_NOT_GUARANTEED, severity);
	                                          ^^^^^^^^^^^^^^^^^^^^^^^^^^^^^^^^^^^^^^^^^
Discouraged access: The field 'ELValidationPreferences.UNARY_OP_STRING_CONVERSION_NOT_GUARANTEED' is not API (restriction on classpath entry '/jobs/genie.webtools/webtools-jsf-gerrit_master/workspace/jsf/plugins/org.eclipse.jst.jsf.core/target/classes')
[WARNING] /jobs/genie.webtools/webtools-jsf-gerrit_master/workspace/jsf/tests/org.eclipse.jst.jsf.validation.el.tests/src/org/eclipse/jst/jsf/validation/el/tests/preferences/PrefTestUtil.java:[54] 
	prefs.setSeverity(ELValidationPreferences.CANNOT_APPLY_OPERATOR_TO_METHOD_BINDING, severity);
	^^^^^^^^^^^^^^^^^^^^^^^^^^^^^^^^^^^^^^^^^^^^^^^^^^^^^^^^^^^^^^^^^^^^^^^^^^^^^^^^^^^^^^^^^^^^
Discouraged access: The method 'ELValidationPreferences.setSeverity(String, Severity)' is not API (restriction on classpath entry '/jobs/genie.webtools/webtools-jsf-gerrit_master/workspace/jsf/plugins/org.eclipse.jst.jsf.core/target/classes')
[WARNING] /jobs/genie.webtools/webtools-jsf-gerrit_master/workspace/jsf/tests/org.eclipse.jst.jsf.validation.el.tests/src/org/eclipse/jst/jsf/validation/el/tests/preferences/PrefTestUtil.java:[54] 
	prefs.setSeverity(ELValidationPreferences.CANNOT_APPLY_OPERATOR_TO_METHOD_BINDING, severity);
	                  ^^^^^^^^^^^^^^^^^^^^^^^^^^^^^^^^^^^^^^^^^^^^^^^^^^^^^^^^^^^^^^^
Discouraged access: The type 'ELValidationPreferences' is not API (restriction on classpath entry '/jobs/genie.webtools/webtools-jsf-gerrit_master/workspace/jsf/plugins/org.eclipse.jst.jsf.core/target/classes')
[WARNING] /jobs/genie.webtools/webtools-jsf-gerrit_master/workspace/jsf/tests/org.eclipse.jst.jsf.validation.el.tests/src/org/eclipse/jst/jsf/validation/el/tests/preferences/PrefTestUtil.java:[54] 
	prefs.setSeverity(ELValidationPreferences.CANNOT_APPLY_OPERATOR_TO_METHOD_BINDING, severity);
	                                          ^^^^^^^^^^^^^^^^^^^^^^^^^^^^^^^^^^^^^^^
Discouraged access: The field 'ELValidationPreferences.CANNOT_APPLY_OPERATOR_TO_METHOD_BINDING' is not API (restriction on classpath entry '/jobs/genie.webtools/webtools-jsf-gerrit_master/workspace/jsf/plugins/org.eclipse.jst.jsf.core/target/classes')
[WARNING] /jobs/genie.webtools/webtools-jsf-gerrit_master/workspace/jsf/tests/org.eclipse.jst.jsf.validation.el.tests/src/org/eclipse/jst/jsf/validation/el/tests/preferences/PrefTestUtil.java:[55] 
	prefs.setSeverity(ELValidationPreferences.MEMBER_NOT_FOUND, severity);
	^^^^^^^^^^^^^^^^^^^^^^^^^^^^^^^^^^^^^^^^^^^^^^^^^^^^^^^^^^^^^^^^^^^^^
Discouraged access: The method 'ELValidationPreferences.setSeverity(String, Severity)' is not API (restriction on classpath entry '/jobs/genie.webtools/webtools-jsf-gerrit_master/workspace/jsf/plugins/org.eclipse.jst.jsf.core/target/classes')
[WARNING] /jobs/genie.webtools/webtools-jsf-gerrit_master/workspace/jsf/tests/org.eclipse.jst.jsf.validation.el.tests/src/org/eclipse/jst/jsf/validation/el/tests/preferences/PrefTestUtil.java:[55] 
	prefs.setSeverity(ELValidationPreferences.MEMBER_NOT_FOUND, severity);
	                  ^^^^^^^^^^^^^^^^^^^^^^^^^^^^^^^^^^^^^^^^
Discouraged access: The type 'ELValidationPreferences' is not API (restriction on classpath entry '/jobs/genie.webtools/webtools-jsf-gerrit_master/workspace/jsf/plugins/org.eclipse.jst.jsf.core/target/classes')
[WARNING] /jobs/genie.webtools/webtools-jsf-gerrit_master/workspace/jsf/tests/org.eclipse.jst.jsf.validation.el.tests/src/org/eclipse/jst/jsf/validation/el/tests/preferences/PrefTestUtil.java:[55] 
	prefs.setSeverity(ELValidationPreferences.MEMBER_NOT_FOUND, severity);
	                                          ^^^^^^^^^^^^^^^^
Discouraged access: The field 'ELValidationPreferences.MEMBER_NOT_FOUND' is not API (restriction on classpath entry '/jobs/genie.webtools/webtools-jsf-gerrit_master/workspace/jsf/plugins/org.eclipse.jst.jsf.core/target/classes')
[WARNING] /jobs/genie.webtools/webtools-jsf-gerrit_master/workspace/jsf/tests/org.eclipse.jst.jsf.validation.el.tests/src/org/eclipse/jst/jsf/validation/el/tests/preferences/PrefTestUtil.java:[56] 
	prefs.setSeverity(ELValidationPreferences.VARIABLE_NOT_FOUND, severity);
	^^^^^^^^^^^^^^^^^^^^^^^^^^^^^^^^^^^^^^^^^^^^^^^^^^^^^^^^^^^^^^^^^^^^^^^
Discouraged access: The method 'ELValidationPreferences.setSeverity(String, Severity)' is not API (restriction on classpath entry '/jobs/genie.webtools/webtools-jsf-gerrit_master/workspace/jsf/plugins/org.eclipse.jst.jsf.core/target/classes')
[WARNING] /jobs/genie.webtools/webtools-jsf-gerrit_master/workspace/jsf/tests/org.eclipse.jst.jsf.validation.el.tests/src/org/eclipse/jst/jsf/validation/el/tests/preferences/PrefTestUtil.java:[56] 
	prefs.setSeverity(ELValidationPreferences.VARIABLE_NOT_FOUND, severity);
	                  ^^^^^^^^^^^^^^^^^^^^^^^^^^^^^^^^^^^^^^^^^^
Discouraged access: The type 'ELValidationPreferences' is not API (restriction on classpath entry '/jobs/genie.webtools/webtools-jsf-gerrit_master/workspace/jsf/plugins/org.eclipse.jst.jsf.core/target/classes')
[WARNING] /jobs/genie.webtools/webtools-jsf-gerrit_master/workspace/jsf/tests/org.eclipse.jst.jsf.validation.el.tests/src/org/eclipse/jst/jsf/validation/el/tests/preferences/PrefTestUtil.java:[56] 
	prefs.setSeverity(ELValidationPreferences.VARIABLE_NOT_FOUND, severity);
	                                          ^^^^^^^^^^^^^^^^^^
Discouraged access: The field 'ELValidationPreferences.VARIABLE_NOT_FOUND' is not API (restriction on classpath entry '/jobs/genie.webtools/webtools-jsf-gerrit_master/workspace/jsf/plugins/org.eclipse.jst.jsf.core/target/classes')
[WARNING] /jobs/genie.webtools/webtools-jsf-gerrit_master/workspace/jsf/tests/org.eclipse.jst.jsf.validation.el.tests/src/org/eclipse/jst/jsf/validation/el/tests/preferences/PrefTestUtil.java:[57] 
	prefs.setSeverity(ELValidationPreferences.MISSING_CLOSING_EXPR_BRACKET, severity);
	^^^^^^^^^^^^^^^^^^^^^^^^^^^^^^^^^^^^^^^^^^^^^^^^^^^^^^^^^^^^^^^^^^^^^^^^^^^^^^^^^
Discouraged access: The method 'ELValidationPreferences.setSeverity(String, Severity)' is not API (restriction on classpath entry '/jobs/genie.webtools/webtools-jsf-gerrit_master/workspace/jsf/plugins/org.eclipse.jst.jsf.core/target/classes')
[WARNING] /jobs/genie.webtools/webtools-jsf-gerrit_master/workspace/jsf/tests/org.eclipse.jst.jsf.validation.el.tests/src/org/eclipse/jst/jsf/validation/el/tests/preferences/PrefTestUtil.java:[57] 
	prefs.setSeverity(ELValidationPreferences.MISSING_CLOSING_EXPR_BRACKET, severity);
	                  ^^^^^^^^^^^^^^^^^^^^^^^^^^^^^^^^^^^^^^^^^^^^^^^^^^^^
Discouraged access: The type 'ELValidationPreferences' is not API (restriction on classpath entry '/jobs/genie.webtools/webtools-jsf-gerrit_master/workspace/jsf/plugins/org.eclipse.jst.jsf.core/target/classes')
[WARNING] /jobs/genie.webtools/webtools-jsf-gerrit_master/workspace/jsf/tests/org.eclipse.jst.jsf.validation.el.tests/src/org/eclipse/jst/jsf/validation/el/tests/preferences/PrefTestUtil.java:[57] 
	prefs.setSeverity(ELValidationPreferences.MISSING_CLOSING_EXPR_BRACKET, severity);
	                                          ^^^^^^^^^^^^^^^^^^^^^^^^^^^^
Discouraged access: The field 'ELValidationPreferences.MISSING_CLOSING_EXPR_BRACKET' is not API (restriction on classpath entry '/jobs/genie.webtools/webtools-jsf-gerrit_master/workspace/jsf/plugins/org.eclipse.jst.jsf.core/target/classes')
[WARNING] /jobs/genie.webtools/webtools-jsf-gerrit_master/workspace/jsf/tests/org.eclipse.jst.jsf.validation.el.tests/src/org/eclipse/jst/jsf/validation/el/tests/preferences/PrefTestUtil.java:[58] 
	prefs.setSeverity(ELValidationPreferences.GENERAL_SYNTAX_ERROR, severity);
	^^^^^^^^^^^^^^^^^^^^^^^^^^^^^^^^^^^^^^^^^^^^^^^^^^^^^^^^^^^^^^^^^^^^^^^^^
Discouraged access: The method 'ELValidationPreferences.setSeverity(String, Severity)' is not API (restriction on classpath entry '/jobs/genie.webtools/webtools-jsf-gerrit_master/workspace/jsf/plugins/org.eclipse.jst.jsf.core/target/classes')
[WARNING] /jobs/genie.webtools/webtools-jsf-gerrit_master/workspace/jsf/tests/org.eclipse.jst.jsf.validation.el.tests/src/org/eclipse/jst/jsf/validation/el/tests/preferences/PrefTestUtil.java:[58] 
	prefs.setSeverity(ELValidationPreferences.GENERAL_SYNTAX_ERROR, severity);
	                  ^^^^^^^^^^^^^^^^^^^^^^^^^^^^^^^^^^^^^^^^^^^^
Discouraged access: The type 'ELValidationPreferences' is not API (restriction on classpath entry '/jobs/genie.webtools/webtools-jsf-gerrit_master/workspace/jsf/plugins/org.eclipse.jst.jsf.core/target/classes')
[WARNING] /jobs/genie.webtools/webtools-jsf-gerrit_master/workspace/jsf/tests/org.eclipse.jst.jsf.validation.el.tests/src/org/eclipse/jst/jsf/validation/el/tests/preferences/PrefTestUtil.java:[58] 
	prefs.setSeverity(ELValidationPreferences.GENERAL_SYNTAX_ERROR, severity);
	                                          ^^^^^^^^^^^^^^^^^^^^
Discouraged access: The field 'ELValidationPreferences.GENERAL_SYNTAX_ERROR' is not API (restriction on classpath entry '/jobs/genie.webtools/webtools-jsf-gerrit_master/workspace/jsf/plugins/org.eclipse.jst.jsf.core/target/classes')
[WARNING] /jobs/genie.webtools/webtools-jsf-gerrit_master/workspace/jsf/tests/org.eclipse.jst.jsf.validation.el.tests/src/org/eclipse/jst/jsf/validation/el/tests/preferences/PrefTestUtil.java:[59] 
	prefs.setSeverity(ELValidationPreferences.EMPTY_EL_EXPRESSION, severity);
	^^^^^^^^^^^^^^^^^^^^^^^^^^^^^^^^^^^^^^^^^^^^^^^^^^^^^^^^^^^^^^^^^^^^^^^^
Discouraged access: The method 'ELValidationPreferences.setSeverity(String, Severity)' is not API (restriction on classpath entry '/jobs/genie.webtools/webtools-jsf-gerrit_master/workspace/jsf/plugins/org.eclipse.jst.jsf.core/target/classes')
[WARNING] /jobs/genie.webtools/webtools-jsf-gerrit_master/workspace/jsf/tests/org.eclipse.jst.jsf.validation.el.tests/src/org/eclipse/jst/jsf/validation/el/tests/preferences/PrefTestUtil.java:[59] 
	prefs.setSeverity(ELValidationPreferences.EMPTY_EL_EXPRESSION, severity);
	                  ^^^^^^^^^^^^^^^^^^^^^^^^^^^^^^^^^^^^^^^^^^^
Discouraged access: The type 'ELValidationPreferences' is not API (restriction on classpath entry '/jobs/genie.webtools/webtools-jsf-gerrit_master/workspace/jsf/plugins/org.eclipse.jst.jsf.core/target/classes')
[WARNING] /jobs/genie.webtools/webtools-jsf-gerrit_master/workspace/jsf/tests/org.eclipse.jst.jsf.validation.el.tests/src/org/eclipse/jst/jsf/validation/el/tests/preferences/PrefTestUtil.java:[59] 
	prefs.setSeverity(ELValidationPreferences.EMPTY_EL_EXPRESSION, severity);
	                                          ^^^^^^^^^^^^^^^^^^^
Discouraged access: The field 'ELValidationPreferences.EMPTY_EL_EXPRESSION' is not API (restriction on classpath entry '/jobs/genie.webtools/webtools-jsf-gerrit_master/workspace/jsf/plugins/org.eclipse.jst.jsf.core/target/classes')
[WARNING] /jobs/genie.webtools/webtools-jsf-gerrit_master/workspace/jsf/tests/org.eclipse.jst.jsf.validation.el.tests/src/org/eclipse/jst/jsf/validation/el/tests/preferences/PrefTestUtil.java:[60] 
	prefs.setSeverity(ELValidationPreferences.BINARY_OP_DOT_WITH_VALUEB_NULL, severity);
	^^^^^^^^^^^^^^^^^^^^^^^^^^^^^^^^^^^^^^^^^^^^^^^^^^^^^^^^^^^^^^^^^^^^^^^^^^^^^^^^^^^
Discouraged access: The method 'ELValidationPreferences.setSeverity(String, Severity)' is not API (restriction on classpath entry '/jobs/genie.webtools/webtools-jsf-gerrit_master/workspace/jsf/plugins/org.eclipse.jst.jsf.core/target/classes')
[WARNING] /jobs/genie.webtools/webtools-jsf-gerrit_master/workspace/jsf/tests/org.eclipse.jst.jsf.validation.el.tests/src/org/eclipse/jst/jsf/validation/el/tests/preferences/PrefTestUtil.java:[60] 
	prefs.setSeverity(ELValidationPreferences.BINARY_OP_DOT_WITH_VALUEB_NULL, severity);
	                  ^^^^^^^^^^^^^^^^^^^^^^^^^^^^^^^^^^^^^^^^^^^^^^^^^^^^^^
Discouraged access: The type 'ELValidationPreferences' is not API (restriction on classpath entry '/jobs/genie.webtools/webtools-jsf-gerrit_master/workspace/jsf/plugins/org.eclipse.jst.jsf.core/target/classes')
[WARNING] /jobs/genie.webtools/webtools-jsf-gerrit_master/workspace/jsf/tests/org.eclipse.jst.jsf.validation.el.tests/src/org/eclipse/jst/jsf/validation/el/tests/preferences/PrefTestUtil.java:[60] 
	prefs.setSeverity(ELValidationPreferences.BINARY_OP_DOT_WITH_VALUEB_NULL, severity);
	                                          ^^^^^^^^^^^^^^^^^^^^^^^^^^^^^^
Discouraged access: The field 'ELValidationPreferences.BINARY_OP_DOT_WITH_VALUEB_NULL' is not API (restriction on classpath entry '/jobs/genie.webtools/webtools-jsf-gerrit_master/workspace/jsf/plugins/org.eclipse.jst.jsf.core/target/classes')
[WARNING] /jobs/genie.webtools/webtools-jsf-gerrit_master/workspace/jsf/tests/org.eclipse.jst.jsf.validation.el.tests/src/org/eclipse/jst/jsf/validation/el/tests/preferences/PrefTestUtil.java:[61] 
	prefs.setSeverity(ELValidationPreferences.BINARY_OP_DOT_WITH_DOTTED_KEY_SHOULD_USE_ARRAY, severity);
	^^^^^^^^^^^^^^^^^^^^^^^^^^^^^^^^^^^^^^^^^^^^^^^^^^^^^^^^^^^^^^^^^^^^^^^^^^^^^^^^^^^^^^^^^^^^^^^^^^^
Discouraged access: The method 'ELValidationPreferences.setSeverity(String, Severity)' is not API (restriction on classpath entry '/jobs/genie.webtools/webtools-jsf-gerrit_master/workspace/jsf/plugins/org.eclipse.jst.jsf.core/target/classes')
[WARNING] /jobs/genie.webtools/webtools-jsf-gerrit_master/workspace/jsf/tests/org.eclipse.jst.jsf.validation.el.tests/src/org/eclipse/jst/jsf/validation/el/tests/preferences/PrefTestUtil.java:[61] 
	prefs.setSeverity(ELValidationPreferences.BINARY_OP_DOT_WITH_DOTTED_KEY_SHOULD_USE_ARRAY, severity);
	                  ^^^^^^^^^^^^^^^^^^^^^^^^^^^^^^^^^^^^^^^^^^^^^^^^^^^^^^^^^^^^^^^^^^^^^^
Discouraged access: The type 'ELValidationPreferences' is not API (restriction on classpath entry '/jobs/genie.webtools/webtools-jsf-gerrit_master/workspace/jsf/plugins/org.eclipse.jst.jsf.core/target/classes')
[WARNING] /jobs/genie.webtools/webtools-jsf-gerrit_master/workspace/jsf/tests/org.eclipse.jst.jsf.validation.el.tests/src/org/eclipse/jst/jsf/validation/el/tests/preferences/PrefTestUtil.java:[61] 
	prefs.setSeverity(ELValidationPreferences.BINARY_OP_DOT_WITH_DOTTED_KEY_SHOULD_USE_ARRAY, severity);
	                                          ^^^^^^^^^^^^^^^^^^^^^^^^^^^^^^^^^^^^^^^^^^^^^^
Discouraged access: The field 'ELValidationPreferences.BINARY_OP_DOT_WITH_DOTTED_KEY_SHOULD_USE_ARRAY' is not API (restriction on classpath entry '/jobs/genie.webtools/webtools-jsf-gerrit_master/workspace/jsf/plugins/org.eclipse.jst.jsf.core/target/classes')
[WARNING] /jobs/genie.webtools/webtools-jsf-gerrit_master/workspace/jsf/tests/org.eclipse.jst.jsf.validation.el.tests/src/org/eclipse/jst/jsf/validation/el/tests/preferences/PrefTestUtil.java:[62] 
	prefs.setSeverity(ELValidationPreferences.POSSIBLE_ARRAY_INDEX_OUT_OF_BOUNDS, severity);
	^^^^^^^^^^^^^^^^^^^^^^^^^^^^^^^^^^^^^^^^^^^^^^^^^^^^^^^^^^^^^^^^^^^^^^^^^^^^^^^^^^^^^^^
Discouraged access: The method 'ELValidationPreferences.setSeverity(String, Severity)' is not API (restriction on classpath entry '/jobs/genie.webtools/webtools-jsf-gerrit_master/workspace/jsf/plugins/org.eclipse.jst.jsf.core/target/classes')
[WARNING] /jobs/genie.webtools/webtools-jsf-gerrit_master/workspace/jsf/tests/org.eclipse.jst.jsf.validation.el.tests/src/org/eclipse/jst/jsf/validation/el/tests/preferences/PrefTestUtil.java:[62] 
	prefs.setSeverity(ELValidationPreferences.POSSIBLE_ARRAY_INDEX_OUT_OF_BOUNDS, severity);
	                  ^^^^^^^^^^^^^^^^^^^^^^^^^^^^^^^^^^^^^^^^^^^^^^^^^^^^^^^^^^
Discouraged access: The type 'ELValidationPreferences' is not API (restriction on classpath entry '/jobs/genie.webtools/webtools-jsf-gerrit_master/workspace/jsf/plugins/org.eclipse.jst.jsf.core/target/classes')
[WARNING] /jobs/genie.webtools/webtools-jsf-gerrit_master/workspace/jsf/tests/org.eclipse.jst.jsf.validation.el.tests/src/org/eclipse/jst/jsf/validation/el/tests/preferences/PrefTestUtil.java:[62] 
	prefs.setSeverity(ELValidationPreferences.POSSIBLE_ARRAY_INDEX_OUT_OF_BOUNDS, severity);
	                                          ^^^^^^^^^^^^^^^^^^^^^^^^^^^^^^^^^^
Discouraged access: The field 'ELValidationPreferences.POSSIBLE_ARRAY_INDEX_OUT_OF_BOUNDS' is not API (restriction on classpath entry '/jobs/genie.webtools/webtools-jsf-gerrit_master/workspace/jsf/plugins/org.eclipse.jst.jsf.core/target/classes')
[WARNING] /jobs/genie.webtools/webtools-jsf-gerrit_master/workspace/jsf/tests/org.eclipse.jst.jsf.validation.el.tests/src/org/eclipse/jst/jsf/validation/el/tests/preferences/PrefTestUtil.java:[63] 
	prefs.setSeverity(ELValidationPreferences.BINARY_COMPARISON_WITH_ENUM_ALWAYS_SAME, severity);
	^^^^^^^^^^^^^^^^^^^^^^^^^^^^^^^^^^^^^^^^^^^^^^^^^^^^^^^^^^^^^^^^^^^^^^^^^^^^^^^^^^^^^^^^^^^^
Discouraged access: The method 'ELValidationPreferences.setSeverity(String, Severity)' is not API (restriction on classpath entry '/jobs/genie.webtools/webtools-jsf-gerrit_master/workspace/jsf/plugins/org.eclipse.jst.jsf.core/target/classes')
[WARNING] /jobs/genie.webtools/webtools-jsf-gerrit_master/workspace/jsf/tests/org.eclipse.jst.jsf.validation.el.tests/src/org/eclipse/jst/jsf/validation/el/tests/preferences/PrefTestUtil.java:[63] 
	prefs.setSeverity(ELValidationPreferences.BINARY_COMPARISON_WITH_ENUM_ALWAYS_SAME, severity);
	                  ^^^^^^^^^^^^^^^^^^^^^^^^^^^^^^^^^^^^^^^^^^^^^^^^^^^^^^^^^^^^^^^
Discouraged access: The type 'ELValidationPreferences' is not API (restriction on classpath entry '/jobs/genie.webtools/webtools-jsf-gerrit_master/workspace/jsf/plugins/org.eclipse.jst.jsf.core/target/classes')
[WARNING] /jobs/genie.webtools/webtools-jsf-gerrit_master/workspace/jsf/tests/org.eclipse.jst.jsf.validation.el.tests/src/org/eclipse/jst/jsf/validation/el/tests/preferences/PrefTestUtil.java:[63] 
	prefs.setSeverity(ELValidationPreferences.BINARY_COMPARISON_WITH_ENUM_ALWAYS_SAME, severity);
	                                          ^^^^^^^^^^^^^^^^^^^^^^^^^^^^^^^^^^^^^^^
Discouraged access: The field 'ELValidationPreferences.BINARY_COMPARISON_WITH_ENUM_ALWAYS_SAME' is not API (restriction on classpath entry '/jobs/genie.webtools/webtools-jsf-gerrit_master/workspace/jsf/plugins/org.eclipse.jst.jsf.core/target/classes')
[WARNING] /jobs/genie.webtools/webtools-jsf-gerrit_master/workspace/jsf/tests/org.eclipse.jst.jsf.validation.el.tests/src/org/eclipse/jst/jsf/validation/el/tests/preferences/PrefTestUtil.java:[64] 
	prefs.setSeverity(ELValidationPreferences.BINARY_OP_COMPARISON_OF_ENUMS_INCOMPATIBLE, severity);
	^^^^^^^^^^^^^^^^^^^^^^^^^^^^^^^^^^^^^^^^^^^^^^^^^^^^^^^^^^^^^^^^^^^^^^^^^^^^^^^^^^^^^^^^^^^^^^^
Discouraged access: The method 'ELValidationPreferences.setSeverity(String, Severity)' is not API (restriction on classpath entry '/jobs/genie.webtools/webtools-jsf-gerrit_master/workspace/jsf/plugins/org.eclipse.jst.jsf.core/target/classes')
[WARNING] /jobs/genie.webtools/webtools-jsf-gerrit_master/workspace/jsf/tests/org.eclipse.jst.jsf.validation.el.tests/src/org/eclipse/jst/jsf/validation/el/tests/preferences/PrefTestUtil.java:[64] 
	prefs.setSeverity(ELValidationPreferences.BINARY_OP_COMPARISON_OF_ENUMS_INCOMPATIBLE, severity);
	                  ^^^^^^^^^^^^^^^^^^^^^^^^^^^^^^^^^^^^^^^^^^^^^^^^^^^^^^^^^^^^^^^^^^
Discouraged access: The type 'ELValidationPreferences' is not API (restriction on classpath entry '/jobs/genie.webtools/webtools-jsf-gerrit_master/workspace/jsf/plugins/org.eclipse.jst.jsf.core/target/classes')
[WARNING] /jobs/genie.webtools/webtools-jsf-gerrit_master/workspace/jsf/tests/org.eclipse.jst.jsf.validation.el.tests/src/org/eclipse/jst/jsf/validation/el/tests/preferences/PrefTestUtil.java:[64] 
	prefs.setSeverity(ELValidationPreferences.BINARY_OP_COMPARISON_OF_ENUMS_INCOMPATIBLE, severity);
	                                          ^^^^^^^^^^^^^^^^^^^^^^^^^^^^^^^^^^^^^^^^^^
Discouraged access: The field 'ELValidationPreferences.BINARY_OP_COMPARISON_OF_ENUMS_INCOMPATIBLE' is not API (restriction on classpath entry '/jobs/genie.webtools/webtools-jsf-gerrit_master/workspace/jsf/plugins/org.eclipse.jst.jsf.core/target/classes')
[WARNING] /jobs/genie.webtools/webtools-jsf-gerrit_master/workspace/jsf/tests/org.eclipse.jst.jsf.validation.el.tests/src/org/eclipse/jst/jsf/validation/el/tests/preferences/PrefTestUtil.java:[66] 
	static void assertSetByKey(Severity severity, ELValidationPreferences prefs)
	                           ^^^^^^^^
Discouraged access: The type 'Severity' is not API (restriction on classpath entry '/jobs/genie.webtools/webtools-jsf-gerrit_master/workspace/jsf/plugins/org.eclipse.jst.jsf.core/target/classes')
[WARNING] /jobs/genie.webtools/webtools-jsf-gerrit_master/workspace/jsf/tests/org.eclipse.jst.jsf.validation.el.tests/src/org/eclipse/jst/jsf/validation/el/tests/preferences/PrefTestUtil.java:[66] 
	static void assertSetByKey(Severity severity, ELValidationPreferences prefs)
	                                              ^^^^^^^^^^^^^^^^^^^^^^^
Discouraged access: The type 'ELValidationPreferences' is not API (restriction on classpath entry '/jobs/genie.webtools/webtools-jsf-gerrit_master/workspace/jsf/plugins/org.eclipse.jst.jsf.core/target/classes')
[WARNING] /jobs/genie.webtools/webtools-jsf-gerrit_master/workspace/jsf/tests/org.eclipse.jst.jsf.validation.el.tests/src/org/eclipse/jst/jsf/validation/el/tests/util/CreateTestCaseForJSP.java:[22] 
	import org.eclipse.jst.jsp.core.internal.regions.DOMJSPRegionContexts;
	       ^^^^^^^^^^^^^^^^^^^^^^^^^^^^^^^^^^^^^^^^^^^^^^^^^^^^^^^^^^^^^^
Discouraged access: The type 'DOMJSPRegionContexts' is not API (restriction on classpath entry '/home/hudson/genie.webtools/.jenkins/jobs/webtools-jsf-gerrit_master/workspace/.repository/p2/osgi/bundle/org.eclipse.jst.jsp.core/1.3.0.v201901310548/org.eclipse.jst.jsp.core-1.3.0.v201901310548.jar')
[WARNING] /jobs/genie.webtools/webtools-jsf-gerrit_master/workspace/jsf/tests/org.eclipse.jst.jsf.validation.el.tests/src/org/eclipse/jst/jsf/validation/el/tests/util/CreateTestCaseForJSP.java:[24] 
	import org.eclipse.wst.sse.core.internal.provisional.IStructuredModel;
	       ^^^^^^^^^^^^^^^^^^^^^^^^^^^^^^^^^^^^^^^^^^^^^^^^^^^^^^^^^^^^^^
Discouraged access: The type 'IStructuredModel' is not API (restriction on classpath entry '/home/hudson/genie.webtools/.jenkins/jobs/webtools-jsf-gerrit_master/workspace/.repository/p2/osgi/bundle/org.eclipse.wst.sse.core/1.2.100.v201901310548/org.eclipse.wst.sse.core-1.2.100.v201901310548.jar')
[WARNING] /jobs/genie.webtools/webtools-jsf-gerrit_master/workspace/jsf/tests/org.eclipse.jst.jsf.validation.el.tests/src/org/eclipse/jst/jsf/validation/el/tests/util/CreateTestCaseForJSP.java:[25] 
	import org.eclipse.wst.sse.core.internal.provisional.text.IStructuredDocument;
	       ^^^^^^^^^^^^^^^^^^^^^^^^^^^^^^^^^^^^^^^^^^^^^^^^^^^^^^^^^^^^^^^^^^^^^^
Discouraged access: The type 'IStructuredDocument' is not API (restriction on classpath entry '/home/hudson/genie.webtools/.jenkins/jobs/webtools-jsf-gerrit_master/workspace/.repository/p2/osgi/bundle/org.eclipse.wst.sse.core/1.2.100.v201901310548/org.eclipse.wst.sse.core-1.2.100.v201901310548.jar')
[WARNING] /jobs/genie.webtools/webtools-jsf-gerrit_master/workspace/jsf/tests/org.eclipse.jst.jsf.validation.el.tests/src/org/eclipse/jst/jsf/validation/el/tests/util/CreateTestCaseForJSP.java:[26] 
	import org.eclipse.wst.sse.core.internal.provisional.text.IStructuredDocumentRegion;
	       ^^^^^^^^^^^^^^^^^^^^^^^^^^^^^^^^^^^^^^^^^^^^^^^^^^^^^^^^^^^^^^^^^^^^^^^^^^^^
Discouraged access: The type 'IStructuredDocumentRegion' is not API (restriction on classpath entry '/home/hudson/genie.webtools/.jenkins/jobs/webtools-jsf-gerrit_master/workspace/.repository/p2/osgi/bundle/org.eclipse.wst.sse.core/1.2.100.v201901310548/org.eclipse.wst.sse.core-1.2.100.v201901310548.jar')
[WARNING] /jobs/genie.webtools/webtools-jsf-gerrit_master/workspace/jsf/tests/org.eclipse.jst.jsf.validation.el.tests/src/org/eclipse/jst/jsf/validation/el/tests/util/CreateTestCaseForJSP.java:[27] 
	import org.eclipse.wst.sse.core.internal.provisional.text.ITextRegion;
	       ^^^^^^^^^^^^^^^^^^^^^^^^^^^^^^^^^^^^^^^^^^^^^^^^^^^^^^^^^^^^^^
Discouraged access: The type 'ITextRegion' is not API (restriction on classpath entry '/home/hudson/genie.webtools/.jenkins/jobs/webtools-jsf-gerrit_master/workspace/.repository/p2/osgi/bundle/org.eclipse.wst.sse.core/1.2.100.v201901310548/org.eclipse.wst.sse.core-1.2.100.v201901310548.jar')
[WARNING] /jobs/genie.webtools/webtools-jsf-gerrit_master/workspace/jsf/tests/org.eclipse.jst.jsf.validation.el.tests/src/org/eclipse/jst/jsf/validation/el/tests/util/CreateTestCaseForJSP.java:[28] 
	import org.eclipse.wst.sse.core.internal.provisional.text.ITextRegionCollection;
	       ^^^^^^^^^^^^^^^^^^^^^^^^^^^^^^^^^^^^^^^^^^^^^^^^^^^^^^^^^^^^^^^^^^^^^^^^
Discouraged access: The type 'ITextRegionCollection' is not API (restriction on classpath entry '/home/hudson/genie.webtools/.jenkins/jobs/webtools-jsf-gerrit_master/workspace/.repository/p2/osgi/bundle/org.eclipse.wst.sse.core/1.2.100.v201901310548/org.eclipse.wst.sse.core-1.2.100.v201901310548.jar')
[WARNING] /jobs/genie.webtools/webtools-jsf-gerrit_master/workspace/jsf/tests/org.eclipse.jst.jsf.validation.el.tests/src/org/eclipse/jst/jsf/validation/el/tests/util/CreateTestCaseForJSP.java:[29] 
	import org.eclipse.wst.sse.core.internal.provisional.text.ITextRegionList;
	       ^^^^^^^^^^^^^^^^^^^^^^^^^^^^^^^^^^^^^^^^^^^^^^^^^^^^^^^^^^^^^^^^^^
Discouraged access: The type 'ITextRegionList' is not API (restriction on classpath entry '/home/hudson/genie.webtools/.jenkins/jobs/webtools-jsf-gerrit_master/workspace/.repository/p2/osgi/bundle/org.eclipse.wst.sse.core/1.2.100.v201901310548/org.eclipse.wst.sse.core-1.2.100.v201901310548.jar')
[WARNING] /jobs/genie.webtools/webtools-jsf-gerrit_master/workspace/jsf/tests/org.eclipse.jst.jsf.validation.el.tests/src/org/eclipse/jst/jsf/validation/el/tests/util/CreateTestCaseForJSP.java:[30] 
	import org.eclipse.wst.xml.core.internal.regions.DOMRegionContext;
	       ^^^^^^^^^^^^^^^^^^^^^^^^^^^^^^^^^^^^^^^^^^^^^^^^^^^^^^^^^^
Discouraged access: The type 'DOMRegionContext' is not API (restriction on classpath entry '/home/hudson/genie.webtools/.jenkins/jobs/webtools-jsf-gerrit_master/workspace/.repository/p2/osgi/bundle/org.eclipse.wst.xml.core/1.2.200.v201901071922/org.eclipse.wst.xml.core-1.2.200.v201901071922.jar')
[WARNING] /jobs/genie.webtools/webtools-jsf-gerrit_master/workspace/jsf/tests/org.eclipse.jst.jsf.validation.el.tests/src/org/eclipse/jst/jsf/validation/el/tests/util/CreateTestCaseForJSP.java:[41] 
	private static IStructuredModel model;
	               ^^^^^^^^^^^^^^^^
Discouraged access: The type 'IStructuredModel' is not API (restriction on classpath entry '/home/hudson/genie.webtools/.jenkins/jobs/webtools-jsf-gerrit_master/workspace/.repository/p2/osgi/bundle/org.eclipse.wst.sse.core/1.2.100.v201901310548/org.eclipse.wst.sse.core-1.2.100.v201901310548.jar')
[WARNING] /jobs/genie.webtools/webtools-jsf-gerrit_master/workspace/jsf/tests/org.eclipse.jst.jsf.validation.el.tests/src/org/eclipse/jst/jsf/validation/el/tests/util/CreateTestCaseForJSP.java:[62] 
	model = StructuredModelManager.getModelManager().getModelForRead(file);
	        ^^^^^^^^^^^^^^^^^^^^^^^^^^^^^^^^^^^^^^^^^^^^^^^^^^^^^^^^^^^^^^
Discouraged access: The method 'IModelManager.getModelForRead(IFile)' is not API (restriction on classpath entry '/home/hudson/genie.webtools/.jenkins/jobs/webtools-jsf-gerrit_master/workspace/.repository/p2/osgi/bundle/org.eclipse.wst.sse.core/1.2.100.v201901310548/org.eclipse.wst.sse.core-1.2.100.v201901310548.jar')
[WARNING] /jobs/genie.webtools/webtools-jsf-gerrit_master/workspace/jsf/tests/org.eclipse.jst.jsf.validation.el.tests/src/org/eclipse/jst/jsf/validation/el/tests/util/CreateTestCaseForJSP.java:[70] 
	model.releaseFromRead();
	^^^^^^^^^^^^^^^^^^^^^^^
Discouraged access: The method 'IStructuredModel.releaseFromRead()' is not API (restriction on classpath entry '/home/hudson/genie.webtools/.jenkins/jobs/webtools-jsf-gerrit_master/workspace/.repository/p2/osgi/bundle/org.eclipse.wst.sse.core/1.2.100.v201901310548/org.eclipse.wst.sse.core-1.2.100.v201901310548.jar')
[WARNING] /jobs/genie.webtools/webtools-jsf-gerrit_master/workspace/jsf/tests/org.eclipse.jst.jsf.validation.el.tests/src/org/eclipse/jst/jsf/validation/el/tests/util/CreateTestCaseForJSP.java:[89] 
	public void handleRegion(ITextRegionCollection parentRegion, ITextRegion elRegion) {
	                         ^^^^^^^^^^^^^^^^^^^^^
Discouraged access: The type 'ITextRegionCollection' is not API (restriction on classpath entry '/home/hudson/genie.webtools/.jenkins/jobs/webtools-jsf-gerrit_master/workspace/.repository/p2/osgi/bundle/org.eclipse.wst.sse.core/1.2.100.v201901310548/org.eclipse.wst.sse.core-1.2.100.v201901310548.jar')
[WARNING] /jobs/genie.webtools/webtools-jsf-gerrit_master/workspace/jsf/tests/org.eclipse.jst.jsf.validation.el.tests/src/org/eclipse/jst/jsf/validation/el/tests/util/CreateTestCaseForJSP.java:[89] 
	public void handleRegion(ITextRegionCollection parentRegion, ITextRegion elRegion) {
	                                                             ^^^^^^^^^^^
Discouraged access: The type 'ITextRegion' is not API (restriction on classpath entry '/home/hudson/genie.webtools/.jenkins/jobs/webtools-jsf-gerrit_master/workspace/.repository/p2/osgi/bundle/org.eclipse.wst.sse.core/1.2.100.v201901310548/org.eclipse.wst.sse.core-1.2.100.v201901310548.jar')
[WARNING] /jobs/genie.webtools/webtools-jsf-gerrit_master/workspace/jsf/tests/org.eclipse.jst.jsf.validation.el.tests/src/org/eclipse/jst/jsf/validation/el/tests/util/CreateTestCaseForJSP.java:[91] 
	parentRegion.getStartOffset(elRegion);
	^^^^^^^^^^^^^^^^^^^^^^^^^^^^^^^^^^^^^
Discouraged access: The method 'ITextRegionCollection.getStartOffset(ITextRegion)' is not API (restriction on classpath entry '/home/hudson/genie.webtools/.jenkins/jobs/webtools-jsf-gerrit_master/workspace/.repository/p2/osgi/bundle/org.eclipse.wst.sse.core/1.2.100.v201901310548/org.eclipse.wst.sse.core-1.2.100.v201901310548.jar')
[WARNING] /jobs/genie.webtools/webtools-jsf-gerrit_master/workspace/jsf/tests/org.eclipse.jst.jsf.validation.el.tests/src/org/eclipse/jst/jsf/validation/el/tests/util/CreateTestCaseForJSP.java:[93] 
	final String elTextStr = "\""+parentRegion.getText(elRegion)+ "\"";
	                              ^^^^^^^^^^^^^^^^^^^^^^^^^^^^^^
Discouraged access: The method 'ITextRegionCollection.getText(ITextRegion)' is not API (restriction on classpath entry '/home/hudson/genie.webtools/.jenkins/jobs/webtools-jsf-gerrit_master/workspace/.repository/p2/osgi/bundle/org.eclipse.wst.sse.core/1.2.100.v201901310548/org.eclipse.wst.sse.core-1.2.100.v201901310548.jar')
[WARNING] /jobs/genie.webtools/webtools-jsf-gerrit_master/workspace/jsf/tests/org.eclipse.jst.jsf.validation.el.tests/src/org/eclipse/jst/jsf/validation/el/tests/util/CreateTestCaseForJSP.java:[98] 
	processJSP(model.getStructuredDocument(), handler);
	           ^^^^^^^^^^^^^^^^^^^^^^^^^^^^^
Discouraged access: The method 'IStructuredModel.getStructuredDocument()' is not API (restriction on classpath entry '/home/hudson/genie.webtools/.jenkins/jobs/webtools-jsf-gerrit_master/workspace/.repository/p2/osgi/bundle/org.eclipse.wst.sse.core/1.2.100.v201901310548/org.eclipse.wst.sse.core-1.2.100.v201901310548.jar')
[WARNING] /jobs/genie.webtools/webtools-jsf-gerrit_master/workspace/jsf/tests/org.eclipse.jst.jsf.validation.el.tests/src/org/eclipse/jst/jsf/validation/el/tests/util/CreateTestCaseForJSP.java:[108] 
	public static void processJSP(final IStructuredDocument document, final ELRegionHandler handler)
	                                    ^^^^^^^^^^^^^^^^^^^
Discouraged access: The type 'IStructuredDocument' is not API (restriction on classpath entry '/home/hudson/genie.webtools/.jenkins/jobs/webtools-jsf-gerrit_master/workspace/.repository/p2/osgi/bundle/org.eclipse.wst.sse.core/1.2.100.v201901310548/org.eclipse.wst.sse.core-1.2.100.v201901310548.jar')
[WARNING] /jobs/genie.webtools/webtools-jsf-gerrit_master/workspace/jsf/tests/org.eclipse.jst.jsf.validation.el.tests/src/org/eclipse/jst/jsf/validation/el/tests/util/CreateTestCaseForJSP.java:[110] 
	IStructuredDocumentRegion curNode = document.getFirstStructuredDocumentRegion();
	^^^^^^^^^^^^^^^^^^^^^^^^^
Discouraged access: The type 'IStructuredDocumentRegion' is not API (restriction on classpath entry '/home/hudson/genie.webtools/.jenkins/jobs/webtools-jsf-gerrit_master/workspace/.repository/p2/osgi/bundle/org.eclipse.wst.sse.core/1.2.100.v201901310548/org.eclipse.wst.sse.core-1.2.100.v201901310548.jar')
[WARNING] /jobs/genie.webtools/webtools-jsf-gerrit_master/workspace/jsf/tests/org.eclipse.jst.jsf.validation.el.tests/src/org/eclipse/jst/jsf/validation/el/tests/util/CreateTestCaseForJSP.java:[110] 
	IStructuredDocumentRegion curNode = document.getFirstStructuredDocumentRegion();
	                                    ^^^^^^^^^^^^^^^^^^^^^^^^^^^^^^^^^^^^^^^^^^^
Discouraged access: The method 'IStructuredDocument.getFirstStructuredDocumentRegion()' is not API (restriction on classpath entry '/home/hudson/genie.webtools/.jenkins/jobs/webtools-jsf-gerrit_master/workspace/.repository/p2/osgi/bundle/org.eclipse.wst.sse.core/1.2.100.v201901310548/org.eclipse.wst.sse.core-1.2.100.v201901310548.jar')
[WARNING] /jobs/genie.webtools/webtools-jsf-gerrit_master/workspace/jsf/tests/org.eclipse.jst.jsf.validation.el.tests/src/org/eclipse/jst/jsf/validation/el/tests/util/CreateTestCaseForJSP.java:[113] 
	if (curNode.getFirstRegion().getType() == DOMRegionContext.XML_TAG_OPEN )
	    ^^^^^^^^^^^^^^^^^^^^^^^^
Discouraged access: The method 'ITextRegionCollection.getFirstRegion()' is not API (restriction on classpath entry '/home/hudson/genie.webtools/.jenkins/jobs/webtools-jsf-gerrit_master/workspace/.repository/p2/osgi/bundle/org.eclipse.wst.sse.core/1.2.100.v201901310548/org.eclipse.wst.sse.core-1.2.100.v201901310548.jar')
[WARNING] /jobs/genie.webtools/webtools-jsf-gerrit_master/workspace/jsf/tests/org.eclipse.jst.jsf.validation.el.tests/src/org/eclipse/jst/jsf/validation/el/tests/util/CreateTestCaseForJSP.java:[113] 
	if (curNode.getFirstRegion().getType() == DOMRegionContext.XML_TAG_OPEN )
	    ^^^^^^^^^^^^^^^^^^^^^^^^^^^^^^^^^^
Discouraged access: The method 'ITextRegion.getType()' is not API (restriction on classpath entry '/home/hudson/genie.webtools/.jenkins/jobs/webtools-jsf-gerrit_master/workspace/.repository/p2/osgi/bundle/org.eclipse.wst.sse.core/1.2.100.v201901310548/org.eclipse.wst.sse.core-1.2.100.v201901310548.jar')
[WARNING] /jobs/genie.webtools/webtools-jsf-gerrit_master/workspace/jsf/tests/org.eclipse.jst.jsf.validation.el.tests/src/org/eclipse/jst/jsf/validation/el/tests/util/CreateTestCaseForJSP.java:[113] 
	if (curNode.getFirstRegion().getType() == DOMRegionContext.XML_TAG_OPEN )
	                                          ^^^^^^^^^^^^^^^^^^^^^^^^^^^^^
Discouraged access: The type 'DOMRegionContext' is not API (restriction on classpath entry '/home/hudson/genie.webtools/.jenkins/jobs/webtools-jsf-gerrit_master/workspace/.repository/p2/osgi/bundle/org.eclipse.wst.xml.core/1.2.200.v201901071922/org.eclipse.wst.xml.core-1.2.200.v201901071922.jar')
[WARNING] /jobs/genie.webtools/webtools-jsf-gerrit_master/workspace/jsf/tests/org.eclipse.jst.jsf.validation.el.tests/src/org/eclipse/jst/jsf/validation/el/tests/util/CreateTestCaseForJSP.java:[113] 
	if (curNode.getFirstRegion().getType() == DOMRegionContext.XML_TAG_OPEN )
	                                                           ^^^^^^^^^^^^
Discouraged access: The field 'DOMRegionContext.XML_TAG_OPEN' is not API (restriction on classpath entry '/home/hudson/genie.webtools/.jenkins/jobs/webtools-jsf-gerrit_master/workspace/.repository/p2/osgi/bundle/org.eclipse.wst.xml.core/1.2.200.v201901071922/org.eclipse.wst.xml.core-1.2.200.v201901071922.jar')
[WARNING] /jobs/genie.webtools/webtools-jsf-gerrit_master/workspace/jsf/tests/org.eclipse.jst.jsf.validation.el.tests/src/org/eclipse/jst/jsf/validation/el/tests/util/CreateTestCaseForJSP.java:[115] 
	final Iterator<?> regions = curNode.getRegions().iterator();
	                            ^^^^^^^^^^^^^^^^^^^^
Discouraged access: The method 'ITextRegionCollection.getRegions()' is not API (restriction on classpath entry '/home/hudson/genie.webtools/.jenkins/jobs/webtools-jsf-gerrit_master/workspace/.repository/p2/osgi/bundle/org.eclipse.wst.sse.core/1.2.100.v201901310548/org.eclipse.wst.sse.core-1.2.100.v201901310548.jar')
[WARNING] /jobs/genie.webtools/webtools-jsf-gerrit_master/workspace/jsf/tests/org.eclipse.jst.jsf.validation.el.tests/src/org/eclipse/jst/jsf/validation/el/tests/util/CreateTestCaseForJSP.java:[115] 
	final Iterator<?> regions = curNode.getRegions().iterator();
	                            ^^^^^^^^^^^^^^^^^^^^^^^^^^^^^^^
Discouraged access: The method 'ITextRegionList.iterator()' is not API (restriction on classpath entry '/home/hudson/genie.webtools/.jenkins/jobs/webtools-jsf-gerrit_master/workspace/.repository/p2/osgi/bundle/org.eclipse.wst.sse.core/1.2.100.v201901310548/org.eclipse.wst.sse.core-1.2.100.v201901310548.jar')
[WARNING] /jobs/genie.webtools/webtools-jsf-gerrit_master/workspace/jsf/tests/org.eclipse.jst.jsf.validation.el.tests/src/org/eclipse/jst/jsf/validation/el/tests/util/CreateTestCaseForJSP.java:[116] 
	ITextRegion region = null;
	^^^^^^^^^^^
Discouraged access: The type 'ITextRegion' is not API (restriction on classpath entry '/home/hudson/genie.webtools/.jenkins/jobs/webtools-jsf-gerrit_master/workspace/.repository/p2/osgi/bundle/org.eclipse.wst.sse.core/1.2.100.v201901310548/org.eclipse.wst.sse.core-1.2.100.v201901310548.jar')
[WARNING] /jobs/genie.webtools/webtools-jsf-gerrit_master/workspace/jsf/tests/org.eclipse.jst.jsf.validation.el.tests/src/org/eclipse/jst/jsf/validation/el/tests/util/CreateTestCaseForJSP.java:[120] 
	region = (ITextRegion) regions.next();
	          ^^^^^^^^^^^
Discouraged access: The type 'ITextRegion' is not API (restriction on classpath entry '/home/hudson/genie.webtools/.jenkins/jobs/webtools-jsf-gerrit_master/workspace/.repository/p2/osgi/bundle/org.eclipse.wst.sse.core/1.2.100.v201901310548/org.eclipse.wst.sse.core-1.2.100.v201901310548.jar')
[WARNING] /jobs/genie.webtools/webtools-jsf-gerrit_master/workspace/jsf/tests/org.eclipse.jst.jsf.validation.el.tests/src/org/eclipse/jst/jsf/validation/el/tests/util/CreateTestCaseForJSP.java:[122] 
	if (region instanceof ITextRegionCollection
	                      ^^^^^^^^^^^^^^^^^^^^^
Discouraged access: The type 'ITextRegionCollection' is not API (restriction on classpath entry '/home/hudson/genie.webtools/.jenkins/jobs/webtools-jsf-gerrit_master/workspace/.repository/p2/osgi/bundle/org.eclipse.wst.sse.core/1.2.100.v201901310548/org.eclipse.wst.sse.core-1.2.100.v201901310548.jar')
[WARNING] /jobs/genie.webtools/webtools-jsf-gerrit_master/workspace/jsf/tests/org.eclipse.jst.jsf.validation.el.tests/src/org/eclipse/jst/jsf/validation/el/tests/util/CreateTestCaseForJSP.java:[123] 
	&& region.getType() == DOMRegionContext.XML_TAG_ATTRIBUTE_VALUE)
	   ^^^^^^^^^^^^^^^^
Discouraged access: The method 'ITextRegion.getType()' is not API (restriction on classpath entry '/home/hudson/genie.webtools/.jenkins/jobs/webtools-jsf-gerrit_master/workspace/.repository/p2/osgi/bundle/org.eclipse.wst.sse.core/1.2.100.v201901310548/org.eclipse.wst.sse.core-1.2.100.v201901310548.jar')
[WARNING] /jobs/genie.webtools/webtools-jsf-gerrit_master/workspace/jsf/tests/org.eclipse.jst.jsf.validation.el.tests/src/org/eclipse/jst/jsf/validation/el/tests/util/CreateTestCaseForJSP.java:[123] 
	&& region.getType() == DOMRegionContext.XML_TAG_ATTRIBUTE_VALUE)
	                       ^^^^^^^^^^^^^^^^^^^^^^^^^^^^^^^^^^^^^^^^
Discouraged access: The type 'DOMRegionContext' is not API (restriction on classpath entry '/home/hudson/genie.webtools/.jenkins/jobs/webtools-jsf-gerrit_master/workspace/.repository/p2/osgi/bundle/org.eclipse.wst.xml.core/1.2.200.v201901071922/org.eclipse.wst.xml.core-1.2.200.v201901071922.jar')
[WARNING] /jobs/genie.webtools/webtools-jsf-gerrit_master/workspace/jsf/tests/org.eclipse.jst.jsf.validation.el.tests/src/org/eclipse/jst/jsf/validation/el/tests/util/CreateTestCaseForJSP.java:[123] 
	&& region.getType() == DOMRegionContext.XML_TAG_ATTRIBUTE_VALUE)
	                                        ^^^^^^^^^^^^^^^^^^^^^^^
Discouraged access: The field 'DOMRegionContext.XML_TAG_ATTRIBUTE_VALUE' is not API (restriction on classpath entry '/home/hudson/genie.webtools/.jenkins/jobs/webtools-jsf-gerrit_master/workspace/.repository/p2/osgi/bundle/org.eclipse.wst.xml.core/1.2.200.v201901071922/org.eclipse.wst.xml.core-1.2.200.v201901071922.jar')
[WARNING] /jobs/genie.webtools/webtools-jsf-gerrit_master/workspace/jsf/tests/org.eclipse.jst.jsf.validation.el.tests/src/org/eclipse/jst/jsf/validation/el/tests/util/CreateTestCaseForJSP.java:[125] 
	final ITextRegionCollection parentRegion = (ITextRegionCollection) region;
	      ^^^^^^^^^^^^^^^^^^^^^
Discouraged access: The type 'ITextRegionCollection' is not API (restriction on classpath entry '/home/hudson/genie.webtools/.jenkins/jobs/webtools-jsf-gerrit_master/workspace/.repository/p2/osgi/bundle/org.eclipse.wst.sse.core/1.2.100.v201901310548/org.eclipse.wst.sse.core-1.2.100.v201901310548.jar')
[WARNING] /jobs/genie.webtools/webtools-jsf-gerrit_master/workspace/jsf/tests/org.eclipse.jst.jsf.validation.el.tests/src/org/eclipse/jst/jsf/validation/el/tests/util/CreateTestCaseForJSP.java:[125] 
	final ITextRegionCollection parentRegion = (ITextRegionCollection) region;
	                                            ^^^^^^^^^^^^^^^^^^^^^
Discouraged access: The type 'ITextRegionCollection' is not API (restriction on classpath entry '/home/hudson/genie.webtools/.jenkins/jobs/webtools-jsf-gerrit_master/workspace/.repository/p2/osgi/bundle/org.eclipse.wst.sse.core/1.2.100.v201901310548/org.eclipse.wst.sse.core-1.2.100.v201901310548.jar')
[WARNING] /jobs/genie.webtools/webtools-jsf-gerrit_master/workspace/jsf/tests/org.eclipse.jst.jsf.validation.el.tests/src/org/eclipse/jst/jsf/validation/el/tests/util/CreateTestCaseForJSP.java:[126] 
	final ITextRegionList  regionList = parentRegion.getRegions();
	      ^^^^^^^^^^^^^^^
Discouraged access: The type 'ITextRegionList' is not API (restriction on classpath entry '/home/hudson/genie.webtools/.jenkins/jobs/webtools-jsf-gerrit_master/workspace/.repository/p2/osgi/bundle/org.eclipse.wst.sse.core/1.2.100.v201901310548/org.eclipse.wst.sse.core-1.2.100.v201901310548.jar')
[WARNING] /jobs/genie.webtools/webtools-jsf-gerrit_master/workspace/jsf/tests/org.eclipse.jst.jsf.validation.el.tests/src/org/eclipse/jst/jsf/validation/el/tests/util/CreateTestCaseForJSP.java:[126] 
	final ITextRegionList  regionList = parentRegion.getRegions();
	                                    ^^^^^^^^^^^^^^^^^^^^^^^^^
Discouraged access: The method 'ITextRegionCollection.getRegions()' is not API (restriction on classpath entry '/home/hudson/genie.webtools/.jenkins/jobs/webtools-jsf-gerrit_master/workspace/.repository/p2/osgi/bundle/org.eclipse.wst.sse.core/1.2.100.v201901310548/org.eclipse.wst.sse.core-1.2.100.v201901310548.jar')
[WARNING] /jobs/genie.webtools/webtools-jsf-gerrit_master/workspace/jsf/tests/org.eclipse.jst.jsf.validation.el.tests/src/org/eclipse/jst/jsf/validation/el/tests/util/CreateTestCaseForJSP.java:[127] 
	if (regionList.size() >= 4)
	    ^^^^^^^^^^^^^^^^^
Discouraged access: The method 'ITextRegionList.size()' is not API (restriction on classpath entry '/home/hudson/genie.webtools/.jenkins/jobs/webtools-jsf-gerrit_master/workspace/.repository/p2/osgi/bundle/org.eclipse.wst.sse.core/1.2.100.v201901310548/org.eclipse.wst.sse.core-1.2.100.v201901310548.jar')
[WARNING] /jobs/genie.webtools/webtools-jsf-gerrit_master/workspace/jsf/tests/org.eclipse.jst.jsf.validation.el.tests/src/org/eclipse/jst/jsf/validation/el/tests/util/CreateTestCaseForJSP.java:[129] 
	final ITextRegion  openQuote = regionList.get(0);
	      ^^^^^^^^^^^
Discouraged access: The type 'ITextRegion' is not API (restriction on classpath entry '/home/hudson/genie.webtools/.jenkins/jobs/webtools-jsf-gerrit_master/workspace/.repository/p2/osgi/bundle/org.eclipse.wst.sse.core/1.2.100.v201901310548/org.eclipse.wst.sse.core-1.2.100.v201901310548.jar')
[WARNING] /jobs/genie.webtools/webtools-jsf-gerrit_master/workspace/jsf/tests/org.eclipse.jst.jsf.validation.el.tests/src/org/eclipse/jst/jsf/validation/el/tests/util/CreateTestCaseForJSP.java:[129] 
	final ITextRegion  openQuote = regionList.get(0);
	                               ^^^^^^^^^^^^^^^^^
Discouraged access: The method 'ITextRegionList.get(int)' is not API (restriction on classpath entry '/home/hudson/genie.webtools/.jenkins/jobs/webtools-jsf-gerrit_master/workspace/.repository/p2/osgi/bundle/org.eclipse.wst.sse.core/1.2.100.v201901310548/org.eclipse.wst.sse.core-1.2.100.v201901310548.jar')
[WARNING] /jobs/genie.webtools/webtools-jsf-gerrit_master/workspace/jsf/tests/org.eclipse.jst.jsf.validation.el.tests/src/org/eclipse/jst/jsf/validation/el/tests/util/CreateTestCaseForJSP.java:[130] 
	final ITextRegion  openVBLQuote = regionList.get(1);
	      ^^^^^^^^^^^
Discouraged access: The type 'ITextRegion' is not API (restriction on classpath entry '/home/hudson/genie.webtools/.jenkins/jobs/webtools-jsf-gerrit_master/workspace/.repository/p2/osgi/bundle/org.eclipse.wst.sse.core/1.2.100.v201901310548/org.eclipse.wst.sse.core-1.2.100.v201901310548.jar')
[WARNING] /jobs/genie.webtools/webtools-jsf-gerrit_master/workspace/jsf/tests/org.eclipse.jst.jsf.validation.el.tests/src/org/eclipse/jst/jsf/validation/el/tests/util/CreateTestCaseForJSP.java:[130] 
	final ITextRegion  openVBLQuote = regionList.get(1);
	                                  ^^^^^^^^^^^^^^^^^
Discouraged access: The method 'ITextRegionList.get(int)' is not API (restriction on classpath entry '/home/hudson/genie.webtools/.jenkins/jobs/webtools-jsf-gerrit_master/workspace/.repository/p2/osgi/bundle/org.eclipse.wst.sse.core/1.2.100.v201901310548/org.eclipse.wst.sse.core-1.2.100.v201901310548.jar')
[WARNING] /jobs/genie.webtools/webtools-jsf-gerrit_master/workspace/jsf/tests/org.eclipse.jst.jsf.validation.el.tests/src/org/eclipse/jst/jsf/validation/el/tests/util/CreateTestCaseForJSP.java:[132] 
	if (    (openQuote.getType() == DOMJSPRegionContexts.XML_TAG_ATTRIBUTE_VALUE_DQUOTE
	         ^^^^^^^^^^^^^^^^^^^
Discouraged access: The method 'ITextRegion.getType()' is not API (restriction on classpath entry '/home/hudson/genie.webtools/.jenkins/jobs/webtools-jsf-gerrit_master/workspace/.repository/p2/osgi/bundle/org.eclipse.wst.sse.core/1.2.100.v201901310548/org.eclipse.wst.sse.core-1.2.100.v201901310548.jar')
[WARNING] /jobs/genie.webtools/webtools-jsf-gerrit_master/workspace/jsf/tests/org.eclipse.jst.jsf.validation.el.tests/src/org/eclipse/jst/jsf/validation/el/tests/util/CreateTestCaseForJSP.java:[132] 
	if (    (openQuote.getType() == DOMJSPRegionContexts.XML_TAG_ATTRIBUTE_VALUE_DQUOTE
	                                ^^^^^^^^^^^^^^^^^^^^^^^^^^^^^^^^^^^^^^^^^^^^^^^^^^^
Discouraged access: The type 'DOMJSPRegionContexts' is not API (restriction on classpath entry '/home/hudson/genie.webtools/.jenkins/jobs/webtools-jsf-gerrit_master/workspace/.repository/p2/osgi/bundle/org.eclipse.jst.jsp.core/1.3.0.v201901310548/org.eclipse.jst.jsp.core-1.3.0.v201901310548.jar')
[WARNING] /jobs/genie.webtools/webtools-jsf-gerrit_master/workspace/jsf/tests/org.eclipse.jst.jsf.validation.el.tests/src/org/eclipse/jst/jsf/validation/el/tests/util/CreateTestCaseForJSP.java:[132] 
	if (    (openQuote.getType() == DOMJSPRegionContexts.XML_TAG_ATTRIBUTE_VALUE_DQUOTE
	                                                     ^^^^^^^^^^^^^^^^^^^^^^^^^^^^^^
Discouraged access: The field 'DOMJSPRegionContexts.XML_TAG_ATTRIBUTE_VALUE_DQUOTE' is not API (restriction on classpath entry '/home/hudson/genie.webtools/.jenkins/jobs/webtools-jsf-gerrit_master/workspace/.repository/p2/osgi/bundle/org.eclipse.jst.jsp.core/1.3.0.v201901310548/org.eclipse.jst.jsp.core-1.3.0.v201901310548.jar')
[WARNING] /jobs/genie.webtools/webtools-jsf-gerrit_master/workspace/jsf/tests/org.eclipse.jst.jsf.validation.el.tests/src/org/eclipse/jst/jsf/validation/el/tests/util/CreateTestCaseForJSP.java:[133] 
	|| openQuote.getType() == DOMJSPRegionContexts.XML_TAG_ATTRIBUTE_VALUE_SQUOTE)
	   ^^^^^^^^^^^^^^^^^^^
Discouraged access: The method 'ITextRegion.getType()' is not API (restriction on classpath entry '/home/hudson/genie.webtools/.jenkins/jobs/webtools-jsf-gerrit_master/workspace/.repository/p2/osgi/bundle/org.eclipse.wst.sse.core/1.2.100.v201901310548/org.eclipse.wst.sse.core-1.2.100.v201901310548.jar')
[WARNING] /jobs/genie.webtools/webtools-jsf-gerrit_master/workspace/jsf/tests/org.eclipse.jst.jsf.validation.el.tests/src/org/eclipse/jst/jsf/validation/el/tests/util/CreateTestCaseForJSP.java:[133] 
	|| openQuote.getType() == DOMJSPRegionContexts.XML_TAG_ATTRIBUTE_VALUE_SQUOTE)
	                          ^^^^^^^^^^^^^^^^^^^^^^^^^^^^^^^^^^^^^^^^^^^^^^^^^^^
Discouraged access: The type 'DOMJSPRegionContexts' is not API (restriction on classpath entry '/home/hudson/genie.webtools/.jenkins/jobs/webtools-jsf-gerrit_master/workspace/.repository/p2/osgi/bundle/org.eclipse.jst.jsp.core/1.3.0.v201901310548/org.eclipse.jst.jsp.core-1.3.0.v201901310548.jar')
[WARNING] /jobs/genie.webtools/webtools-jsf-gerrit_master/workspace/jsf/tests/org.eclipse.jst.jsf.validation.el.tests/src/org/eclipse/jst/jsf/validation/el/tests/util/CreateTestCaseForJSP.java:[133] 
	|| openQuote.getType() == DOMJSPRegionContexts.XML_TAG_ATTRIBUTE_VALUE_SQUOTE)
	                                               ^^^^^^^^^^^^^^^^^^^^^^^^^^^^^^
Discouraged access: The field 'DOMJSPRegionContexts.XML_TAG_ATTRIBUTE_VALUE_SQUOTE' is not API (restriction on classpath entry '/home/hudson/genie.webtools/.jenkins/jobs/webtools-jsf-gerrit_master/workspace/.repository/p2/osgi/bundle/org.eclipse.jst.jsp.core/1.3.0.v201901310548/org.eclipse.jst.jsp.core-1.3.0.v201901310548.jar')
[WARNING] /jobs/genie.webtools/webtools-jsf-gerrit_master/workspace/jsf/tests/org.eclipse.jst.jsf.validation.el.tests/src/org/eclipse/jst/jsf/validation/el/tests/util/CreateTestCaseForJSP.java:[134] 
	&& (openVBLQuote.getType() == DOMJSPRegionContexts.JSP_VBL_OPEN))
	    ^^^^^^^^^^^^^^^^^^^^^^
Discouraged access: The method 'ITextRegion.getType()' is not API (restriction on classpath entry '/home/hudson/genie.webtools/.jenkins/jobs/webtools-jsf-gerrit_master/workspace/.repository/p2/osgi/bundle/org.eclipse.wst.sse.core/1.2.100.v201901310548/org.eclipse.wst.sse.core-1.2.100.v201901310548.jar')
[WARNING] /jobs/genie.webtools/webtools-jsf-gerrit_master/workspace/jsf/tests/org.eclipse.jst.jsf.validation.el.tests/src/org/eclipse/jst/jsf/validation/el/tests/util/CreateTestCaseForJSP.java:[134] 
	&& (openVBLQuote.getType() == DOMJSPRegionContexts.JSP_VBL_OPEN))
	                              ^^^^^^^^^^^^^^^^^^^^^^^^^^^^^^^^^
Discouraged access: The type 'DOMJSPRegionContexts' is not API (restriction on classpath entry '/home/hudson/genie.webtools/.jenkins/jobs/webtools-jsf-gerrit_master/workspace/.repository/p2/osgi/bundle/org.eclipse.jst.jsp.core/1.3.0.v201901310548/org.eclipse.jst.jsp.core-1.3.0.v201901310548.jar')
[WARNING] /jobs/genie.webtools/webtools-jsf-gerrit_master/workspace/jsf/tests/org.eclipse.jst.jsf.validation.el.tests/src/org/eclipse/jst/jsf/validation/el/tests/util/CreateTestCaseForJSP.java:[134] 
	&& (openVBLQuote.getType() == DOMJSPRegionContexts.JSP_VBL_OPEN))
	                                                   ^^^^^^^^^^^^
Discouraged access: The field 'DOMJSPRegionContexts.JSP_VBL_OPEN' is not API (restriction on classpath entry '/home/hudson/genie.webtools/.jenkins/jobs/webtools-jsf-gerrit_master/workspace/.repository/p2/osgi/bundle/org.eclipse.jst.jsp.core/1.3.0.v201901310548/org.eclipse.jst.jsp.core-1.3.0.v201901310548.jar')
[WARNING] /jobs/genie.webtools/webtools-jsf-gerrit_master/workspace/jsf/tests/org.eclipse.jst.jsf.validation.el.tests/src/org/eclipse/jst/jsf/validation/el/tests/util/CreateTestCaseForJSP.java:[138] 
	final ITextRegion content = regionList.get(2);
	      ^^^^^^^^^^^
Discouraged access: The type 'ITextRegion' is not API (restriction on classpath entry '/home/hudson/genie.webtools/.jenkins/jobs/webtools-jsf-gerrit_master/workspace/.repository/p2/osgi/bundle/org.eclipse.wst.sse.core/1.2.100.v201901310548/org.eclipse.wst.sse.core-1.2.100.v201901310548.jar')
[WARNING] /jobs/genie.webtools/webtools-jsf-gerrit_master/workspace/jsf/tests/org.eclipse.jst.jsf.validation.el.tests/src/org/eclipse/jst/jsf/validation/el/tests/util/CreateTestCaseForJSP.java:[138] 
	final ITextRegion content = regionList.get(2);
	                            ^^^^^^^^^^^^^^^^^
Discouraged access: The method 'ITextRegionList.get(int)' is not API (restriction on classpath entry '/home/hudson/genie.webtools/.jenkins/jobs/webtools-jsf-gerrit_master/workspace/.repository/p2/osgi/bundle/org.eclipse.wst.sse.core/1.2.100.v201901310548/org.eclipse.wst.sse.core-1.2.100.v201901310548.jar')
[WARNING] /jobs/genie.webtools/webtools-jsf-gerrit_master/workspace/jsf/tests/org.eclipse.jst.jsf.validation.el.tests/src/org/eclipse/jst/jsf/validation/el/tests/util/CreateTestCaseForJSP.java:[139] 
	if (content.getType() == DOMJSPRegionContexts.JSP_VBL_CONTENT)
	    ^^^^^^^^^^^^^^^^^
Discouraged access: The method 'ITextRegion.getType()' is not API (restriction on classpath entry '/home/hudson/genie.webtools/.jenkins/jobs/webtools-jsf-gerrit_master/workspace/.repository/p2/osgi/bundle/org.eclipse.wst.sse.core/1.2.100.v201901310548/org.eclipse.wst.sse.core-1.2.100.v201901310548.jar')
[WARNING] /jobs/genie.webtools/webtools-jsf-gerrit_master/workspace/jsf/tests/org.eclipse.jst.jsf.validation.el.tests/src/org/eclipse/jst/jsf/validation/el/tests/util/CreateTestCaseForJSP.java:[139] 
	if (content.getType() == DOMJSPRegionContexts.JSP_VBL_CONTENT)
	                         ^^^^^^^^^^^^^^^^^^^^^^^^^^^^^^^^^^^^
Discouraged access: The type 'DOMJSPRegionContexts' is not API (restriction on classpath entry '/home/hudson/genie.webtools/.jenkins/jobs/webtools-jsf-gerrit_master/workspace/.repository/p2/osgi/bundle/org.eclipse.jst.jsp.core/1.3.0.v201901310548/org.eclipse.jst.jsp.core-1.3.0.v201901310548.jar')
[WARNING] /jobs/genie.webtools/webtools-jsf-gerrit_master/workspace/jsf/tests/org.eclipse.jst.jsf.validation.el.tests/src/org/eclipse/jst/jsf/validation/el/tests/util/CreateTestCaseForJSP.java:[139] 
	if (content.getType() == DOMJSPRegionContexts.JSP_VBL_CONTENT)
	                                              ^^^^^^^^^^^^^^^
Discouraged access: The field 'DOMJSPRegionContexts.JSP_VBL_CONTENT' is not API (restriction on classpath entry '/home/hudson/genie.webtools/.jenkins/jobs/webtools-jsf-gerrit_master/workspace/.repository/p2/osgi/bundle/org.eclipse.jst.jsp.core/1.3.0.v201901310548/org.eclipse.jst.jsp.core-1.3.0.v201901310548.jar')
[WARNING] /jobs/genie.webtools/webtools-jsf-gerrit_master/workspace/jsf/tests/org.eclipse.jst.jsf.validation.el.tests/src/org/eclipse/jst/jsf/validation/el/tests/util/CreateTestCaseForJSP.java:[148] 
	curNode = curNode.getNext();
	          ^^^^^^^^^^^^^^^^^
Discouraged access: The method 'IStructuredDocumentRegion.getNext()' is not API (restriction on classpath entry '/home/hudson/genie.webtools/.jenkins/jobs/webtools-jsf-gerrit_master/workspace/.repository/p2/osgi/bundle/org.eclipse.wst.sse.core/1.2.100.v201901310548/org.eclipse.wst.sse.core-1.2.100.v201901310548.jar')
[WARNING] /jobs/genie.webtools/webtools-jsf-gerrit_master/workspace/jsf/tests/org.eclipse.jst.jsf.validation.el.tests/src/org/eclipse/jst/jsf/validation/el/tests/util/CreateTestCaseForJSP.java:[165] 
	public void handleRegion(ITextRegionCollection parentRegion, ITextRegion elRegion);
	                         ^^^^^^^^^^^^^^^^^^^^^
Discouraged access: The type 'ITextRegionCollection' is not API (restriction on classpath entry '/home/hudson/genie.webtools/.jenkins/jobs/webtools-jsf-gerrit_master/workspace/.repository/p2/osgi/bundle/org.eclipse.wst.sse.core/1.2.100.v201901310548/org.eclipse.wst.sse.core-1.2.100.v201901310548.jar')
[WARNING] /jobs/genie.webtools/webtools-jsf-gerrit_master/workspace/jsf/tests/org.eclipse.jst.jsf.validation.el.tests/src/org/eclipse/jst/jsf/validation/el/tests/util/CreateTestCaseForJSP.java:[165] 
	public void handleRegion(ITextRegionCollection parentRegion, ITextRegion elRegion);
	                                                             ^^^^^^^^^^^
Discouraged access: The type 'ITextRegion' is not API (restriction on classpath entry '/home/hudson/genie.webtools/.jenkins/jobs/webtools-jsf-gerrit_master/workspace/.repository/p2/osgi/bundle/org.eclipse.wst.sse.core/1.2.100.v201901310548/org.eclipse.wst.sse.core-1.2.100.v201901310548.jar')
[WARNING] /jobs/genie.webtools/webtools-jsf-gerrit_master/workspace/jsf/tests/org.eclipse.jst.jsf.validation.el.tests/src/org/eclipse/jst/jsf/validation/el/tests/perf/StressTest.java:[30] 
	import org.eclipse.wst.sse.core.internal.provisional.IStructuredModel;
	       ^^^^^^^^^^^^^^^^^^^^^^^^^^^^^^^^^^^^^^^^^^^^^^^^^^^^^^^^^^^^^^
Discouraged access: The type 'IStructuredModel' is not API (restriction on classpath entry '/home/hudson/genie.webtools/.jenkins/jobs/webtools-jsf-gerrit_master/workspace/.repository/p2/osgi/bundle/org.eclipse.wst.sse.core/1.2.100.v201901310548/org.eclipse.wst.sse.core-1.2.100.v201901310548.jar')
[WARNING] /jobs/genie.webtools/webtools-jsf-gerrit_master/workspace/jsf/tests/org.eclipse.jst.jsf.validation.el.tests/src/org/eclipse/jst/jsf/validation/el/tests/perf/StressTest.java:[31] 
	import org.eclipse.wst.sse.core.internal.provisional.text.IStructuredDocument;
	       ^^^^^^^^^^^^^^^^^^^^^^^^^^^^^^^^^^^^^^^^^^^^^^^^^^^^^^^^^^^^^^^^^^^^^^
Discouraged access: The type 'IStructuredDocument' is not API (restriction on classpath entry '/home/hudson/genie.webtools/.jenkins/jobs/webtools-jsf-gerrit_master/workspace/.repository/p2/osgi/bundle/org.eclipse.wst.sse.core/1.2.100.v201901310548/org.eclipse.wst.sse.core-1.2.100.v201901310548.jar')
[WARNING] /jobs/genie.webtools/webtools-jsf-gerrit_master/workspace/jsf/tests/org.eclipse.jst.jsf.validation.el.tests/src/org/eclipse/jst/jsf/validation/el/tests/perf/StressTest.java:[47] 
	private IStructuredModel _structuredModel;
	        ^^^^^^^^^^^^^^^^
Discouraged access: The type 'IStructuredModel' is not API (restriction on classpath entry '/home/hudson/genie.webtools/.jenkins/jobs/webtools-jsf-gerrit_master/workspace/.repository/p2/osgi/bundle/org.eclipse.wst.sse.core/1.2.100.v201901310548/org.eclipse.wst.sse.core-1.2.100.v201901310548.jar')
[WARNING] /jobs/genie.webtools/webtools-jsf-gerrit_master/workspace/jsf/tests/org.eclipse.jst.jsf.validation.el.tests/src/org/eclipse/jst/jsf/validation/el/tests/perf/StressTest.java:[48] 
	private IStructuredDocument _structuredDocument;
	        ^^^^^^^^^^^^^^^^^^^
Discouraged access: The type 'IStructuredDocument' is not API (restriction on classpath entry '/home/hudson/genie.webtools/.jenkins/jobs/webtools-jsf-gerrit_master/workspace/.repository/p2/osgi/bundle/org.eclipse.wst.sse.core/1.2.100.v201901310548/org.eclipse.wst.sse.core-1.2.100.v201901310548.jar')
[WARNING] /jobs/genie.webtools/webtools-jsf-gerrit_master/workspace/jsf/tests/org.eclipse.jst.jsf.validation.el.tests/src/org/eclipse/jst/jsf/validation/el/tests/perf/StressTest.java:[58] 
	_structuredModel = StructuredModelManager.getModelManager().getModelForRead(_testJSP);
	                   ^^^^^^^^^^^^^^^^^^^^^^^^^^^^^^^^^^^^^^^^^^^^^^^^^^^^^^^^^^^^^^^^^^
Discouraged access: The method 'IModelManager.getModelForRead(IFile)' is not API (restriction on classpath entry '/home/hudson/genie.webtools/.jenkins/jobs/webtools-jsf-gerrit_master/workspace/.repository/p2/osgi/bundle/org.eclipse.wst.sse.core/1.2.100.v201901310548/org.eclipse.wst.sse.core-1.2.100.v201901310548.jar')
[WARNING] /jobs/genie.webtools/webtools-jsf-gerrit_master/workspace/jsf/tests/org.eclipse.jst.jsf.validation.el.tests/src/org/eclipse/jst/jsf/validation/el/tests/perf/StressTest.java:[59] 
	_structuredDocument = _structuredModel.getStructuredDocument();
	                      ^^^^^^^^^^^^^^^^^^^^^^^^^^^^^^^^^^^^^^^^
Discouraged access: The method 'IStructuredModel.getStructuredDocument()' is not API (restriction on classpath entry '/home/hudson/genie.webtools/.jenkins/jobs/webtools-jsf-gerrit_master/workspace/.repository/p2/osgi/bundle/org.eclipse.wst.sse.core/1.2.100.v201901310548/org.eclipse.wst.sse.core-1.2.100.v201901310548.jar')
[WARNING] /jobs/genie.webtools/webtools-jsf-gerrit_master/workspace/jsf/tests/org.eclipse.jst.jsf.validation.el.tests/src/org/eclipse/jst/jsf/validation/el/tests/perf/StressTest.java:[69] 
	_structuredModel.releaseFromRead();
	^^^^^^^^^^^^^^^^^^^^^^^^^^^^^^^^^^
Discouraged access: The method 'IStructuredModel.releaseFromRead()' is not API (restriction on classpath entry '/home/hudson/genie.webtools/.jenkins/jobs/webtools-jsf-gerrit_master/workspace/.repository/p2/osgi/bundle/org.eclipse.wst.sse.core/1.2.100.v201901310548/org.eclipse.wst.sse.core-1.2.100.v201901310548.jar')
324 problems (324 warnings)
[INFO] 
[INFO] --- maven-resources-plugin:2.4.3:testResources (default-testResources) @ org.eclipse.jst.jsf.validation.el.tests ---
[WARNING] Using platform encoding (UTF-8 actually) to copy filtered resources, i.e. build is platform dependent!
[INFO] skip non existing resourceDirectory /jobs/genie.webtools/webtools-jsf-gerrit_master/workspace/jsf/tests/org.eclipse.jst.jsf.validation.el.tests/src/test/resources
[INFO] 
[INFO] --- tycho-source-plugin:1.2.0:plugin-source (plugin-source) @ org.eclipse.jst.jsf.validation.el.tests ---
[INFO] Building jar: /jobs/genie.webtools/webtools-jsf-gerrit_master/workspace/jsf/tests/org.eclipse.jst.jsf.validation.el.tests/target/org.eclipse.jst.jsf.validation.el.tests-1.5.1-SNAPSHOT-sources.jar
[INFO] 
[INFO] --- target-platform-configuration:1.2.0:target-platform (default-target-platform) @ org.eclipse.jst.jsf.validation.el.tests ---
[INFO] 
[INFO] --- tycho-packaging-plugin:1.2.0:package-plugin (default-package-plugin) @ org.eclipse.jst.jsf.validation.el.tests ---
[INFO] Building jar: /jobs/genie.webtools/webtools-jsf-gerrit_master/workspace/jsf/tests/org.eclipse.jst.jsf.validation.el.tests/target/org.eclipse.jst.jsf.validation.el.tests-1.5.1-SNAPSHOT.jar
[INFO] 
[INFO] --- tycho-p2-plugin:1.2.0:p2-metadata-default (default-p2-metadata-default) @ org.eclipse.jst.jsf.validation.el.tests ---
[INFO] 
[INFO] --- tycho-surefire-plugin:1.2.0:test (default-test) @ org.eclipse.jst.jsf.validation.el.tests ---
[WARNING] Both parameter 'skipTests' and 'maven.test.skip' are set, 'skipTests' has a higher priority!
[INFO] Skipping tests
[INFO] 
[INFO] --- tycho-pack200a-plugin:1.2.0:normalize (pack200-normalize) @ org.eclipse.jst.jsf.validation.el.tests ---
[INFO] Pack200 normalizing jar /jobs/genie.webtools/webtools-jsf-gerrit_master/workspace/jsf/tests/org.eclipse.jst.jsf.validation.el.tests/target/org.eclipse.jst.jsf.validation.el.tests-1.5.1-SNAPSHOT.jar
[INFO] 
[INFO] --- eclipse-jarsigner-plugin:1.1.4:sign (sign) @ org.eclipse.jst.jsf.validation.el.tests ---
[INFO] Signing jar: /jobs/genie.webtools/webtools-jsf-gerrit_master/workspace/jsf/tests/org.eclipse.jst.jsf.validation.el.tests/target/org.eclipse.jst.jsf.validation.el.tests-1.5.1-SNAPSHOT.jar
[INFO] Signing jar: /jobs/genie.webtools/webtools-jsf-gerrit_master/workspace/jsf/tests/org.eclipse.jst.jsf.validation.el.tests/target/org.eclipse.jst.jsf.validation.el.tests-1.5.1-SNAPSHOT-sources.jar
[INFO] 
[INFO] --- tycho-pack200b-plugin:1.2.0:pack (pack200-pack) @ org.eclipse.jst.jsf.validation.el.tests ---
[INFO] Pack200 packing jar /jobs/genie.webtools/webtools-jsf-gerrit_master/workspace/jsf/tests/org.eclipse.jst.jsf.validation.el.tests/target/org.eclipse.jst.jsf.validation.el.tests-1.5.1-SNAPSHOT.jar
[INFO] 
[INFO] --- tycho-p2-plugin:1.2.0:p2-metadata (p2-metadata) @ org.eclipse.jst.jsf.validation.el.tests ---
[INFO] No baseline version MavenProject: org.eclipse.webtools.jsf:org.eclipse.jst.jsf.validation.el.tests:1.5.1-SNAPSHOT @ /jobs/genie.webtools/webtools-jsf-gerrit_master/workspace/jsf/tests/org.eclipse.jst.jsf.validation.el.tests/pom.xml
[INFO] 
[INFO] --- maven-install-plugin:2.3.1:install (default-install) @ org.eclipse.jst.jsf.validation.el.tests ---
[INFO] Installing /jobs/genie.webtools/webtools-jsf-gerrit_master/workspace/jsf/tests/org.eclipse.jst.jsf.validation.el.tests/target/org.eclipse.jst.jsf.validation.el.tests-1.5.1-SNAPSHOT.jar to /home/hudson/genie.webtools/.jenkins/jobs/webtools-jsf-gerrit_master/workspace/.repository/org/eclipse/webtools/jsf/org.eclipse.jst.jsf.validation.el.tests/1.5.1-SNAPSHOT/org.eclipse.jst.jsf.validation.el.tests-1.5.1-SNAPSHOT.jar
[INFO] Installing /jobs/genie.webtools/webtools-jsf-gerrit_master/workspace/jsf/tests/org.eclipse.jst.jsf.validation.el.tests/pom.xml to /home/hudson/genie.webtools/.jenkins/jobs/webtools-jsf-gerrit_master/workspace/.repository/org/eclipse/webtools/jsf/org.eclipse.jst.jsf.validation.el.tests/1.5.1-SNAPSHOT/org.eclipse.jst.jsf.validation.el.tests-1.5.1-SNAPSHOT.pom
[INFO] Installing /jobs/genie.webtools/webtools-jsf-gerrit_master/workspace/jsf/tests/org.eclipse.jst.jsf.validation.el.tests/target/org.eclipse.jst.jsf.validation.el.tests-1.5.1-SNAPSHOT-sources.jar to /home/hudson/genie.webtools/.jenkins/jobs/webtools-jsf-gerrit_master/workspace/.repository/org/eclipse/webtools/jsf/org.eclipse.jst.jsf.validation.el.tests/1.5.1-SNAPSHOT/org.eclipse.jst.jsf.validation.el.tests-1.5.1-SNAPSHOT-sources.jar
[INFO] Installing /jobs/genie.webtools/webtools-jsf-gerrit_master/workspace/jsf/tests/org.eclipse.jst.jsf.validation.el.tests/target/org.eclipse.jst.jsf.validation.el.tests-1.5.1-SNAPSHOT.jar.pack.gz to /home/hudson/genie.webtools/.jenkins/jobs/webtools-jsf-gerrit_master/workspace/.repository/org/eclipse/webtools/jsf/org.eclipse.jst.jsf.validation.el.tests/1.5.1-SNAPSHOT/org.eclipse.jst.jsf.validation.el.tests-1.5.1-SNAPSHOT-pack200.jar.pack.gz
[INFO] Installing /jobs/genie.webtools/webtools-jsf-gerrit_master/workspace/jsf/tests/org.eclipse.jst.jsf.validation.el.tests/target/p2content.xml to /home/hudson/genie.webtools/.jenkins/jobs/webtools-jsf-gerrit_master/workspace/.repository/org/eclipse/webtools/jsf/org.eclipse.jst.jsf.validation.el.tests/1.5.1-SNAPSHOT/org.eclipse.jst.jsf.validation.el.tests-1.5.1-SNAPSHOT-p2metadata.xml
[INFO] Installing /jobs/genie.webtools/webtools-jsf-gerrit_master/workspace/jsf/tests/org.eclipse.jst.jsf.validation.el.tests/target/p2artifacts.xml to /home/hudson/genie.webtools/.jenkins/jobs/webtools-jsf-gerrit_master/workspace/.repository/org/eclipse/webtools/jsf/org.eclipse.jst.jsf.validation.el.tests/1.5.1-SNAPSHOT/org.eclipse.jst.jsf.validation.el.tests-1.5.1-SNAPSHOT-p2artifacts.xml
[INFO] 
[INFO] --- tycho-p2-plugin:1.2.0:update-local-index (default-update-local-index) @ org.eclipse.jst.jsf.validation.el.tests ---
[INFO] 
[INFO] ------------------------------------------------------------------------
[INFO] Skipping org.eclipse.jst.pagedesigner.tests
[INFO] This project has been banned from the build due to previous failures.
[INFO] ------------------------------------------------------------------------
[INFO] 
[INFO] ------------------------------------------------------------------------
[INFO] Skipping org.eclipse.jst.jsf.tests.feature
[INFO] This project has been banned from the build due to previous failures.
[INFO] ------------------------------------------------------------------------
[INFO] 
[INFO] ------------------------------------------------------------------------
[INFO] Skipping org.eclipse.webtools.jsf.site
[INFO] This project has been banned from the build due to previous failures.
[INFO] ------------------------------------------------------------------------
[INFO] ------------------------------------------------------------------------
[INFO] Reactor Summary:
[INFO] 
[INFO] org.eclipse.webtools.jsf 3.6.0-SNAPSHOT ............ SUCCESS [03:10 min]
[INFO] org.eclipse.jst.jsf.common 1.5.103-SNAPSHOT ........ SUCCESS [05:27 min]
[INFO] org.eclipse.jst.jsf.common.runtime 1.4.1-SNAPSHOT .. SUCCESS [ 10.337 s]
[INFO] org.eclipse.jst.jsf.common.ui 1.5.101-SNAPSHOT ..... SUCCESS [  9.768 s]
[INFO] org.eclipse.jst.jsf.facesconfig 1.5.102-SNAPSHOT ... SUCCESS [ 24.663 s]
[INFO] org.eclipse.jst.jsf.core 1.8.2-SNAPSHOT ............ SUCCESS [ 22.758 s]
[INFO] org.eclipse.jst.pagedesigner.jsp.core 1.5.102-SNAPSHOT SUCCESS [ 18.104 s]
[INFO] org.eclipse.jst.pagedesigner 1.8.2-SNAPSHOT ........ FAILURE [05:17 min]
[INFO] org.eclipse.jst.jsf.apache.trinidad.tagsupport 1.4.1-SNAPSHOT SKIPPED
[INFO] org.eclipse.jst.jsf.apache.trinidad.tagsupport.feature 2.6.1-SNAPSHOT SKIPPED
[INFO] org.eclipse.jst.pagedesigner.jsf.ui 1.5.2-SNAPSHOT . SKIPPED
[INFO] org.eclipse.jst.webpageeditor.feature 2.9.0-SNAPSHOT SKIPPED
[INFO] org.eclipse.jst.jsf.facelet.core 1.4.2-SNAPSHOT .... SUCCESS [02:28 min]
[INFO] org.eclipse.jst.jsf.ui 1.6.102-SNAPSHOT ............ SUCCESS [ 25.716 s]
[INFO] org.eclipse.jst.jsf.facelet.ui 1.3.112-SNAPSHOT .... SUCCESS [  3.906 s]
[INFO] org.eclipse.jst.jsf.facesconfig.ui 1.5.2-SNAPSHOT .. SUCCESS [ 48.094 s]
[INFO] org.eclipse.jst.jsf.standard.tagsupport 1.5.1-SNAPSHOT SUCCESS [ 22.527 s]
[INFO] org.eclipse.jsf.branding 3.5.1-SNAPSHOT ............ SUCCESS [ 32.485 s]
[INFO] org.eclipse.jsf.feature 3.10.0-SNAPSHOT ............ SUCCESS [  3.352 s]
[INFO] org.eclipse.jsf.assembly.feature 3.4.1-SNAPSHOT .... SKIPPED
[INFO] org.eclipse.jst.jsf.apache.trinidad.tagsupport_sdk.feature 2.6.1-SNAPSHOT SKIPPED
[INFO] org.eclipse.jst.webpageeditor_sdk.feature 2.9.0-SNAPSHOT SKIPPED
[INFO] org.eclipse.jsf_sdk.feature 3.10.0-SNAPSHOT ........ SUCCESS [  1.354 s]
[INFO] org.eclipse.jsf_sdk.assembly.feature 3.4.0-SNAPSHOT  SKIPPED
[INFO] org.eclipse.jst.jsf.doc.dev 1.5.0-SNAPSHOT ......... SUCCESS [03:37 min]
[INFO] org.eclipse.jst.jsf.doc.user 1.5.0-SNAPSHOT ........ SUCCESS [ 18.883 s]
[INFO] org.eclipse.jst.jsf.doc.feature 2.4.0-SNAPSHOT ..... SUCCESS [  1.798 s]
[INFO] org.eclipse.jst.jsf.common.runtime.tests 1.4.0-SNAPSHOT SUCCESS [ 32.965 s]
[INFO] org.eclipse.jst.jsf.test.util 1.5.111-SNAPSHOT ..... SUCCESS [ 25.736 s]
[INFO] org.eclipse.jst.jsf.core.tests 1.5.111-SNAPSHOT .... SUCCESS [01:52 min]
[INFO] org.eclipse.jst.jsf.contentassist.tests 1.5.101-SNAPSHOT SUCCESS [ 17.645 s]
[INFO] org.eclipse.jst.jsf.context.symbol.tests 1.5.0-SNAPSHOT SUCCESS [ 28.039 s]
[INFO] org.eclipse.jst.jsf.designtime.tests 1.15.0-SNAPSHOT SUCCESS [ 34.704 s]
[INFO] org.eclipse.jst.jsf.facesconfig.tests 1.4.100-SNAPSHOT SUCCESS [ 36.408 s]
[INFO] org.eclipse.jst.jsf.facesconfig.ui.test 1.4.0-SNAPSHOT SUCCESS [ 10.954 s]
[INFO] org.eclipse.jst.jsf.metadata.tests 1.5.111-SNAPSHOT  SKIPPED
[INFO] org.eclipse.jst.jsf.metadataprocessingtests2 1.5.0-SNAPSHOT SUCCESS [ 20.035 s]
[INFO] org.eclipse.jst.jsf.ui.tests 1.5.0-SNAPSHOT ........ SUCCESS [ 12.389 s]
[INFO] org.eclipse.jst.jsf.validation.el.tests 1.5.1-SNAPSHOT SUCCESS [  9.524 s]
[INFO] org.eclipse.jst.pagedesigner.tests 1.5.101-SNAPSHOT  SKIPPED
[INFO] org.eclipse.jst.jsf.tests.feature 3.5.100-SNAPSHOT . SKIPPED
[INFO] org.eclipse.webtools.jsf.site 3.6.0-SNAPSHOT ....... SKIPPED
[INFO] ------------------------------------------------------------------------
[INFO] BUILD FAILURE
[INFO] ------------------------------------------------------------------------
[INFO] Total time: 41:57 min
[INFO] Finished at: 2019-02-12T16:45:12-05:00
[INFO] ------------------------------------------------------------------------
[ERROR] Failed to execute goal org.eclipse.tycho.extras:tycho-pack200b-plugin:1.2.0:pack (pack200-pack) on project org.eclipse.jst.pagedesigner: Could not pack200 pack jar file /jobs/genie.webtools/webtools-jsf-gerrit_master/workspace/jsf/plugins/org.eclipse.jst.pagedesigner/target/org.eclipse.jst.pagedesigner-1.8.2-SNAPSHOT.jar: error in opening zip file -> [Help 1]
[ERROR] 
[ERROR] To see the full stack trace of the errors, re-run Maven with the -e switch.
[ERROR] Re-run Maven using the -X switch to enable full debug logging.
[ERROR] 
[ERROR] For more information about the errors and possible solutions, please read the following articles:
[ERROR] [Help 1] http://cwiki.apache.org/confluence/display/MAVEN/MojoExecutionException
[ERROR] 
[ERROR] After correcting the problems, you can resume the build with the command
[ERROR]   mvn <goals> -rf :org.eclipse.jst.pagedesigner
Build step 'Invoke top-level Maven targets' marked build as failure
Terminating xvnc.
append disk usage
Started calculate disk usage of build
Finished Calculation of disk usage of build in 0 seconds
Started calculate disk usage of workspace
Finished Calculation of disk usage of workspace in 0 seconds
Recording test results
ERROR: Step ‘Publish JUnit test result report’ failed: No test report files were found. Configuration error?
Skipping calculation of disk usage, it was already done in post build step.
Finished: FAILURE