FailedConsole Output

Skipping 17,554 KB.. Full Log
ration.java:[40] 
	import org.eclipse.wst.validation.internal.TaskListUtility;
	       ^^^^^^^^^^^^^^^^^^^^^^^^^^^^^^^^^^^^^^^^^^^^^^^^^^^
Discouraged access: The type 'TaskListUtility' is not API (restriction on classpath entry '/home/hudson/genie.webtools/.jenkins/jobs/webtools-javaee_R3_10/workspace/.repository/p2/osgi/bundle/org.eclipse.wst.validation/1.2.701.v201707142105/org.eclipse.wst.validation-1.2.701.v201707142105.jar')
[WARNING] /jobs/genie.webtools/webtools-javaee_R3_10/workspace/tests/org.eclipse.jst.validation.test/testFwk/org/eclipse/jst/validation/test/fwk/TestOpConstrOperation.java:[41] 
	import org.eclipse.wst.validation.internal.ValidationConfiguration;
	       ^^^^^^^^^^^^^^^^^^^^^^^^^^^^^^^^^^^^^^^^^^^^^^^^^^^^^^^^^^^
Discouraged access: The type 'ValidationConfiguration' is not API (restriction on classpath entry '/home/hudson/genie.webtools/.jenkins/jobs/webtools-javaee_R3_10/workspace/.repository/p2/osgi/bundle/org.eclipse.wst.validation/1.2.701.v201707142105/org.eclipse.wst.validation-1.2.701.v201707142105.jar')
[WARNING] /jobs/genie.webtools/webtools-javaee_R3_10/workspace/tests/org.eclipse.jst.validation.test/testFwk/org/eclipse/jst/validation/test/fwk/TestOpConstrOperation.java:[42] 
	import org.eclipse.wst.validation.internal.ValidatorMetaData;
	       ^^^^^^^^^^^^^^^^^^^^^^^^^^^^^^^^^^^^^^^^^^^^^^^^^^^^^
Discouraged access: The type 'ValidatorMetaData' is not API (restriction on classpath entry '/home/hudson/genie.webtools/.jenkins/jobs/webtools-javaee_R3_10/workspace/.repository/p2/osgi/bundle/org.eclipse.wst.validation/1.2.701.v201707142105/org.eclipse.wst.validation-1.2.701.v201707142105.jar')
[WARNING] /jobs/genie.webtools/webtools-javaee_R3_10/workspace/tests/org.eclipse.jst.validation.test/testFwk/org/eclipse/jst/validation/test/fwk/TestOpConstrOperation.java:[43] 
	import org.eclipse.wst.validation.internal.operations.AllValidatorsOperation;
	       ^^^^^^^^^^^^^^^^^^^^^^^^^^^^^^^^^^^^^^^^^^^^^^^^^^^^^^^^^^^^^^^^^^^^^
Discouraged access: The type 'AllValidatorsOperation' is not API (restriction on classpath entry '/home/hudson/genie.webtools/.jenkins/jobs/webtools-javaee_R3_10/workspace/.repository/p2/osgi/bundle/org.eclipse.wst.validation/1.2.701.v201707142105/org.eclipse.wst.validation-1.2.701.v201707142105.jar')
[WARNING] /jobs/genie.webtools/webtools-javaee_R3_10/workspace/tests/org.eclipse.jst.validation.test/testFwk/org/eclipse/jst/validation/test/fwk/TestOpConstrOperation.java:[44] 
	import org.eclipse.wst.validation.internal.operations.EnabledIncrementalValidatorsOperation;
	       ^^^^^^^^^^^^^^^^^^^^^^^^^^^^^^^^^^^^^^^^^^^^^^^^^^^^^^^^^^^^^^^^^^^^^^^^^^^^^^^^^^^^
Discouraged access: The type 'EnabledIncrementalValidatorsOperation' is not API (restriction on classpath entry '/home/hudson/genie.webtools/.jenkins/jobs/webtools-javaee_R3_10/workspace/.repository/p2/osgi/bundle/org.eclipse.wst.validation/1.2.701.v201707142105/org.eclipse.wst.validation-1.2.701.v201707142105.jar')
[WARNING] /jobs/genie.webtools/webtools-javaee_R3_10/workspace/tests/org.eclipse.jst.validation.test/testFwk/org/eclipse/jst/validation/test/fwk/TestOpConstrOperation.java:[45] 
	import org.eclipse.wst.validation.internal.operations.EnabledValidatorsOperation;
	       ^^^^^^^^^^^^^^^^^^^^^^^^^^^^^^^^^^^^^^^^^^^^^^^^^^^^^^^^^^^^^^^^^^^^^^^^^
Discouraged access: The type 'EnabledValidatorsOperation' is not API (restriction on classpath entry '/home/hudson/genie.webtools/.jenkins/jobs/webtools-javaee_R3_10/workspace/.repository/p2/osgi/bundle/org.eclipse.wst.validation/1.2.701.v201707142105/org.eclipse.wst.validation-1.2.701.v201707142105.jar')
[WARNING] /jobs/genie.webtools/webtools-javaee_R3_10/workspace/tests/org.eclipse.jst.validation.test/testFwk/org/eclipse/jst/validation/test/fwk/TestOpConstrOperation.java:[46] 
	import org.eclipse.wst.validation.internal.operations.IRuleGroup;
	       ^^^^^^^^^^^^^^^^^^^^^^^^^^^^^^^^^^^^^^^^^^^^^^^^^^^^^^^^^
Discouraged access: The type 'IRuleGroup' is not API (restriction on classpath entry '/home/hudson/genie.webtools/.jenkins/jobs/webtools-javaee_R3_10/workspace/.repository/p2/osgi/bundle/org.eclipse.wst.validation/1.2.701.v201707142105/org.eclipse.wst.validation-1.2.701.v201707142105.jar')
[WARNING] /jobs/genie.webtools/webtools-javaee_R3_10/workspace/tests/org.eclipse.jst.validation.test/testFwk/org/eclipse/jst/validation/test/fwk/TestOpConstrOperation.java:[47] 
	import org.eclipse.wst.validation.internal.operations.OneValidatorOperation;
	       ^^^^^^^^^^^^^^^^^^^^^^^^^^^^^^^^^^^^^^^^^^^^^^^^^^^^^^^^^^^^^^^^^^^^
Discouraged access: The type 'OneValidatorOperation' is not API (restriction on classpath entry '/home/hudson/genie.webtools/.jenkins/jobs/webtools-javaee_R3_10/workspace/.repository/p2/osgi/bundle/org.eclipse.wst.validation/1.2.701.v201707142105/org.eclipse.wst.validation-1.2.701.v201707142105.jar')
[WARNING] /jobs/genie.webtools/webtools-javaee_R3_10/workspace/tests/org.eclipse.jst.validation.test/testFwk/org/eclipse/jst/validation/test/fwk/TestOpConstrOperation.java:[48] 
	import org.eclipse.wst.validation.internal.operations.ValidationOperation;
	       ^^^^^^^^^^^^^^^^^^^^^^^^^^^^^^^^^^^^^^^^^^^^^^^^^^^^^^^^^^^^^^^^^^
Discouraged access: The type 'ValidationOperation' is not API (restriction on classpath entry '/home/hudson/genie.webtools/.jenkins/jobs/webtools-javaee_R3_10/workspace/.repository/p2/osgi/bundle/org.eclipse.wst.validation/1.2.701.v201707142105/org.eclipse.wst.validation-1.2.701.v201707142105.jar')
[WARNING] /jobs/genie.webtools/webtools-javaee_R3_10/workspace/tests/org.eclipse.jst.validation.test/testFwk/org/eclipse/jst/validation/test/fwk/TestOpConstrOperation.java:[49] 
	import org.eclipse.wst.validation.internal.operations.ValidatorSubsetOperation;
	       ^^^^^^^^^^^^^^^^^^^^^^^^^^^^^^^^^^^^^^^^^^^^^^^^^^^^^^^^^^^^^^^^^^^^^^^
Discouraged access: The type 'ValidatorSubsetOperation' is not API (restriction on classpath entry '/home/hudson/genie.webtools/.jenkins/jobs/webtools-javaee_R3_10/workspace/.repository/p2/osgi/bundle/org.eclipse.wst.validation/1.2.701.v201707142105/org.eclipse.wst.validation-1.2.701.v201707142105.jar')
[WARNING] /jobs/genie.webtools/webtools-javaee_R3_10/workspace/tests/org.eclipse.jst.validation.test/testFwk/org/eclipse/jst/validation/test/fwk/TestOpConstrOperation.java:[103] 
	GlobalConfiguration gconf = ConfigurationManager.getManager().getGlobalConfiguration();
	^^^^^^^^^^^^^^^^^^^
Discouraged access: The type 'GlobalConfiguration' is not API (restriction on classpath entry '/home/hudson/genie.webtools/.jenkins/jobs/webtools-javaee_R3_10/workspace/.repository/p2/osgi/bundle/org.eclipse.wst.validation/1.2.701.v201707142105/org.eclipse.wst.validation-1.2.701.v201707142105.jar')
[WARNING] /jobs/genie.webtools/webtools-javaee_R3_10/workspace/tests/org.eclipse.jst.validation.test/testFwk/org/eclipse/jst/validation/test/fwk/TestOpConstrOperation.java:[103] 
	GlobalConfiguration gconf = ConfigurationManager.getManager().getGlobalConfiguration();
	                            ^^^^^^^^^^^^^^^^^^^^^^^^^^^^^^^^^^^^^^^^^^^^^^^^^^^^^^^^^^
Discouraged access: The method 'ConfigurationManager.getGlobalConfiguration()' is not API (restriction on classpath entry '/home/hudson/genie.webtools/.jenkins/jobs/webtools-javaee_R3_10/workspace/.repository/p2/osgi/bundle/org.eclipse.wst.validation/1.2.701.v201707142105/org.eclipse.wst.validation-1.2.701.v201707142105.jar')
[WARNING] /jobs/genie.webtools/webtools-javaee_R3_10/workspace/tests/org.eclipse.jst.validation.test/testFwk/org/eclipse/jst/validation/test/fwk/TestOpConstrOperation.java:[103] 
	GlobalConfiguration gconf = ConfigurationManager.getManager().getGlobalConfiguration();
	                            ^^^^^^^^^^^^^^^^^^^^^^^^^^^^^^^^^
Discouraged access: The method 'ConfigurationManager.getManager()' is not API (restriction on classpath entry '/home/hudson/genie.webtools/.jenkins/jobs/webtools-javaee_R3_10/workspace/.repository/p2/osgi/bundle/org.eclipse.wst.validation/1.2.701.v201707142105/org.eclipse.wst.validation-1.2.701.v201707142105.jar')
[WARNING] /jobs/genie.webtools/webtools-javaee_R3_10/workspace/tests/org.eclipse.jst.validation.test/testFwk/org/eclipse/jst/validation/test/fwk/TestOpConstrOperation.java:[103] 
	GlobalConfiguration gconf = ConfigurationManager.getManager().getGlobalConfiguration();
	                            ^^^^^^^^^^^^^^^^^^^^
Discouraged access: The type 'ConfigurationManager' is not API (restriction on classpath entry '/home/hudson/genie.webtools/.jenkins/jobs/webtools-javaee_R3_10/workspace/.repository/p2/osgi/bundle/org.eclipse.wst.validation/1.2.701.v201707142105/org.eclipse.wst.validation-1.2.701.v201707142105.jar')
[WARNING] /jobs/genie.webtools/webtools-javaee_R3_10/workspace/tests/org.eclipse.jst.validation.test/testFwk/org/eclipse/jst/validation/test/fwk/TestOpConstrOperation.java:[104] 
	GlobalConfiguration origGconf = new GlobalConfiguration(gconf);
	^^^^^^^^^^^^^^^^^^^
Discouraged access: The type 'GlobalConfiguration' is not API (restriction on classpath entry '/home/hudson/genie.webtools/.jenkins/jobs/webtools-javaee_R3_10/workspace/.repository/p2/osgi/bundle/org.eclipse.wst.validation/1.2.701.v201707142105/org.eclipse.wst.validation-1.2.701.v201707142105.jar')
[WARNING] /jobs/genie.webtools/webtools-javaee_R3_10/workspace/tests/org.eclipse.jst.validation.test/testFwk/org/eclipse/jst/validation/test/fwk/TestOpConstrOperation.java:[104] 
	GlobalConfiguration origGconf = new GlobalConfiguration(gconf);
	                                ^^^^^^^^^^^^^^^^^^^^^^^^^^^^^^
Discouraged access: The constructor 'GlobalConfiguration(GlobalConfiguration)' is not API (restriction on classpath entry '/home/hudson/genie.webtools/.jenkins/jobs/webtools-javaee_R3_10/workspace/.repository/p2/osgi/bundle/org.eclipse.wst.validation/1.2.701.v201707142105/org.eclipse.wst.validation-1.2.701.v201707142105.jar')
[WARNING] /jobs/genie.webtools/webtools-javaee_R3_10/workspace/tests/org.eclipse.jst.validation.test/testFwk/org/eclipse/jst/validation/test/fwk/TestOpConstrOperation.java:[104] 
	GlobalConfiguration origGconf = new GlobalConfiguration(gconf);
	                                    ^^^^^^^^^^^^^^^^^^^
Discouraged access: The type 'GlobalConfiguration' is not API (restriction on classpath entry '/home/hudson/genie.webtools/.jenkins/jobs/webtools-javaee_R3_10/workspace/.repository/p2/osgi/bundle/org.eclipse.wst.validation/1.2.701.v201707142105/org.eclipse.wst.validation-1.2.701.v201707142105.jar')
[WARNING] /jobs/genie.webtools/webtools-javaee_R3_10/workspace/tests/org.eclipse.jst.validation.test/testFwk/org/eclipse/jst/validation/test/fwk/TestOpConstrOperation.java:[110] 
	gconf.setCanProjectsOverride(false);
	^^^^^^^^^^^^^^^^^^^^^^^^^^^^^^^^^^^
Discouraged access: The method 'GlobalConfiguration.setCanProjectsOverride(boolean)' is not API (restriction on classpath entry '/home/hudson/genie.webtools/.jenkins/jobs/webtools-javaee_R3_10/workspace/.repository/p2/osgi/bundle/org.eclipse.wst.validation/1.2.701.v201707142105/org.eclipse.wst.validation-1.2.701.v201707142105.jar')
[WARNING] /jobs/genie.webtools/webtools-javaee_R3_10/workspace/tests/org.eclipse.jst.validation.test/testFwk/org/eclipse/jst/validation/test/fwk/TestOpConstrOperation.java:[115] 
	gconf.passivate();
	^^^^^^^^^^^^^^^^^
Discouraged access: The method 'ValidationConfiguration.passivate()' is not API (restriction on classpath entry '/home/hudson/genie.webtools/.jenkins/jobs/webtools-javaee_R3_10/workspace/.repository/p2/osgi/bundle/org.eclipse.wst.validation/1.2.701.v201707142105/org.eclipse.wst.validation-1.2.701.v201707142105.jar')
[WARNING] /jobs/genie.webtools/webtools-javaee_R3_10/workspace/tests/org.eclipse.jst.validation.test/testFwk/org/eclipse/jst/validation/test/fwk/TestOpConstrOperation.java:[131] 
	ValidationOperation operation = testWrapper.getOperation();
	^^^^^^^^^^^^^^^^^^^
Discouraged access: The type 'ValidationOperation' is not API (restriction on classpath entry '/home/hudson/genie.webtools/.jenkins/jobs/webtools-javaee_R3_10/workspace/.repository/p2/osgi/bundle/org.eclipse.wst.validation/1.2.701.v201707142105/org.eclipse.wst.validation-1.2.701.v201707142105.jar')
[WARNING] /jobs/genie.webtools/webtools-javaee_R3_10/workspace/tests/org.eclipse.jst.validation.test/testFwk/org/eclipse/jst/validation/test/fwk/TestOpConstrOperation.java:[166] 
	gconf.passivate();
	^^^^^^^^^^^^^^^^^
Discouraged access: The method 'ValidationConfiguration.passivate()' is not API (restriction on classpath entry '/home/hudson/genie.webtools/.jenkins/jobs/webtools-javaee_R3_10/workspace/.repository/p2/osgi/bundle/org.eclipse.wst.validation/1.2.701.v201707142105/org.eclipse.wst.validation-1.2.701.v201707142105.jar')
[WARNING] /jobs/genie.webtools/webtools-javaee_R3_10/workspace/tests/org.eclipse.jst.validation.test/testFwk/org/eclipse/jst/validation/test/fwk/TestOpConstrOperation.java:[185] 
	TaskListUtility.removeAllTasks(getProject(), wrapper.getValidatorNames()); // null=delete markers on all objects
	^^^^^^^^^^^^^^^
Discouraged access: The type 'TaskListUtility' is not API (restriction on classpath entry '/home/hudson/genie.webtools/.jenkins/jobs/webtools-javaee_R3_10/workspace/.repository/p2/osgi/bundle/org.eclipse.wst.validation/1.2.701.v201707142105/org.eclipse.wst.validation-1.2.701.v201707142105.jar')
[WARNING] /jobs/genie.webtools/webtools-javaee_R3_10/workspace/tests/org.eclipse.jst.validation.test/testFwk/org/eclipse/jst/validation/test/fwk/TestOpConstrOperation.java:[185] 
	TaskListUtility.removeAllTasks(getProject(), wrapper.getValidatorNames()); // null=delete markers on all objects
	^^^^^^^^^^^^^^^^^^^^^^^^^^^^^^^^^^^^^^^^^^^^^^^^^^^^^^^^^^^^^^^^^^^^^^^^^
Discouraged access: The method 'TaskListUtility.removeAllTasks(IResource, String[])' is not API (restriction on classpath entry '/home/hudson/genie.webtools/.jenkins/jobs/webtools-javaee_R3_10/workspace/.repository/p2/osgi/bundle/org.eclipse.wst.validation/1.2.701.v201707142105/org.eclipse.wst.validation-1.2.701.v201707142105.jar')
[WARNING] /jobs/genie.webtools/webtools-javaee_R3_10/workspace/tests/org.eclipse.jst.validation.test/testFwk/org/eclipse/jst/validation/test/fwk/TestOpConstrOperation.java:[210] 
	private TestWrapper[] getOperations(IProgressMonitor monitor, ValidationConfiguration vconf) throws InvocationTargetException {
	                                                              ^^^^^^^^^^^^^^^^^^^^^^^
Discouraged access: The type 'ValidationConfiguration' is not API (restriction on classpath entry '/home/hudson/genie.webtools/.jenkins/jobs/webtools-javaee_R3_10/workspace/.repository/p2/osgi/bundle/org.eclipse.wst.validation/1.2.701.v201707142105/org.eclipse.wst.validation-1.2.701.v201707142105.jar')
[WARNING] /jobs/genie.webtools/webtools-javaee_R3_10/workspace/tests/org.eclipse.jst.validation.test/testFwk/org/eclipse/jst/validation/test/fwk/TestOpConstrOperation.java:[232] 
	ValidatorMetaData[] enabledVmd = new ValidatorMetaData[allTmds.length];
	^^^^^^^^^^^^^^^^^^^
Discouraged access: The type 'ValidatorMetaData' is not API (restriction on classpath entry '/home/hudson/genie.webtools/.jenkins/jobs/webtools-javaee_R3_10/workspace/.repository/p2/osgi/bundle/org.eclipse.wst.validation/1.2.701.v201707142105/org.eclipse.wst.validation-1.2.701.v201707142105.jar')
[WARNING] /jobs/genie.webtools/webtools-javaee_R3_10/workspace/tests/org.eclipse.jst.validation.test/testFwk/org/eclipse/jst/validation/test/fwk/TestOpConstrOperation.java:[232] 
	ValidatorMetaData[] enabledVmd = new ValidatorMetaData[allTmds.length];
	                                     ^^^^^^^^^^^^^^^^^
Discouraged access: The type 'ValidatorMetaData' is not API (restriction on classpath entry '/home/hudson/genie.webtools/.jenkins/jobs/webtools-javaee_R3_10/workspace/.repository/p2/osgi/bundle/org.eclipse.wst.validation/1.2.701.v201707142105/org.eclipse.wst.validation-1.2.701.v201707142105.jar')
[WARNING] /jobs/genie.webtools/webtools-javaee_R3_10/workspace/tests/org.eclipse.jst.validation.test/testFwk/org/eclipse/jst/validation/test/fwk/TestOpConstrOperation.java:[236] 
	ValidatorMetaData vmd = vt.getValidatorMetaData();
	^^^^^^^^^^^^^^^^^
Discouraged access: The type 'ValidatorMetaData' is not API (restriction on classpath entry '/home/hudson/genie.webtools/.jenkins/jobs/webtools-javaee_R3_10/workspace/.repository/p2/osgi/bundle/org.eclipse.wst.validation/1.2.701.v201707142105/org.eclipse.wst.validation-1.2.701.v201707142105.jar')
[WARNING] /jobs/genie.webtools/webtools-javaee_R3_10/workspace/tests/org.eclipse.jst.validation.test/testFwk/org/eclipse/jst/validation/test/fwk/TestOpConstrOperation.java:[239] 
	if(vmd.isIncremental()) {
	   ^^^^^^^^^^^^^^^^^^^
Discouraged access: The method 'ValidatorMetaData.isIncremental()' is not API (restriction on classpath entry '/home/hudson/genie.webtools/.jenkins/jobs/webtools-javaee_R3_10/workspace/.repository/p2/osgi/bundle/org.eclipse.wst.validation/1.2.701.v201707142105/org.eclipse.wst.validation-1.2.701.v201707142105.jar')
[WARNING] /jobs/genie.webtools/webtools-javaee_R3_10/workspace/tests/org.eclipse.jst.validation.test/testFwk/org/eclipse/jst/validation/test/fwk/TestOpConstrOperation.java:[252] 
	if(vmd.isApplicableTo(javaFile) && vmd.isIncremental()) {
	   ^^^^^^^^^^^^^^^^^^^^^^^^^^^^
Discouraged access: The method 'ValidatorMetaData.isApplicableTo(IResource)' is not API (restriction on classpath entry '/home/hudson/genie.webtools/.jenkins/jobs/webtools-javaee_R3_10/workspace/.repository/p2/osgi/bundle/org.eclipse.wst.validation/1.2.701.v201707142105/org.eclipse.wst.validation-1.2.701.v201707142105.jar')
[WARNING] /jobs/genie.webtools/webtools-javaee_R3_10/workspace/tests/org.eclipse.jst.validation.test/testFwk/org/eclipse/jst/validation/test/fwk/TestOpConstrOperation.java:[252] 
	if(vmd.isApplicableTo(javaFile) && vmd.isIncremental()) {
	                                   ^^^^^^^^^^^^^^^^^^^
Discouraged access: The method 'ValidatorMetaData.isIncremental()' is not API (restriction on classpath entry '/home/hudson/genie.webtools/.jenkins/jobs/webtools-javaee_R3_10/workspace/.repository/p2/osgi/bundle/org.eclipse.wst.validation/1.2.701.v201707142105/org.eclipse.wst.validation-1.2.701.v201707142105.jar')
[WARNING] /jobs/genie.webtools/webtools-javaee_R3_10/workspace/tests/org.eclipse.jst.validation.test/testFwk/org/eclipse/jst/validation/test/fwk/TestOpConstrOperation.java:[260] 
	String[] allValidatorNames = InternalValidatorManager.getManager().getValidatorNames(enabledValidators);
	                             ^^^^^^^^^^^^^^^^^^^^^^^^^^^^^^^^^^^^^^^^^^^^^^^^^^^^^^^^^^^^^^^^^^^^^^^^^^
Discouraged access: The method 'InternalValidatorManager.getValidatorNames(Collection<ValidatorMetaData>)' is not API (restriction on classpath entry '/home/hudson/genie.webtools/.jenkins/jobs/webtools-javaee_R3_10/workspace/.repository/p2/osgi/bundle/org.eclipse.wst.validation/1.2.701.v201707142105/org.eclipse.wst.validation-1.2.701.v201707142105.jar')
[WARNING] /jobs/genie.webtools/webtools-javaee_R3_10/workspace/tests/org.eclipse.jst.validation.test/testFwk/org/eclipse/jst/validation/test/fwk/TestOpConstrOperation.java:[260] 
	String[] allValidatorNames = InternalValidatorManager.getManager().getValidatorNames(enabledValidators);
	                             ^^^^^^^^^^^^^^^^^^^^^^^^^^^^^^^^^^^^^
Discouraged access: The method 'InternalValidatorManager.getManager()' is not API (restriction on classpath entry '/home/hudson/genie.webtools/.jenkins/jobs/webtools-javaee_R3_10/workspace/.repository/p2/osgi/bundle/org.eclipse.wst.validation/1.2.701.v201707142105/org.eclipse.wst.validation-1.2.701.v201707142105.jar')
[WARNING] /jobs/genie.webtools/webtools-javaee_R3_10/workspace/tests/org.eclipse.jst.validation.test/testFwk/org/eclipse/jst/validation/test/fwk/TestOpConstrOperation.java:[260] 
	String[] allValidatorNames = InternalValidatorManager.getManager().getValidatorNames(enabledValidators);
	                             ^^^^^^^^^^^^^^^^^^^^^^^^
Discouraged access: The type 'InternalValidatorManager' is not API (restriction on classpath entry '/home/hudson/genie.webtools/.jenkins/jobs/webtools-javaee_R3_10/workspace/.repository/p2/osgi/bundle/org.eclipse.wst.validation/1.2.701.v201707142105/org.eclipse.wst.validation-1.2.701.v201707142105.jar')
[WARNING] /jobs/genie.webtools/webtools-javaee_R3_10/workspace/tests/org.eclipse.jst.validation.test/testFwk/org/eclipse/jst/validation/test/fwk/TestOpConstrOperation.java:[261] 
	String[] incValidatorNames = InternalValidatorManager.getManager().getValidatorNames(enabledIncrementalValidators);
	                             ^^^^^^^^^^^^^^^^^^^^^^^^
Discouraged access: The type 'InternalValidatorManager' is not API (restriction on classpath entry '/home/hudson/genie.webtools/.jenkins/jobs/webtools-javaee_R3_10/workspace/.repository/p2/osgi/bundle/org.eclipse.wst.validation/1.2.701.v201707142105/org.eclipse.wst.validation-1.2.701.v201707142105.jar')
[WARNING] /jobs/genie.webtools/webtools-javaee_R3_10/workspace/tests/org.eclipse.jst.validation.test/testFwk/org/eclipse/jst/validation/test/fwk/TestOpConstrOperation.java:[261] 
	String[] incValidatorNames = InternalValidatorManager.getManager().getValidatorNames(enabledIncrementalValidators);
	                             ^^^^^^^^^^^^^^^^^^^^^^^^^^^^^^^^^^^^^
Discouraged access: The method 'InternalValidatorManager.getManager()' is not API (restriction on classpath entry '/home/hudson/genie.webtools/.jenkins/jobs/webtools-javaee_R3_10/workspace/.repository/p2/osgi/bundle/org.eclipse.wst.validation/1.2.701.v201707142105/org.eclipse.wst.validation-1.2.701.v201707142105.jar')
[WARNING] /jobs/genie.webtools/webtools-javaee_R3_10/workspace/tests/org.eclipse.jst.validation.test/testFwk/org/eclipse/jst/validation/test/fwk/TestOpConstrOperation.java:[261] 
	String[] incValidatorNames = InternalValidatorManager.getManager().getValidatorNames(enabledIncrementalValidators);
	                             ^^^^^^^^^^^^^^^^^^^^^^^^^^^^^^^^^^^^^^^^^^^^^^^^^^^^^^^^^^^^^^^^^^^^^^^^^^^^^^^^^^^^^
Discouraged access: The method 'InternalValidatorManager.getValidatorNames(Collection<ValidatorMetaData>)' is not API (restriction on classpath entry '/home/hudson/genie.webtools/.jenkins/jobs/webtools-javaee_R3_10/workspace/.repository/p2/osgi/bundle/org.eclipse.wst.validation/1.2.701.v201707142105/org.eclipse.wst.validation-1.2.701.v201707142105.jar')
[WARNING] /jobs/genie.webtools/webtools-javaee_R3_10/workspace/tests/org.eclipse.jst.validation.test/testFwk/org/eclipse/jst/validation/test/fwk/TestOpConstrOperation.java:[262] 
	String[] javaValidatorNames = InternalValidatorManager.getManager().getValidatorNames(javaValidators);
	                              ^^^^^^^^^^^^^^^^^^^^^^^^
Discouraged access: The type 'InternalValidatorManager' is not API (restriction on classpath entry '/home/hudson/genie.webtools/.jenkins/jobs/webtools-javaee_R3_10/workspace/.repository/p2/osgi/bundle/org.eclipse.wst.validation/1.2.701.v201707142105/org.eclipse.wst.validation-1.2.701.v201707142105.jar')
[WARNING] /jobs/genie.webtools/webtools-javaee_R3_10/workspace/tests/org.eclipse.jst.validation.test/testFwk/org/eclipse/jst/validation/test/fwk/TestOpConstrOperation.java:[262] 
	String[] javaValidatorNames = InternalValidatorManager.getManager().getValidatorNames(javaValidators);
	                              ^^^^^^^^^^^^^^^^^^^^^^^^^^^^^^^^^^^^^
Discouraged access: The method 'InternalValidatorManager.getManager()' is not API (restriction on classpath entry '/home/hudson/genie.webtools/.jenkins/jobs/webtools-javaee_R3_10/workspace/.repository/p2/osgi/bundle/org.eclipse.wst.validation/1.2.701.v201707142105/org.eclipse.wst.validation-1.2.701.v201707142105.jar')
[WARNING] /jobs/genie.webtools/webtools-javaee_R3_10/workspace/tests/org.eclipse.jst.validation.test/testFwk/org/eclipse/jst/validation/test/fwk/TestOpConstrOperation.java:[262] 
	String[] javaValidatorNames = InternalValidatorManager.getManager().getValidatorNames(javaValidators);
	                              ^^^^^^^^^^^^^^^^^^^^^^^^^^^^^^^^^^^^^^^^^^^^^^^^^^^^^^^^^^^^^^^^^^^^^^^
Discouraged access: The method 'InternalValidatorManager.getValidatorNames(Collection<ValidatorMetaData>)' is not API (restriction on classpath entry '/home/hudson/genie.webtools/.jenkins/jobs/webtools-javaee_R3_10/workspace/.repository/p2/osgi/bundle/org.eclipse.wst.validation/1.2.701.v201707142105/org.eclipse.wst.validation-1.2.701.v201707142105.jar')
[WARNING] /jobs/genie.webtools/webtools-javaee_R3_10/workspace/tests/org.eclipse.jst.validation.test/testFwk/org/eclipse/jst/validation/test/fwk/TestOpConstrOperation.java:[263] 
	String[] fullValidatorNames = InternalValidatorManager.getManager().getValidatorNames(fullValidators);
	                              ^^^^^^^^^^^^^^^^^^^^^^^^^^^^^^^^^^^^^^^^^^^^^^^^^^^^^^^^^^^^^^^^^^^^^^^
Discouraged access: The method 'InternalValidatorManager.getValidatorNames(Collection<ValidatorMetaData>)' is not API (restriction on classpath entry '/home/hudson/genie.webtools/.jenkins/jobs/webtools-javaee_R3_10/workspace/.repository/p2/osgi/bundle/org.eclipse.wst.validation/1.2.701.v201707142105/org.eclipse.wst.validation-1.2.701.v201707142105.jar')
[WARNING] /jobs/genie.webtools/webtools-javaee_R3_10/workspace/tests/org.eclipse.jst.validation.test/testFwk/org/eclipse/jst/validation/test/fwk/TestOpConstrOperation.java:[263] 
	String[] fullValidatorNames = InternalValidatorManager.getManager().getValidatorNames(fullValidators);
	                              ^^^^^^^^^^^^^^^^^^^^^^^^^^^^^^^^^^^^^
Discouraged access: The method 'InternalValidatorManager.getManager()' is not API (restriction on classpath entry '/home/hudson/genie.webtools/.jenkins/jobs/webtools-javaee_R3_10/workspace/.repository/p2/osgi/bundle/org.eclipse.wst.validation/1.2.701.v201707142105/org.eclipse.wst.validation-1.2.701.v201707142105.jar')
[WARNING] /jobs/genie.webtools/webtools-javaee_R3_10/workspace/tests/org.eclipse.jst.validation.test/testFwk/org/eclipse/jst/validation/test/fwk/TestOpConstrOperation.java:[263] 
	String[] fullValidatorNames = InternalValidatorManager.getManager().getValidatorNames(fullValidators);
	                              ^^^^^^^^^^^^^^^^^^^^^^^^
Discouraged access: The type 'InternalValidatorManager' is not API (restriction on classpath entry '/home/hudson/genie.webtools/.jenkins/jobs/webtools-javaee_R3_10/workspace/.repository/p2/osgi/bundle/org.eclipse.wst.validation/1.2.701.v201707142105/org.eclipse.wst.validation-1.2.701.v201707142105.jar')
[WARNING] /jobs/genie.webtools/webtools-javaee_R3_10/workspace/tests/org.eclipse.jst.validation.test/testFwk/org/eclipse/jst/validation/test/fwk/TestOpConstrOperation.java:[265] 
	vconf.setEnabledValidators(enabledVmd);
	^^^^^^^^^^^^^^^^^^^^^^^^^^^^^^^^^^^^^^
Discouraged access: The method 'ValidationConfiguration.setEnabledValidators(ValidatorMetaData[])' is not API (restriction on classpath entry '/home/hudson/genie.webtools/.jenkins/jobs/webtools-javaee_R3_10/workspace/.repository/p2/osgi/bundle/org.eclipse.wst.validation/1.2.701.v201707142105/org.eclipse.wst.validation-1.2.701.v201707142105.jar')
[WARNING] /jobs/genie.webtools/webtools-javaee_R3_10/workspace/tests/org.eclipse.jst.validation.test/testFwk/org/eclipse/jst/validation/test/fwk/TestOpConstrOperation.java:[266] 
	vconf.passivate();
	^^^^^^^^^^^^^^^^^
Discouraged access: The method 'ValidationConfiguration.passivate()' is not API (restriction on classpath entry '/home/hudson/genie.webtools/.jenkins/jobs/webtools-javaee_R3_10/workspace/.repository/p2/osgi/bundle/org.eclipse.wst.validation/1.2.701.v201707142105/org.eclipse.wst.validation-1.2.701.v201707142105.jar')
[WARNING] /jobs/genie.webtools/webtools-javaee_R3_10/workspace/tests/org.eclipse.jst.validation.test/testFwk/org/eclipse/jst/validation/test/fwk/TestOpConstrOperation.java:[275] 
	AllValidatorsOperation op1 = new AllValidatorsOperation(getProject());
	^^^^^^^^^^^^^^^^^^^^^^
Discouraged access: The type 'AllValidatorsOperation' is not API (restriction on classpath entry '/home/hudson/genie.webtools/.jenkins/jobs/webtools-javaee_R3_10/workspace/.repository/p2/osgi/bundle/org.eclipse.wst.validation/1.2.701.v201707142105/org.eclipse.wst.validation-1.2.701.v201707142105.jar')
[WARNING] /jobs/genie.webtools/webtools-javaee_R3_10/workspace/tests/org.eclipse.jst.validation.test/testFwk/org/eclipse/jst/validation/test/fwk/TestOpConstrOperation.java:[275] 
	AllValidatorsOperation op1 = new AllValidatorsOperation(getProject());
	                             ^^^^^^^^^^^^^^^^^^^^^^^^^^^^^^^^^^^^^^^^
Discouraged access: The constructor 'AllValidatorsOperation(IProject)' is not API (restriction on classpath entry '/home/hudson/genie.webtools/.jenkins/jobs/webtools-javaee_R3_10/workspace/.repository/p2/osgi/bundle/org.eclipse.wst.validation/1.2.701.v201707142105/org.eclipse.wst.validation-1.2.701.v201707142105.jar')
[WARNING] /jobs/genie.webtools/webtools-javaee_R3_10/workspace/tests/org.eclipse.jst.validation.test/testFwk/org/eclipse/jst/validation/test/fwk/TestOpConstrOperation.java:[275] 
	AllValidatorsOperation op1 = new AllValidatorsOperation(getProject());
	                                 ^^^^^^^^^^^^^^^^^^^^^^
Discouraged access: The type 'AllValidatorsOperation' is not API (restriction on classpath entry '/home/hudson/genie.webtools/.jenkins/jobs/webtools-javaee_R3_10/workspace/.repository/p2/osgi/bundle/org.eclipse.wst.validation/1.2.701.v201707142105/org.eclipse.wst.validation-1.2.701.v201707142105.jar')
[WARNING] /jobs/genie.webtools/webtools-javaee_R3_10/workspace/tests/org.eclipse.jst.validation.test/testFwk/org/eclipse/jst/validation/test/fwk/TestOpConstrOperation.java:[278] 
	AllValidatorsOperation op2 = new AllValidatorsOperation(getProject(), false); // don't fork
	^^^^^^^^^^^^^^^^^^^^^^
Discouraged access: The type 'AllValidatorsOperation' is not API (restriction on classpath entry '/home/hudson/genie.webtools/.jenkins/jobs/webtools-javaee_R3_10/workspace/.repository/p2/osgi/bundle/org.eclipse.wst.validation/1.2.701.v201707142105/org.eclipse.wst.validation-1.2.701.v201707142105.jar')
[WARNING] /jobs/genie.webtools/webtools-javaee_R3_10/workspace/tests/org.eclipse.jst.validation.test/testFwk/org/eclipse/jst/validation/test/fwk/TestOpConstrOperation.java:[278] 
	AllValidatorsOperation op2 = new AllValidatorsOperation(getProject(), false); // don't fork
	                             ^^^^^^^^^^^^^^^^^^^^^^^^^^^^^^^^^^^^^^^^^^^^^^^
Discouraged access: The constructor 'AllValidatorsOperation(IProject, boolean)' is not API (restriction on classpath entry '/home/hudson/genie.webtools/.jenkins/jobs/webtools-javaee_R3_10/workspace/.repository/p2/osgi/bundle/org.eclipse.wst.validation/1.2.701.v201707142105/org.eclipse.wst.validation-1.2.701.v201707142105.jar')
[WARNING] /jobs/genie.webtools/webtools-javaee_R3_10/workspace/tests/org.eclipse.jst.validation.test/testFwk/org/eclipse/jst/validation/test/fwk/TestOpConstrOperation.java:[278] 
	AllValidatorsOperation op2 = new AllValidatorsOperation(getProject(), false); // don't fork
	                                 ^^^^^^^^^^^^^^^^^^^^^^
Discouraged access: The type 'AllValidatorsOperation' is not API (restriction on classpath entry '/home/hudson/genie.webtools/.jenkins/jobs/webtools-javaee_R3_10/workspace/.repository/p2/osgi/bundle/org.eclipse.wst.validation/1.2.701.v201707142105/org.eclipse.wst.validation-1.2.701.v201707142105.jar')
[WARNING] /jobs/genie.webtools/webtools-javaee_R3_10/workspace/tests/org.eclipse.jst.validation.test/testFwk/org/eclipse/jst/validation/test/fwk/TestOpConstrOperation.java:[301] 
	EnabledIncrementalValidatorsOperation op3 = new EnabledIncrementalValidatorsOperation(getProject(), null,true);
	^^^^^^^^^^^^^^^^^^^^^^^^^^^^^^^^^^^^^
Discouraged access: The type 'EnabledIncrementalValidatorsOperation' is not API (restriction on classpath entry '/home/hudson/genie.webtools/.jenkins/jobs/webtools-javaee_R3_10/workspace/.repository/p2/osgi/bundle/org.eclipse.wst.validation/1.2.701.v201707142105/org.eclipse.wst.validation-1.2.701.v201707142105.jar')
[WARNING] /jobs/genie.webtools/webtools-javaee_R3_10/workspace/tests/org.eclipse.jst.validation.test/testFwk/org/eclipse/jst/validation/test/fwk/TestOpConstrOperation.java:[301] 
	EnabledIncrementalValidatorsOperation op3 = new EnabledIncrementalValidatorsOperation(getProject(), null,true);
	                                            ^^^^^^^^^^^^^^^^^^^^^^^^^^^^^^^^^^^^^^^^^^^^^^^^^^^^^^^^^^^^^^^^^^
Discouraged access: The constructor 'EnabledIncrementalValidatorsOperation(IProject, IResourceDelta, boolean)' is not API (restriction on classpath entry '/home/hudson/genie.webtools/.jenkins/jobs/webtools-javaee_R3_10/workspace/.repository/p2/osgi/bundle/org.eclipse.wst.validation/1.2.701.v201707142105/org.eclipse.wst.validation-1.2.701.v201707142105.jar')
[WARNING] /jobs/genie.webtools/webtools-javaee_R3_10/workspace/tests/org.eclipse.jst.validation.test/testFwk/org/eclipse/jst/validation/test/fwk/TestOpConstrOperation.java:[301] 
	EnabledIncrementalValidatorsOperation op3 = new EnabledIncrementalValidatorsOperation(getProject(), null,true);
	                                                ^^^^^^^^^^^^^^^^^^^^^^^^^^^^^^^^^^^^^
Discouraged access: The type 'EnabledIncrementalValidatorsOperation' is not API (restriction on classpath entry '/home/hudson/genie.webtools/.jenkins/jobs/webtools-javaee_R3_10/workspace/.repository/p2/osgi/bundle/org.eclipse.wst.validation/1.2.701.v201707142105/org.eclipse.wst.validation-1.2.701.v201707142105.jar')
[WARNING] /jobs/genie.webtools/webtools-javaee_R3_10/workspace/tests/org.eclipse.jst.validation.test/testFwk/org/eclipse/jst/validation/test/fwk/TestOpConstrOperation.java:[304] 
	EnabledIncrementalValidatorsOperation op4 = new EnabledIncrementalValidatorsOperation(getProject(), changedDelta,false);
	^^^^^^^^^^^^^^^^^^^^^^^^^^^^^^^^^^^^^
Discouraged access: The type 'EnabledIncrementalValidatorsOperation' is not API (restriction on classpath entry '/home/hudson/genie.webtools/.jenkins/jobs/webtools-javaee_R3_10/workspace/.repository/p2/osgi/bundle/org.eclipse.wst.validation/1.2.701.v201707142105/org.eclipse.wst.validation-1.2.701.v201707142105.jar')
[WARNING] /jobs/genie.webtools/webtools-javaee_R3_10/workspace/tests/org.eclipse.jst.validation.test/testFwk/org/eclipse/jst/validation/test/fwk/TestOpConstrOperation.java:[304] 
	EnabledIncrementalValidatorsOperation op4 = new EnabledIncrementalValidatorsOperation(getProject(), changedDelta,false);
	                                            ^^^^^^^^^^^^^^^^^^^^^^^^^^^^^^^^^^^^^^^^^^^^^^^^^^^^^^^^^^^^^^^^^^^^^^^^^^^
Discouraged access: The constructor 'EnabledIncrementalValidatorsOperation(IProject, IResourceDelta, boolean)' is not API (restriction on classpath entry '/home/hudson/genie.webtools/.jenkins/jobs/webtools-javaee_R3_10/workspace/.repository/p2/osgi/bundle/org.eclipse.wst.validation/1.2.701.v201707142105/org.eclipse.wst.validation-1.2.701.v201707142105.jar')
[WARNING] /jobs/genie.webtools/webtools-javaee_R3_10/workspace/tests/org.eclipse.jst.validation.test/testFwk/org/eclipse/jst/validation/test/fwk/TestOpConstrOperation.java:[304] 
	EnabledIncrementalValidatorsOperation op4 = new EnabledIncrementalValidatorsOperation(getProject(), changedDelta,false);
	                                                ^^^^^^^^^^^^^^^^^^^^^^^^^^^^^^^^^^^^^
Discouraged access: The type 'EnabledIncrementalValidatorsOperation' is not API (restriction on classpath entry '/home/hudson/genie.webtools/.jenkins/jobs/webtools-javaee_R3_10/workspace/.repository/p2/osgi/bundle/org.eclipse.wst.validation/1.2.701.v201707142105/org.eclipse.wst.validation-1.2.701.v201707142105.jar')
[WARNING] /jobs/genie.webtools/webtools-javaee_R3_10/workspace/tests/org.eclipse.jst.validation.test/testFwk/org/eclipse/jst/validation/test/fwk/TestOpConstrOperation.java:[307] 
	EnabledIncrementalValidatorsOperation op5 = new EnabledIncrementalValidatorsOperation(getProject(), emptyDelta,false);
	^^^^^^^^^^^^^^^^^^^^^^^^^^^^^^^^^^^^^
Discouraged access: The type 'EnabledIncrementalValidatorsOperation' is not API (restriction on classpath entry '/home/hudson/genie.webtools/.jenkins/jobs/webtools-javaee_R3_10/workspace/.repository/p2/osgi/bundle/org.eclipse.wst.validation/1.2.701.v201707142105/org.eclipse.wst.validation-1.2.701.v201707142105.jar')
[WARNING] /jobs/genie.webtools/webtools-javaee_R3_10/workspace/tests/org.eclipse.jst.validation.test/testFwk/org/eclipse/jst/validation/test/fwk/TestOpConstrOperation.java:[307] 
	EnabledIncrementalValidatorsOperation op5 = new EnabledIncrementalValidatorsOperation(getProject(), emptyDelta,false);
	                                            ^^^^^^^^^^^^^^^^^^^^^^^^^^^^^^^^^^^^^^^^^^^^^^^^^^^^^^^^^^^^^^^^^^^^^^^^^
Discouraged access: The constructor 'EnabledIncrementalValidatorsOperation(IProject, IResourceDelta, boolean)' is not API (restriction on classpath entry '/home/hudson/genie.webtools/.jenkins/jobs/webtools-javaee_R3_10/workspace/.repository/p2/osgi/bundle/org.eclipse.wst.validation/1.2.701.v201707142105/org.eclipse.wst.validation-1.2.701.v201707142105.jar')
[WARNING] /jobs/genie.webtools/webtools-javaee_R3_10/workspace/tests/org.eclipse.jst.validation.test/testFwk/org/eclipse/jst/validation/test/fwk/TestOpConstrOperation.java:[307] 
	EnabledIncrementalValidatorsOperation op5 = new EnabledIncrementalValidatorsOperation(getProject(), emptyDelta,false);
	                                                ^^^^^^^^^^^^^^^^^^^^^^^^^^^^^^^^^^^^^
Discouraged access: The type 'EnabledIncrementalValidatorsOperation' is not API (restriction on classpath entry '/home/hudson/genie.webtools/.jenkins/jobs/webtools-javaee_R3_10/workspace/.repository/p2/osgi/bundle/org.eclipse.wst.validation/1.2.701.v201707142105/org.eclipse.wst.validation-1.2.701.v201707142105.jar')
[WARNING] /jobs/genie.webtools/webtools-javaee_R3_10/workspace/tests/org.eclipse.jst.validation.test/testFwk/org/eclipse/jst/validation/test/fwk/TestOpConstrOperation.java:[310] 
	EnabledIncrementalValidatorsOperation op6 = new EnabledIncrementalValidatorsOperation(getProject(), null, IRuleGroup.PASS_FAST,false);
	^^^^^^^^^^^^^^^^^^^^^^^^^^^^^^^^^^^^^
Discouraged access: The type 'EnabledIncrementalValidatorsOperation' is not API (restriction on classpath entry '/home/hudson/genie.webtools/.jenkins/jobs/webtools-javaee_R3_10/workspace/.repository/p2/osgi/bundle/org.eclipse.wst.validation/1.2.701.v201707142105/org.eclipse.wst.validation-1.2.701.v201707142105.jar')
[WARNING] /jobs/genie.webtools/webtools-javaee_R3_10/workspace/tests/org.eclipse.jst.validation.test/testFwk/org/eclipse/jst/validation/test/fwk/TestOpConstrOperation.java:[310] 
	EnabledIncrementalValidatorsOperation op6 = new EnabledIncrementalValidatorsOperation(getProject(), null, IRuleGroup.PASS_FAST,false);
	                                            ^^^^^^^^^^^^^^^^^^^^^^^^^^^^^^^^^^^^^^^^^^^^^^^^^^^^^^^^^^^^^^^^^^^^^^^^^^^^^^^^^^^^^^^^^
Discouraged access: The constructor 'EnabledIncrementalValidatorsOperation(IProject, IResourceDelta, int, boolean)' is not API (restriction on classpath entry '/home/hudson/genie.webtools/.jenkins/jobs/webtools-javaee_R3_10/workspace/.repository/p2/osgi/bundle/org.eclipse.wst.validation/1.2.701.v201707142105/org.eclipse.wst.validation-1.2.701.v201707142105.jar')
[WARNING] /jobs/genie.webtools/webtools-javaee_R3_10/workspace/tests/org.eclipse.jst.validation.test/testFwk/org/eclipse/jst/validation/test/fwk/TestOpConstrOperation.java:[310] 
	EnabledIncrementalValidatorsOperation op6 = new EnabledIncrementalValidatorsOperation(getProject(), null, IRuleGroup.PASS_FAST,false);
	                                                ^^^^^^^^^^^^^^^^^^^^^^^^^^^^^^^^^^^^^
Discouraged access: The type 'EnabledIncrementalValidatorsOperation' is not API (restriction on classpath entry '/home/hudson/genie.webtools/.jenkins/jobs/webtools-javaee_R3_10/workspace/.repository/p2/osgi/bundle/org.eclipse.wst.validation/1.2.701.v201707142105/org.eclipse.wst.validation-1.2.701.v201707142105.jar')
[WARNING] /jobs/genie.webtools/webtools-javaee_R3_10/workspace/tests/org.eclipse.jst.validation.test/testFwk/org/eclipse/jst/validation/test/fwk/TestOpConstrOperation.java:[310] 
	EnabledIncrementalValidatorsOperation op6 = new EnabledIncrementalValidatorsOperation(getProject(), null, IRuleGroup.PASS_FAST,false);
	                                                                                                          ^^^^^^^^^^^^^^^^^^^^
Discouraged access: The type 'IRuleGroup' is not API (restriction on classpath entry '/home/hudson/genie.webtools/.jenkins/jobs/webtools-javaee_R3_10/workspace/.repository/p2/osgi/bundle/org.eclipse.wst.validation/1.2.701.v201707142105/org.eclipse.wst.validation-1.2.701.v201707142105.jar')
[WARNING] /jobs/genie.webtools/webtools-javaee_R3_10/workspace/tests/org.eclipse.jst.validation.test/testFwk/org/eclipse/jst/validation/test/fwk/TestOpConstrOperation.java:[310] 
	EnabledIncrementalValidatorsOperation op6 = new EnabledIncrementalValidatorsOperation(getProject(), null, IRuleGroup.PASS_FAST,false);
	                                                                                                                     ^^^^^^^^^
Discouraged access: The field 'IRuleGroup.PASS_FAST' is not API (restriction on classpath entry '/home/hudson/genie.webtools/.jenkins/jobs/webtools-javaee_R3_10/workspace/.repository/p2/osgi/bundle/org.eclipse.wst.validation/1.2.701.v201707142105/org.eclipse.wst.validation-1.2.701.v201707142105.jar')
[WARNING] /jobs/genie.webtools/webtools-javaee_R3_10/workspace/tests/org.eclipse.jst.validation.test/testFwk/org/eclipse/jst/validation/test/fwk/TestOpConstrOperation.java:[313] 
	EnabledIncrementalValidatorsOperation op7 = new EnabledIncrementalValidatorsOperation(getProject(), changedDelta, IRuleGroup.PASS_FAST,false);
	^^^^^^^^^^^^^^^^^^^^^^^^^^^^^^^^^^^^^
Discouraged access: The type 'EnabledIncrementalValidatorsOperation' is not API (restriction on classpath entry '/home/hudson/genie.webtools/.jenkins/jobs/webtools-javaee_R3_10/workspace/.repository/p2/osgi/bundle/org.eclipse.wst.validation/1.2.701.v201707142105/org.eclipse.wst.validation-1.2.701.v201707142105.jar')
[WARNING] /jobs/genie.webtools/webtools-javaee_R3_10/workspace/tests/org.eclipse.jst.validation.test/testFwk/org/eclipse/jst/validation/test/fwk/TestOpConstrOperation.java:[313] 
	EnabledIncrementalValidatorsOperation op7 = new EnabledIncrementalValidatorsOperation(getProject(), changedDelta, IRuleGroup.PASS_FAST,false);
	                                            ^^^^^^^^^^^^^^^^^^^^^^^^^^^^^^^^^^^^^^^^^^^^^^^^^^^^^^^^^^^^^^^^^^^^^^^^^^^^^^^^^^^^^^^^^^^^^^^^^
Discouraged access: The constructor 'EnabledIncrementalValidatorsOperation(IProject, IResourceDelta, int, boolean)' is not API (restriction on classpath entry '/home/hudson/genie.webtools/.jenkins/jobs/webtools-javaee_R3_10/workspace/.repository/p2/osgi/bundle/org.eclipse.wst.validation/1.2.701.v201707142105/org.eclipse.wst.validation-1.2.701.v201707142105.jar')
[WARNING] /jobs/genie.webtools/webtools-javaee_R3_10/workspace/tests/org.eclipse.jst.validation.test/testFwk/org/eclipse/jst/validation/test/fwk/TestOpConstrOperation.java:[313] 
	EnabledIncrementalValidatorsOperation op7 = new EnabledIncrementalValidatorsOperation(getProject(), changedDelta, IRuleGroup.PASS_FAST,false);
	                                                ^^^^^^^^^^^^^^^^^^^^^^^^^^^^^^^^^^^^^
Discouraged access: The type 'EnabledIncrementalValidatorsOperation' is not API (restriction on classpath entry '/home/hudson/genie.webtools/.jenkins/jobs/webtools-javaee_R3_10/workspace/.repository/p2/osgi/bundle/org.eclipse.wst.validation/1.2.701.v201707142105/org.eclipse.wst.validation-1.2.701.v201707142105.jar')
[WARNING] /jobs/genie.webtools/webtools-javaee_R3_10/workspace/tests/org.eclipse.jst.validation.test/testFwk/org/eclipse/jst/validation/test/fwk/TestOpConstrOperation.java:[313] 
	EnabledIncrementalValidatorsOperation op7 = new EnabledIncrementalValidatorsOperation(getProject(), changedDelta, IRuleGroup.PASS_FAST,false);
	                                                                                                                  ^^^^^^^^^^^^^^^^^^^^
Discouraged access: The type 'IRuleGroup' is not API (restriction on classpath entry '/home/hudson/genie.webtools/.jenkins/jobs/webtools-javaee_R3_10/workspace/.repository/p2/osgi/bundle/org.eclipse.wst.validation/1.2.701.v201707142105/org.eclipse.wst.validation-1.2.701.v201707142105.jar')
[WARNING] /jobs/genie.webtools/webtools-javaee_R3_10/workspace/tests/org.eclipse.jst.validation.test/testFwk/org/eclipse/jst/validation/test/fwk/TestOpConstrOperation.java:[313] 
	EnabledIncrementalValidatorsOperation op7 = new EnabledIncrementalValidatorsOperation(getProject(), changedDelta, IRuleGroup.PASS_FAST,false);
	                                                                                                                             ^^^^^^^^^
Discouraged access: The field 'IRuleGroup.PASS_FAST' is not API (restriction on classpath entry '/home/hudson/genie.webtools/.jenkins/jobs/webtools-javaee_R3_10/workspace/.repository/p2/osgi/bundle/org.eclipse.wst.validation/1.2.701.v201707142105/org.eclipse.wst.validation-1.2.701.v201707142105.jar')
[WARNING] /jobs/genie.webtools/webtools-javaee_R3_10/workspace/tests/org.eclipse.jst.validation.test/testFwk/org/eclipse/jst/validation/test/fwk/TestOpConstrOperation.java:[316] 
	EnabledIncrementalValidatorsOperation op8 = new EnabledIncrementalValidatorsOperation(getProject(), emptyDelta, IRuleGroup.PASS_FAST,false);
	^^^^^^^^^^^^^^^^^^^^^^^^^^^^^^^^^^^^^
Discouraged access: The type 'EnabledIncrementalValidatorsOperation' is not API (restriction on classpath entry '/home/hudson/genie.webtools/.jenkins/jobs/webtools-javaee_R3_10/workspace/.repository/p2/osgi/bundle/org.eclipse.wst.validation/1.2.701.v201707142105/org.eclipse.wst.validation-1.2.701.v201707142105.jar')
[WARNING] /jobs/genie.webtools/webtools-javaee_R3_10/workspace/tests/org.eclipse.jst.validation.test/testFwk/org/eclipse/jst/validation/test/fwk/TestOpConstrOperation.java:[316] 
	EnabledIncrementalValidatorsOperation op8 = new EnabledIncrementalValidatorsOperation(getProject(), emptyDelta, IRuleGroup.PASS_FAST,false);
	                                            ^^^^^^^^^^^^^^^^^^^^^^^^^^^^^^^^^^^^^^^^^^^^^^^^^^^^^^^^^^^^^^^^^^^^^^^^^^^^^^^^^^^^^^^^^^^^^^^
Discouraged access: The constructor 'EnabledIncrementalValidatorsOperation(IProject, IResourceDelta, int, boolean)' is not API (restriction on classpath entry '/home/hudson/genie.webtools/.jenkins/jobs/webtools-javaee_R3_10/workspace/.repository/p2/osgi/bundle/org.eclipse.wst.validation/1.2.701.v201707142105/org.eclipse.wst.validation-1.2.701.v201707142105.jar')
[WARNING] /jobs/genie.webtools/webtools-javaee_R3_10/workspace/tests/org.eclipse.jst.validation.test/testFwk/org/eclipse/jst/validation/test/fwk/TestOpConstrOperation.java:[316] 
	EnabledIncrementalValidatorsOperation op8 = new EnabledIncrementalValidatorsOperation(getProject(), emptyDelta, IRuleGroup.PASS_FAST,false);
	                                                ^^^^^^^^^^^^^^^^^^^^^^^^^^^^^^^^^^^^^
Discouraged access: The type 'EnabledIncrementalValidatorsOperation' is not API (restriction on classpath entry '/home/hudson/genie.webtools/.jenkins/jobs/webtools-javaee_R3_10/workspace/.repository/p2/osgi/bundle/org.eclipse.wst.validation/1.2.701.v201707142105/org.eclipse.wst.validation-1.2.701.v201707142105.jar')
[WARNING] /jobs/genie.webtools/webtools-javaee_R3_10/workspace/tests/org.eclipse.jst.validation.test/testFwk/org/eclipse/jst/validation/test/fwk/TestOpConstrOperation.java:[316] 
	EnabledIncrementalValidatorsOperation op8 = new EnabledIncrementalValidatorsOperation(getProject(), emptyDelta, IRuleGroup.PASS_FAST,false);
	                                                                                                                ^^^^^^^^^^^^^^^^^^^^
Discouraged access: The type 'IRuleGroup' is not API (restriction on classpath entry '/home/hudson/genie.webtools/.jenkins/jobs/webtools-javaee_R3_10/workspace/.repository/p2/osgi/bundle/org.eclipse.wst.validation/1.2.701.v201707142105/org.eclipse.wst.validation-1.2.701.v201707142105.jar')
[WARNING] /jobs/genie.webtools/webtools-javaee_R3_10/workspace/tests/org.eclipse.jst.validation.test/testFwk/org/eclipse/jst/validation/test/fwk/TestOpConstrOperation.java:[316] 
	EnabledIncrementalValidatorsOperation op8 = new EnabledIncrementalValidatorsOperation(getProject(), emptyDelta, IRuleGroup.PASS_FAST,false);
	                                                                                                                           ^^^^^^^^^
Discouraged access: The field 'IRuleGroup.PASS_FAST' is not API (restriction on classpath entry '/home/hudson/genie.webtools/.jenkins/jobs/webtools-javaee_R3_10/workspace/.repository/p2/osgi/bundle/org.eclipse.wst.validation/1.2.701.v201707142105/org.eclipse.wst.validation-1.2.701.v201707142105.jar')
[WARNING] /jobs/genie.webtools/webtools-javaee_R3_10/workspace/tests/org.eclipse.jst.validation.test/testFwk/org/eclipse/jst/validation/test/fwk/TestOpConstrOperation.java:[319] 
	EnabledIncrementalValidatorsOperation op9 = new EnabledIncrementalValidatorsOperation(getProject(), enabledIncrementalValidators, null, IRuleGroup.PASS_FAST);
	^^^^^^^^^^^^^^^^^^^^^^^^^^^^^^^^^^^^^
Discouraged access: The type 'EnabledIncrementalValidatorsOperation' is not API (restriction on classpath entry '/home/hudson/genie.webtools/.jenkins/jobs/webtools-javaee_R3_10/workspace/.repository/p2/osgi/bundle/org.eclipse.wst.validation/1.2.701.v201707142105/org.eclipse.wst.validation-1.2.701.v201707142105.jar')
[WARNING] /jobs/genie.webtools/webtools-javaee_R3_10/workspace/tests/org.eclipse.jst.validation.test/testFwk/org/eclipse/jst/validation/test/fwk/TestOpConstrOperation.java:[319] 
	EnabledIncrementalValidatorsOperation op9 = new EnabledIncrementalValidatorsOperation(getProject(), enabledIncrementalValidators, null, IRuleGroup.PASS_FAST);
	                                            ^^^^^^^^^^^^^^^^^^^^^^^^^^^^^^^^^^^^^^^^^^^^^^^^^^^^^^^^^^^^^^^^^^^^^^^^^^^^^^^^^^^^^^^^^^^^^^^^^^^^^^^^^^^^^^^^^
Discouraged access: The constructor 'EnabledIncrementalValidatorsOperation(IProject, Set<ValidatorMetaData>, IResourceDelta, int)' is not API (restriction on classpath entry '/home/hudson/genie.webtools/.jenkins/jobs/webtools-javaee_R3_10/workspace/.repository/p2/osgi/bundle/org.eclipse.wst.validation/1.2.701.v201707142105/org.eclipse.wst.validation-1.2.701.v201707142105.jar')
[WARNING] /jobs/genie.webtools/webtools-javaee_R3_10/workspace/tests/org.eclipse.jst.validation.test/testFwk/org/eclipse/jst/validation/test/fwk/TestOpConstrOperation.java:[319] 
	EnabledIncrementalValidatorsOperation op9 = new EnabledIncrementalValidatorsOperation(getProject(), enabledIncrementalValidators, null, IRuleGroup.PASS_FAST);
	                                                ^^^^^^^^^^^^^^^^^^^^^^^^^^^^^^^^^^^^^
Discouraged access: The type 'EnabledIncrementalValidatorsOperation' is not API (restriction on classpath entry '/home/hudson/genie.webtools/.jenkins/jobs/webtools-javaee_R3_10/workspace/.repository/p2/osgi/bundle/org.eclipse.wst.validation/1.2.701.v201707142105/org.eclipse.wst.validation-1.2.701.v201707142105.jar')
[WARNING] /jobs/genie.webtools/webtools-javaee_R3_10/workspace/tests/org.eclipse.jst.validation.test/testFwk/org/eclipse/jst/validation/test/fwk/TestOpConstrOperation.java:[319] 
	EnabledIncrementalValidatorsOperation op9 = new EnabledIncrementalValidatorsOperation(getProject(), enabledIncrementalValidators, null, IRuleGroup.PASS_FAST);
	                                                                                                                                        ^^^^^^^^^^^^^^^^^^^^
Discouraged access: The type 'IRuleGroup' is not API (restriction on classpath entry '/home/hudson/genie.webtools/.jenkins/jobs/webtools-javaee_R3_10/workspace/.repository/p2/osgi/bundle/org.eclipse.wst.validation/1.2.701.v201707142105/org.eclipse.wst.validation-1.2.701.v201707142105.jar')
[WARNING] /jobs/genie.webtools/webtools-javaee_R3_10/workspace/tests/org.eclipse.jst.validation.test/testFwk/org/eclipse/jst/validation/test/fwk/TestOpConstrOperation.java:[319] 
	EnabledIncrementalValidatorsOperation op9 = new EnabledIncrementalValidatorsOperation(getProject(), enabledIncrementalValidators, null, IRuleGroup.PASS_FAST);
	                                                                                                                                                   ^^^^^^^^^
Discouraged access: The field 'IRuleGroup.PASS_FAST' is not API (restriction on classpath entry '/home/hudson/genie.webtools/.jenkins/jobs/webtools-javaee_R3_10/workspace/.repository/p2/osgi/bundle/org.eclipse.wst.validation/1.2.701.v201707142105/org.eclipse.wst.validation-1.2.701.v201707142105.jar')
[WARNING] /jobs/genie.webtools/webtools-javaee_R3_10/workspace/tests/org.eclipse.jst.validation.test/testFwk/org/eclipse/jst/validation/test/fwk/TestOpConstrOperation.java:[322] 
	EnabledIncrementalValidatorsOperation op10 = new EnabledIncrementalValidatorsOperation(getProject(), enabledIncrementalValidators, changedDelta, IRuleGroup.PASS_FAST);
	^^^^^^^^^^^^^^^^^^^^^^^^^^^^^^^^^^^^^
Discouraged access: The type 'EnabledIncrementalValidatorsOperation' is not API (restriction on classpath entry '/home/hudson/genie.webtools/.jenkins/jobs/webtools-javaee_R3_10/workspace/.repository/p2/osgi/bundle/org.eclipse.wst.validation/1.2.701.v201707142105/org.eclipse.wst.validation-1.2.701.v201707142105.jar')
[WARNING] /jobs/genie.webtools/webtools-javaee_R3_10/workspace/tests/org.eclipse.jst.validation.test/testFwk/org/eclipse/jst/validation/test/fwk/TestOpConstrOperation.java:[322] 
	EnabledIncrementalValidatorsOperation op10 = new EnabledIncrementalValidatorsOperation(getProject(), enabledIncrementalValidators, changedDelta, IRuleGroup.PASS_FAST);
	                                             ^^^^^^^^^^^^^^^^^^^^^^^^^^^^^^^^^^^^^^^^^^^^^^^^^^^^^^^^^^^^^^^^^^^^^^^^^^^^^^^^^^^^^^^^^^^^^^^^^^^^^^^^^^^^^^^^^^^^^^^^^
Discouraged access: The constructor 'EnabledIncrementalValidatorsOperation(IProject, Set<ValidatorMetaData>, IResourceDelta, int)' is not API (restriction on classpath entry '/home/hudson/genie.webtools/.jenkins/jobs/webtools-javaee_R3_10/workspace/.repository/p2/osgi/bundle/org.eclipse.wst.validation/1.2.701.v201707142105/org.eclipse.wst.validation-1.2.701.v201707142105.jar')
[WARNING] /jobs/genie.webtools/webtools-javaee_R3_10/workspace/tests/org.eclipse.jst.validation.test/testFwk/org/eclipse/jst/validation/test/fwk/TestOpConstrOperation.java:[322] 
	EnabledIncrementalValidatorsOperation op10 = new EnabledIncrementalValidatorsOperation(getProject(), enabledIncrementalValidators, changedDelta, IRuleGroup.PASS_FAST);
	                                                 ^^^^^^^^^^^^^^^^^^^^^^^^^^^^^^^^^^^^^
Discouraged access: The type 'EnabledIncrementalValidatorsOperation' is not API (restriction on classpath entry '/home/hudson/genie.webtools/.jenkins/jobs/webtools-javaee_R3_10/workspace/.repository/p2/osgi/bundle/org.eclipse.wst.validation/1.2.701.v201707142105/org.eclipse.wst.validation-1.2.701.v201707142105.jar')
[WARNING] /jobs/genie.webtools/webtools-javaee_R3_10/workspace/tests/org.eclipse.jst.validation.test/testFwk/org/eclipse/jst/validation/test/fwk/TestOpConstrOperation.java:[322] 
	EnabledIncrementalValidatorsOperation op10 = new EnabledIncrementalValidatorsOperation(getProject(), enabledIncrementalValidators, changedDelta, IRuleGroup.PASS_FAST);
	                                                                                                                                                 ^^^^^^^^^^^^^^^^^^^^
Discouraged access: The type 'IRuleGroup' is not API (restriction on classpath entry '/home/hudson/genie.webtools/.jenkins/jobs/webtools-javaee_R3_10/workspace/.repository/p2/osgi/bundle/org.eclipse.wst.validation/1.2.701.v201707142105/org.eclipse.wst.validation-1.2.701.v201707142105.jar')
[WARNING] /jobs/genie.webtools/webtools-javaee_R3_10/workspace/tests/org.eclipse.jst.validation.test/testFwk/org/eclipse/jst/validation/test/fwk/TestOpConstrOperation.java:[322] 
	EnabledIncrementalValidatorsOperation op10 = new EnabledIncrementalValidatorsOperation(getProject(), enabledIncrementalValidators, changedDelta, IRuleGroup.PASS_FAST);
	                                                                                                                                                            ^^^^^^^^^
Discouraged access: The field 'IRuleGroup.PASS_FAST' is not API (restriction on classpath entry '/home/hudson/genie.webtools/.jenkins/jobs/webtools-javaee_R3_10/workspace/.repository/p2/osgi/bundle/org.eclipse.wst.validation/1.2.701.v201707142105/org.eclipse.wst.validation-1.2.701.v201707142105.jar')
[WARNING] /jobs/genie.webtools/webtools-javaee_R3_10/workspace/tests/org.eclipse.jst.validation.test/testFwk/org/eclipse/jst/validation/test/fwk/TestOpConstrOperation.java:[325] 
	EnabledIncrementalValidatorsOperation op11 = new EnabledIncrementalValidatorsOperation(getProject(), enabledIncrementalValidators, emptyDelta, IRuleGroup.PASS_FAST);
	^^^^^^^^^^^^^^^^^^^^^^^^^^^^^^^^^^^^^
Discouraged access: The type 'EnabledIncrementalValidatorsOperation' is not API (restriction on classpath entry '/home/hudson/genie.webtools/.jenkins/jobs/webtools-javaee_R3_10/workspace/.repository/p2/osgi/bundle/org.eclipse.wst.validation/1.2.701.v201707142105/org.eclipse.wst.validation-1.2.701.v201707142105.jar')
[WARNING] /jobs/genie.webtools/webtools-javaee_R3_10/workspace/tests/org.eclipse.jst.validation.test/testFwk/org/eclipse/jst/validation/test/fwk/TestOpConstrOperation.java:[325] 
	EnabledIncrementalValidatorsOperation op11 = new EnabledIncrementalValidatorsOperation(getProject(), enabledIncrementalValidators, emptyDelta, IRuleGroup.PASS_FAST);
	                                             ^^^^^^^^^^^^^^^^^^^^^^^^^^^^^^^^^^^^^^^^^^^^^^^^^^^^^^^^^^^^^^^^^^^^^^^^^^^^^^^^^^^^^^^^^^^^^^^^^^^^^^^^^^^^^^^^^^^^^^^
Discouraged access: The constructor 'EnabledIncrementalValidatorsOperation(IProject, Set<ValidatorMetaData>, IResourceDelta, int)' is not API (restriction on classpath entry '/home/hudson/genie.webtools/.jenkins/jobs/webtools-javaee_R3_10/workspace/.repository/p2/osgi/bundle/org.eclipse.wst.validation/1.2.701.v201707142105/org.eclipse.wst.validation-1.2.701.v201707142105.jar')
[WARNING] /jobs/genie.webtools/webtools-javaee_R3_10/workspace/tests/org.eclipse.jst.validation.test/testFwk/org/eclipse/jst/validation/test/fwk/TestOpConstrOperation.java:[325] 
	EnabledIncrementalValidatorsOperation op11 = new EnabledIncrementalValidatorsOperation(getProject(), enabledIncrementalValidators, emptyDelta, IRuleGroup.PASS_FAST);
	                                                 ^^^^^^^^^^^^^^^^^^^^^^^^^^^^^^^^^^^^^
Discouraged access: The type 'EnabledIncrementalValidatorsOperation' is not API (restriction on classpath entry '/home/hudson/genie.webtools/.jenkins/jobs/webtools-javaee_R3_10/workspace/.repository/p2/osgi/bundle/org.eclipse.wst.validation/1.2.701.v201707142105/org.eclipse.wst.validation-1.2.701.v201707142105.jar')
[WARNING] /jobs/genie.webtools/webtools-javaee_R3_10/workspace/tests/org.eclipse.jst.validation.test/testFwk/org/eclipse/jst/validation/test/fwk/TestOpConstrOperation.java:[325] 
	EnabledIncrementalValidatorsOperation op11 = new EnabledIncrementalValidatorsOperation(getProject(), enabledIncrementalValidators, emptyDelta, IRuleGroup.PASS_FAST);
	                                                                                                                                               ^^^^^^^^^^^^^^^^^^^^
Discouraged access: The type 'IRuleGroup' is not API (restriction on classpath entry '/home/hudson/genie.webtools/.jenkins/jobs/webtools-javaee_R3_10/workspace/.repository/p2/osgi/bundle/org.eclipse.wst.validation/1.2.701.v201707142105/org.eclipse.wst.validation-1.2.701.v201707142105.jar')
[WARNING] /jobs/genie.webtools/webtools-javaee_R3_10/workspace/tests/org.eclipse.jst.validation.test/testFwk/org/eclipse/jst/validation/test/fwk/TestOpConstrOperation.java:[325] 
	EnabledIncrementalValidatorsOperation op11 = new EnabledIncrementalValidatorsOperation(getProject(), enabledIncrementalValidators, emptyDelta, IRuleGroup.PASS_FAST);
	                                                                                                                                                          ^^^^^^^^^
Discouraged access: The field 'IRuleGroup.PASS_FAST' is not API (restriction on classpath entry '/home/hudson/genie.webtools/.jenkins/jobs/webtools-javaee_R3_10/workspace/.repository/p2/osgi/bundle/org.eclipse.wst.validation/1.2.701.v201707142105/org.eclipse.wst.validation-1.2.701.v201707142105.jar')
[WARNING] /jobs/genie.webtools/webtools-javaee_R3_10/workspace/tests/org.eclipse.jst.validation.test/testFwk/org/eclipse/jst/validation/test/fwk/TestOpConstrOperation.java:[328] 
	EnabledIncrementalValidatorsOperation op12 = new EnabledIncrementalValidatorsOperation(getProject(), null, false); // full validate, don't fork
	^^^^^^^^^^^^^^^^^^^^^^^^^^^^^^^^^^^^^
Discouraged access: The type 'EnabledIncrementalValidatorsOperation' is not API (restriction on classpath entry '/home/hudson/genie.webtools/.jenkins/jobs/webtools-javaee_R3_10/workspace/.repository/p2/osgi/bundle/org.eclipse.wst.validation/1.2.701.v201707142105/org.eclipse.wst.validation-1.2.701.v201707142105.jar')
[WARNING] /jobs/genie.webtools/webtools-javaee_R3_10/workspace/tests/org.eclipse.jst.validation.test/testFwk/org/eclipse/jst/validation/test/fwk/TestOpConstrOperation.java:[328] 
	EnabledIncrementalValidatorsOperation op12 = new EnabledIncrementalValidatorsOperation(getProject(), null, false); // full validate, don't fork
	                                             ^^^^^^^^^^^^^^^^^^^^^^^^^^^^^^^^^^^^^^^^^^^^^^^^^^^^^^^^^^^^^^^^^^^^
Discouraged access: The constructor 'EnabledIncrementalValidatorsOperation(IProject, IResourceDelta, boolean)' is not API (restriction on classpath entry '/home/hudson/genie.webtools/.jenkins/jobs/webtools-javaee_R3_10/workspace/.repository/p2/osgi/bundle/org.eclipse.wst.validation/1.2.701.v201707142105/org.eclipse.wst.validation-1.2.701.v201707142105.jar')
[WARNING] /jobs/genie.webtools/webtools-javaee_R3_10/workspace/tests/org.eclipse.jst.validation.test/testFwk/org/eclipse/jst/validation/test/fwk/TestOpConstrOperation.java:[328] 
	EnabledIncrementalValidatorsOperation op12 = new EnabledIncrementalValidatorsOperation(getProject(), null, false); // full validate, don't fork
	                                                 ^^^^^^^^^^^^^^^^^^^^^^^^^^^^^^^^^^^^^
Discouraged access: The type 'EnabledIncrementalValidatorsOperation' is not API (restriction on classpath entry '/home/hudson/genie.webtools/.jenkins/jobs/webtools-javaee_R3_10/workspace/.repository/p2/osgi/bundle/org.eclipse.wst.validation/1.2.701.v201707142105/org.eclipse.wst.validation-1.2.701.v201707142105.jar')
[WARNING] /jobs/genie.webtools/webtools-javaee_R3_10/workspace/tests/org.eclipse.jst.validation.test/testFwk/org/eclipse/jst/validation/test/fwk/TestOpConstrOperation.java:[331] 
	EnabledIncrementalValidatorsOperation op13 = new EnabledIncrementalValidatorsOperation(getProject(), changedDelta, false); // delta validate, don't fork
	^^^^^^^^^^^^^^^^^^^^^^^^^^^^^^^^^^^^^
Discouraged access: The type 'EnabledIncrementalValidatorsOperation' is not API (restriction on classpath entry '/home/hudson/genie.webtools/.jenkins/jobs/webtools-javaee_R3_10/workspace/.repository/p2/osgi/bundle/org.eclipse.wst.validation/1.2.701.v201707142105/org.eclipse.wst.validation-1.2.701.v201707142105.jar')
[WARNING] /jobs/genie.webtools/webtools-javaee_R3_10/workspace/tests/org.eclipse.jst.validation.test/testFwk/org/eclipse/jst/validation/test/fwk/TestOpConstrOperation.java:[331] 
	EnabledIncrementalValidatorsOperation op13 = new EnabledIncrementalValidatorsOperation(getProject(), changedDelta, false); // delta validate, don't fork
	                                             ^^^^^^^^^^^^^^^^^^^^^^^^^^^^^^^^^^^^^^^^^^^^^^^^^^^^^^^^^^^^^^^^^^^^^^^^^^^^
Discouraged access: The constructor 'EnabledIncrementalValidatorsOperation(IProject, IResourceDelta, boolean)' is not API (restriction on classpath entry '/home/hudson/genie.webtools/.jenkins/jobs/webtools-javaee_R3_10/workspace/.repository/p2/osgi/bundle/org.eclipse.wst.validation/1.2.701.v201707142105/org.eclipse.wst.validation-1.2.701.v201707142105.jar')
[WARNING] /jobs/genie.webtools/webtools-javaee_R3_10/workspace/tests/org.eclipse.jst.validation.test/testFwk/org/eclipse/jst/validation/test/fwk/TestOpConstrOperation.java:[331] 
	EnabledIncrementalValidatorsOperation op13 = new EnabledIncrementalValidatorsOperation(getProject(), changedDelta, false); // delta validate, don't fork
	                                                 ^^^^^^^^^^^^^^^^^^^^^^^^^^^^^^^^^^^^^
Discouraged access: The type 'EnabledIncrementalValidatorsOperation' is not API (restriction on classpath entry '/home/hudson/genie.webtools/.jenkins/jobs/webtools-javaee_R3_10/workspace/.repository/p2/osgi/bundle/org.eclipse.wst.validation/1.2.701.v201707142105/org.eclipse.wst.validation-1.2.701.v201707142105.jar')
[WARNING] /jobs/genie.webtools/webtools-javaee_R3_10/workspace/tests/org.eclipse.jst.validation.test/testFwk/org/eclipse/jst/validation/test/fwk/TestOpConstrOperation.java:[334] 
	EnabledIncrementalValidatorsOperation op14 = new EnabledIncrementalValidatorsOperation(getProject(), emptyDelta, false); // empty delta validate, don't fork
	^^^^^^^^^^^^^^^^^^^^^^^^^^^^^^^^^^^^^
Discouraged access: The type 'EnabledIncrementalValidatorsOperation' is not API (restriction on classpath entry '/home/hudson/genie.webtools/.jenkins/jobs/webtools-javaee_R3_10/workspace/.repository/p2/osgi/bundle/org.eclipse.wst.validation/1.2.701.v201707142105/org.eclipse.wst.validation-1.2.701.v201707142105.jar')
[WARNING] /jobs/genie.webtools/webtools-javaee_R3_10/workspace/tests/org.eclipse.jst.validation.test/testFwk/org/eclipse/jst/validation/test/fwk/TestOpConstrOperation.java:[334] 
	EnabledIncrementalValidatorsOperation op14 = new EnabledIncrementalValidatorsOperation(getProject(), emptyDelta, false); // empty delta validate, don't fork
	                                                 ^^^^^^^^^^^^^^^^^^^^^^^^^^^^^^^^^^^^^
Discouraged access: The type 'EnabledIncrementalValidatorsOperation' is not API (restriction on classpath entry '/home/hudson/genie.webtools/.jenkins/jobs/webtools-javaee_R3_10/workspace/.repository/p2/osgi/bundle/org.eclipse.wst.validation/1.2.701.v201707142105/org.eclipse.wst.validation-1.2.701.v201707142105.jar')
[WARNING] /jobs/genie.webtools/webtools-javaee_R3_10/workspace/tests/org.eclipse.jst.validation.test/test/org/eclipse/jst/validation/test/setup/TestCaseGeneratorOperation.java:[18] 
	import org.eclipse.wst.validation.internal.TaskListUtility;
	       ^^^^^^^^^^^^^^^^^^^^^^^^^^^^^^^^^^^^^^^^^^^^^^^^^^^
Discouraged access: The type 'TaskListUtility' is not API (restriction on classpath entry '/home/hudson/genie.webtools/.jenkins/jobs/webtools-javaee_R3_10/workspace/.repository/p2/osgi/bundle/org.eclipse.wst.validation/1.2.701.v201707142105/org.eclipse.wst.validation-1.2.701.v201707142105.jar')
[WARNING] /jobs/genie.webtools/webtools-javaee_R3_10/workspace/tests/org.eclipse.jst.validation.test/test/org/eclipse/jst/validation/test/setup/TestCaseGeneratorOperation.java:[19] 
	import org.eclipse.wst.validation.internal.ValidatorMetaData;
	       ^^^^^^^^^^^^^^^^^^^^^^^^^^^^^^^^^^^^^^^^^^^^^^^^^^^^^
Discouraged access: The type 'ValidatorMetaData' is not API (restriction on classpath entry '/home/hudson/genie.webtools/.jenkins/jobs/webtools-javaee_R3_10/workspace/.repository/p2/osgi/bundle/org.eclipse.wst.validation/1.2.701.v201707142105/org.eclipse.wst.validation-1.2.701.v201707142105.jar')
[WARNING] /jobs/genie.webtools/webtools-javaee_R3_10/workspace/tests/org.eclipse.jst.validation.test/test/org/eclipse/jst/validation/test/setup/TestCaseGeneratorOperation.java:[79] 
	IMarker[] markers = TaskListUtility.getValidationTasks(project, IMessage.ALL_MESSAGES);
	                    ^^^^^^^^^^^^^^^
Discouraged access: The type 'TaskListUtility' is not API (restriction on classpath entry '/home/hudson/genie.webtools/.jenkins/jobs/webtools-javaee_R3_10/workspace/.repository/p2/osgi/bundle/org.eclipse.wst.validation/1.2.701.v201707142105/org.eclipse.wst.validation-1.2.701.v201707142105.jar')
[WARNING] /jobs/genie.webtools/webtools-javaee_R3_10/workspace/tests/org.eclipse.jst.validation.test/test/org/eclipse/jst/validation/test/setup/TestCaseGeneratorOperation.java:[79] 
	IMarker[] markers = TaskListUtility.getValidationTasks(project, IMessage.ALL_MESSAGES);
	                    ^^^^^^^^^^^^^^^^^^^^^^^^^^^^^^^^^^^^^^^^^^^^^^^^^^^^^^^^^^^^^^^^^^
Discouraged access: The method 'TaskListUtility.getValidationTasks(IResource, int)' is not API (restriction on classpath entry '/home/hudson/genie.webtools/.jenkins/jobs/webtools-javaee_R3_10/workspace/.repository/p2/osgi/bundle/org.eclipse.wst.validation/1.2.701.v201707142105/org.eclipse.wst.validation-1.2.701.v201707142105.jar')
[WARNING] /jobs/genie.webtools/webtools-javaee_R3_10/workspace/tests/org.eclipse.jst.validation.test/test/org/eclipse/jst/validation/test/setup/TestCaseGeneratorOperation.java:[97] 
	ValidatorMetaData vmd = MessageUtility.getValidator(marker);
	^^^^^^^^^^^^^^^^^
Discouraged access: The type 'ValidatorMetaData' is not API (restriction on classpath entry '/home/hudson/genie.webtools/.jenkins/jobs/webtools-javaee_R3_10/workspace/.repository/p2/osgi/bundle/org.eclipse.wst.validation/1.2.701.v201707142105/org.eclipse.wst.validation-1.2.701.v201707142105.jar')
[WARNING] /jobs/genie.webtools/webtools-javaee_R3_10/workspace/tests/org.eclipse.jst.validation.test/test/org/eclipse/jst/validation/test/setup/TestCaseGeneratorOperation.java:[114] 
	ValidatorMetaData vmd = (ValidatorMetaData)iterator.next();
	^^^^^^^^^^^^^^^^^
Discouraged access: The type 'ValidatorMetaData' is not API (restriction on classpath entry '/home/hudson/genie.webtools/.jenkins/jobs/webtools-javaee_R3_10/workspace/.repository/p2/osgi/bundle/org.eclipse.wst.validation/1.2.701.v201707142105/org.eclipse.wst.validation-1.2.701.v201707142105.jar')
[WARNING] /jobs/genie.webtools/webtools-javaee_R3_10/workspace/tests/org.eclipse.jst.validation.test/test/org/eclipse/jst/validation/test/setup/TestCaseGeneratorOperation.java:[114] 
	ValidatorMetaData vmd = (ValidatorMetaData)iterator.next();
	                         ^^^^^^^^^^^^^^^^^
Discouraged access: The type 'ValidatorMetaData' is not API (restriction on classpath entry '/home/hudson/genie.webtools/.jenkins/jobs/webtools-javaee_R3_10/workspace/.repository/p2/osgi/bundle/org.eclipse.wst.validation/1.2.701.v201707142105/org.eclipse.wst.validation-1.2.701.v201707142105.jar')
[WARNING] /jobs/genie.webtools/webtools-javaee_R3_10/workspace/tests/org.eclipse.jst.validation.test/test/org/eclipse/jst/validation/test/setup/TestCaseGeneratorOperation.java:[116] 
	String testcaseTemplate = MessageFormat.format(_TESTCASE_TEMPLATE_, new String[]{project.getName(), vmd.getValidatorUniqueName(), buffer.toString()});
	                                                                                                    ^^^^^^^^^^^^^^^^^^^^^^^^^^^^
Discouraged access: The method 'ValidatorMetaData.getValidatorUniqueName()' is not API (restriction on classpath entry '/home/hudson/genie.webtools/.jenkins/jobs/webtools-javaee_R3_10/workspace/.repository/p2/osgi/bundle/org.eclipse.wst.validation/1.2.701.v201707142105/org.eclipse.wst.validation-1.2.701.v201707142105.jar')
[WARNING] /jobs/genie.webtools/webtools-javaee_R3_10/workspace/tests/org.eclipse.jst.validation.test/test/org/eclipse/jst/validation/test/setup/TestCaseGeneratorOperation.java:[125] 
	private StringBuffer getBuffer(ValidatorMetaData vmd) {
	                               ^^^^^^^^^^^^^^^^^
Discouraged access: The type 'ValidatorMetaData' is not API (restriction on classpath entry '/home/hudson/genie.webtools/.jenkins/jobs/webtools-javaee_R3_10/workspace/.repository/p2/osgi/bundle/org.eclipse.wst.validation/1.2.701.v201707142105/org.eclipse.wst.validation-1.2.701.v201707142105.jar')
[WARNING] /jobs/genie.webtools/webtools-javaee_R3_10/workspace/tests/org.eclipse.jst.validation.test/testFwk/org/eclipse/jst/validation/test/fwk/validator/FwkTestValidator.java:[4] 
	import org.eclipse.wst.validation.internal.core.IFileDelta;
	       ^^^^^^^^^^^^^^^^^^^^^^^^^^^^^^^^^^^^^^^^^^^^^^^^^^^
Discouraged access: The type 'IFileDelta' is not API (restriction on classpath entry '/home/hudson/genie.webtools/.jenkins/jobs/webtools-javaee_R3_10/workspace/.repository/p2/osgi/bundle/org.eclipse.wst.validation/1.2.701.v201707142105/org.eclipse.wst.validation-1.2.701.v201707142105.jar')
[WARNING] /jobs/genie.webtools/webtools-javaee_R3_10/workspace/tests/org.eclipse.jst.validation.test/testFwk/org/eclipse/jst/validation/test/fwk/validator/FwkTestValidator.java:[5] 
	import org.eclipse.wst.validation.internal.core.ValidationException;
	       ^^^^^^^^^^^^^^^^^^^^^^^^^^^^^^^^^^^^^^^^^^^^^^^^^^^^^^^^^^^^
Discouraged access: The type 'ValidationException' is not API (restriction on classpath entry '/home/hudson/genie.webtools/.jenkins/jobs/webtools-javaee_R3_10/workspace/.repository/p2/osgi/bundle/org.eclipse.wst.validation/1.2.701.v201707142105/org.eclipse.wst.validation-1.2.701.v201707142105.jar')
[WARNING] /jobs/genie.webtools/webtools-javaee_R3_10/workspace/tests/org.eclipse.jst.validation.test/testFwk/org/eclipse/jst/validation/test/fwk/validator/FwkTestValidator.java:[6] 
	import org.eclipse.wst.validation.internal.operations.LocalizedMessage;
	       ^^^^^^^^^^^^^^^^^^^^^^^^^^^^^^^^^^^^^^^^^^^^^^^^^^^^^^^^^^^^^^^
Discouraged access: The type 'LocalizedMessage' is not API (restriction on classpath entry '/home/hudson/genie.webtools/.jenkins/jobs/webtools-javaee_R3_10/workspace/.repository/p2/osgi/bundle/org.eclipse.wst.validation/1.2.701.v201707142105/org.eclipse.wst.validation-1.2.701.v201707142105.jar')
[WARNING] /jobs/genie.webtools/webtools-javaee_R3_10/workspace/tests/org.eclipse.jst.validation.test/testFwk/org/eclipse/jst/validation/test/fwk/validator/FwkTestValidator.java:[26] 
	public void validate(IValidationContext helper, IReporter reporter) throws ValidationException {
	                                                                           ^^^^^^^^^^^^^^^^^^^
Discouraged access: The type 'ValidationException' is not API (restriction on classpath entry '/home/hudson/genie.webtools/.jenkins/jobs/webtools-javaee_R3_10/workspace/.repository/p2/osgi/bundle/org.eclipse.wst.validation/1.2.701.v201707142105/org.eclipse.wst.validation-1.2.701.v201707142105.jar')
[WARNING] /jobs/genie.webtools/webtools-javaee_R3_10/workspace/tests/org.eclipse.jst.validation.test/testFwk/org/eclipse/jst/validation/test/fwk/validator/FwkTestValidator.java:[27] 
	IFileDelta[] delta = null;
	^^^^^^^^^^^^
Discouraged access: The type 'IFileDelta' is not API (restriction on classpath entry '/home/hudson/genie.webtools/.jenkins/jobs/webtools-javaee_R3_10/workspace/.repository/p2/osgi/bundle/org.eclipse.wst.validation/1.2.701.v201707142105/org.eclipse.wst.validation-1.2.701.v201707142105.jar')
[WARNING] /jobs/genie.webtools/webtools-javaee_R3_10/workspace/tests/org.eclipse.jst.validation.test/testFwk/org/eclipse/jst/validation/test/fwk/validator/FwkTestValidator.java:[30] 
	delta = (IFileDelta[])helper.loadModel(ALL_FILES);
	         ^^^^^^^^^^^^
Discouraged access: The type 'IFileDelta' is not API (restriction on classpath entry '/home/hudson/genie.webtools/.jenkins/jobs/webtools-javaee_R3_10/workspace/.repository/p2/osgi/bundle/org.eclipse.wst.validation/1.2.701.v201707142105/org.eclipse.wst.validation-1.2.701.v201707142105.jar')
[WARNING] /jobs/genie.webtools/webtools-javaee_R3_10/workspace/tests/org.eclipse.jst.validation.test/testFwk/org/eclipse/jst/validation/test/fwk/validator/FwkTestValidator.java:[40] 
	LocalizedMessage message = new LocalizedMessage(IMessage.LOW_SEVERITY, "This is a test message for the validation framework, reported by VF Test Validator. Please ignore.", target); //$NON-NLS-1$
	^^^^^^^^^^^^^^^^
Discouraged access: The type 'LocalizedMessage' is not API (restriction on classpath entry '/home/hudson/genie.webtools/.jenkins/jobs/webtools-javaee_R3_10/workspace/.repository/p2/osgi/bundle/org.eclipse.wst.validation/1.2.701.v201707142105/org.eclipse.wst.validation-1.2.701.v201707142105.jar')
[WARNING] /jobs/genie.webtools/webtools-javaee_R3_10/workspace/tests/org.eclipse.jst.validation.test/testFwk/org/eclipse/jst/validation/test/fwk/validator/FwkTestValidator.java:[40] 
	LocalizedMessage message = new LocalizedMessage(IMessage.LOW_SEVERITY, "This is a test message for the validation framework, reported by VF Test Validator. Please ignore.", target); //$NON-NLS-1$
	                           ^^^^^^^^^^^^^^^^^^^^^^^^^^^^^^^^^^^^^^^^^^^^^^^^^^^^^^^^^^^^^^^^^^^^^^^^^^^^^^^^^^^^^^^^^^^^^^^^^^^^^^^^^^^^^^^^^^^^^^^^^^^^^^^^^^^^^^^^^^^^^^^^^^^^^^^^^
Discouraged access: The constructor 'LocalizedMessage(int, String, Object)' is not API (restriction on classpath entry '/home/hudson/genie.webtools/.jenkins/jobs/webtools-javaee_R3_10/workspace/.repository/p2/osgi/bundle/org.eclipse.wst.validation/1.2.701.v201707142105/org.eclipse.wst.validation-1.2.701.v201707142105.jar')
[WARNING] /jobs/genie.webtools/webtools-javaee_R3_10/workspace/tests/org.eclipse.jst.validation.test/testFwk/org/eclipse/jst/validation/test/fwk/validator/FwkTestValidator.java:[40] 
	LocalizedMessage message = new LocalizedMessage(IMessage.LOW_SEVERITY, "This is a test message for the validation framework, reported by VF Test Validator. Please ignore.", target); //$NON-NLS-1$
	                               ^^^^^^^^^^^^^^^^
Discouraged access: The type 'LocalizedMessage' is not API (restriction on classpath entry '/home/hudson/genie.webtools/.jenkins/jobs/webtools-javaee_R3_10/workspace/.repository/p2/osgi/bundle/org.eclipse.wst.validation/1.2.701.v201707142105/org.eclipse.wst.validation-1.2.701.v201707142105.jar')
[WARNING] /jobs/genie.webtools/webtools-javaee_R3_10/workspace/tests/org.eclipse.jst.validation.test/test/org/eclipse/jst/validation/test/setup/CheckForUntestedPropertiesOperation.java:[22] 
	import org.eclipse.wst.validation.internal.ValidatorMetaData;
	       ^^^^^^^^^^^^^^^^^^^^^^^^^^^^^^^^^^^^^^^^^^^^^^^^^^^^^
Discouraged access: The type 'ValidatorMetaData' is not API (restriction on classpath entry '/home/hudson/genie.webtools/.jenkins/jobs/webtools-javaee_R3_10/workspace/.repository/p2/osgi/bundle/org.eclipse.wst.validation/1.2.701.v201707142105/org.eclipse.wst.validation-1.2.701.v201707142105.jar')
[WARNING] /jobs/genie.webtools/webtools-javaee_R3_10/workspace/tests/org.eclipse.jst.validation.test/test/org/eclipse/jst/validation/test/setup/CheckForUntestedPropertiesOperation.java:[28] 
	private ValidatorMetaData _vmd = null;
	        ^^^^^^^^^^^^^^^^^
Discouraged access: The type 'ValidatorMetaData' is not API (restriction on classpath entry '/home/hudson/genie.webtools/.jenkins/jobs/webtools-javaee_R3_10/workspace/.repository/p2/osgi/bundle/org.eclipse.wst.validation/1.2.701.v201707142105/org.eclipse.wst.validation-1.2.701.v201707142105.jar')
[WARNING] /jobs/genie.webtools/webtools-javaee_R3_10/workspace/tests/org.eclipse.jst.validation.test/test/org/eclipse/jst/validation/test/setup/CheckForUntestedPropertiesOperation.java:[31] 
	public CheckForUntestedPropertiesOperation(IBuffer buffer, ValidatorMetaData vmd, String resourceBundleName) {
	                                                           ^^^^^^^^^^^^^^^^^
Discouraged access: The type 'ValidatorMetaData' is not API (restriction on classpath entry '/home/hudson/genie.webtools/.jenkins/jobs/webtools-javaee_R3_10/workspace/.repository/p2/osgi/bundle/org.eclipse.wst.validation/1.2.701.v201707142105/org.eclipse.wst.validation-1.2.701.v201707142105.jar')
[WARNING] /jobs/genie.webtools/webtools-javaee_R3_10/workspace/tests/org.eclipse.jst.validation.test/test/org/eclipse/jst/validation/test/setup/CheckForUntestedPropertiesOperation.java:[42] 
	public ValidatorMetaData getValidatorMetaData() {
	       ^^^^^^^^^^^^^^^^^
Discouraged access: The type 'ValidatorMetaData' is not API (restriction on classpath entry '/home/hudson/genie.webtools/.jenkins/jobs/webtools-javaee_R3_10/workspace/.repository/p2/osgi/bundle/org.eclipse.wst.validation/1.2.701.v201707142105/org.eclipse.wst.validation-1.2.701.v201707142105.jar')
[WARNING] /jobs/genie.webtools/webtools-javaee_R3_10/workspace/tests/org.eclipse.jst.validation.test/test/org/eclipse/jst/validation/test/setup/CheckForUntestedPropertiesOperation.java:[45] 
	private String getPluginId(ValidatorMetaData vmd) {
	                           ^^^^^^^^^^^^^^^^^
Discouraged access: The type 'ValidatorMetaData' is not API (restriction on classpath entry '/home/hudson/genie.webtools/.jenkins/jobs/webtools-javaee_R3_10/workspace/.repository/p2/osgi/bundle/org.eclipse.wst.validation/1.2.701.v201707142105/org.eclipse.wst.validation-1.2.701.v201707142105.jar')
[WARNING] /jobs/genie.webtools/webtools-javaee_R3_10/workspace/tests/org.eclipse.jst.validation.test/test/org/eclipse/jst/validation/test/setup/CheckForUntestedPropertiesOperation.java:[49] 
	ClassLoader cl = vmd.getValidator().getClass().getClassLoader();
	                 ^^^^^^^^^^^^^^^^^^
Discouraged access: The method 'ValidatorMetaData.getValidator()' is not API (restriction on classpath entry '/home/hudson/genie.webtools/.jenkins/jobs/webtools-javaee_R3_10/workspace/.repository/p2/osgi/bundle/org.eclipse.wst.validation/1.2.701.v201707142105/org.eclipse.wst.validation-1.2.701.v201707142105.jar')
[WARNING] /jobs/genie.webtools/webtools-javaee_R3_10/workspace/tests/org.eclipse.jst.validation.test/test/org/eclipse/jst/validation/test/setup/CheckForUntestedPropertiesOperation.java:[64] 
	void setValidatorMetaData(ValidatorMetaData vmd) {
	                          ^^^^^^^^^^^^^^^^^
Discouraged access: The type 'ValidatorMetaData' is not API (restriction on classpath entry '/home/hudson/genie.webtools/.jenkins/jobs/webtools-javaee_R3_10/workspace/.repository/p2/osgi/bundle/org.eclipse.wst.validation/1.2.701.v201707142105/org.eclipse.wst.validation-1.2.701.v201707142105.jar')
[WARNING] /jobs/genie.webtools/webtools-javaee_R3_10/workspace/tests/org.eclipse.jst.validation.test/test/org/eclipse/jst/validation/test/setup/CheckForUntestedPropertiesOperation.java:[86] 
	ValidatorMetaData vmd = getValidatorMetaData();
	^^^^^^^^^^^^^^^^^
Discouraged access: The type 'ValidatorMetaData' is not API (restriction on classpath entry '/home/hudson/genie.webtools/.jenkins/jobs/webtools-javaee_R3_10/workspace/.repository/p2/osgi/bundle/org.eclipse.wst.validation/1.2.701.v201707142105/org.eclipse.wst.validation-1.2.701.v201707142105.jar')
[WARNING] /jobs/genie.webtools/webtools-javaee_R3_10/workspace/tests/org.eclipse.jst.validation.test/test/org/eclipse/jst/validation/test/setup/CheckForUntestedPropertiesOperation.java:[90] 
	String msg = "Cannot load plugin id for validator " + vmd.getValidatorDisplayName();//$NON-NLS-1$	
	                                                      ^^^^^^^^^^^^^^^^^^^^^^^^^^^^^
Discouraged access: The method 'ValidatorMetaData.getValidatorDisplayName()' is not API (restriction on classpath entry '/home/hudson/genie.webtools/.jenkins/jobs/webtools-javaee_R3_10/workspace/.repository/p2/osgi/bundle/org.eclipse.wst.validation/1.2.701.v201707142105/org.eclipse.wst.validation-1.2.701.v201707142105.jar')
[WARNING] /jobs/genie.webtools/webtools-javaee_R3_10/workspace/tests/org.eclipse.jst.validation.test/test/org/eclipse/jst/validation/test/internal/registry/TestcaseMetaData.java:[19] 
	import org.eclipse.wst.validation.internal.ValidatorMetaData;
	       ^^^^^^^^^^^^^^^^^^^^^^^^^^^^^^^^^^^^^^^^^^^^^^^^^^^^^
Discouraged access: The type 'ValidatorMetaData' is not API (restriction on classpath entry '/home/hudson/genie.webtools/.jenkins/jobs/webtools-javaee_R3_10/workspace/.repository/p2/osgi/bundle/org.eclipse.wst.validation/1.2.701.v201707142105/org.eclipse.wst.validation-1.2.701.v201707142105.jar')
[WARNING] /jobs/genie.webtools/webtools-javaee_R3_10/workspace/tests/org.eclipse.jst.validation.test/test/org/eclipse/jst/validation/test/internal/registry/TestcaseMetaData.java:[23] 
	private ValidatorMetaData _vmd = null;
	        ^^^^^^^^^^^^^^^^^
Discouraged access: The type 'ValidatorMetaData' is not API (restriction on classpath entry '/home/hudson/genie.webtools/.jenkins/jobs/webtools-javaee_R3_10/workspace/.repository/p2/osgi/bundle/org.eclipse.wst.validation/1.2.701.v201707142105/org.eclipse.wst.validation-1.2.701.v201707142105.jar')
[WARNING] /jobs/genie.webtools/webtools-javaee_R3_10/workspace/tests/org.eclipse.jst.validation.test/test/org/eclipse/jst/validation/test/internal/registry/TestcaseMetaData.java:[30] 
	public TestcaseMetaData(String pluginName, String project, ValidatorMetaData vmd, String inputFileName) {
	                                                           ^^^^^^^^^^^^^^^^^
Discouraged access: The type 'ValidatorMetaData' is not API (restriction on classpath entry '/home/hudson/genie.webtools/.jenkins/jobs/webtools-javaee_R3_10/workspace/.repository/p2/osgi/bundle/org.eclipse.wst.validation/1.2.701.v201707142105/org.eclipse.wst.validation-1.2.701.v201707142105.jar')
[WARNING] /jobs/genie.webtools/webtools-javaee_R3_10/workspace/tests/org.eclipse.jst.validation.test/test/org/eclipse/jst/validation/test/internal/registry/TestcaseMetaData.java:[112] 
	public ValidatorMetaData getValidatorMetaData() {
	       ^^^^^^^^^^^^^^^^^
Discouraged access: The type 'ValidatorMetaData' is not API (restriction on classpath entry '/home/hudson/genie.webtools/.jenkins/jobs/webtools-javaee_R3_10/workspace/.repository/p2/osgi/bundle/org.eclipse.wst.validation/1.2.701.v201707142105/org.eclipse.wst.validation-1.2.701.v201707142105.jar')
[WARNING] /jobs/genie.webtools/webtools-javaee_R3_10/workspace/tests/org.eclipse.jst.validation.test/test/org/eclipse/jst/validation/test/internal/registry/TestcaseMetaData.java:[117] 
	return getValidatorMetaData().getValidatorUniqueName();
	       ^^^^^^^^^^^^^^^^^^^^^^^^^^^^^^^^^^^^^^^^^^^^^^^
Discouraged access: The method 'ValidatorMetaData.getValidatorUniqueName()' is not API (restriction on classpath entry '/home/hudson/genie.webtools/.jenkins/jobs/webtools-javaee_R3_10/workspace/.repository/p2/osgi/bundle/org.eclipse.wst.validation/1.2.701.v201707142105/org.eclipse.wst.validation-1.2.701.v201707142105.jar')
[WARNING] /jobs/genie.webtools/webtools-javaee_R3_10/workspace/tests/org.eclipse.jst.validation.test/test/org/eclipse/jst/validation/test/internal/registry/TestcaseMetaData.java:[122] 
	_name = _vmd.getValidatorDisplayName() + "::" + getProject(); //$NON-NLS-1$
	        ^^^^^^^^^^^^^^^^^^^^^^^^^^^^^^
Discouraged access: The method 'ValidatorMetaData.getValidatorDisplayName()' is not API (restriction on classpath entry '/home/hudson/genie.webtools/.jenkins/jobs/webtools-javaee_R3_10/workspace/.repository/p2/osgi/bundle/org.eclipse.wst.validation/1.2.701.v201707142105/org.eclipse.wst.validation-1.2.701.v201707142105.jar')
[WARNING] /jobs/genie.webtools/webtools-javaee_R3_10/workspace/tests/org.eclipse.jst.validation.test/test/org/eclipse/jst/validation/test/internal/registry/BVTValidationRegistryReader.java:[33] 
	import org.eclipse.wst.validation.internal.ValidationRegistryReader;
	       ^^^^^^^^^^^^^^^^^^^^^^^^^^^^^^^^^^^^^^^^^^^^^^^^^^^^^^^^^^^^
Discouraged access: The type 'ValidationRegistryReader' is not API (restriction on classpath entry '/home/hudson/genie.webtools/.jenkins/jobs/webtools-javaee_R3_10/workspace/.repository/p2/osgi/bundle/org.eclipse.wst.validation/1.2.701.v201707142105/org.eclipse.wst.validation-1.2.701.v201707142105.jar')
[WARNING] /jobs/genie.webtools/webtools-javaee_R3_10/workspace/tests/org.eclipse.jst.validation.test/test/org/eclipse/jst/validation/test/internal/registry/BVTValidationRegistryReader.java:[34] 
	import org.eclipse.wst.validation.internal.ValidatorMetaData;
	       ^^^^^^^^^^^^^^^^^^^^^^^^^^^^^^^^^^^^^^^^^^^^^^^^^^^^^
Discouraged access: The type 'ValidatorMetaData' is not API (restriction on classpath entry '/home/hudson/genie.webtools/.jenkins/jobs/webtools-javaee_R3_10/workspace/.repository/p2/osgi/bundle/org.eclipse.wst.validation/1.2.701.v201707142105/org.eclipse.wst.validation-1.2.701.v201707142105.jar')
[WARNING] /jobs/genie.webtools/webtools-javaee_R3_10/workspace/tests/org.eclipse.jst.validation.test/test/org/eclipse/jst/validation/test/internal/registry/BVTValidationRegistryReader.java:[340] 
	ValidatorMetaData vmd = getValidatorMetaData(test);
	^^^^^^^^^^^^^^^^^
Discouraged access: The type 'ValidatorMetaData' is not API (restriction on classpath entry '/home/hudson/genie.webtools/.jenkins/jobs/webtools-javaee_R3_10/workspace/.repository/p2/osgi/bundle/org.eclipse.wst.validation/1.2.701.v201707142105/org.eclipse.wst.validation-1.2.701.v201707142105.jar')
[WARNING] /jobs/genie.webtools/webtools-javaee_R3_10/workspace/tests/org.eclipse.jst.validation.test/test/org/eclipse/jst/validation/test/internal/registry/BVTValidationRegistryReader.java:[375] 
	private ValidatorMetaData getValidatorMetaData(IConfigurationElement element) {
	        ^^^^^^^^^^^^^^^^^
Discouraged access: The type 'ValidatorMetaData' is not API (restriction on classpath entry '/home/hudson/genie.webtools/.jenkins/jobs/webtools-javaee_R3_10/workspace/.repository/p2/osgi/bundle/org.eclipse.wst.validation/1.2.701.v201707142105/org.eclipse.wst.validation-1.2.701.v201707142105.jar')
[WARNING] /jobs/genie.webtools/webtools-javaee_R3_10/workspace/tests/org.eclipse.jst.validation.test/test/org/eclipse/jst/validation/test/internal/registry/BVTValidationRegistryReader.java:[392] 
	ValidatorMetaData vmd = ValidationRegistryReader.getReader().getValidatorMetaData(validatorClass);
	^^^^^^^^^^^^^^^^^
Discouraged access: The type 'ValidatorMetaData' is not API (restriction on classpath entry '/home/hudson/genie.webtools/.jenkins/jobs/webtools-javaee_R3_10/workspace/.repository/p2/osgi/bundle/org.eclipse.wst.validation/1.2.701.v201707142105/org.eclipse.wst.validation-1.2.701.v201707142105.jar')
[WARNING] /jobs/genie.webtools/webtools-javaee_R3_10/workspace/tests/org.eclipse.jst.validation.test/test/org/eclipse/jst/validation/test/internal/registry/BVTValidationRegistryReader.java:[392] 
	ValidatorMetaData vmd = ValidationRegistryReader.getReader().getValidatorMetaData(validatorClass);
	                        ^^^^^^^^^^^^^^^^^^^^^^^^
Discouraged access: The type 'ValidationRegistryReader' is not API (restriction on classpath entry '/home/hudson/genie.webtools/.jenkins/jobs/webtools-javaee_R3_10/workspace/.repository/p2/osgi/bundle/org.eclipse.wst.validation/1.2.701.v201707142105/org.eclipse.wst.validation-1.2.701.v201707142105.jar')
[WARNING] /jobs/genie.webtools/webtools-javaee_R3_10/workspace/tests/org.eclipse.jst.validation.test/test/org/eclipse/jst/validation/test/internal/registry/BVTValidationRegistryReader.java:[392] 
	ValidatorMetaData vmd = ValidationRegistryReader.getReader().getValidatorMetaData(validatorClass);
	                        ^^^^^^^^^^^^^^^^^^^^^^^^^^^^^^^^^^^^
Discouraged access: The method 'ValidationRegistryReader.getReader()' is not API (restriction on classpath entry '/home/hudson/genie.webtools/.jenkins/jobs/webtools-javaee_R3_10/workspace/.repository/p2/osgi/bundle/org.eclipse.wst.validation/1.2.701.v201707142105/org.eclipse.wst.validation-1.2.701.v201707142105.jar')
[WARNING] /jobs/genie.webtools/webtools-javaee_R3_10/workspace/tests/org.eclipse.jst.validation.test/test/org/eclipse/jst/validation/test/internal/registry/BVTValidationRegistryReader.java:[392] 
	ValidatorMetaData vmd = ValidationRegistryReader.getReader().getValidatorMetaData(validatorClass);
	                        ^^^^^^^^^^^^^^^^^^^^^^^^^^^^^^^^^^^^^^^^^^^^^^^^^^^^^^^^^^^^^^^^^^^^^^^^^
Discouraged access: The method 'ValidationRegistryReader.getValidatorMetaData(String)' is not API (restriction on classpath entry '/home/hudson/genie.webtools/.jenkins/jobs/webtools-javaee_R3_10/workspace/.repository/p2/osgi/bundle/org.eclipse.wst.validation/1.2.701.v201707142105/org.eclipse.wst.validation-1.2.701.v201707142105.jar')
[WARNING] /jobs/genie.webtools/webtools-javaee_R3_10/workspace/tests/org.eclipse.jst.validation.test/test/org/eclipse/jst/validation/test/internal/util/BVTValidationUtility.java:[30] 
	import org.eclipse.wst.validation.internal.ConfigurationConstants;
	       ^^^^^^^^^^^^^^^^^^^^^^^^^^^^^^^^^^^^^^^^^^^^^^^^^^^^^^^^^^
Discouraged access: The type 'ConfigurationConstants' is not API (restriction on classpath entry '/home/hudson/genie.webtools/.jenkins/jobs/webtools-javaee_R3_10/workspace/.repository/p2/osgi/bundle/org.eclipse.wst.validation/1.2.701.v201707142105/org.eclipse.wst.validation-1.2.701.v201707142105.jar')
[WARNING] /jobs/genie.webtools/webtools-javaee_R3_10/workspace/tests/org.eclipse.jst.validation.test/test/org/eclipse/jst/validation/test/internal/util/BVTValidationUtility.java:[31] 
	import org.eclipse.wst.validation.internal.ValidationRegistryReader;
	       ^^^^^^^^^^^^^^^^^^^^^^^^^^^^^^^^^^^^^^^^^^^^^^^^^^^^^^^^^^^^
Discouraged access: The type 'ValidationRegistryReader' is not API (restriction on classpath entry '/home/hudson/genie.webtools/.jenkins/jobs/webtools-javaee_R3_10/workspace/.repository/p2/osgi/bundle/org.eclipse.wst.validation/1.2.701.v201707142105/org.eclipse.wst.validation-1.2.701.v201707142105.jar')
[WARNING] /jobs/genie.webtools/webtools-javaee_R3_10/workspace/tests/org.eclipse.jst.validation.test/test/org/eclipse/jst/validation/test/internal/util/BVTValidationUtility.java:[32] 
	import org.eclipse.wst.validation.internal.ValidatorMetaData;
	       ^^^^^^^^^^^^^^^^^^^^^^^^^^^^^^^^^^^^^^^^^^^^^^^^^^^^^
Discouraged access: The type 'ValidatorMetaData' is not API (restriction on classpath entry '/home/hudson/genie.webtools/.jenkins/jobs/webtools-javaee_R3_10/workspace/.repository/p2/osgi/bundle/org.eclipse.wst.validation/1.2.701.v201707142105/org.eclipse.wst.validation-1.2.701.v201707142105.jar')
[WARNING] /jobs/genie.webtools/webtools-javaee_R3_10/workspace/tests/org.eclipse.jst.validation.test/test/org/eclipse/jst/validation/test/internal/util/BVTValidationUtility.java:[42] 
	public static ValidatorMetaData getValidatorMetaData(IMarker marker) {
	              ^^^^^^^^^^^^^^^^^
Discouraged access: The type 'ValidatorMetaData' is not API (restriction on classpath entry '/home/hudson/genie.webtools/.jenkins/jobs/webtools-javaee_R3_10/workspace/.repository/p2/osgi/bundle/org.eclipse.wst.validation/1.2.701.v201707142105/org.eclipse.wst.validation-1.2.701.v201707142105.jar')
[WARNING] /jobs/genie.webtools/webtools-javaee_R3_10/workspace/tests/org.eclipse.jst.validation.test/test/org/eclipse/jst/validation/test/internal/util/BVTValidationUtility.java:[45] 
	validatorClassName = marker.getAttribute(ConfigurationConstants.VALIDATION_MARKER_OWNER).toString();
	                                         ^^^^^^^^^^^^^^^^^^^^^^^^^^^^^^^^^^^^^^^^^^^^^^
Discouraged access: The type 'ConfigurationConstants' is not API (restriction on classpath entry '/home/hudson/genie.webtools/.jenkins/jobs/webtools-javaee_R3_10/workspace/.repository/p2/osgi/bundle/org.eclipse.wst.validation/1.2.701.v201707142105/org.eclipse.wst.validation-1.2.701.v201707142105.jar')
[WARNING] /jobs/genie.webtools/webtools-javaee_R3_10/workspace/tests/org.eclipse.jst.validation.test/test/org/eclipse/jst/validation/test/internal/util/BVTValidationUtility.java:[45] 
	validatorClassName = marker.getAttribute(ConfigurationConstants.VALIDATION_MARKER_OWNER).toString();
	                                                                ^^^^^^^^^^^^^^^^^^^^^^^
Discouraged access: The field 'ConfigurationConstants.VALIDATION_MARKER_OWNER' is not API (restriction on classpath entry '/home/hudson/genie.webtools/.jenkins/jobs/webtools-javaee_R3_10/workspace/.repository/p2/osgi/bundle/org.eclipse.wst.validation/1.2.701.v201707142105/org.eclipse.wst.validation-1.2.701.v201707142105.jar')
[WARNING] /jobs/genie.webtools/webtools-javaee_R3_10/workspace/tests/org.eclipse.jst.validation.test/test/org/eclipse/jst/validation/test/internal/util/BVTValidationUtility.java:[46] 
	ValidatorMetaData vmd = ValidationRegistryReader.getReader().getValidatorMetaData(validatorClassName);
	^^^^^^^^^^^^^^^^^
Discouraged access: The type 'ValidatorMetaData' is not API (restriction on classpath entry '/home/hudson/genie.webtools/.jenkins/jobs/webtools-javaee_R3_10/workspace/.repository/p2/osgi/bundle/org.eclipse.wst.validation/1.2.701.v201707142105/org.eclipse.wst.validation-1.2.701.v201707142105.jar')
[WARNING] /jobs/genie.webtools/webtools-javaee_R3_10/workspace/tests/org.eclipse.jst.validation.test/test/org/eclipse/jst/validation/test/internal/util/BVTValidationUtility.java:[46] 
	ValidatorMetaData vmd = ValidationRegistryReader.getReader().getValidatorMetaData(validatorClassName);
	                        ^^^^^^^^^^^^^^^^^^^^^^^^
Discouraged access: The type 'ValidationRegistryReader' is not API (restriction on classpath entry '/home/hudson/genie.webtools/.jenkins/jobs/webtools-javaee_R3_10/workspace/.repository/p2/osgi/bundle/org.eclipse.wst.validation/1.2.701.v201707142105/org.eclipse.wst.validation-1.2.701.v201707142105.jar')
[WARNING] /jobs/genie.webtools/webtools-javaee_R3_10/workspace/tests/org.eclipse.jst.validation.test/test/org/eclipse/jst/validation/test/internal/util/BVTValidationUtility.java:[46] 
	ValidatorMetaData vmd = ValidationRegistryReader.getReader().getValidatorMetaData(validatorClassName);
	                        ^^^^^^^^^^^^^^^^^^^^^^^^^^^^^^^^^^^^
Discouraged access: The method 'ValidationRegistryReader.getReader()' is not API (restriction on classpath entry '/home/hudson/genie.webtools/.jenkins/jobs/webtools-javaee_R3_10/workspace/.repository/p2/osgi/bundle/org.eclipse.wst.validation/1.2.701.v201707142105/org.eclipse.wst.validation-1.2.701.v201707142105.jar')
[WARNING] /jobs/genie.webtools/webtools-javaee_R3_10/workspace/tests/org.eclipse.jst.validation.test/test/org/eclipse/jst/validation/test/internal/util/BVTValidationUtility.java:[46] 
	ValidatorMetaData vmd = ValidationRegistryReader.getReader().getValidatorMetaData(validatorClassName);
	                        ^^^^^^^^^^^^^^^^^^^^^^^^^^^^^^^^^^^^^^^^^^^^^^^^^^^^^^^^^^^^^^^^^^^^^^^^^^^^^
Discouraged access: The method 'ValidationRegistryReader.getValidatorMetaData(String)' is not API (restriction on classpath entry '/home/hudson/genie.webtools/.jenkins/jobs/webtools-javaee_R3_10/workspace/.repository/p2/osgi/bundle/org.eclipse.wst.validation/1.2.701.v201707142105/org.eclipse.wst.validation-1.2.701.v201707142105.jar')
[WARNING] /jobs/genie.webtools/webtools-javaee_R3_10/workspace/tests/org.eclipse.jst.validation.test/test/org/eclipse/jst/validation/test/internal/util/BVTValidationUtility.java:[56] 
	IMarker[] allMarkers = resource.findMarkers(ConfigurationConstants.VALIDATION_MARKER, false, IResource.DEPTH_INFINITE); // false means only consider PROBLEM_MARKER, not variants of PROBLEM_MARKER. Since addTask only adds PROBLEM_MARKER, we don't need to consider its subtypes.
	                                            ^^^^^^^^^^^^^^^^^^^^^^^^^^^^^^^^^^^^^^^^
Discouraged access: The type 'ConfigurationConstants' is not API (restriction on classpath entry '/home/hudson/genie.webtools/.jenkins/jobs/webtools-javaee_R3_10/workspace/.repository/p2/osgi/bundle/org.eclipse.wst.validation/1.2.701.v201707142105/org.eclipse.wst.validation-1.2.701.v201707142105.jar')
[WARNING] /jobs/genie.webtools/webtools-javaee_R3_10/workspace/tests/org.eclipse.jst.validation.test/test/org/eclipse/jst/validation/test/internal/util/BVTValidationUtility.java:[56] 
	IMarker[] allMarkers = resource.findMarkers(ConfigurationConstants.VALIDATION_MARKER, false, IResource.DEPTH_INFINITE); // false means only consider PROBLEM_MARKER, not variants of PROBLEM_MARKER. Since addTask only adds PROBLEM_MARKER, we don't need to consider its subtypes.
	                                                                   ^^^^^^^^^^^^^^^^^
Discouraged access: The field 'ConfigurationConstants.VALIDATION_MARKER' is not API (restriction on classpath entry '/home/hudson/genie.webtools/.jenkins/jobs/webtools-javaee_R3_10/workspace/.repository/p2/osgi/bundle/org.eclipse.wst.validation/1.2.701.v201707142105/org.eclipse.wst.validation-1.2.701.v201707142105.jar')
[WARNING] /jobs/genie.webtools/webtools-javaee_R3_10/workspace/tests/org.eclipse.jst.validation.test/test/org/eclipse/jst/validation/test/internal/util/BVTValidationUtility.java:[226] 
	public static ValidatorTestcase[] getValidatorTests(IProgressMonitor monitor, ValidatorMetaData vmd) {
	                                                                              ^^^^^^^^^^^^^^^^^
Discouraged access: The type 'ValidatorMetaData' is not API (restriction on classpath entry '/home/hudson/genie.webtools/.jenkins/jobs/webtools-javaee_R3_10/workspace/.repository/p2/osgi/bundle/org.eclipse.wst.validation/1.2.701.v201707142105/org.eclipse.wst.validation-1.2.701.v201707142105.jar')
[WARNING] /jobs/genie.webtools/webtools-javaee_R3_10/workspace/tests/org.eclipse.jst.validation.test/test/org/eclipse/jst/validation/test/internal/util/BVTValidationUtility.java:[241] 
	public static ValidatorMetaData[] getValidatorsThatHaveTests(IProgressMonitor monitor) {
	              ^^^^^^^^^^^^^^^^^^^
Discouraged access: The type 'ValidatorMetaData' is not API (restriction on classpath entry '/home/hudson/genie.webtools/.jenkins/jobs/webtools-javaee_R3_10/workspace/.repository/p2/osgi/bundle/org.eclipse.wst.validation/1.2.701.v201707142105/org.eclipse.wst.validation-1.2.701.v201707142105.jar')
[WARNING] /jobs/genie.webtools/webtools-javaee_R3_10/workspace/tests/org.eclipse.jst.validation.test/test/org/eclipse/jst/validation/test/internal/util/BVTValidationUtility.java:[249] 
	ValidatorMetaData[] vmds = new ValidatorMetaData[temp.size()];
	^^^^^^^^^^^^^^^^^^^
Discouraged access: The type 'ValidatorMetaData' is not API (restriction on classpath entry '/home/hudson/genie.webtools/.jenkins/jobs/webtools-javaee_R3_10/workspace/.repository/p2/osgi/bundle/org.eclipse.wst.validation/1.2.701.v201707142105/org.eclipse.wst.validation-1.2.701.v201707142105.jar')
[WARNING] /jobs/genie.webtools/webtools-javaee_R3_10/workspace/tests/org.eclipse.jst.validation.test/test/org/eclipse/jst/validation/test/internal/util/BVTValidationUtility.java:[249] 
	ValidatorMetaData[] vmds = new ValidatorMetaData[temp.size()];
	                               ^^^^^^^^^^^^^^^^^
Discouraged access: The type 'ValidatorMetaData' is not API (restriction on classpath entry '/home/hudson/genie.webtools/.jenkins/jobs/webtools-javaee_R3_10/workspace/.repository/p2/osgi/bundle/org.eclipse.wst.validation/1.2.701.v201707142105/org.eclipse.wst.validation-1.2.701.v201707142105.jar')
539 problems (539 warnings)
[INFO] 
[INFO] --- maven-resources-plugin:2.4.3:testResources (default-testResources) @ org.eclipse.jst.validation.test ---
[WARNING] Using platform encoding (UTF-8 actually) to copy filtered resources, i.e. build is platform dependent!
[INFO] skip non existing resourceDirectory /jobs/genie.webtools/webtools-javaee_R3_10/workspace/tests/org.eclipse.jst.validation.test/src/test/resources
[INFO] 
[INFO] --- tycho-source-plugin:1.1.0:plugin-source (plugin-source) @ org.eclipse.jst.validation.test ---
[INFO] Building jar: /jobs/genie.webtools/webtools-javaee_R3_10/workspace/tests/org.eclipse.jst.validation.test/target/org.eclipse.jst.validation.test-1.1.100-SNAPSHOT-sources.jar
[INFO] 
[INFO] --- target-platform-configuration:1.1.0:target-platform (default-target-platform) @ org.eclipse.jst.validation.test ---
[INFO] 
[INFO] --- tycho-packaging-plugin:1.1.0:package-plugin (default-package-plugin) @ org.eclipse.jst.validation.test ---
[INFO] Building jar: /jobs/genie.webtools/webtools-javaee_R3_10/workspace/tests/org.eclipse.jst.validation.test/validationtest.jar
[INFO] Building jar: /jobs/genie.webtools/webtools-javaee_R3_10/workspace/tests/org.eclipse.jst.validation.test/target/org.eclipse.jst.validation.test-1.1.100-SNAPSHOT.jar
[INFO] 
[INFO] --- tycho-p2-plugin:1.1.0:p2-metadata-default (default-p2-metadata-default) @ org.eclipse.jst.validation.test ---
[INFO] 
[INFO] --- tycho-surefire-plugin:1.1.0:test (default-test) @ org.eclipse.jst.validation.test ---
[INFO] Expected eclipse log file: /jobs/genie.webtools/webtools-javaee_R3_10/workspace/tests/org.eclipse.jst.validation.test/target/work/data/.metadata/.log
[INFO] Command line:
	[/opt/public/common/java/oracle/jdk1.8.0_162_x64/jre/bin/java, -Dosgi.noShutdown=false, -Dosgi.os=linux, -Dosgi.ws=gtk, -Dosgi.arch=x86_64, -Dosgi.clean=true, -jar, /jobs/genie.webtools/webtools-javaee_R3_10/workspace/.repository/p2/osgi/bundle/org.eclipse.equinox.launcher/1.5.0.v20180207-1446/org.eclipse.equinox.launcher-1.5.0.v20180207-1446.jar, -data, /jobs/genie.webtools/webtools-javaee_R3_10/workspace/tests/org.eclipse.jst.validation.test/target/work/data, -install, /jobs/genie.webtools/webtools-javaee_R3_10/workspace/tests/org.eclipse.jst.validation.test/target/work, -configuration, /jobs/genie.webtools/webtools-javaee_R3_10/workspace/tests/org.eclipse.jst.validation.test/target/work/configuration, -application, org.eclipse.tycho.surefire.osgibooter.headlesstest, -testproperties, /jobs/genie.webtools/webtools-javaee_R3_10/workspace/tests/org.eclipse.jst.validation.test/target/surefire.properties]
Picked up JAVA_TOOL_OPTIONS: -Xmx2G -Djava.io.tmpdir=/tmp/genie.webtools

-------------------------------------------------------
 T E S T S
-------------------------------------------------------
Running org.eclipse.jst.validation.test.junit.ValidatorTest
Tests run: 1, Failures: 0, Errors: 0, Skipped: 1, Time elapsed: 0.008 sec - in org.eclipse.jst.validation.test.junit.ValidatorTest
org.eclipse.jst.validation.test.junit.ValidatorTest skipped
Running org.eclipse.jst.validation.test.junit.OperationTest
Tests run: 1, Failures: 0, Errors: 0, Skipped: 1, Time elapsed: 0 sec - in org.eclipse.jst.validation.test.junit.OperationTest
org.eclipse.jst.validation.test.junit.OperationTest skipped
Running org.eclipse.jst.validation.api.test.ValidationRegistryApiTest
Tests run: 1, Failures: 0, Errors: 0, Skipped: 0, Time elapsed: 0.397 sec - in org.eclipse.jst.validation.api.test.ValidationRegistryApiTest
test_getValidator(org.eclipse.jst.validation.api.test.ValidationRegistryApiTest)  Time elapsed: 0.39 sec

Results :

Tests run: 3, Failures: 0, Errors: 0, Skipped: 2

[INFO] All tests passed!
[INFO] 
[INFO] --- tycho-pack200a-plugin:1.1.0:normalize (pack200-normalize) @ org.eclipse.jst.validation.test ---
[INFO] Pack200 normalizing jar /jobs/genie.webtools/webtools-javaee_R3_10/workspace/tests/org.eclipse.jst.validation.test/target/org.eclipse.jst.validation.test-1.1.100-SNAPSHOT.jar
Picked up JAVA_TOOL_OPTIONS: -Xmx2G -Djava.io.tmpdir=/tmp/genie.webtools
Picked up JAVA_TOOL_OPTIONS: -Xmx2G -Djava.io.tmpdir=/tmp/genie.webtools
[INFO] 
[INFO] --- eclipse-jarsigner-plugin:1.1.4:sign (sign) @ org.eclipse.jst.validation.test ---
[INFO] Signing of nested jars of '/jobs/genie.webtools/webtools-javaee_R3_10/workspace/tests/org.eclipse.jst.validation.test/target/org.eclipse.jst.validation.test-1.1.100-SNAPSHOT.jar_unpacked_3266860051050769081/testInput/FWK/BVT/opConstr.jar' is disabled.
[INFO] Signing jar: /jobs/genie.webtools/webtools-javaee_R3_10/workspace/tests/org.eclipse.jst.validation.test/target/org.eclipse.jst.validation.test-1.1.100-SNAPSHOT.jar_unpacked_3266860051050769081/testInput/FWK/BVT/opConstr.jar
[INFO] Signing of nested jars of '/jobs/genie.webtools/webtools-javaee_R3_10/workspace/tests/org.eclipse.jst.validation.test/target/org.eclipse.jst.validation.test-1.1.100-SNAPSHOT.jar_unpacked_3266860051050769081/testInput/Properties/aProperties.jar' is disabled.
[INFO] Signing jar: /jobs/genie.webtools/webtools-javaee_R3_10/workspace/tests/org.eclipse.jst.validation.test/target/org.eclipse.jst.validation.test-1.1.100-SNAPSHOT.jar_unpacked_3266860051050769081/testInput/Properties/aProperties.jar
[INFO] Signing of nested jars of '/jobs/genie.webtools/webtools-javaee_R3_10/workspace/tests/org.eclipse.jst.validation.test/target/org.eclipse.jst.validation.test-1.1.100-SNAPSHOT.jar_unpacked_3266860051050769081/validationtest.jar' is disabled.
[INFO] Signing jar: /jobs/genie.webtools/webtools-javaee_R3_10/workspace/tests/org.eclipse.jst.validation.test/target/org.eclipse.jst.validation.test-1.1.100-SNAPSHOT.jar_unpacked_3266860051050769081/validationtest.jar
[INFO] Signing jar: /jobs/genie.webtools/webtools-javaee_R3_10/workspace/tests/org.eclipse.jst.validation.test/target/org.eclipse.jst.validation.test-1.1.100-SNAPSHOT.jar
[INFO] Signing jar: /jobs/genie.webtools/webtools-javaee_R3_10/workspace/tests/org.eclipse.jst.validation.test/target/org.eclipse.jst.validation.test-1.1.100-SNAPSHOT-sources.jar
[INFO] 
[INFO] --- tycho-pack200b-plugin:1.1.0:pack (pack200-pack) @ org.eclipse.jst.validation.test ---
[INFO] Pack200 packing jar /jobs/genie.webtools/webtools-javaee_R3_10/workspace/tests/org.eclipse.jst.validation.test/target/org.eclipse.jst.validation.test-1.1.100-SNAPSHOT.jar
Picked up JAVA_TOOL_OPTIONS: -Xmx2G -Djava.io.tmpdir=/tmp/genie.webtools
[INFO] 
[INFO] --- tycho-p2-plugin:1.1.0:p2-metadata (p2-metadata) @ org.eclipse.jst.validation.test ---
[INFO] No baseline version MavenProject: org.eclipse.webtools.javaee:org.eclipse.jst.validation.test:1.1.100-SNAPSHOT @ /jobs/genie.webtools/webtools-javaee_R3_10/workspace/tests/org.eclipse.jst.validation.test/pom.xml
[INFO] 
[INFO] --- maven-install-plugin:2.3.1:install (default-install) @ org.eclipse.jst.validation.test ---
[INFO] Installing /jobs/genie.webtools/webtools-javaee_R3_10/workspace/tests/org.eclipse.jst.validation.test/target/org.eclipse.jst.validation.test-1.1.100-SNAPSHOT.jar to /home/hudson/genie.webtools/.jenkins/jobs/webtools-javaee_R3_10/workspace/.repository/org/eclipse/webtools/javaee/org.eclipse.jst.validation.test/1.1.100-SNAPSHOT/org.eclipse.jst.validation.test-1.1.100-SNAPSHOT.jar
[INFO] Installing /jobs/genie.webtools/webtools-javaee_R3_10/workspace/tests/org.eclipse.jst.validation.test/pom.xml to /home/hudson/genie.webtools/.jenkins/jobs/webtools-javaee_R3_10/workspace/.repository/org/eclipse/webtools/javaee/org.eclipse.jst.validation.test/1.1.100-SNAPSHOT/org.eclipse.jst.validation.test-1.1.100-SNAPSHOT.pom
[INFO] Installing /jobs/genie.webtools/webtools-javaee_R3_10/workspace/tests/org.eclipse.jst.validation.test/target/org.eclipse.jst.validation.test-1.1.100-SNAPSHOT-sources.jar to /home/hudson/genie.webtools/.jenkins/jobs/webtools-javaee_R3_10/workspace/.repository/org/eclipse/webtools/javaee/org.eclipse.jst.validation.test/1.1.100-SNAPSHOT/org.eclipse.jst.validation.test-1.1.100-SNAPSHOT-sources.jar
[INFO] Installing /jobs/genie.webtools/webtools-javaee_R3_10/workspace/tests/org.eclipse.jst.validation.test/target/org.eclipse.jst.validation.test-1.1.100-SNAPSHOT.jar.pack.gz to /home/hudson/genie.webtools/.jenkins/jobs/webtools-javaee_R3_10/workspace/.repository/org/eclipse/webtools/javaee/org.eclipse.jst.validation.test/1.1.100-SNAPSHOT/org.eclipse.jst.validation.test-1.1.100-SNAPSHOT-pack200.jar.pack.gz
[INFO] Installing /jobs/genie.webtools/webtools-javaee_R3_10/workspace/tests/org.eclipse.jst.validation.test/target/p2content.xml to /home/hudson/genie.webtools/.jenkins/jobs/webtools-javaee_R3_10/workspace/.repository/org/eclipse/webtools/javaee/org.eclipse.jst.validation.test/1.1.100-SNAPSHOT/org.eclipse.jst.validation.test-1.1.100-SNAPSHOT-p2metadata.xml
[INFO] Installing /jobs/genie.webtools/webtools-javaee_R3_10/workspace/tests/org.eclipse.jst.validation.test/target/p2artifacts.xml to /home/hudson/genie.webtools/.jenkins/jobs/webtools-javaee_R3_10/workspace/.repository/org/eclipse/webtools/javaee/org.eclipse.jst.validation.test/1.1.100-SNAPSHOT/org.eclipse.jst.validation.test-1.1.100-SNAPSHOT-p2artifacts.xml
[INFO] 
[INFO] --- tycho-p2-plugin:1.1.0:update-local-index (default-update-local-index) @ org.eclipse.jst.validation.test ---
[INFO] 
[INFO] ------------------------------------------------------------------------
[INFO] Skipping org.eclipse.webtools.javaee.site
[INFO] This project has been banned from the build due to previous failures.
[INFO] ------------------------------------------------------------------------
[INFO] ------------------------------------------------------------------------
[INFO] Reactor Summary:
[INFO] 
[INFO] org.eclipse.webtools.javaee ........................ SUCCESS [01:21 min]
[INFO] javaee.docs ........................................ SUCCESS [  0.108 s]
[INFO] org.eclipse.jst.ejb.doc.user ....................... SUCCESS [ 50.137 s]
[INFO] org.eclipse.jst.ejb.ui.infopop ..................... SUCCESS [  2.955 s]
[INFO] org.eclipse.jst.j2ee.doc.user ...................... SUCCESS [  9.226 s]
[INFO] org.eclipse.jst.j2ee.infopop ....................... SUCCESS [  4.205 s]
[INFO] org.eclipse.jst.servlet.ui.infopop ................. SUCCESS [  3.026 s]
[INFO] javaee.plugins ..................................... SUCCESS [  0.032 s]
[INFO] org.eclipse.jem.proxy .............................. SUCCESS [ 34.731 s]
[INFO] org.eclipse.jem .................................... SUCCESS [ 17.203 s]
[INFO] org.eclipse.jem.workbench .......................... SUCCESS [  5.816 s]
[INFO] org.eclipse.jem.beaninfo.vm.common ................. SUCCESS [  7.782 s]
[INFO] org.eclipse.jem.beaninfo.vm ........................ SUCCESS [  4.674 s]
[INFO] org.eclipse.jem.beaninfo ........................... SUCCESS [ 10.784 s]
[INFO] org.eclipse.jst.common.annotations.core ............ SUCCESS [  5.465 s]
[INFO] org.eclipse.jst.common.annotations.controller ...... SUCCESS [  6.682 s]
[INFO] org.eclipse.jst.common.annotations.ui .............. SUCCESS [  4.204 s]
[INFO] org.eclipse.jst.common.frameworks .................. SUCCESS [  4.668 s]
[INFO] org.eclipse.jst.common.ui .......................... SUCCESS [  9.177 s]
[INFO] org.eclipse.jst.j2ee.core .......................... SUCCESS [ 23.388 s]
[INFO] org.eclipse.jst.j2ee ............................... SUCCESS [ 12.683 s]
[INFO] org.eclipse.jst.j2ee.jca ........................... SUCCESS [ 11.191 s]
[INFO] org.eclipse.jst.jee ................................ SUCCESS [  5.985 s]
[INFO] org.eclipse.jst.j2ee.ejb ........................... SUCCESS [  6.176 s]
[INFO] org.eclipse.jst.j2ee.ejb.annotation.model .......... SUCCESS [  3.112 s]
[INFO] org.eclipse.jst.j2ee.web ........................... SUCCESS [  7.054 s]
[INFO] org.eclipse.jst.j2ee.ui ............................ SUCCESS [ 11.863 s]
[INFO] org.eclipse.jst.j2ee.jca.ui ........................ SUCCESS [  3.253 s]
[INFO] org.eclipse.jst.j2ee.navigator.ui .................. SUCCESS [  5.801 s]
[INFO] org.eclipse.jst.jee.ui ............................. SUCCESS [ 13.534 s]
[INFO] org.eclipse.jst.ejb.ui ............................. SUCCESS [ 15.554 s]
[INFO] org.eclipse.jst.j2ee.ejb.annotations.emitter ....... SUCCESS [ 10.611 s]
[INFO] org.eclipse.jst.j2ee.ejb.annotations.ui ............ SUCCESS [  9.249 s]
[INFO] org.eclipse.jst.j2ee.ejb.annotations.xdoclet ....... SUCCESS [  9.501 s]
[INFO] org.eclipse.jst.j2ee.webservice .................... SUCCESS [ 22.662 s]
[INFO] org.eclipse.jst.j2ee.webservice.ui ................. SUCCESS [  6.302 s]
[INFO] org.eclipse.jst.j2ee.xdoclet.runtime ............... SUCCESS [  6.033 s]
[INFO] org.eclipse.jst.jee.ejb ............................ SUCCESS [  8.932 s]
[INFO] org.eclipse.jst.jee.web ............................ SUCCESS [  5.030 s]
[INFO] org.eclipse.jst.servlet.ui ......................... SUCCESS [ 17.287 s]
[INFO] org.eclipse.wtp.jee.capabilities ................... SUCCESS [  3.878 s]
[INFO] javaee.tests ....................................... SUCCESS [  0.030 s]
[INFO] org.eclipse.jst.validation.sample .................. SUCCESS [  6.849 s]
[INFO] org.eclipse.jst.ejb.ui.tests ....................... SUCCESS [ 11.655 s]
[INFO] org.eclipse.jem.tests .............................. SUCCESS [ 17.555 s]
[INFO] org.eclipse.jst.j2ee.core.tests .................... SUCCESS [ 48.919 s]
[INFO] org.eclipse.jst.j2ee.tests ......................... SUCCESS [21:13 min]
[INFO] org.eclipse.jst.jee.tests .......................... FAILURE [30:20 min]
[INFO] org.eclipse.jst.servlet.tests ...................... SUCCESS [ 25.854 s]
[INFO] org.eclipse.jst.validation.test .................... SUCCESS [ 37.119 s]
[INFO] org.eclipse.webtools.javaee.site ................... SKIPPED
[INFO] ------------------------------------------------------------------------
[INFO] BUILD FAILURE
[INFO] ------------------------------------------------------------------------
[INFO] Total time: 01:08 h
[INFO] Finished at: 2018-03-29T12:37:16-04:00
[INFO] Final Memory: 170M/1304M
[INFO] ------------------------------------------------------------------------
[ERROR] Failed to execute goal org.eclipse.tycho:tycho-surefire-plugin:1.1.0:test (default-test) on project org.eclipse.jst.jee.tests: An unexpected error occured while launching the test runtime (return code 143). See log for details. -> [Help 1]
[ERROR] 
[ERROR] To see the full stack trace of the errors, re-run Maven with the -e switch.
[ERROR] Re-run Maven using the -X switch to enable full debug logging.
[ERROR] 
[ERROR] For more information about the errors and possible solutions, please read the following articles:
[ERROR] [Help 1] http://cwiki.apache.org/confluence/display/MAVEN/MojoFailureException
[ERROR] 
[ERROR] After correcting the problems, you can resume the build with the command
[ERROR]   mvn <goals> -rf :org.eclipse.jst.jee.tests
Build step 'Invoke top-level Maven targets' marked build as failure
Taking screenshot.
[workspace] $ echo $XAUTHORITY
/home/hudson/genie.webtools/.jenkins/jobs/webtools-javaee_R3_10/workspace/.Xauthority-9047979709939390248
[workspace] $ ls -l $XAUTHORITY
-rw-rw-r-- 1 genie.webtools webtools 0 Mar 29 11:28 /home/hudson/genie.webtools/.jenkins/jobs/webtools-javaee_R3_10/workspace/.Xauthority-9047979709939390248
[workspace] $ import -window root -display :456 screenshot.jpg
Terminating xvnc.
[WARNINGS] Skipping publisher since build result is FAILURE
append disk usage
Started calculate disk usage of build
Finished Calculation of disk usage of build in 0 seconds
Started calculate disk usage of workspace
Finished Calculation of disk usage of workspace in 0 seconds
Not sending mail to unregistered user stryker@redhat.com
Sending e-mails to: wtp-releng@eclipse.org
Recording test results
Archiving artifacts
[description-setter] Could not determine description.
Skipping calculation of disk usage, it was already done in post build step.
Finished: FAILURE