Console Output

Skipping 603 KB.. Full Log
    	at java.base/java.lang.reflect.Method.invoke(Method.java:566)
06:05:21     	at junit.framework.TestCase.runTest(TestCase.java:177)
06:05:21     	at junit.framework.TestCase.runBare(TestCase.java:142)
06:05:21     	at junit.framework.TestResult$1.protect(TestResult.java:122)
06:05:21     	at junit.framework.TestResult.runProtected(TestResult.java:142)
06:05:21     	at junit.framework.TestResult.run(TestResult.java:125)
06:05:21     	at junit.framework.TestCase.run(TestCase.java:130)
06:05:21     	at junit.framework.TestSuite.runTest(TestSuite.java:241)
06:05:21     	at junit.framework.TestSuite.run(TestSuite.java:236)
06:05:21     	at org.junit.internal.runners.JUnit38ClassRunner.run(JUnit38ClassRunner.java:90)
06:05:21     	at org.apache.maven.surefire.junit4.JUnit4Provider.execute(JUnit4Provider.java:365)
06:05:21     	at org.apache.maven.surefire.junit4.JUnit4Provider.executeWithRerun(JUnit4Provider.java:273)
06:05:21     	at org.apache.maven.surefire.junit4.JUnit4Provider.executeTestSet(JUnit4Provider.java:238)
06:05:21     	at org.apache.maven.surefire.junit4.JUnit4Provider.invoke(JUnit4Provider.java:159)
06:05:21     	at java.base/jdk.internal.reflect.NativeMethodAccessorImpl.invoke0(Native Method)
06:05:21     	at java.base/jdk.internal.reflect.NativeMethodAccessorImpl.invoke(NativeMethodAccessorImpl.java:62)
06:05:21     	at java.base/jdk.internal.reflect.DelegatingMethodAccessorImpl.invoke(DelegatingMethodAccessorImpl.java:43)
06:05:21     	at java.base/java.lang.reflect.Method.invoke(Method.java:566)
06:05:21     	at org.apache.maven.surefire.util.ReflectionUtils.invokeMethodWithArray2(ReflectionUtils.java:206)
06:05:21     	at org.apache.maven.surefire.booter.ProviderFactory$ProviderProxy.invoke(ProviderFactory.java:161)
06:05:21     	at org.apache.maven.surefire.booter.ProviderFactory.invokeProvider(ProviderFactory.java:84)
06:05:21     	at org.eclipse.tycho.surefire.osgibooter.OsgiSurefireBooter.run(OsgiSurefireBooter.java:116)
06:05:21     	at org.eclipse.tycho.surefire.osgibooter.HeadlessTestApplication.start(HeadlessTestApplication.java:23)
06:05:21     	at org.eclipse.equinox.internal.app.EclipseAppHandle.run(EclipseAppHandle.java:203)
06:05:21     	at org.eclipse.core.runtime.internal.adaptor.EclipseAppLauncher.runApplication(EclipseAppLauncher.java:136)
06:05:21     	at org.eclipse.core.runtime.internal.adaptor.EclipseAppLauncher.start(EclipseAppLauncher.java:104)
06:05:21     	at org.eclipse.core.runtime.adaptor.EclipseStarter.run(EclipseStarter.java:401)
06:05:21     	at org.eclipse.core.runtime.adaptor.EclipseStarter.run(EclipseStarter.java:255)
06:05:21     	at java.base/jdk.internal.reflect.NativeMethodAccessorImpl.invoke0(Native Method)
06:05:21     	at java.base/jdk.internal.reflect.NativeMethodAccessorImpl.invoke(NativeMethodAccessorImpl.java:62)
06:05:21     	at java.base/jdk.internal.reflect.DelegatingMethodAccessorImpl.invoke(DelegatingMethodAccessorImpl.java:43)
06:05:21     	at java.base/java.lang.reflect.Method.invoke(Method.java:566)
06:05:21     	at org.eclipse.equinox.launcher.Main.invokeFramework(Main.java:654)
06:05:21     	at org.eclipse.equinox.launcher.Main.basicRun(Main.java:591)
06:05:21     	at org.eclipse.equinox.launcher.Main.run(Main.java:1462)
06:05:21     	at org.eclipse.equinox.launcher.Main.main(Main.java:1435)
06:05:21 
06:05:21 *** ERROR ***: Tue Jun 29 10:05:21 UTC 2021    IWAE0037E Could not open /home/jenkins/agent/workspace/webtools-javaee-gerrit_master/tests/org.eclipse.jst.j2ee.core.tests/commonArchiveResources/WSSecured_InsuranceServices_EJB_WS.ear
06:05:21 
06:05:21 *** ERROR ***: Tue Jun 29 10:05:21 UTC 2021    java.io.FileNotFoundException: IWAE0036E URI Name: /home/jenkins/agent/workspace/webtools-javaee-gerrit_master/tests/org.eclipse.jst.j2ee.core.tests/commonArchiveResources/WSSecured_InsuranceServices_EJB_WS.ear; File name: /home/jenkins/agent/workspace/webtools-javaee-gerrit_master/tests/org.eclipse.jst.j2ee.core.tests/commonArchiveResources/WSSecured_InsuranceServices_EJB_WS.ear
06:05:21     	at org.eclipse.jst.j2ee.commonarchivecore.internal.impl.CommonarchiveFactoryImpl.createLoadStrategy(CommonarchiveFactoryImpl.java:342)
06:05:21     	at org.eclipse.jst.j2ee.commonarchivecore.internal.impl.CommonarchiveFactoryImpl.primOpenArchive(CommonarchiveFactoryImpl.java:876)
06:05:21     	at org.eclipse.jst.j2ee.commonarchivecore.internal.impl.CommonarchiveFactoryImpl.openEARFile(CommonarchiveFactoryImpl.java:639)
06:05:21     	at org.eclipse.jst.j2ee.archive.test.DefectVerificationTests.testServiceQNameTranslator(DefectVerificationTests.java:216)
06:05:21     	at java.base/jdk.internal.reflect.NativeMethodAccessorImpl.invoke0(Native Method)
06:05:21     	at java.base/jdk.internal.reflect.NativeMethodAccessorImpl.invoke(NativeMethodAccessorImpl.java:62)
06:05:21     	at java.base/jdk.internal.reflect.DelegatingMethodAccessorImpl.invoke(DelegatingMethodAccessorImpl.java:43)
06:05:21     	at java.base/java.lang.reflect.Method.invoke(Method.java:566)
06:05:21     	at junit.framework.TestCase.runTest(TestCase.java:177)
06:05:21     	at junit.framework.TestCase.runBare(TestCase.java:142)
06:05:21     	at junit.framework.TestResult$1.protect(TestResult.java:122)
06:05:21     	at junit.framework.TestResult.runProtected(TestResult.java:142)
06:05:21     	at junit.framework.TestResult.run(TestResult.java:125)
06:05:21     	at junit.framework.TestCase.run(TestCase.java:130)
06:05:21     	at junit.framework.TestSuite.runTest(TestSuite.java:241)
06:05:21     	at junit.framework.TestSuite.run(TestSuite.java:236)
06:05:21     	at org.junit.internal.runners.JUnit38ClassRunner.run(JUnit38ClassRunner.java:90)
06:05:21     	at org.apache.maven.surefire.junit4.JUnit4Provider.execute(JUnit4Provider.java:365)
06:05:21     	at org.apache.maven.surefire.junit4.JUnit4Provider.executeWithRerun(JUnit4Provider.java:273)
06:05:21     	at org.apache.maven.surefire.junit4.JUnit4Provider.executeTestSet(JUnit4Provider.java:238)
06:05:21     	at org.apache.maven.surefire.junit4.JUnit4Provider.invoke(JUnit4Provider.java:159)
06:05:21     	at java.base/jdk.internal.reflect.NativeMethodAccessorImpl.invoke0(Native Method)
06:05:21     	at java.base/jdk.internal.reflect.NativeMethodAccessorImpl.invoke(NativeMethodAccessorImpl.java:62)
06:05:21     	at java.base/jdk.internal.reflect.DelegatingMethodAccessorImpl.invoke(DelegatingMethodAccessorImpl.java:43)
06:05:21     	at java.base/java.lang.reflect.Method.invoke(Method.java:566)
06:05:21     	at org.apache.maven.surefire.util.ReflectionUtils.invokeMethodWithArray2(ReflectionUtils.java:206)
06:05:21     	at org.apache.maven.surefire.booter.ProviderFactory$ProviderProxy.invoke(ProviderFactory.java:161)
06:05:21     	at org.apache.maven.surefire.booter.ProviderFactory.invokeProvider(ProviderFactory.java:84)
06:05:21     	at org.eclipse.tycho.surefire.osgibooter.OsgiSurefireBooter.run(OsgiSurefireBooter.java:116)
06:05:21     	at org.eclipse.tycho.surefire.osgibooter.HeadlessTestApplication.start(HeadlessTestApplication.java:23)
06:05:21     	at org.eclipse.equinox.internal.app.EclipseAppHandle.run(EclipseAppHandle.java:203)
06:05:21     	at org.eclipse.core.runtime.internal.adaptor.EclipseAppLauncher.runApplication(EclipseAppLauncher.java:136)
06:05:21     	at org.eclipse.core.runtime.internal.adaptor.EclipseAppLauncher.start(EclipseAppLauncher.java:104)
06:05:21     	at org.eclipse.core.runtime.adaptor.EclipseStarter.run(EclipseStarter.java:401)
06:05:21     	at org.eclipse.core.runtime.adaptor.EclipseStarter.run(EclipseStarter.java:255)
06:05:21     	at java.base/jdk.internal.reflect.NativeMethodAccessorImpl.invoke0(Native Method)
06:05:21     	at java.base/jdk.internal.reflect.NativeMethodAccessorImpl.invoke(NativeMethodAccessorImpl.java:62)
06:05:21     	at java.base/jdk.internal.reflect.DelegatingMethodAccessorImpl.invoke(DelegatingMethodAccessorImpl.java:43)
06:05:21     	at java.base/java.lang.reflect.Method.invoke(Method.java:566)
06:05:21     	at org.eclipse.equinox.launcher.Main.invokeFramework(Main.java:654)
06:05:21     	at org.eclipse.equinox.launcher.Main.basicRun(Main.java:591)
06:05:21     	at org.eclipse.equinox.launcher.Main.run(Main.java:1462)
06:05:21     	at org.eclipse.equinox.launcher.Main.main(Main.java:1435)
06:05:21 
06:05:21 *** ERROR ***: Tue Jun 29 10:05:21 UTC 2021    java.io.FileNotFoundException: IWAE0036E URI Name: /home/jenkins/agent/workspace/webtools-javaee-gerrit_master/tests/org.eclipse.jst.j2ee.core.tests/commonArchiveResources/WSSecured_InsuranceServices_EJB_WS.ear; File name: /home/jenkins/agent/workspace/webtools-javaee-gerrit_master/tests/org.eclipse.jst.j2ee.core.tests/commonArchiveResources/WSSecured_InsuranceServices_EJB_WS.ear
06:05:21     	at org.eclipse.jst.j2ee.commonarchivecore.internal.impl.CommonarchiveFactoryImpl.createLoadStrategy(CommonarchiveFactoryImpl.java:342)
06:05:21     	at org.eclipse.jst.j2ee.commonarchivecore.internal.impl.CommonarchiveFactoryImpl.primOpenArchive(CommonarchiveFactoryImpl.java:876)
06:05:21     	at org.eclipse.jst.j2ee.commonarchivecore.internal.impl.CommonarchiveFactoryImpl.openEARFile(CommonarchiveFactoryImpl.java:639)
06:05:21     	at org.eclipse.jst.j2ee.archive.test.DefectVerificationTests.testServiceQNameTranslator(DefectVerificationTests.java:216)
06:05:21     	at java.base/jdk.internal.reflect.NativeMethodAccessorImpl.invoke0(Native Method)
06:05:21     	at java.base/jdk.internal.reflect.NativeMethodAccessorImpl.invoke(NativeMethodAccessorImpl.java:62)
06:05:21     	at java.base/jdk.internal.reflect.DelegatingMethodAccessorImpl.invoke(DelegatingMethodAccessorImpl.java:43)
06:05:21     	at java.base/java.lang.reflect.Method.invoke(Method.java:566)
06:05:21     	at junit.framework.TestCase.runTest(TestCase.java:177)
06:05:21     	at junit.framework.TestCase.runBare(TestCase.java:142)
06:05:21     	at junit.framework.TestResult$1.protect(TestResult.java:122)
06:05:21     	at junit.framework.TestResult.runProtected(TestResult.java:142)
06:05:21     	at junit.framework.TestResult.run(TestResult.java:125)
06:05:21     	at junit.framework.TestCase.run(TestCase.java:130)
06:05:21     	at junit.framework.TestSuite.runTest(TestSuite.java:241)
06:05:21     	at junit.framework.TestSuite.run(TestSuite.java:236)
06:05:21     	at org.junit.internal.runners.JUnit38ClassRunner.run(JUnit38ClassRunner.java:90)
06:05:21     	at org.apache.maven.surefire.junit4.JUnit4Provider.execute(JUnit4Provider.java:365)
06:05:21     	at org.apache.maven.surefire.junit4.JUnit4Provider.executeWithRerun(JUnit4Provider.java:273)
06:05:21     	at org.apache.maven.surefire.junit4.JUnit4Provider.executeTestSet(JUnit4Provider.java:238)
06:05:21     	at org.apache.maven.surefire.junit4.JUnit4Provider.invoke(JUnit4Provider.java:159)
06:05:21     	at java.base/jdk.internal.reflect.NativeMethodAccessorImpl.invoke0(Native Method)
06:05:21     	at java.base/jdk.internal.reflect.NativeMethodAccessorImpl.invoke(NativeMethodAccessorImpl.java:62)
06:05:21     	at java.base/jdk.internal.reflect.DelegatingMethodAccessorImpl.invoke(DelegatingMethodAccessorImpl.java:43)
06:05:21     	at java.base/java.lang.reflect.Method.invoke(Method.java:566)
06:05:21     	at org.apache.maven.surefire.util.ReflectionUtils.invokeMethodWithArray2(ReflectionUtils.java:206)
06:05:21     	at org.apache.maven.surefire.booter.ProviderFactory$ProviderProxy.invoke(ProviderFactory.java:161)
06:05:21     	at org.apache.maven.surefire.booter.ProviderFactory.invokeProvider(ProviderFactory.java:84)
06:05:21     	at org.eclipse.tycho.surefire.osgibooter.OsgiSurefireBooter.run(OsgiSurefireBooter.java:116)
06:05:21     	at org.eclipse.tycho.surefire.osgibooter.HeadlessTestApplication.start(HeadlessTestApplication.java:23)
06:05:21     	at org.eclipse.equinox.internal.app.EclipseAppHandle.run(EclipseAppHandle.java:203)
06:05:21     	at org.eclipse.core.runtime.internal.adaptor.EclipseAppLauncher.runApplication(EclipseAppLauncher.java:136)
06:05:21     	at org.eclipse.core.runtime.internal.adaptor.EclipseAppLauncher.start(EclipseAppLauncher.java:104)
06:05:21     	at org.eclipse.core.runtime.adaptor.EclipseStarter.run(EclipseStarter.java:401)
06:05:21     	at org.eclipse.core.runtime.adaptor.EclipseStarter.run(EclipseStarter.java:255)
06:05:21     	at java.base/jdk.internal.reflect.NativeMethodAccessorImpl.invoke0(Native Method)
06:05:21     	at java.base/jdk.internal.reflect.NativeMethodAccessorImpl.invoke(NativeMethodAccessorImpl.java:62)
06:05:21     	at java.base/jdk.internal.reflect.DelegatingMethodAccessorImpl.invoke(DelegatingMethodAccessorImpl.java:43)
06:05:21     	at java.base/java.lang.reflect.Method.invoke(Method.java:566)
06:05:21     	at org.eclipse.equinox.launcher.Main.invokeFramework(Main.java:654)
06:05:21     	at org.eclipse.equinox.launcher.Main.basicRun(Main.java:591)
06:05:21     	at org.eclipse.equinox.launcher.Main.run(Main.java:1462)
06:05:21     	at org.eclipse.equinox.launcher.Main.main(Main.java:1435)
06:05:21 
06:05:21 *** ERROR ***: Tue Jun 29 10:05:21 UTC 2021    IWAE0037E Could not open /home/jenkins/agent/workspace/webtools-javaee-gerrit_master/tests/org.eclipse.jst.j2ee.core.tests/commonArchiveResources/WSSecured_InsuranceServices_EJB_WS.ear
06:05:21     IWAE0036E URI Name: /home/jenkins/agent/workspace/webtools-javaee-gerrit_master/tests/org.eclipse.jst.j2ee.core.tests/commonArchiveResources/WSSecured_InsuranceServices_EJB_WS.ear; File name: /home/jenkins/agent/workspace/webtools-javaee-gerrit_master/tests/org.eclipse.jst.j2ee.core.tests/commonArchiveResources/WSSecured_InsuranceServices_EJB_WS.ear
06:05:21 Tests run: 7, Failures: 0, Errors: 5, Skipped: 0, Time elapsed: 0.025 s <<< FAILURE! - in org.eclipse.jst.j2ee.archive.test.DefectVerificationTests
06:05:21 testSavingEARWhileDeploying(org.eclipse.jst.j2ee.archive.test.DefectVerificationTests)  Time elapsed: 0.008 s  <<< ERROR!
06:05:21 org.eclipse.jst.j2ee.commonarchivecore.internal.exception.OpenFailureException: IWAE0037E Could not open /home/jenkins/agent/workspace/webtools-javaee-gerrit_master/tests/org.eclipse.jst.j2ee.core.tests/commonArchiveResources/AuctionApp.ear
06:05:21 	at org.eclipse.jst.j2ee.archive.test.DefectVerificationTests.testSavingEARWhileDeploying(DefectVerificationTests.java:172)
06:05:21 Caused by: java.io.FileNotFoundException: IWAE0036E URI Name: /home/jenkins/agent/workspace/webtools-javaee-gerrit_master/tests/org.eclipse.jst.j2ee.core.tests/commonArchiveResources/AuctionApp.ear; File name: /home/jenkins/agent/workspace/webtools-javaee-gerrit_master/tests/org.eclipse.jst.j2ee.core.tests/commonArchiveResources/AuctionApp.ear
06:05:21 	at org.eclipse.jst.j2ee.archive.test.DefectVerificationTests.testSavingEARWhileDeploying(DefectVerificationTests.java:172)
06:05:21 
06:05:21 testFilterMappingTranslator(org.eclipse.jst.j2ee.archive.test.DefectVerificationTests)  Time elapsed: 0 s  <<< ERROR!
06:05:21 org.eclipse.jst.j2ee.commonarchivecore.internal.exception.OpenFailureException: IWAE0037E Could not open /home/jenkins/agent/workspace/webtools-javaee-gerrit_master/tests/org.eclipse.jst.j2ee.core.tests/commonArchiveResources/QIDefectsNew.ear
06:05:21 	at org.eclipse.jst.j2ee.archive.test.DefectVerificationTests.testFilterMappingTranslator(DefectVerificationTests.java:83)
06:05:21 Caused by: java.io.FileNotFoundException: IWAE0036E URI Name: /home/jenkins/agent/workspace/webtools-javaee-gerrit_master/tests/org.eclipse.jst.j2ee.core.tests/commonArchiveResources/QIDefectsNew.ear; File name: /home/jenkins/agent/workspace/webtools-javaee-gerrit_master/tests/org.eclipse.jst.j2ee.core.tests/commonArchiveResources/QIDefectsNew.ear
06:05:21 	at org.eclipse.jst.j2ee.archive.test.DefectVerificationTests.testFilterMappingTranslator(DefectVerificationTests.java:83)
06:05:21 
06:05:21 testReadCrimsonCase(org.eclipse.jst.j2ee.archive.test.DefectVerificationTests)  Time elapsed: 0.001 s  <<< ERROR!
06:05:21 org.eclipse.jst.j2ee.commonarchivecore.internal.exception.OpenFailureException: IWAE0037E Could not open /home/jenkins/agent/workspace/webtools-javaee-gerrit_master/tests/org.eclipse.jst.j2ee.core.tests/commonArchiveResources/ejb_sam_Hello.ear
06:05:21 	at org.eclipse.jst.j2ee.archive.test.DefectVerificationTests.testReadCrimsonCase(DefectVerificationTests.java:261)
06:05:21 Caused by: java.io.FileNotFoundException: IWAE0036E URI Name: /home/jenkins/agent/workspace/webtools-javaee-gerrit_master/tests/org.eclipse.jst.j2ee.core.tests/commonArchiveResources/ejb_sam_Hello.ear; File name: /home/jenkins/agent/workspace/webtools-javaee-gerrit_master/tests/org.eclipse.jst.j2ee.core.tests/commonArchiveResources/ejb_sam_Hello.ear
06:05:21 	at org.eclipse.jst.j2ee.archive.test.DefectVerificationTests.testReadCrimsonCase(DefectVerificationTests.java:261)
06:05:21 
06:05:21 testFormerDefect297(org.eclipse.jst.j2ee.archive.test.DefectVerificationTests)  Time elapsed: 0 s  <<< ERROR!
06:05:21 org.eclipse.jst.j2ee.commonarchivecore.internal.exception.OpenFailureException: IWAE0037E Could not open /home/jenkins/agent/workspace/webtools-javaee-gerrit_master/tests/org.eclipse.jst.j2ee.core.tests/commonArchiveResources/sample.ear
06:05:21 	at org.eclipse.jst.j2ee.archive.test.DefectVerificationTests.testFormerDefect297(DefectVerificationTests.java:109)
06:05:21 Caused by: java.io.FileNotFoundException: IWAE0036E URI Name: /home/jenkins/agent/workspace/webtools-javaee-gerrit_master/tests/org.eclipse.jst.j2ee.core.tests/commonArchiveResources/sample.ear; File name: /home/jenkins/agent/workspace/webtools-javaee-gerrit_master/tests/org.eclipse.jst.j2ee.core.tests/commonArchiveResources/sample.ear
06:05:21 	at org.eclipse.jst.j2ee.archive.test.DefectVerificationTests.testFormerDefect297(DefectVerificationTests.java:109)
06:05:21 
06:05:21 testServiceQNameTranslator(org.eclipse.jst.j2ee.archive.test.DefectVerificationTests)  Time elapsed: 0.001 s  <<< ERROR!
06:05:21 org.eclipse.jst.j2ee.commonarchivecore.internal.exception.OpenFailureException: IWAE0037E Could not open /home/jenkins/agent/workspace/webtools-javaee-gerrit_master/tests/org.eclipse.jst.j2ee.core.tests/commonArchiveResources/WSSecured_InsuranceServices_EJB_WS.ear
06:05:21 	at org.eclipse.jst.j2ee.archive.test.DefectVerificationTests.testServiceQNameTranslator(DefectVerificationTests.java:216)
06:05:21 Caused by: java.io.FileNotFoundException: IWAE0036E URI Name: /home/jenkins/agent/workspace/webtools-javaee-gerrit_master/tests/org.eclipse.jst.j2ee.core.tests/commonArchiveResources/WSSecured_InsuranceServices_EJB_WS.ear; File name: /home/jenkins/agent/workspace/webtools-javaee-gerrit_master/tests/org.eclipse.jst.j2ee.core.tests/commonArchiveResources/WSSecured_InsuranceServices_EJB_WS.ear
06:05:21 	at org.eclipse.jst.j2ee.archive.test.DefectVerificationTests.testServiceQNameTranslator(DefectVerificationTests.java:216)
06:05:21 
06:05:21 testCreatingEARFile(org.eclipse.jst.j2ee.archive.test.DefectVerificationTests)  Time elapsed: 0.009 s
06:05:21 testFormerDefect1459(org.eclipse.jst.j2ee.archive.test.DefectVerificationTests)  Time elapsed: 0.005 s
06:05:21 Running org.eclipse.jst.j2ee.archive.test.SecurityRoleTests
06:05:21 Tests run: 2, Failures: 0, Errors: 2, Skipped: 0, Time elapsed: 0.001 s <<< FAILURE! - in org.eclipse.jst.j2ee.archive.test.SecurityRoleTests
06:05:21 testRollupAddAndPushDown(org.eclipse.jst.j2ee.archive.test.SecurityRoleTests)  Time elapsed: 0 s  <<< ERROR!
06:05:21 org.eclipse.jst.j2ee.commonarchivecore.internal.exception.OpenFailureException: IWAE0037E Could not open /home/jenkins/agent/workspace/webtools-javaee-gerrit_master/tests/org.eclipse.jst.j2ee.core.tests/commonArchiveResources/sample.ear
06:05:21 	at org.eclipse.jst.j2ee.archive.test.SecurityRoleTests.testRollupAddAndPushDown(SecurityRoleTests.java:73)
06:05:21 Caused by: java.io.FileNotFoundException: IWAE0036E URI Name: /home/jenkins/agent/workspace/webtools-javaee-gerrit_master/tests/org.eclipse.jst.j2ee.core.tests/commonArchiveResources/sample.ear; File name: /home/jenkins/agent/workspace/webtools-javaee-gerrit_master/tests/org.eclipse.jst.j2ee.core.tests/commonArchiveResources/sample.ear
06:05:21 	at org.eclipse.jst.j2ee.archive.test.SecurityRoleTests.testRollupAddAndPushDown(SecurityRoleTests.java:73)
06:05:21 
06:05:21 testPushDownCopy(org.eclipse.jst.j2ee.archive.test.SecurityRoleTests)  Time elapsed: 0 s  <<< ERROR!
06:05:21 org.eclipse.jst.j2ee.commonarchivecore.internal.exception.OpenFailureException: IWAE0037E Could not open /home/jenkins/agent/workspace/webtools-javaee-gerrit_master/tests/org.eclipse.jst.j2ee.core.tests/commonArchiveResources/sample.ear
06:05:21 	at org.eclipse.jst.j2ee.archive.test.SecurityRoleTests.testPushDownCopy(SecurityRoleTests.java:53)
06:05:21 Caused by: java.io.FileNotFoundException: IWAE0036E URI Name: /home/jenkins/agent/workspace/webtools-javaee-gerrit_master/tests/org.eclipse.jst.j2ee.core.tests/commonArchiveResources/sample.ear; File name: /home/jenkins/agent/workspace/webtools-javaee-gerrit_master/tests/org.eclipse.jst.j2ee.core.tests/commonArchiveResources/sample.ear
06:05:21 	at org.eclipse.jst.j2ee.archive.test.SecurityRoleTests.testPushDownCopy(SecurityRoleTests.java:53)
06:05:21 
06:05:21 Running org.eclipse.jst.j2ee.archive.test.TestInvalidXmlMultiplicity
06:05:21 Tests run: 3, Failures: 0, Errors: 0, Skipped: 0, Time elapsed: 0 s - in org.eclipse.jst.j2ee.archive.test.TestInvalidXmlMultiplicity
06:05:21 test1(org.eclipse.jst.j2ee.archive.test.TestInvalidXmlMultiplicity)  Time elapsed: 0 s
06:05:21 test2(org.eclipse.jst.j2ee.archive.test.TestInvalidXmlMultiplicity)  Time elapsed: 0 s
06:05:21 test3(org.eclipse.jst.j2ee.archive.test.TestInvalidXmlMultiplicity)  Time elapsed: 0 s
06:05:21 Running org.eclipse.jst.j2ee.archive.test.CopyTests
06:05:21 Tests run: 6, Failures: 0, Errors: 6, Skipped: 0, Time elapsed: 0.002 s <<< FAILURE! - in org.eclipse.jst.j2ee.archive.test.CopyTests
06:05:21 testAddCopyModuleFilesToEAR(org.eclipse.jst.j2ee.archive.test.CopyTests)  Time elapsed: 0 s  <<< ERROR!
06:05:21 org.eclipse.jst.j2ee.commonarchivecore.internal.exception.OpenFailureException: IWAE0037E Could not open /home/jenkins/agent/workspace/webtools-javaee-gerrit_master/tests/org.eclipse.jst.j2ee.core.tests/commonArchiveResources/bankejbs.jar
06:05:21 	at org.eclipse.jst.j2ee.archive.test.CopyTests.testAddCopyModuleFilesToEAR(CopyTests.java:139)
06:05:21 Caused by: java.io.FileNotFoundException: IWAE0036E URI Name: /home/jenkins/agent/workspace/webtools-javaee-gerrit_master/tests/org.eclipse.jst.j2ee.core.tests/commonArchiveResources/bankejbs.jar; File name: /home/jenkins/agent/workspace/webtools-javaee-gerrit_master/tests/org.eclipse.jst.j2ee.core.tests/commonArchiveResources/bankejbs.jar
06:05:21 	at org.eclipse.jst.j2ee.archive.test.CopyTests.testAddCopyModuleFilesToEAR(CopyTests.java:139)
06:05:21 
06:05:21 testAddRenameAndDeleteStandalone(org.eclipse.jst.j2ee.archive.test.CopyTests)  Time elapsed: 0 s  <<< ERROR!
06:05:21 org.eclipse.jst.j2ee.commonarchivecore.internal.exception.OpenFailureException: IWAE0037E Could not open /home/jenkins/agent/workspace/webtools-javaee-gerrit_master/tests/org.eclipse.jst.j2ee.core.tests/commonArchiveResources/bankejbs.jar
06:05:21 	at org.eclipse.jst.j2ee.archive.test.CopyTests.testAddRenameAndDeleteStandalone(CopyTests.java:218)
06:05:21 Caused by: java.io.FileNotFoundException: IWAE0036E URI Name: /home/jenkins/agent/workspace/webtools-javaee-gerrit_master/tests/org.eclipse.jst.j2ee.core.tests/commonArchiveResources/bankejbs.jar; File name: /home/jenkins/agent/workspace/webtools-javaee-gerrit_master/tests/org.eclipse.jst.j2ee.core.tests/commonArchiveResources/bankejbs.jar
06:05:21 	at org.eclipse.jst.j2ee.archive.test.CopyTests.testAddRenameAndDeleteStandalone(CopyTests.java:218)
06:05:21 
06:05:21 testAddCopyDirectory(org.eclipse.jst.j2ee.archive.test.CopyTests)  Time elapsed: 0 s  <<< ERROR!
06:05:21 org.eclipse.jst.j2ee.commonarchivecore.internal.exception.OpenFailureException: IWAE0037E Could not open /home/jenkins/agent/workspace/webtools-javaee-gerrit_master/tests/org.eclipse.jst.j2ee.core.tests/commonArchiveResources/example2.war
06:05:21 	at org.eclipse.jst.j2ee.archive.test.CopyTests.testAddCopyDirectory(CopyTests.java:78)
06:05:21 Caused by: java.io.FileNotFoundException: IWAE0036E URI Name: /home/jenkins/agent/workspace/webtools-javaee-gerrit_master/tests/org.eclipse.jst.j2ee.core.tests/commonArchiveResources/example2.war; File name: /home/jenkins/agent/workspace/webtools-javaee-gerrit_master/tests/org.eclipse.jst.j2ee.core.tests/commonArchiveResources/example2.war
06:05:21 	at org.eclipse.jst.j2ee.archive.test.CopyTests.testAddCopyDirectory(CopyTests.java:78)
06:05:21 
06:05:21 testAddCopyModule(org.eclipse.jst.j2ee.archive.test.CopyTests)  Time elapsed: 0 s  <<< ERROR!
06:05:21 org.eclipse.jst.j2ee.commonarchivecore.internal.exception.OpenFailureException: IWAE0037E Could not open /home/jenkins/agent/workspace/webtools-javaee-gerrit_master/tests/org.eclipse.jst.j2ee.core.tests/commonArchiveResources/sample.ear
06:05:21 	at org.eclipse.jst.j2ee.archive.test.CopyTests.testAddCopyModule(CopyTests.java:100)
06:05:21 Caused by: java.io.FileNotFoundException: IWAE0036E URI Name: /home/jenkins/agent/workspace/webtools-javaee-gerrit_master/tests/org.eclipse.jst.j2ee.core.tests/commonArchiveResources/sample.ear; File name: /home/jenkins/agent/workspace/webtools-javaee-gerrit_master/tests/org.eclipse.jst.j2ee.core.tests/commonArchiveResources/sample.ear
06:05:21 	at org.eclipse.jst.j2ee.archive.test.CopyTests.testAddCopyModule(CopyTests.java:100)
06:05:21 
06:05:21 testAddRenameAndDelete(org.eclipse.jst.j2ee.archive.test.CopyTests)  Time elapsed: 0 s  <<< ERROR!
06:05:21 org.eclipse.jst.j2ee.commonarchivecore.internal.exception.OpenFailureException: IWAE0037E Could not open /home/jenkins/agent/workspace/webtools-javaee-gerrit_master/tests/org.eclipse.jst.j2ee.core.tests/commonArchiveResources/sample.ear
06:05:21 	at org.eclipse.jst.j2ee.archive.test.CopyTests.testAddRenameAndDelete(CopyTests.java:184)
06:05:21 Caused by: java.io.FileNotFoundException: IWAE0036E URI Name: /home/jenkins/agent/workspace/webtools-javaee-gerrit_master/tests/org.eclipse.jst.j2ee.core.tests/commonArchiveResources/sample.ear; File name: /home/jenkins/agent/workspace/webtools-javaee-gerrit_master/tests/org.eclipse.jst.j2ee.core.tests/commonArchiveResources/sample.ear
06:05:21 	at org.eclipse.jst.j2ee.archive.test.CopyTests.testAddRenameAndDelete(CopyTests.java:184)
06:05:21 
06:05:21 testAddCopyStandaloneModule(org.eclipse.jst.j2ee.archive.test.CopyTests)  Time elapsed: 0.001 s  <<< ERROR!
06:05:21 org.eclipse.jst.j2ee.commonarchivecore.internal.exception.OpenFailureException: IWAE0037E Could not open /home/jenkins/agent/workspace/webtools-javaee-gerrit_master/tests/org.eclipse.jst.j2ee.core.tests/commonArchiveResources/bankejbs.jar
06:05:21 	at org.eclipse.jst.j2ee.archive.test.CopyTests.testAddCopyStandaloneModule(CopyTests.java:167)
06:05:21 Caused by: java.io.FileNotFoundException: IWAE0036E URI Name: /home/jenkins/agent/workspace/webtools-javaee-gerrit_master/tests/org.eclipse.jst.j2ee.core.tests/commonArchiveResources/bankejbs.jar; File name: /home/jenkins/agent/workspace/webtools-javaee-gerrit_master/tests/org.eclipse.jst.j2ee.core.tests/commonArchiveResources/bankejbs.jar
06:05:21 	at org.eclipse.jst.j2ee.archive.test.CopyTests.testAddCopyStandaloneModule(CopyTests.java:167)
06:05:21 
06:05:21 Running org.eclipse.jst.j2ee.archive.test.ResourceTests
06:05:21 Tests run: 2, Failures: 1, Errors: 1, Skipped: 0, Time elapsed: 0.037 s <<< FAILURE! - in org.eclipse.jst.j2ee.archive.test.ResourceTests
06:05:21 testResourceDirty(org.eclipse.jst.j2ee.archive.test.ResourceTests)  Time elapsed: 0 s  <<< ERROR!
06:05:21 org.eclipse.jst.j2ee.commonarchivecore.internal.exception.OpenFailureException: IWAE0037E Could not open /home/jenkins/agent/workspace/webtools-javaee-gerrit_master/tests/org.eclipse.jst.j2ee.core.tests/commonArchiveResources/bankejbs.jar
06:05:21 	at org.eclipse.jst.j2ee.archive.test.ResourceTests.testResourceDirty(ResourceTests.java:95)
06:05:21 Caused by: java.io.FileNotFoundException: IWAE0036E URI Name: /home/jenkins/agent/workspace/webtools-javaee-gerrit_master/tests/org.eclipse.jst.j2ee.core.tests/commonArchiveResources/bankejbs.jar; File name: /home/jenkins/agent/workspace/webtools-javaee-gerrit_master/tests/org.eclipse.jst.j2ee.core.tests/commonArchiveResources/bankejbs.jar
06:05:21 	at org.eclipse.jst.j2ee.archive.test.ResourceTests.testResourceDirty(ResourceTests.java:95)
06:05:21 
06:05:21 testResourceCreation(org.eclipse.jst.j2ee.archive.test.ResourceTests)  Time elapsed: 0.037 s  <<< FAILURE!
06:05:21 junit.framework.AssertionFailedError: The resource should be unloaded
06:05:21 	at org.eclipse.jst.j2ee.archive.test.ResourceTests.testResourceCreation(ResourceTests.java:76)
06:05:21 
06:05:21 Running org.eclipse.jst.j2ee.archive.test.SaveTests
06:05:21 Tests run: 2, Failures: 0, Errors: 2, Skipped: 0, Time elapsed: 0.001 s <<< FAILURE! - in org.eclipse.jst.j2ee.archive.test.SaveTests
06:05:21 testSave(org.eclipse.jst.j2ee.archive.test.SaveTests)  Time elapsed: 0 s  <<< ERROR!
06:05:21 org.eclipse.jst.j2ee.commonarchivecore.internal.exception.OpenFailureException: IWAE0037E Could not open /home/jenkins/agent/workspace/webtools-javaee-gerrit_master/tests/org.eclipse.jst.j2ee.core.tests/commonArchiveResources/example2.war
06:05:21 	at org.eclipse.jst.j2ee.archive.test.SaveTests.testSave(SaveTests.java:63)
06:05:21 Caused by: java.io.FileNotFoundException: IWAE0036E URI Name: /home/jenkins/agent/workspace/webtools-javaee-gerrit_master/tests/org.eclipse.jst.j2ee.core.tests/commonArchiveResources/example2.war; File name: /home/jenkins/agent/workspace/webtools-javaee-gerrit_master/tests/org.eclipse.jst.j2ee.core.tests/commonArchiveResources/example2.war
06:05:21 	at org.eclipse.jst.j2ee.archive.test.SaveTests.testSave(SaveTests.java:63)
06:05:21 
06:05:21 testSaveDirectory(org.eclipse.jst.j2ee.archive.test.SaveTests)  Time elapsed: 0 s  <<< ERROR!
06:05:21 org.eclipse.jst.j2ee.commonarchivecore.internal.exception.OpenFailureException: IWAE0037E Could not open /home/jenkins/agent/workspace/webtools-javaee-gerrit_master/tests/org.eclipse.jst.j2ee.core.tests/commonArchiveResources/sample.ear
06:05:21 	at org.eclipse.jst.j2ee.archive.test.SaveTests.testSaveDirectory(SaveTests.java:93)
06:05:21 Caused by: java.io.FileNotFoundException: IWAE0036E URI Name: /home/jenkins/agent/workspace/webtools-javaee-gerrit_master/tests/org.eclipse.jst.j2ee.core.tests/commonArchiveResources/sample.ear; File name: /home/jenkins/agent/workspace/webtools-javaee-gerrit_master/tests/org.eclipse.jst.j2ee.core.tests/commonArchiveResources/sample.ear
06:05:21 	at org.eclipse.jst.j2ee.archive.test.SaveTests.testSaveDirectory(SaveTests.java:93)
06:05:21 
06:05:21 Running org.eclipse.jst.j2ee.archive.test.ClientContainerResourceLoadTest
06:05:21 org.eclipse.jst.j2ee.commonarchivecore.internal.exception.OpenFailureException: IWAE0037E Could not open /home/jenkins/agent/workspace/webtools-javaee-gerrit_master/tests/org.eclipse.jst.j2ee.core.tests/commonArchiveResources/mtapp2.ear
06:05:21 Stack trace of nested exception:
06:05:21 java.io.FileNotFoundException: IWAE0036E URI Name: /home/jenkins/agent/workspace/webtools-javaee-gerrit_master/tests/org.eclipse.jst.j2ee.core.tests/commonArchiveResources/mtapp2.ear; File name: /home/jenkins/agent/workspace/webtools-javaee-gerrit_master/tests/org.eclipse.jst.j2ee.core.tests/commonArchiveResources/mtapp2.ear
06:05:21 	at org.eclipse.jst.j2ee.commonarchivecore.internal.impl.CommonarchiveFactoryImpl.createLoadStrategy(CommonarchiveFactoryImpl.java:342)
06:05:21 	at org.eclipse.jst.j2ee.commonarchivecore.internal.impl.CommonarchiveFactoryImpl.primOpenArchive(CommonarchiveFactoryImpl.java:876)
06:05:21 	at org.eclipse.jst.j2ee.commonarchivecore.internal.impl.CommonarchiveFactoryImpl.primOpenArchive(CommonarchiveFactoryImpl.java:902)
06:05:21 	at org.eclipse.jst.j2ee.commonarchivecore.internal.impl.CommonarchiveFactoryImpl.openEARFile(CommonarchiveFactoryImpl.java:657)
06:05:21 	at org.eclipse.jst.j2ee.archive.test.ClientContainerResourceLoadTest.testClientContainerLoad(ClientContainerResourceLoadTest.java:57)
06:05:21 	at java.base/jdk.internal.reflect.NativeMethodAccessorImpl.invoke0(Native Method)
06:05:21 	at java.base/jdk.internal.reflect.NativeMethodAccessorImpl.invoke(NativeMethodAccessorImpl.java:62)
06:05:21 	at java.base/jdk.internal.reflect.DelegatingMethodAccessorImpl.invoke(DelegatingMethodAccessorImpl.java:43)
06:05:21 	at java.base/java.lang.reflect.Method.invoke(Method.java:566)
06:05:21 	at junit.framework.TestCase.runTest(TestCase.java:177)
06:05:21 	at junit.framework.TestCase.runBare(TestCase.java:142)
06:05:21 	at junit.framework.TestResult$1.protect(TestResult.java:122)
06:05:21 	at junit.framework.TestResult.runProtected(TestResult.java:142)
06:05:21 	at junit.framework.TestResult.run(TestResult.java:125)
06:05:21 	at junit.framework.TestCase.run(TestCase.java:130)
06:05:21 	at junit.framework.TestSuite.runTest(TestSuite.java:241)
06:05:21 	at junit.framework.TestSuite.run(TestSuite.java:236)
06:05:21 	at org.junit.internal.runners.JUnit38ClassRunner.run(JUnit38ClassRunner.java:90)
06:05:21 	at org.apache.maven.surefire.junit4.JUnit4Provider.execute(JUnit4Provider.java:365)
06:05:21 	at org.apache.maven.surefire.junit4.JUnit4Provider.executeWithRerun(JUnit4Provider.java:273)
06:05:21 	at org.apache.maven.surefire.junit4.JUnit4Provider.executeTestSet(JUnit4Provider.java:238)
06:05:21 	at org.apache.maven.surefire.junit4.JUnit4Provider.invoke(JUnit4Provider.java:159)
06:05:21 	at java.base/jdk.internal.reflect.NativeMethodAccessorImpl.invoke0(Native Method)
06:05:21 	at java.base/jdk.internal.reflect.NativeMethodAccessorImpl.invoke(NativeMethodAccessorImpl.java:62)
06:05:21 	at java.base/jdk.internal.reflect.DelegatingMethodAccessorImpl.invoke(DelegatingMethodAccessorImpl.java:43)
06:05:21 	at java.base/java.lang.reflect.Method.invoke(Method.java:566)
06:05:21 	at org.apache.maven.surefire.util.ReflectionUtils.invokeMethodWithArray2(ReflectionUtils.java:206)
06:05:21 	at org.apache.maven.surefire.booter.ProviderFactory$ProviderProxy.invoke(ProviderFactory.java:161)
06:05:21 	at org.apache.maven.surefire.booter.ProviderFactory.invokeProvider(ProviderFactory.java:84)
06:05:21 	at org.eclipse.tycho.surefire.osgibooter.OsgiSurefireBooter.run(OsgiSurefireBooter.java:116)
06:05:21 	at org.eclipse.tycho.surefire.osgibooter.HeadlessTestApplication.start(HeadlessTestApplication.java:23)
06:05:21 	at org.eclipse.equinox.internal.app.EclipseAppHandle.run(EclipseAppHandle.java:203)
06:05:21 	at org.eclipse.core.runtime.internal.adaptor.EclipseAppLauncher.runApplication(EclipseAppLauncher.java:136)
06:05:21 	at org.eclipse.core.runtime.internal.adaptor.EclipseAppLauncher.start(EclipseAppLauncher.java:104)
06:05:21 	at org.eclipse.core.runtime.adaptor.EclipseStarter.run(EclipseStarter.java:401)
06:05:21 	at org.eclipse.core.runtime.adaptor.EclipseStarter.run(EclipseStarter.java:255)
06:05:21 	at java.base/jdk.internal.reflect.NativeMethodAccessorImpl.invoke0(Native Method)
06:05:21 	at java.base/jdk.internal.reflect.NativeMethodAccessorImpl.invoke(NativeMethodAccessorImpl.java:62)
06:05:21 	at java.base/jdk.internal.reflect.DelegatingMethodAccessorImpl.invoke(DelegatingMethodAccessorImpl.java:43)
06:05:21 	at java.base/java.lang.reflect.Method.invoke(Method.java:566)
06:05:21 	at org.eclipse.equinox.launcher.Main.invokeFramework(Main.java:654)
06:05:21 	at org.eclipse.equinox.launcher.Main.basicRun(Main.java:591)
06:05:21 	at org.eclipse.equinox.launcher.Main.run(Main.java:1462)
06:05:21 	at org.eclipse.equinox.launcher.Main.main(Main.java:1435)
06:05:21 Tests run: 1, Failures: 0, Errors: 0, Skipped: 0, Time elapsed: 0.002 s - in org.eclipse.jst.j2ee.archive.test.ClientContainerResourceLoadTest
06:05:21 testClientContainerLoad(org.eclipse.jst.j2ee.archive.test.ClientContainerResourceLoadTest)  Time elapsed: 0.001 s
06:05:21 Running org.eclipse.jst.j2ee.archive.test.LooseArchiveTests
06:05:21 Tests run: 5, Failures: 0, Errors: 0, Skipped: 0, Time elapsed: 0.152 s - in org.eclipse.jst.j2ee.archive.test.LooseArchiveTests
06:05:22 testLooseConfigCreation(org.eclipse.jst.j2ee.archive.test.LooseArchiveTests)  Time elapsed: 0.021 s
06:05:22 testLooseAppCreation(org.eclipse.jst.j2ee.archive.test.LooseArchiveTests)  Time elapsed: 0.005 s
06:05:22 testLooseConfigOpenAndSave(org.eclipse.jst.j2ee.archive.test.LooseArchiveTests)  Time elapsed: 0.063 s
06:05:22 testLooseConfigOpenAndReOpen(org.eclipse.jst.j2ee.archive.test.LooseArchiveTests)  Time elapsed: 0.011 s
06:05:22 testLooseConfigUnimodeOpenAndSave(org.eclipse.jst.j2ee.archive.test.LooseArchiveTests)  Time elapsed: 0.051 s
06:05:22 Running org.eclipse.jst.j2ee.archive.test.DiscriminatorTest
06:05:22 Tests run: 1, Failures: 0, Errors: 0, Skipped: 0, Time elapsed: 0.001 s - in org.eclipse.jst.j2ee.archive.test.DiscriminatorTest
06:05:22 testDiscriminator(org.eclipse.jst.j2ee.archive.test.DiscriminatorTest)  Time elapsed: 0 s
06:05:22 Running org.eclipse.jst.j2ee.archive.test.WARFileTests
06:05:22 Tests run: 3, Failures: 0, Errors: 3, Skipped: 0, Time elapsed: 0.001 s <<< FAILURE! - in org.eclipse.jst.j2ee.archive.test.WARFileTests
06:05:22 testAddCopyLib(org.eclipse.jst.j2ee.archive.test.WARFileTests)  Time elapsed: 0 s  <<< ERROR!
06:05:22 org.eclipse.jst.j2ee.commonarchivecore.internal.exception.OpenFailureException: IWAE0037E Could not open /home/jenkins/agent/workspace/webtools-javaee-gerrit_master/tests/org.eclipse.jst.j2ee.core.tests/commonArchiveResources/example2.war
06:05:22 	at org.eclipse.jst.j2ee.archive.test.WARFileTests.testAddCopyLib(WARFileTests.java:77)
06:05:22 Caused by: java.io.FileNotFoundException: IWAE0036E URI Name: /home/jenkins/agent/workspace/webtools-javaee-gerrit_master/tests/org.eclipse.jst.j2ee.core.tests/commonArchiveResources/example2.war; File name: /home/jenkins/agent/workspace/webtools-javaee-gerrit_master/tests/org.eclipse.jst.j2ee.core.tests/commonArchiveResources/example2.war
06:05:22 	at org.eclipse.jst.j2ee.archive.test.WARFileTests.testAddCopyLib(WARFileTests.java:77)
06:05:22 
06:05:22 testAddCopyClass(org.eclipse.jst.j2ee.archive.test.WARFileTests)  Time elapsed: 0 s  <<< ERROR!
06:05:22 org.eclipse.jst.j2ee.commonarchivecore.internal.exception.OpenFailureException: IWAE0037E Could not open /home/jenkins/agent/workspace/webtools-javaee-gerrit_master/tests/org.eclipse.jst.j2ee.core.tests/commonArchiveResources/example2.war
06:05:22 	at org.eclipse.jst.j2ee.archive.test.WARFileTests.testAddCopyClass(WARFileTests.java:56)
06:05:22 Caused by: java.io.FileNotFoundException: IWAE0036E URI Name: /home/jenkins/agent/workspace/webtools-javaee-gerrit_master/tests/org.eclipse.jst.j2ee.core.tests/commonArchiveResources/example2.war; File name: /home/jenkins/agent/workspace/webtools-javaee-gerrit_master/tests/org.eclipse.jst.j2ee.core.tests/commonArchiveResources/example2.war
06:05:22 	at org.eclipse.jst.j2ee.archive.test.WARFileTests.testAddCopyClass(WARFileTests.java:56)
06:05:22 
06:05:22 testListClassesAndLibs(org.eclipse.jst.j2ee.archive.test.WARFileTests)  Time elapsed: 0 s  <<< ERROR!
06:05:22 org.eclipse.jst.j2ee.commonarchivecore.internal.exception.OpenFailureException: IWAE0037E Could not open /home/jenkins/agent/workspace/webtools-javaee-gerrit_master/tests/org.eclipse.jst.j2ee.core.tests/commonArchiveResources/example2.war
06:05:22 	at org.eclipse.jst.j2ee.archive.test.WARFileTests.testListClassesAndLibs(WARFileTests.java:96)
06:05:22 Caused by: java.io.FileNotFoundException: IWAE0036E URI Name: /home/jenkins/agent/workspace/webtools-javaee-gerrit_master/tests/org.eclipse.jst.j2ee.core.tests/commonArchiveResources/example2.war; File name: /home/jenkins/agent/workspace/webtools-javaee-gerrit_master/tests/org.eclipse.jst.j2ee.core.tests/commonArchiveResources/example2.war
06:05:22 	at org.eclipse.jst.j2ee.archive.test.WARFileTests.testListClassesAndLibs(WARFileTests.java:96)
06:05:22 
06:05:22 Running org.eclipse.jst.j2ee.archive.test.JavaTests
06:05:22 Tests run: 1, Failures: 0, Errors: 0, Skipped: 0, Time elapsed: 0 s - in org.eclipse.jst.j2ee.archive.test.JavaTests
06:05:22 testJavaReflection(org.eclipse.jst.j2ee.archive.test.JavaTests)  Time elapsed: 0 s
06:05:22 Running org.eclipse.jst.j2ee.archive.test.RarFileTests
06:05:22 Tests run: 7, Failures: 0, Errors: 7, Skipped: 0, Time elapsed: 0.001 s <<< FAILURE! - in org.eclipse.jst.j2ee.archive.test.RarFileTests
06:05:22 testOpenAndRead(org.eclipse.jst.j2ee.archive.test.RarFileTests)  Time elapsed: 0 s  <<< ERROR!
06:05:22 org.eclipse.jst.j2ee.commonarchivecore.internal.exception.OpenFailureException: IWAE0037E Could not open /home/jenkins/agent/workspace/webtools-javaee-gerrit_master/tests/org.eclipse.jst.j2ee.core.tests/commonArchiveResources/sample.rar
06:05:22 	at org.eclipse.jst.j2ee.archive.test.RarFileTests.testOpenAndRead(RarFileTests.java:165)
06:05:22 Caused by: java.io.FileNotFoundException: IWAE0036E URI Name: /home/jenkins/agent/workspace/webtools-javaee-gerrit_master/tests/org.eclipse.jst.j2ee.core.tests/commonArchiveResources/sample.rar; File name: /home/jenkins/agent/workspace/webtools-javaee-gerrit_master/tests/org.eclipse.jst.j2ee.core.tests/commonArchiveResources/sample.rar
06:05:22 	at org.eclipse.jst.j2ee.archive.test.RarFileTests.testOpenAndRead(RarFileTests.java:165)
06:05:22 
06:05:22 testaddCopyModule(org.eclipse.jst.j2ee.archive.test.RarFileTests)  Time elapsed: 0 s  <<< ERROR!
06:05:22 org.eclipse.jst.j2ee.commonarchivecore.internal.exception.OpenFailureException: IWAE0037E Could not open /home/jenkins/agent/workspace/webtools-javaee-gerrit_master/tests/org.eclipse.jst.j2ee.core.tests/commonArchiveResources/sample.rar
06:05:22 	at org.eclipse.jst.j2ee.archive.test.RarFileTests.testaddCopyModule(RarFileTests.java:114)
06:05:22 Caused by: java.io.FileNotFoundException: IWAE0036E URI Name: /home/jenkins/agent/workspace/webtools-javaee-gerrit_master/tests/org.eclipse.jst.j2ee.core.tests/commonArchiveResources/sample.rar; File name: /home/jenkins/agent/workspace/webtools-javaee-gerrit_master/tests/org.eclipse.jst.j2ee.core.tests/commonArchiveResources/sample.rar
06:05:22 	at org.eclipse.jst.j2ee.archive.test.RarFileTests.testaddCopyModule(RarFileTests.java:114)
06:05:22 
06:05:22 testSaveRarEar(org.eclipse.jst.j2ee.archive.test.RarFileTests)  Time elapsed: 0 s  <<< ERROR!
06:05:22 org.eclipse.jst.j2ee.commonarchivecore.internal.exception.OpenFailureException: IWAE0037E Could not open /home/jenkins/agent/workspace/webtools-javaee-gerrit_master/tests/org.eclipse.jst.j2ee.core.tests/commonArchiveResources/sample.rar
06:05:22 	at org.eclipse.jst.j2ee.archive.test.RarFileTests.testSaveRarEar(RarFileTests.java:178)
06:05:22 Caused by: java.io.FileNotFoundException: IWAE0036E URI Name: /home/jenkins/agent/workspace/webtools-javaee-gerrit_master/tests/org.eclipse.jst.j2ee.core.tests/commonArchiveResources/sample.rar; File name: /home/jenkins/agent/workspace/webtools-javaee-gerrit_master/tests/org.eclipse.jst.j2ee.core.tests/commonArchiveResources/sample.rar
06:05:22 	at org.eclipse.jst.j2ee.archive.test.RarFileTests.testSaveRarEar(RarFileTests.java:178)
06:05:22 
06:05:22 testexpandRarModule(org.eclipse.jst.j2ee.archive.test.RarFileTests)  Time elapsed: 0 s  <<< ERROR!
06:05:22 org.eclipse.jst.j2ee.commonarchivecore.internal.exception.OpenFailureException: IWAE0037E Could not open /home/jenkins/agent/workspace/webtools-javaee-gerrit_master/tests/org.eclipse.jst.j2ee.core.tests/commonArchiveResources/sample.rar
06:05:22 	at org.eclipse.jst.j2ee.archive.test.RarFileTests.testexpandRarModule(RarFileTests.java:132)
06:05:22 Caused by: java.io.FileNotFoundException: IWAE0036E URI Name: /home/jenkins/agent/workspace/webtools-javaee-gerrit_master/tests/org.eclipse.jst.j2ee.core.tests/commonArchiveResources/sample.rar; File name: /home/jenkins/agent/workspace/webtools-javaee-gerrit_master/tests/org.eclipse.jst.j2ee.core.tests/commonArchiveResources/sample.rar
06:05:22 	at org.eclipse.jst.j2ee.archive.test.RarFileTests.testexpandRarModule(RarFileTests.java:132)
06:05:22 
06:05:22 testJ2Cauth(org.eclipse.jst.j2ee.archive.test.RarFileTests)  Time elapsed: 0 s  <<< ERROR!
06:05:22 org.eclipse.jst.j2ee.commonarchivecore.internal.exception.OpenFailureException: IWAE0037E Could not open /home/jenkins/agent/workspace/webtools-javaee-gerrit_master/tests/org.eclipse.jst.j2ee.core.tests/commonArchiveResources/sample.rar
06:05:22 	at org.eclipse.jst.j2ee.archive.test.RarFileTests.testJ2Cauth(RarFileTests.java:193)
06:05:22 Caused by: java.io.FileNotFoundException: IWAE0036E URI Name: /home/jenkins/agent/workspace/webtools-javaee-gerrit_master/tests/org.eclipse.jst.j2ee.core.tests/commonArchiveResources/sample.rar; File name: /home/jenkins/agent/workspace/webtools-javaee-gerrit_master/tests/org.eclipse.jst.j2ee.core.tests/commonArchiveResources/sample.rar
06:05:22 	at org.eclipse.jst.j2ee.archive.test.RarFileTests.testJ2Cauth(RarFileTests.java:193)
06:05:22 
06:05:22 testOpenAndExtract(org.eclipse.jst.j2ee.archive.test.RarFileTests)  Time elapsed: 0 s  <<< ERROR!
06:05:22 org.eclipse.jst.j2ee.commonarchivecore.internal.exception.OpenFailureException: IWAE0037E Could not open /home/jenkins/agent/workspace/webtools-javaee-gerrit_master/tests/org.eclipse.jst.j2ee.core.tests/commonArchiveResources/sample.rar
06:05:22 	at org.eclipse.jst.j2ee.archive.test.RarFileTests.testOpenAndExtract(RarFileTests.java:153)
06:05:22 Caused by: java.io.FileNotFoundException: IWAE0036E URI Name: /home/jenkins/agent/workspace/webtools-javaee-gerrit_master/tests/org.eclipse.jst.j2ee.core.tests/commonArchiveResources/sample.rar; File name: /home/jenkins/agent/workspace/webtools-javaee-gerrit_master/tests/org.eclipse.jst.j2ee.core.tests/commonArchiveResources/sample.rar
06:05:22 	at org.eclipse.jst.j2ee.archive.test.RarFileTests.testOpenAndExtract(RarFileTests.java:153)
06:05:22 
06:05:22 testopenRarEar(org.eclipse.jst.j2ee.archive.test.RarFileTests)  Time elapsed: 0 s  <<< ERROR!
06:05:22 org.eclipse.jst.j2ee.commonarchivecore.internal.exception.OpenFailureException: IWAE0037E Could not open /home/jenkins/agent/workspace/webtools-javaee-gerrit_master/tests/org.eclipse.jst.j2ee.core.tests/commonArchiveResources/testrar.ear
06:05:22 	at org.eclipse.jst.j2ee.archive.test.RarFileTests.testopenRarEar(RarFileTests.java:172)
06:05:22 Caused by: java.io.FileNotFoundException: IWAE0036E URI Name: /home/jenkins/agent/workspace/webtools-javaee-gerrit_master/tests/org.eclipse.jst.j2ee.core.tests/commonArchiveResources/testrar.ear; File name: /home/jenkins/agent/workspace/webtools-javaee-gerrit_master/tests/org.eclipse.jst.j2ee.core.tests/commonArchiveResources/testrar.ear
06:05:22 	at org.eclipse.jst.j2ee.archive.test.RarFileTests.testopenRarEar(RarFileTests.java:172)
06:05:22 
06:05:22 Running org.eclipse.jst.j2ee.archive.test.TestModuleClassLoading
06:05:22 org.eclipse.jst.j2ee.commonarchivecore.internal.exception.OpenFailureException: IWAE0037E Could not open /home/jenkins/agent/workspace/webtools-javaee-gerrit_master/tests/org.eclipse.jst.j2ee.core.tests/commonArchiveResources/PROTO.ear
06:05:22 org.eclipse.jst.j2ee.commonarchivecore.internal.exception.OpenFailureException: IWAE0037E Could not open /home/jenkins/agent/workspace/webtools-javaee-gerrit_master/tests/org.eclipse.jst.j2ee.core.tests/commonArchiveResources/SEIinAnotherJar.ear
06:05:22 org.eclipse.jst.j2ee.commonarchivecore.internal.exception.OpenFailureException: IWAE0037E Could not open /home/jenkins/agent/workspace/webtools-javaee-gerrit_master/tests/org.eclipse.jst.j2ee.core.tests/commonArchiveResources/SEIinWEB-INF_lib_jar.ear
06:05:22 Tests run: 1, Failures: 0, Errors: 0, Skipped: 0, Time elapsed: 0.001 s - in org.eclipse.jst.j2ee.archive.test.TestModuleClassLoading
06:05:22 testAddModuleClassLoading(org.eclipse.jst.j2ee.archive.test.TestModuleClassLoading)  Time elapsed: 0 s
06:05:22 Running org.eclipse.jst.j2ee.ejb.test.CMRFieldTest
06:05:22 Tests run: 6, Failures: 0, Errors: 0, Skipped: 0, Time elapsed: 0.001 s - in org.eclipse.jst.j2ee.ejb.test.CMRFieldTest
06:05:22 test_getRole(org.eclipse.jst.j2ee.ejb.test.CMRFieldTest)  Time elapsed: 0 s
06:05:22 test_setCollectionTypeName(org.eclipse.jst.j2ee.ejb.test.CMRFieldTest)  Time elapsed: 0 s
06:05:22 test_setCollectionType(org.eclipse.jst.j2ee.ejb.test.CMRFieldTest)  Time elapsed: 0 s
06:05:22 test_getCollectionType(org.eclipse.jst.j2ee.ejb.test.CMRFieldTest)  Time elapsed: 0 s
06:05:22 test_setRole(org.eclipse.jst.j2ee.ejb.test.CMRFieldTest)  Time elapsed: 0 s
06:05:22 test_getCollectionTypeName(org.eclipse.jst.j2ee.ejb.test.CMRFieldTest)  Time elapsed: 0 s
06:05:22 Running org.eclipse.jst.j2ee.ejb.test.MethodPermissionTest
06:05:22 Tests run: 5, Failures: 0, Errors: 0, Skipped: 0, Time elapsed: 0.001 s - in org.eclipse.jst.j2ee.ejb.test.MethodPermissionTest
06:05:22 test_MethodPermission(org.eclipse.jst.j2ee.ejb.test.MethodPermissionTest)  Time elapsed: 0 s
06:05:22 test_isEquivalent(org.eclipse.jst.j2ee.ejb.test.MethodPermissionTest)  Time elapsed: 0 s
06:05:22 test_hasSecurityRole(org.eclipse.jst.j2ee.ejb.test.MethodPermissionTest)  Time elapsed: 0 s
06:05:22 test_getSecurityRole(org.eclipse.jst.j2ee.ejb.test.MethodPermissionTest)  Time elapsed: 0 s
06:05:22 test_hasSecurityRole_2(org.eclipse.jst.j2ee.ejb.test.MethodPermissionTest)  Time elapsed: 0 s
06:05:22 Running org.eclipse.jst.j2ee.ejb.test.EJBRelationTest
06:05:22 Tests run: 6, Failures: 0, Errors: 0, Skipped: 0, Time elapsed: 0.001 s - in org.eclipse.jst.j2ee.ejb.test.EJBRelationTest
06:05:22 test_containsRelationshipRole(org.eclipse.jst.j2ee.ejb.test.EJBRelationTest)  Time elapsed: 0.001 s
06:05:22 test_getSecondRole(org.eclipse.jst.j2ee.ejb.test.EJBRelationTest)  Time elapsed: 0 s
06:05:22 test_getFirstRole(org.eclipse.jst.j2ee.ejb.test.EJBRelationTest)  Time elapsed: 0 s
06:05:22 test_getOppositeRole(org.eclipse.jst.j2ee.ejb.test.EJBRelationTest)  Time elapsed: 0 s
06:05:22 test_EJBRelation(org.eclipse.jst.j2ee.ejb.test.EJBRelationTest)  Time elapsed: 0 s
06:05:22 test_setFoward(org.eclipse.jst.j2ee.ejb.test.EJBRelationTest)  Time elapsed: 0 s
06:05:22 Running org.eclipse.jst.j2ee.ejb.test.ContainerManagedEntityTest
06:05:22 Tests run: 15, Failures: 0, Errors: 0, Skipped: 0, Time elapsed: 0.002 s - in org.eclipse.jst.j2ee.ejb.test.ContainerManagedEntityTest
06:05:22 test_isUnknownPrimaryKey(org.eclipse.jst.j2ee.ejb.test.ContainerManagedEntityTest)  Time elapsed: 0 s
06:05:22 test_addPersistentAttribute(org.eclipse.jst.j2ee.ejb.test.ContainerManagedEntityTest)  Time elapsed: 0 s
06:05:22 test_addKeyAttributeName(org.eclipse.jst.j2ee.ejb.test.ContainerManagedEntityTest)  Time elapsed: 0 s
06:05:22 test_getKeyAttribute(org.eclipse.jst.j2ee.ejb.test.ContainerManagedEntityTest)  Time elapsed: 0 s
06:05:22 test_isContainerManagedEntity(org.eclipse.jst.j2ee.ejb.test.ContainerManagedEntityTest)  Time elapsed: 0 s
06:05:22 test_getPrimaryKeyAttribute(org.eclipse.jst.j2ee.ejb.test.ContainerManagedEntityTest)  Time elapsed: 0 s
06:05:22 test_isVersion1_X(org.eclipse.jst.j2ee.ejb.test.ContainerManagedEntityTest)  Time elapsed: 0 s
06:05:22 test_isVersion2_X(org.eclipse.jst.j2ee.ejb.test.ContainerManagedEntityTest)  Time elapsed: 0 s
06:05:22 test_removePersistentAttribute_2(org.eclipse.jst.j2ee.ejb.test.ContainerManagedEntityTest)  Time elapsed: 0 s
06:05:22 test_listPersistentFieldNames(org.eclipse.jst.j2ee.ejb.test.ContainerManagedEntityTest)  Time elapsed: 0 s
06:05:22 test_isKeyAttribute(org.eclipse.jst.j2ee.ejb.test.ContainerManagedEntityTest)  Time elapsed: 0.001 s
06:05:22 test_getCMPVersionID(org.eclipse.jst.j2ee.ejb.test.ContainerManagedEntityTest)  Time elapsed: 0 s
06:05:22 test_setPrimKeyField(org.eclipse.jst.j2ee.ejb.test.ContainerManagedEntityTest)  Time elapsed: 0 s
06:05:22 test_addPersistentAttributeName(org.eclipse.jst.j2ee.ejb.test.ContainerManagedEntityTest)  Time elapsed: 0 s
06:05:22 test_removePersistentAttribute(org.eclipse.jst.j2ee.ejb.test.ContainerManagedEntityTest)  Time elapsed: 0 s
06:05:22 Running org.eclipse.jst.j2ee.ejb.test.EJBJarTest
06:05:22 Tests run: 15, Failures: 0, Errors: 0, Skipped: 0, Time elapsed: 0.002 s - in org.eclipse.jst.j2ee.ejb.test.EJBJarTest
06:05:22 test_EJBJar(org.eclipse.jst.j2ee.ejb.test.EJBJarTest)  Time elapsed: 0.001 s
06:05:22 test_containsContainerManagedBeans(org.eclipse.jst.j2ee.ejb.test.EJBJarTest)  Time elapsed: 0 s
06:05:22 test_containsSecurityRole(org.eclipse.jst.j2ee.ejb.test.EJBJarTest)  Time elapsed: 0 s
06:05:22 test_getBeanManagedBeans(org.eclipse.jst.j2ee.ejb.test.EJBJarTest)  Time elapsed: 0 s
06:05:22 test_getContainerManagedBeans(org.eclipse.jst.j2ee.ejb.test.EJBJarTest)  Time elapsed: 0 s
06:05:22 test_getEJB11ContainerManagedBeans(org.eclipse.jst.j2ee.ejb.test.EJBJarTest)  Time elapsed: 0 s
06:05:22 test_getEJB20ContainerManagedBeans(org.eclipse.jst.j2ee.ejb.test.EJBJarTest)  Time elapsed: 0 s
06:05:22 test_getMessageDrivenBeans(org.eclipse.jst.j2ee.ejb.test.EJBJarTest)  Time elapsed: 0.001 s
06:05:22 test_getEjbRelations(org.eclipse.jst.j2ee.ejb.test.EJBJarTest)  Time elapsed: 0 s
06:05:22 test_getEnterpiseBeanFromRef(org.eclipse.jst.j2ee.ejb.test.EJBJarTest)  Time elapsed: 0 s
06:05:22 test_getEnterpriseBeanNamed(org.eclipse.jst.j2ee.ejb.test.EJBJarTest)  Time elapsed: 0 s
06:05:22 test_getEnterpriseBeansWithReference(org.eclipse.jst.j2ee.ejb.test.EJBJarTest)  Time elapsed: 0 s
06:05:22 test_getEnterpriseBeanWithReference(org.eclipse.jst.j2ee.ejb.test.EJBJarTest)  Time elapsed: 0 s
06:05:22 test_getSessionBeans(org.eclipse.jst.j2ee.ejb.test.EJBJarTest)  Time elapsed: 0 s
06:05:22 test_getEJBRelation(org.eclipse.jst.j2ee.ejb.test.EJBJarTest)  Time elapsed: 0 s
06:05:22 Running org.eclipse.jst.j2ee.ejb.test.QueryMethodTest
06:05:22 Tests run: 1, Failures: 0, Errors: 0, Skipped: 0, Time elapsed: 0.25 s - in org.eclipse.jst.j2ee.ejb.test.QueryMethodTest
06:05:22 test_getClientTypeJavaClasses(org.eclipse.jst.j2ee.ejb.test.QueryMethodTest)  Time elapsed: 0.249 s
06:05:22 Running org.eclipse.jst.j2ee.ejb.test.QueryTest
06:05:22 Tests run: 3, Failures: 0, Errors: 0, Skipped: 0, Time elapsed: 0.001 s - in org.eclipse.jst.j2ee.ejb.test.QueryTest
06:05:22 test_isRemoteResultMapping(org.eclipse.jst.j2ee.ejb.test.QueryTest)  Time elapsed: 0 s
06:05:22 test_isLocalResultMapping(org.eclipse.jst.j2ee.ejb.test.QueryTest)  Time elapsed: 0 s
06:05:22 test_Query(org.eclipse.jst.j2ee.ejb.test.QueryTest)  Time elapsed: 0 s
06:05:22 Running org.eclipse.jst.j2ee.ejb.test.CMPAttributeTest
06:05:22 Tests run: 10, Failures: 0, Errors: 0, Skipped: 0, Time elapsed: 0.001 s - in org.eclipse.jst.j2ee.ejb.test.CMPAttributeTest
06:05:22 test_getSetterName(org.eclipse.jst.j2ee.ejb.test.CMPAttributeTest)  Time elapsed: 0 s
06:05:22 test_getType(org.eclipse.jst.j2ee.ejb.test.CMPAttributeTest)  Time elapsed: 0 s
06:05:22 test_getOriginatingType(org.eclipse.jst.j2ee.ejb.test.CMPAttributeTest)  Time elapsed: 0 s
06:05:22 test_setDerived(org.eclipse.jst.j2ee.ejb.test.CMPAttributeTest)  Time elapsed: 0 s
06:05:22 test_setOriginatingType(org.eclipse.jst.j2ee.ejb.test.CMPAttributeTest)  Time elapsed: 0 s
06:05:22 test_isCMRField(org.eclipse.jst.j2ee.ejb.test.CMPAttributeTest)  Time elapsed: 0 s
06:05:22 test_getGetterName(org.eclipse.jst.j2ee.ejb.test.CMPAttributeTest)  Time elapsed: 0 s
06:05:22 test_isDerived(org.eclipse.jst.j2ee.ejb.test.CMPAttributeTest)  Time elapsed: 0 s
06:05:22 test_isKey(org.eclipse.jst.j2ee.ejb.test.CMPAttributeTest)  Time elapsed: 0 s
06:05:22 test_isPrimKeyField(org.eclipse.jst.j2ee.ejb.test.CMPAttributeTest)  Time elapsed: 0 s
06:05:22 Running org.eclipse.jst.j2ee.ejb.test.EntityTest
06:05:22 Tests run: 2, Failures: 0, Errors: 0, Skipped: 0, Time elapsed: 0.337 s - in org.eclipse.jst.j2ee.ejb.test.EntityTest
06:05:22 test_setPrimaryKeyName(org.eclipse.jst.j2ee.ejb.test.EntityTest)  Time elapsed: 0.171 s
06:05:22 test_getPrimaryKeyName(org.eclipse.jst.j2ee.ejb.test.EntityTest)  Time elapsed: 0.166 s
06:05:22 Running org.eclipse.jst.j2ee.ejb.test.MethodElementTest
06:05:22 Tests run: 21, Failures: 0, Errors: 0, Skipped: 0, Time elapsed: 0.149 s - in org.eclipse.jst.j2ee.ejb.test.MethodElementTest
06:05:22 test_initializeFromSignature(org.eclipse.jst.j2ee.ejb.test.MethodElementTest)  Time elapsed: 0 s
06:05:22 test_applyZeroParams(org.eclipse.jst.j2ee.ejb.test.MethodElementTest)  Time elapsed: 0.001 s
06:05:22 test_equalSignature(org.eclipse.jst.j2ee.ejb.test.MethodElementTest)  Time elapsed: 0 s
06:05:22 test_isRemote(org.eclipse.jst.j2ee.ejb.test.MethodElementTest)  Time elapsed: 0 s
06:05:22 test_getTypeJavaClass(org.eclipse.jst.j2ee.ejb.test.MethodElementTest)  Time elapsed: 0.144 s
06:05:22 test_isHome(org.eclipse.jst.j2ee.ejb.test.MethodElementTest)  Time elapsed: 0 s
06:05:22 test_getSignature(org.eclipse.jst.j2ee.ejb.test.MethodElementTest)  Time elapsed: 0 s
06:05:22 test_nameAndParamsEquals(org.eclipse.jst.j2ee.ejb.test.MethodElementTest)  Time elapsed: 0.001 s
06:05:22 test_isLocalHome(org.eclipse.jst.j2ee.ejb.test.MethodElementTest)  Time elapsed: 0 s
06:05:22 test_isUnspecified(org.eclipse.jst.j2ee.ejb.test.MethodElementTest)  Time elapsed: 0.001 s
06:05:22 test_isEquivalent(org.eclipse.jst.j2ee.ejb.test.MethodElementTest)  Time elapsed: 0 s
06:05:22 test_MethodElement(org.eclipse.jst.j2ee.ejb.test.MethodElementTest)  Time elapsed: 0 s
06:05:22 test_hasMethodParams(org.eclipse.jst.j2ee.ejb.test.MethodElementTest)  Time elapsed: 0 s
06:05:22 test_isLocal(org.eclipse.jst.j2ee.ejb.test.MethodElementTest)  Time elapsed: 0 s
06:05:22 test_isValid(org.eclipse.jst.j2ee.ejb.test.MethodElementTest)  Time elapsed: 0 s
06:05:22 test_getMethodParams(org.eclipse.jst.j2ee.ejb.test.MethodElementTest)  Time elapsed: 0 s
06:05:22 test_isDefault(org.eclipse.jst.j2ee.ejb.test.MethodElementTest)  Time elapsed: 0 s
06:05:22 test_addMethodParams(org.eclipse.jst.j2ee.ejb.test.MethodElementTest)  Time elapsed: 0.001 s
06:05:22 test_removeMethodParams(org.eclipse.jst.j2ee.ejb.test.MethodElementTest)  Time elapsed: 0 s
06:05:22 testEJBJarPopulation(org.eclipse.jst.j2ee.ejb.test.MethodElementTest)  Time elapsed: 0 s
06:05:22 test14EJBJarPopulation(org.eclipse.jst.j2ee.ejb.test.MethodElementTest)  Time elapsed: 0 s
06:05:22 Running org.eclipse.jst.j2ee.ejb.test.EJBRelationshipRoleTest
06:05:22 Tests run: 13, Failures: 0, Errors: 0, Skipped: 0, Time elapsed: 0.004 s - in org.eclipse.jst.j2ee.ejb.test.EJBRelationshipRoleTest
06:05:22 test_isNavigable(org.eclipse.jst.j2ee.ejb.test.EJBRelationshipRoleTest)  Time elapsed: 0 s
06:05:22 test_getLogicalName(org.eclipse.jst.j2ee.ejb.test.EJBRelationshipRoleTest)  Time elapsed: 0 s
06:05:22 test_getName(org.eclipse.jst.j2ee.ejb.test.EJBRelationshipRoleTest)  Time elapsed: 0 s
06:05:22 test_isForward(org.eclipse.jst.j2ee.ejb.test.EJBRelationshipRoleTest)  Time elapsed: 0 s
06:05:22 test_isMany(org.eclipse.jst.j2ee.ejb.test.EJBRelationshipRoleTest)  Time elapsed: 0 s
06:05:22 test_setKey(org.eclipse.jst.j2ee.ejb.test.EJBRelationshipRoleTest)  Time elapsed: 0.001 s
06:05:22 test_EJBRelationshipRole(org.eclipse.jst.j2ee.ejb.test.EJBRelationshipRoleTest)  Time elapsed: 0 s
06:05:22 test_setFoward(org.eclipse.jst.j2ee.ejb.test.EJBRelationshipRoleTest)  Time elapsed: 0.001 s
06:05:22 test_setName(org.eclipse.jst.j2ee.ejb.test.EJBRelationshipRoleTest)  Time elapsed: 0 s
06:05:22 test_getSourceEntity(org.eclipse.jst.j2ee.ejb.test.EJBRelationshipRoleTest)  Time elapsed: 0 s
06:05:22 test_setRequired(org.eclipse.jst.j2ee.ejb.test.EJBRelationshipRoleTest)  Time elapsed: 0 s
06:05:22 test_isKey(org.eclipse.jst.j2ee.ejb.test.EJBRelationshipRoleTest)  Time elapsed: 0 s
06:05:22 test_getOpposite(org.eclipse.jst.j2ee.ejb.test.EJBRelationshipRoleTest)  Time elapsed: 0 s
06:05:22 Running org.eclipse.jst.j2ee.ejb.test.AssemblyDescriptorTest
06:05:22 Tests run: 5, Failures: 0, Errors: 0, Skipped: 0, Time elapsed: 0.701 s - in org.eclipse.jst.j2ee.ejb.test.AssemblyDescriptorTest
06:05:23 test_getMethodPermissionMethodElements(org.eclipse.jst.j2ee.ejb.test.AssemblyDescriptorTest)  Time elapsed: 0.156 s
06:05:23 test_getMethodTransactionMethodElements(org.eclipse.jst.j2ee.ejb.test.AssemblyDescriptorTest)  Time elapsed: 0.133 s
06:05:23 test_getSecurityRoleNamed(org.eclipse.jst.j2ee.ejb.test.AssemblyDescriptorTest)  Time elapsed: 0.154 s
06:05:23 test_renameSecurityRole(org.eclipse.jst.j2ee.ejb.test.AssemblyDescriptorTest)  Time elapsed: 0.126 s
06:05:23 test_removeData(org.eclipse.jst.j2ee.ejb.test.AssemblyDescriptorTest)  Time elapsed: 0.131 s
06:05:23 Running org.eclipse.jst.j2ee.ejb.test.MethodTransactionTest
06:05:23 Tests run: 2, Failures: 0, Errors: 0, Skipped: 0, Time elapsed: 0.149 s - in org.eclipse.jst.j2ee.ejb.test.MethodTransactionTest
06:05:23 test_isEquivalent(org.eclipse.jst.j2ee.ejb.test.MethodTransactionTest)  Time elapsed: 0.001 s
06:05:23 test_getMethodElements(org.eclipse.jst.j2ee.ejb.test.MethodTransactionTest)  Time elapsed: 0.147 s
06:05:23 Running org.eclipse.jst.j2ee.ejb.test.SessionTest
06:05:23 Tests run: 3, Failures: 0, Errors: 0, Skipped: 0, Time elapsed: 0.001 s - in org.eclipse.jst.j2ee.ejb.test.SessionTest
06:05:23 test_hasServiceEndpoint(org.eclipse.jst.j2ee.ejb.test.SessionTest)  Time elapsed: 0 s
06:05:23 test_getServiceEndpointName(org.eclipse.jst.j2ee.ejb.test.SessionTest)  Time elapsed: 0 s
06:05:23 test_setServiceEndpointName(org.eclipse.jst.j2ee.ejb.test.SessionTest)  Time elapsed: 0 s
06:05:23 Running org.eclipse.jst.j2ee.ejb.test.EjbFactoryTest
06:05:23 Tests run: 26, Failures: 0, Errors: 0, Skipped: 0, Time elapsed: 0.003 s - in org.eclipse.jst.j2ee.ejb.test.EjbFactoryTest
06:05:23 test_createActivationConfig(org.eclipse.jst.j2ee.ejb.test.EjbFactoryTest)  Time elapsed: 0 s
06:05:23 test_createExcludeList(org.eclipse.jst.j2ee.ejb.test.EjbFactoryTest)  Time elapsed: 0.001 s
06:05:23 test_createEJBRelationshipRole(org.eclipse.jst.j2ee.ejb.test.EjbFactoryTest)  Time elapsed: 0 s
06:05:23 test_createContainerManagedEntity(org.eclipse.jst.j2ee.ejb.test.EjbFactoryTest)  Time elapsed: 0 s
06:05:23 test_createMessageDrivenDestination(org.eclipse.jst.j2ee.ejb.test.EjbFactoryTest)  Time elapsed: 0 s
06:05:23 test_createMethodElement_2(org.eclipse.jst.j2ee.ejb.test.EjbFactoryTest)  Time elapsed: 0 s
06:05:23 test_createCMPAttribute(org.eclipse.jst.j2ee.ejb.test.EjbFactoryTest)  Time elapsed: 0 s
06:05:23 test_createSession(org.eclipse.jst.j2ee.ejb.test.EjbFactoryTest)  Time elapsed: 0 s
06:05:23 test_createMethodElementFrom(org.eclipse.jst.j2ee.ejb.test.EjbFactoryTest)  Time elapsed: 0 s
06:05:23 test_createEJBRelation(org.eclipse.jst.j2ee.ejb.test.EjbFactoryTest)  Time elapsed: 0 s
06:05:23 test_createMethodElementFrom_2(org.eclipse.jst.j2ee.ejb.test.EjbFactoryTest)  Time elapsed: 0 s
06:05:23 test_EjbFactory(org.eclipse.jst.j2ee.ejb.test.EjbFactoryTest)  Time elapsed: 0 s
06:05:23 test_createQuery(org.eclipse.jst.j2ee.ejb.test.EjbFactoryTest)  Time elapsed: 0 s
06:05:23 test_createQueryMethod(org.eclipse.jst.j2ee.ejb.test.EjbFactoryTest)  Time elapsed: 0 s
06:05:23 test_createActivationConfigProperty(org.eclipse.jst.j2ee.ejb.test.EjbFactoryTest)  Time elapsed: 0 s
06:05:23 test_createEJBJar(org.eclipse.jst.j2ee.ejb.test.EjbFactoryTest)  Time elapsed: 0 s
06:05:23 test_createMethodPermission(org.eclipse.jst.j2ee.ejb.test.EjbFactoryTest)  Time elapsed: 0 s
06:05:23 test_createEntity(org.eclipse.jst.j2ee.ejb.test.EjbFactoryTest)  Time elapsed: 0 s
06:05:23 test_createRelationships(org.eclipse.jst.j2ee.ejb.test.EjbFactoryTest)  Time elapsed: 0 s
06:05:23 test_createEJBMethodCategory(org.eclipse.jst.j2ee.ejb.test.EjbFactoryTest)  Time elapsed: 0 s
06:05:23 test_createMethodTransaction(org.eclipse.jst.j2ee.ejb.test.EjbFactoryTest)  Time elapsed: 0 s
06:05:23 test_createMethodElement(org.eclipse.jst.j2ee.ejb.test.EjbFactoryTest)  Time elapsed: 0.001 s
06:05:23 test_createAssemblyDescriptor(org.eclipse.jst.j2ee.ejb.test.EjbFactoryTest)  Time elapsed: 0 s
06:05:23 test_createRoleSource(org.eclipse.jst.j2ee.ejb.test.EjbFactoryTest)  Time elapsed: 0 s
06:05:23 test_createCMRField(org.eclipse.jst.j2ee.ejb.test.EjbFactoryTest)  Time elapsed: 0 s
06:05:23 test_createMessageDriven(org.eclipse.jst.j2ee.ejb.test.EjbFactoryTest)  Time elapsed: 0 s
06:05:23 Running org.eclipse.jst.j2ee.common.tests.CommonTests
06:05:23 Tests run: 0, Failures: 0, Errors: 0, Skipped: 0, Time elapsed: 0 s - in org.eclipse.jst.j2ee.common.tests.CommonTests
06:05:23 Running org.eclipse.jst.j2ee.common.test.QNameTest
06:05:23 Tests run: 1, Failures: 0, Errors: 0, Skipped: 0, Time elapsed: 0.001 s - in org.eclipse.jst.j2ee.common.test.QNameTest
06:05:23 test_setValues(org.eclipse.jst.j2ee.common.test.QNameTest)  Time elapsed: 0 s
06:05:23 Running org.eclipse.jst.j2ee.common.test.ListenerTest
06:05:23 Tests run: 2, Failures: 0, Errors: 0, Skipped: 0, Time elapsed: 0 s - in org.eclipse.jst.j2ee.common.test.ListenerTest
06:05:23 test_setListenerClassName(org.eclipse.jst.j2ee.common.test.ListenerTest)  Time elapsed: 0 s
06:05:23 test_getListenerClassName(org.eclipse.jst.j2ee.common.test.ListenerTest)  Time elapsed: 0 s
06:05:23 Running org.eclipse.jst.j2ee.common.test.EjbRefTest
06:05:23 Tests run: 5, Failures: 0, Errors: 0, Skipped: 0, Time elapsed: 0 s - in org.eclipse.jst.j2ee.common.test.EjbRefTest
06:05:23 test_isLinked(org.eclipse.jst.j2ee.common.test.EjbRefTest)  Time elapsed: 0 s
06:05:23 test_EjbRef(org.eclipse.jst.j2ee.common.test.EjbRefTest)  Time elapsed: 0 s
06:05:23 test_isEquivalent(org.eclipse.jst.j2ee.common.test.EjbRefTest)  Time elapsed: 0 s
06:05:23 test_isLocal(org.eclipse.jst.j2ee.common.test.EjbRefTest)  Time elapsed: 0 s
06:05:23 test_getLinkedEjb(org.eclipse.jst.j2ee.common.test.EjbRefTest)  Time elapsed: 0 s
06:05:23 Running org.eclipse.jst.j2ee.common.test.CommonFactoryTest
06:05:23 Tests run: 22, Failures: 0, Errors: 0, Skipped: 0, Time elapsed: 0.002 s - in org.eclipse.jst.j2ee.common.test.CommonFactoryTest
06:05:23 test_createCompatibilityDescriptionGroup(org.eclipse.jst.j2ee.common.test.CommonFactoryTest)  Time elapsed: 0 s
06:05:23 test_createUseCallerIdentity(org.eclipse.jst.j2ee.common.test.CommonFactoryTest)  Time elapsed: 0 s
06:05:23 test_createDescriptionGroup(org.eclipse.jst.j2ee.common.test.CommonFactoryTest)  Time elapsed: 0 s
06:05:23 test_createIconType(org.eclipse.jst.j2ee.common.test.CommonFactoryTest)  Time elapsed: 0 s
06:05:23 test_createResourceRef(org.eclipse.jst.j2ee.common.test.CommonFactoryTest)  Time elapsed: 0 s
06:05:23 test_createDisplayName(org.eclipse.jst.j2ee.common.test.CommonFactoryTest)  Time elapsed: 0 s
06:05:23 test_createIdentity(org.eclipse.jst.j2ee.common.test.CommonFactoryTest)  Time elapsed: 0 s
06:05:23 test_createSecurityIdentity(org.eclipse.jst.j2ee.common.test.CommonFactoryTest)  Time elapsed: 0 s
06:05:23 test_createResourceEnvRef(org.eclipse.jst.j2ee.common.test.CommonFactoryTest)  Time elapsed: 0 s
06:05:23 test_createDescription(org.eclipse.jst.j2ee.common.test.CommonFactoryTest)  Time elapsed: 0 s
06:05:23 test_createQName(org.eclipse.jst.j2ee.common.test.CommonFactoryTest)  Time elapsed: 0 s
06:05:23 test_CommonFactory(org.eclipse.jst.j2ee.common.test.CommonFactoryTest)  Time elapsed: 0 s
06:05:23 test_createParamValue(org.eclipse.jst.j2ee.common.test.CommonFactoryTest)  Time elapsed: 0 s
06:05:23 test_createEjbRef(org.eclipse.jst.j2ee.common.test.CommonFactoryTest)  Time elapsed: 0 s
06:05:23 test_createListener(org.eclipse.jst.j2ee.common.test.CommonFactoryTest)  Time elapsed: 0 s
06:05:23 test_createMessageDestination(org.eclipse.jst.j2ee.common.test.CommonFactoryTest)  Time elapsed: 0 s
06:05:23 test_createEnvEntry(org.eclipse.jst.j2ee.common.test.CommonFactoryTest)  Time elapsed: 0 s
06:05:23 test_createSecurityRole(org.eclipse.jst.j2ee.common.test.CommonFactoryTest)  Time elapsed: 0 s
06:05:23 test_createMessageDestinationRef(org.eclipse.jst.j2ee.common.test.CommonFactoryTest)  Time elapsed: 0 s
06:05:23 test_createEJBLocalRef(org.eclipse.jst.j2ee.common.test.CommonFactoryTest)  Time elapsed: 0 s
06:05:23 test_createSecurityRoleRef(org.eclipse.jst.j2ee.common.test.CommonFactoryTest)  Time elapsed: 0 s
06:05:23 test_createRunAsSpecifiedIdentity(org.eclipse.jst.j2ee.common.test.CommonFactoryTest)  Time elapsed: 0 s
06:05:23 Running org.eclipse.jst.j2ee.webservice.wsdd.test.WsddFactoryTest
06:05:23 Tests run: 9, Failures: 0, Errors: 0, Skipped: 0, Time elapsed: 0.001 s - in org.eclipse.jst.j2ee.webservice.wsdd.test.WsddFactoryTest
06:05:23 test_createEJBLink(org.eclipse.jst.j2ee.webservice.wsdd.test.WsddFactoryTest)  Time elapsed: 0 s
06:05:23 test_createWSDLPort(org.eclipse.jst.j2ee.webservice.wsdd.test.WsddFactoryTest)  Time elapsed: 0 s
06:05:23 test_createPortComponent(org.eclipse.jst.j2ee.webservice.wsdd.test.WsddFactoryTest)  Time elapsed: 0 s
06:05:23 test_createServiceImplBean(org.eclipse.jst.j2ee.webservice.wsdd.test.WsddFactoryTest)  Time elapsed: 0 s
06:05:23 test_createWebServices(org.eclipse.jst.j2ee.webservice.wsdd.test.WsddFactoryTest)  Time elapsed: 0.001 s
06:05:23 test_createBeanLink(org.eclipse.jst.j2ee.webservice.wsdd.test.WsddFactoryTest)  Time elapsed: 0 s
06:05:23 test_createWebServiceDescription(org.eclipse.jst.j2ee.webservice.wsdd.test.WsddFactoryTest)  Time elapsed: 0 s
06:05:23 test_createHandler(org.eclipse.jst.j2ee.webservice.wsdd.test.WsddFactoryTest)  Time elapsed: 0 s
06:05:23 test_createServletLink(org.eclipse.jst.j2ee.webservice.wsdd.test.WsddFactoryTest)  Time elapsed: 0 s
06:05:23 Running org.eclipse.jst.j2ee.webservice.wscommon.test.WscommonFactoryTest
06:05:23 Tests run: 7, Failures: 0, Errors: 0, Skipped: 0, Time elapsed: 0.002 s - in org.eclipse.jst.j2ee.webservice.wscommon.test.WscommonFactoryTest
06:05:23 test_createSOAPHeader(org.eclipse.jst.j2ee.webservice.wscommon.test.WscommonFactoryTest)  Time elapsed: 0 s
06:05:23 test_createDisplayNameType(org.eclipse.jst.j2ee.webservice.wscommon.test.WscommonFactoryTest)  Time elapsed: 0 s
06:05:23 test_getWscommonPackage(org.eclipse.jst.j2ee.webservice.wscommon.test.WscommonFactoryTest)  Time elapsed: 0 s
06:05:23 test_createDescriptionType(org.eclipse.jst.j2ee.webservice.wscommon.test.WscommonFactoryTest)  Time elapsed: 0 s
06:05:23 test_createPortName(org.eclipse.jst.j2ee.webservice.wscommon.test.WscommonFactoryTest)  Time elapsed: 0.001 s
06:05:23 test_createSOAPRole(org.eclipse.jst.j2ee.webservice.wscommon.test.WscommonFactoryTest)  Time elapsed: 0 s
06:05:23 test_createInitParam(org.eclipse.jst.j2ee.webservice.wscommon.test.WscommonFactoryTest)  Time elapsed: 0 s
06:05:23 Running org.eclipse.jst.j2ee.core.tests.api.AllAPITest
06:05:23 Tests run: 243, Failures: 0, Errors: 0, Skipped: 0, Time elapsed: 1.223 s - in org.eclipse.jst.j2ee.core.tests.api.AllAPITest
06:05:24 test_createEjbModule(org.eclipse.jst.j2ee.application.test.ApplicationFactoryTest)  Time elapsed: 0 s
06:05:24 test_createApplication(org.eclipse.jst.j2ee.application.test.ApplicationFactoryTest)  Time elapsed: 0 s
06:05:24 test_createConnectorModule(org.eclipse.jst.j2ee.application.test.ApplicationFactoryTest)  Time elapsed: 0 s
06:05:24 test_createWebModule(org.eclipse.jst.j2ee.application.test.ApplicationFactoryTest)  Time elapsed: 0 s
06:05:24 test_createJavaClientModule(org.eclipse.jst.j2ee.application.test.ApplicationFactoryTest)  Time elapsed: 0 s
06:05:24 test_createModule(org.eclipse.jst.j2ee.application.test.ApplicationFactoryTest)  Time elapsed: 0 s
06:05:24 test_getVersionID(org.eclipse.jst.j2ee.application.test.ApplicationTest)  Time elapsed: 0 s
06:05:24 test_getJ2EEVersionID(org.eclipse.jst.j2ee.application.test.ApplicationTest)  Time elapsed: 0.001 s
06:05:24 test_getSecurityRoleNamed(org.eclipse.jst.j2ee.application.test.ApplicationTest)  Time elapsed: 0 s
06:05:24 test_getModuleHavingAltDD(org.eclipse.jst.j2ee.application.test.ApplicationTest)  Time elapsed: 0 s
06:05:24 test_containsSecurityRole(org.eclipse.jst.j2ee.application.test.ApplicationTest)  Time elapsed: 0 s
06:05:24 test_getModule_2(org.eclipse.jst.j2ee.application.test.ApplicationTest)  Time elapsed: 0 s
06:05:24 test_getFirstModule(org.eclipse.jst.j2ee.application.test.ApplicationTest)  Time elapsed: 0 s
06:05:24 test_getVersionID(org.eclipse.jst.j2ee.client.test.ApplicationClientTest)  Time elapsed: 0.004 s
06:05:24 test_getJ2EEVersionID(org.eclipse.jst.j2ee.client.test.ApplicationClientTest)  Time elapsed: 0.003 s
06:05:24 test_getCallbackHandlerClassName(org.eclipse.jst.j2ee.client.test.ApplicationClientTest)  Time elapsed: 0 s
06:05:24 test_setCallbackHandlerClassName(org.eclipse.jst.j2ee.client.test.ApplicationClientTest)  Time elapsed: 0 s
06:05:24 test_ClientFactory(org.eclipse.jst.j2ee.client.test.ClientFactoryTest)  Time elapsed: 0 s
06:05:24 test_createApplicationClient(org.eclipse.jst.j2ee.client.test.ClientFactoryTest)  Time elapsed: 0 s
06:05:24 test_createCompatibilityDescriptionGroup(org.eclipse.jst.j2ee.common.test.CommonFactoryTest)  Time elapsed: 0 s
06:05:24 test_createUseCallerIdentity(org.eclipse.jst.j2ee.common.test.CommonFactoryTest)  Time elapsed: 0 s
06:05:24 test_createDescriptionGroup(org.eclipse.jst.j2ee.common.test.CommonFactoryTest)  Time elapsed: 0 s
06:05:24 test_createIconType(org.eclipse.jst.j2ee.common.test.CommonFactoryTest)  Time elapsed: 0 s
06:05:24 test_createResourceRef(org.eclipse.jst.j2ee.common.test.CommonFactoryTest)  Time elapsed: 0 s
06:05:24 test_createDisplayName(org.eclipse.jst.j2ee.common.test.CommonFactoryTest)  Time elapsed: 0 s
06:05:24 test_createIdentity(org.eclipse.jst.j2ee.common.test.CommonFactoryTest)  Time elapsed: 0 s
06:05:24 test_createSecurityIdentity(org.eclipse.jst.j2ee.common.test.CommonFactoryTest)  Time elapsed: 0 s
06:05:24 test_createResourceEnvRef(org.eclipse.jst.j2ee.common.test.CommonFactoryTest)  Time elapsed: 0 s
06:05:24 test_createDescription(org.eclipse.jst.j2ee.common.test.CommonFactoryTest)  Time elapsed: 0 s
06:05:24 test_createQName(org.eclipse.jst.j2ee.common.test.CommonFactoryTest)  Time elapsed: 0 s
06:05:24 test_CommonFactory(org.eclipse.jst.j2ee.common.test.CommonFactoryTest)  Time elapsed: 0 s
06:05:24 test_createParamValue(org.eclipse.jst.j2ee.common.test.CommonFactoryTest)  Time elapsed: 0 s
06:05:24 test_createEjbRef(org.eclipse.jst.j2ee.common.test.CommonFactoryTest)  Time elapsed: 0 s
06:05:24 test_createListener(org.eclipse.jst.j2ee.common.test.CommonFactoryTest)  Time elapsed: 0 s
06:05:24 test_createMessageDestination(org.eclipse.jst.j2ee.common.test.CommonFactoryTest)  Time elapsed: 0 s
06:05:24 test_createEnvEntry(org.eclipse.jst.j2ee.common.test.CommonFactoryTest)  Time elapsed: 0 s
06:05:24 test_createSecurityRole(org.eclipse.jst.j2ee.common.test.CommonFactoryTest)  Time elapsed: 0 s
06:05:24 test_createMessageDestinationRef(org.eclipse.jst.j2ee.common.test.CommonFactoryTest)  Time elapsed: 0 s
06:05:24 test_createEJBLocalRef(org.eclipse.jst.j2ee.common.test.CommonFactoryTest)  Time elapsed: 0 s
06:05:24 test_createSecurityRoleRef(org.eclipse.jst.j2ee.common.test.CommonFactoryTest)  Time elapsed: 0 s
06:05:24 test_createRunAsSpecifiedIdentity(org.eclipse.jst.j2ee.common.test.CommonFactoryTest)  Time elapsed: 0 s
06:05:24 test_isLinked(org.eclipse.jst.j2ee.common.test.EjbRefTest)  Time elapsed: 0 s
06:05:24 test_EjbRef(org.eclipse.jst.j2ee.common.test.EjbRefTest)  Time elapsed: 0 s
06:05:24 test_isEquivalent(org.eclipse.jst.j2ee.common.test.EjbRefTest)  Time elapsed: 0 s
06:05:24 test_isLocal(org.eclipse.jst.j2ee.common.test.EjbRefTest)  Time elapsed: 0 s
06:05:24 test_getLinkedEjb(org.eclipse.jst.j2ee.common.test.EjbRefTest)  Time elapsed: 0 s
06:05:24 test_setListenerClassName(org.eclipse.jst.j2ee.common.test.ListenerTest)  Time elapsed: 0 s
06:05:24 test_getListenerClassName(org.eclipse.jst.j2ee.common.test.ListenerTest)  Time elapsed: 0 s
06:05:24 test_setValues(org.eclipse.jst.j2ee.common.test.QNameTest)  Time elapsed: 0 s
06:05:24 test_getMethodPermissionMethodElements(org.eclipse.jst.j2ee.ejb.test.AssemblyDescriptorTest)  Time elapsed: 0.14 s
06:05:24 test_getMethodTransactionMethodElements(org.eclipse.jst.j2ee.ejb.test.AssemblyDescriptorTest)  Time elapsed: 0.132 s
06:05:24 test_getSecurityRoleNamed(org.eclipse.jst.j2ee.ejb.test.AssemblyDescriptorTest)  Time elapsed: 0.127 s
06:05:24 test_renameSecurityRole(org.eclipse.jst.j2ee.ejb.test.AssemblyDescriptorTest)  Time elapsed: 0.136 s
06:05:24 test_removeData(org.eclipse.jst.j2ee.ejb.test.AssemblyDescriptorTest)  Time elapsed: 0.123 s
06:05:24 test_getSetterName(org.eclipse.jst.j2ee.ejb.test.CMPAttributeTest)  Time elapsed: 0 s
06:05:24 test_getType(org.eclipse.jst.j2ee.ejb.test.CMPAttributeTest)  Time elapsed: 0 s
06:05:24 test_getOriginatingType(org.eclipse.jst.j2ee.ejb.test.CMPAttributeTest)  Time elapsed: 0 s
06:05:24 test_setDerived(org.eclipse.jst.j2ee.ejb.test.CMPAttributeTest)  Time elapsed: 0 s
06:05:24 test_setOriginatingType(org.eclipse.jst.j2ee.ejb.test.CMPAttributeTest)  Time elapsed: 0 s
06:05:24 test_isCMRField(org.eclipse.jst.j2ee.ejb.test.CMPAttributeTest)  Time elapsed: 0 s
06:05:24 test_getGetterName(org.eclipse.jst.j2ee.ejb.test.CMPAttributeTest)  Time elapsed: 0 s
06:05:24 test_isDerived(org.eclipse.jst.j2ee.ejb.test.CMPAttributeTest)  Time elapsed: 0 s
06:05:24 test_isKey(org.eclipse.jst.j2ee.ejb.test.CMPAttributeTest)  Time elapsed: 0 s
06:05:24 test_isPrimKeyField(org.eclipse.jst.j2ee.ejb.test.CMPAttributeTest)  Time elapsed: 0 s
06:05:24 test_getRole(org.eclipse.jst.j2ee.ejb.test.CMRFieldTest)  Time elapsed: 0 s
06:05:24 test_setCollectionTypeName(org.eclipse.jst.j2ee.ejb.test.CMRFieldTest)  Time elapsed: 0 s
06:05:24 test_setCollectionType(org.eclipse.jst.j2ee.ejb.test.CMRFieldTest)  Time elapsed: 0 s
06:05:24 test_getCollectionType(org.eclipse.jst.j2ee.ejb.test.CMRFieldTest)  Time elapsed: 0 s
06:05:24 test_setRole(org.eclipse.jst.j2ee.ejb.test.CMRFieldTest)  Time elapsed: 0 s
06:05:24 test_getCollectionTypeName(org.eclipse.jst.j2ee.ejb.test.CMRFieldTest)  Time elapsed: 0 s
06:05:24 test_isUnknownPrimaryKey(org.eclipse.jst.j2ee.ejb.test.ContainerManagedEntityTest)  Time elapsed: 0 s
06:05:24 test_addPersistentAttribute(org.eclipse.jst.j2ee.ejb.test.ContainerManagedEntityTest)  Time elapsed: 0 s
06:05:24 test_addKeyAttributeName(org.eclipse.jst.j2ee.ejb.test.ContainerManagedEntityTest)  Time elapsed: 0 s
06:05:24 test_getKeyAttribute(org.eclipse.jst.j2ee.ejb.test.ContainerManagedEntityTest)  Time elapsed: 0 s
06:05:24 test_isContainerManagedEntity(org.eclipse.jst.j2ee.ejb.test.ContainerManagedEntityTest)  Time elapsed: 0 s
06:05:24 test_getPrimaryKeyAttribute(org.eclipse.jst.j2ee.ejb.test.ContainerManagedEntityTest)  Time elapsed: 0.001 s
06:05:24 test_isVersion1_X(org.eclipse.jst.j2ee.ejb.test.ContainerManagedEntityTest)  Time elapsed: 0 s
06:05:24 test_isVersion2_X(org.eclipse.jst.j2ee.ejb.test.ContainerManagedEntityTest)  Time elapsed: 0 s
06:05:24 test_removePersistentAttribute_2(org.eclipse.jst.j2ee.ejb.test.ContainerManagedEntityTest)  Time elapsed: 0 s
06:05:24 test_listPersistentFieldNames(org.eclipse.jst.j2ee.ejb.test.ContainerManagedEntityTest)  Time elapsed: 0 s
06:05:24 test_isKeyAttribute(org.eclipse.jst.j2ee.ejb.test.ContainerManagedEntityTest)  Time elapsed: 0 s
06:05:24 test_getCMPVersionID(org.eclipse.jst.j2ee.ejb.test.ContainerManagedEntityTest)  Time elapsed: 0 s
06:05:24 test_setPrimKeyField(org.eclipse.jst.j2ee.ejb.test.ContainerManagedEntityTest)  Time elapsed: 0 s
06:05:24 test_addPersistentAttributeName(org.eclipse.jst.j2ee.ejb.test.ContainerManagedEntityTest)  Time elapsed: 0 s
06:05:24 test_removePersistentAttribute(org.eclipse.jst.j2ee.ejb.test.ContainerManagedEntityTest)  Time elapsed: 0 s
06:05:24 test_createActivationConfig(org.eclipse.jst.j2ee.ejb.test.EjbFactoryTest)  Time elapsed: 0 s
06:05:24 test_createExcludeList(org.eclipse.jst.j2ee.ejb.test.EjbFactoryTest)  Time elapsed: 0 s
06:05:24 test_createEJBRelationshipRole(org.eclipse.jst.j2ee.ejb.test.EjbFactoryTest)  Time elapsed: 0 s
06:05:24 test_createContainerManagedEntity(org.eclipse.jst.j2ee.ejb.test.EjbFactoryTest)  Time elapsed: 0 s
06:05:24 test_createMessageDrivenDestination(org.eclipse.jst.j2ee.ejb.test.EjbFactoryTest)  Time elapsed: 0 s
06:05:24 test_createMethodElement_2(org.eclipse.jst.j2ee.ejb.test.EjbFactoryTest)  Time elapsed: 0 s
06:05:24 test_createCMPAttribute(org.eclipse.jst.j2ee.ejb.test.EjbFactoryTest)  Time elapsed: 0 s
06:05:24 test_createSession(org.eclipse.jst.j2ee.ejb.test.EjbFactoryTest)  Time elapsed: 0 s
06:05:24 test_createMethodElementFrom(org.eclipse.jst.j2ee.ejb.test.EjbFactoryTest)  Time elapsed: 0 s
06:05:24 test_createEJBRelation(org.eclipse.jst.j2ee.ejb.test.EjbFactoryTest)  Time elapsed: 0 s
06:05:24 test_createMethodElementFrom_2(org.eclipse.jst.j2ee.ejb.test.EjbFactoryTest)  Time elapsed: 0 s
06:05:24 test_EjbFactory(org.eclipse.jst.j2ee.ejb.test.EjbFactoryTest)  Time elapsed: 0 s
06:05:24 test_createQuery(org.eclipse.jst.j2ee.ejb.test.EjbFactoryTest)  Time elapsed: 0 s
06:05:24 test_createQueryMethod(org.eclipse.jst.j2ee.ejb.test.EjbFactoryTest)  Time elapsed: 0 s
06:05:24 test_createActivationConfigProperty(org.eclipse.jst.j2ee.ejb.test.EjbFactoryTest)  Time elapsed: 0 s
06:05:24 test_createEJBJar(org.eclipse.jst.j2ee.ejb.test.EjbFactoryTest)  Time elapsed: 0 s
06:05:24 test_createMethodPermission(org.eclipse.jst.j2ee.ejb.test.EjbFactoryTest)  Time elapsed: 0 s
06:05:24 test_createEntity(org.eclipse.jst.j2ee.ejb.test.EjbFactoryTest)  Time elapsed: 0 s
06:05:24 test_createRelationships(org.eclipse.jst.j2ee.ejb.test.EjbFactoryTest)  Time elapsed: 0 s
06:05:24 test_createEJBMethodCategory(org.eclipse.jst.j2ee.ejb.test.EjbFactoryTest)  Time elapsed: 0 s
06:05:24 test_createMethodTransaction(org.eclipse.jst.j2ee.ejb.test.EjbFactoryTest)  Time elapsed: 0 s
06:05:24 test_createMethodElement(org.eclipse.jst.j2ee.ejb.test.EjbFactoryTest)  Time elapsed: 0 s
06:05:24 test_createAssemblyDescriptor(org.eclipse.jst.j2ee.ejb.test.EjbFactoryTest)  Time elapsed: 0 s
06:05:24 test_createRoleSource(org.eclipse.jst.j2ee.ejb.test.EjbFactoryTest)  Time elapsed: 0 s
06:05:24 test_createCMRField(org.eclipse.jst.j2ee.ejb.test.EjbFactoryTest)  Time elapsed: 0 s
06:05:24 test_createMessageDriven(org.eclipse.jst.j2ee.ejb.test.EjbFactoryTest)  Time elapsed: 0 s
06:05:24 test_isNavigable(org.eclipse.jst.j2ee.ejb.test.EJBRelationshipRoleTest)  Time elapsed: 0 s
06:05:24 test_getLogicalName(org.eclipse.jst.j2ee.ejb.test.EJBRelationshipRoleTest)  Time elapsed: 0 s
06:05:24 test_getName(org.eclipse.jst.j2ee.ejb.test.EJBRelationshipRoleTest)  Time elapsed: 0 s
06:05:24 test_isForward(org.eclipse.jst.j2ee.ejb.test.EJBRelationshipRoleTest)  Time elapsed: 0 s
06:05:24 test_isMany(org.eclipse.jst.j2ee.ejb.test.EJBRelationshipRoleTest)  Time elapsed: 0 s
06:05:24 test_setKey(org.eclipse.jst.j2ee.ejb.test.EJBRelationshipRoleTest)  Time elapsed: 0 s
06:05:24 test_EJBRelationshipRole(org.eclipse.jst.j2ee.ejb.test.EJBRelationshipRoleTest)  Time elapsed: 0 s
06:05:24 test_setFoward(org.eclipse.jst.j2ee.ejb.test.EJBRelationshipRoleTest)  Time elapsed: 0 s
06:05:24 test_setName(org.eclipse.jst.j2ee.ejb.test.EJBRelationshipRoleTest)  Time elapsed: 0 s
06:05:24 test_getSourceEntity(org.eclipse.jst.j2ee.ejb.test.EJBRelationshipRoleTest)  Time elapsed: 0 s
06:05:24 test_setRequired(org.eclipse.jst.j2ee.ejb.test.EJBRelationshipRoleTest)  Time elapsed: 0 s
06:05:24 test_isKey(org.eclipse.jst.j2ee.ejb.test.EJBRelationshipRoleTest)  Time elapsed: 0 s
06:05:24 test_getOpposite(org.eclipse.jst.j2ee.ejb.test.EJBRelationshipRoleTest)  Time elapsed: 0 s
06:05:24 test_containsRelationshipRole(org.eclipse.jst.j2ee.ejb.test.EJBRelationTest)  Time elapsed: 0 s
06:05:24 test_getSecondRole(org.eclipse.jst.j2ee.ejb.test.EJBRelationTest)  Time elapsed: 0 s
06:05:24 test_getFirstRole(org.eclipse.jst.j2ee.ejb.test.EJBRelationTest)  Time elapsed: 0 s
06:05:24 test_getOppositeRole(org.eclipse.jst.j2ee.ejb.test.EJBRelationTest)  Time elapsed: 0 s
06:05:24 test_EJBRelation(org.eclipse.jst.j2ee.ejb.test.EJBRelationTest)  Time elapsed: 0 s
06:05:24 test_setFoward(org.eclipse.jst.j2ee.ejb.test.EJBRelationTest)  Time elapsed: 0 s
06:05:24 test_setPrimaryKeyName(org.eclipse.jst.j2ee.ejb.test.EntityTest)  Time elapsed: 0.148 s
06:05:24 test_getPrimaryKeyName(org.eclipse.jst.j2ee.ejb.test.EntityTest)  Time elapsed: 0.124 s
06:05:24 test_initializeFromSignature(org.eclipse.jst.j2ee.ejb.test.MethodElementTest)  Time elapsed: 0 s
06:05:24 test_applyZeroParams(org.eclipse.jst.j2ee.ejb.test.MethodElementTest)  Time elapsed: 0 s
06:05:24 test_equalSignature(org.eclipse.jst.j2ee.ejb.test.MethodElementTest)  Time elapsed: 0 s
06:05:24 test_isRemote(org.eclipse.jst.j2ee.ejb.test.MethodElementTest)  Time elapsed: 0.001 s
06:05:24 test_getTypeJavaClass(org.eclipse.jst.j2ee.ejb.test.MethodElementTest)  Time elapsed: 0.143 s
06:05:24 test_isHome(org.eclipse.jst.j2ee.ejb.test.MethodElementTest)  Time elapsed: 0 s
06:05:24 test_getSignature(org.eclipse.jst.j2ee.ejb.test.MethodElementTest)  Time elapsed: 0 s
06:05:24 test_nameAndParamsEquals(org.eclipse.jst.j2ee.ejb.test.MethodElementTest)  Time elapsed: 0 s
06:05:24 test_isLocalHome(org.eclipse.jst.j2ee.ejb.test.MethodElementTest)  Time elapsed: 0 s
06:05:24 test_isUnspecified(org.eclipse.jst.j2ee.ejb.test.MethodElementTest)  Time elapsed: 0 s
06:05:24 test_isEquivalent(org.eclipse.jst.j2ee.ejb.test.MethodElementTest)  Time elapsed: 0 s
06:05:24 test_MethodElement(org.eclipse.jst.j2ee.ejb.test.MethodElementTest)  Time elapsed: 0 s
06:05:24 test_hasMethodParams(org.eclipse.jst.j2ee.ejb.test.MethodElementTest)  Time elapsed: 0 s
06:05:24 test_isLocal(org.eclipse.jst.j2ee.ejb.test.MethodElementTest)  Time elapsed: 0 s
06:05:24 test_isValid(org.eclipse.jst.j2ee.ejb.test.MethodElementTest)  Time elapsed: 0 s
06:05:24 test_getMethodParams(org.eclipse.jst.j2ee.ejb.test.MethodElementTest)  Time elapsed: 0 s
06:05:24 test_isDefault(org.eclipse.jst.j2ee.ejb.test.MethodElementTest)  Time elapsed: 0 s
06:05:24 test_addMethodParams(org.eclipse.jst.j2ee.ejb.test.MethodElementTest)  Time elapsed: 0 s
06:05:24 test_removeMethodParams(org.eclipse.jst.j2ee.ejb.test.MethodElementTest)  Time elapsed: 0.001 s
06:05:24 testEJBJarPopulation(org.eclipse.jst.j2ee.ejb.test.MethodElementTest)  Time elapsed: 0 s
06:05:24 test14EJBJarPopulation(org.eclipse.jst.j2ee.ejb.test.MethodElementTest)  Time elapsed: 0 s
06:05:24 test_MethodPermission(org.eclipse.jst.j2ee.ejb.test.MethodPermissionTest)  Time elapsed: 0 s
06:05:24 test_isEquivalent(org.eclipse.jst.j2ee.ejb.test.MethodPermissionTest)  Time elapsed: 0 s
06:05:24 test_hasSecurityRole(org.eclipse.jst.j2ee.ejb.test.MethodPermissionTest)  Time elapsed: 0 s
06:05:24 test_getSecurityRole(org.eclipse.jst.j2ee.ejb.test.MethodPermissionTest)  Time elapsed: 0 s
06:05:24 test_hasSecurityRole_2(org.eclipse.jst.j2ee.ejb.test.MethodPermissionTest)  Time elapsed: 0 s
06:05:24 test_getClientTypeJavaClasses(org.eclipse.jst.j2ee.ejb.test.QueryMethodTest)  Time elapsed: 0.125 s
06:05:24 test_isRemoteResultMapping(org.eclipse.jst.j2ee.ejb.test.QueryTest)  Time elapsed: 0 s
06:05:24 test_isLocalResultMapping(org.eclipse.jst.j2ee.ejb.test.QueryTest)  Time elapsed: 0 s
06:05:24 test_Query(org.eclipse.jst.j2ee.ejb.test.QueryTest)  Time elapsed: 0 s
06:05:24 test_hasServiceEndpoint(org.eclipse.jst.j2ee.ejb.test.SessionTest)  Time elapsed: 0 s
06:05:24 test_getServiceEndpointName(org.eclipse.jst.j2ee.ejb.test.SessionTest)  Time elapsed: 0 s
06:05:24 test_setServiceEndpointName(org.eclipse.jst.j2ee.ejb.test.SessionTest)  Time elapsed: 0 s
06:05:24 test_getVersionID(org.eclipse.jst.j2ee.jca.test.ConnectorTest)  Time elapsed: 0 s
06:05:24 test_createResourceAdapter(org.eclipse.jst.j2ee.jca.test.JcaFactoryTest)  Time elapsed: 0 s
06:05:24 test_createInboundResourceAdapter(org.eclipse.jst.j2ee.jca.test.JcaFactoryTest)  Time elapsed: 0 s
06:05:24 test_createActivationSpec(org.eclipse.jst.j2ee.jca.test.JcaFactoryTest)  Time elapsed: 0 s
06:05:24 test_getJcaPackage(org.eclipse.jst.j2ee.jca.test.JcaFactoryTest)  Time elapsed: 0 s
06:05:24 test_createAuthenticationMechanism(org.eclipse.jst.j2ee.jca.test.JcaFactoryTest)  Time elapsed: 0 s
06:05:24 test_createMessageAdapter(org.eclipse.jst.j2ee.jca.test.JcaFactoryTest)  Time elapsed: 0 s
06:05:24 test_createRequiredConfigPropertyType(org.eclipse.jst.j2ee.jca.test.JcaFactoryTest)  Time elapsed: 0 s
06:05:24 test_createConfigProperty(org.eclipse.jst.j2ee.jca.test.JcaFactoryTest)  Time elapsed: 0 s
06:05:24 test_createConnectionDefinition(org.eclipse.jst.j2ee.jca.test.JcaFactoryTest)  Time elapsed: 0 s
06:05:24 test_createAdminObject(org.eclipse.jst.j2ee.jca.test.JcaFactoryTest)  Time elapsed: 0 s
06:05:24 test_JcaFactory(org.eclipse.jst.j2ee.jca.test.JcaFactoryTest)  Time elapsed: 0 s
06:05:24 test_createConnector(org.eclipse.jst.j2ee.jca.test.JcaFactoryTest)  Time elapsed: 0 s
06:05:24 test_createMessageListener(org.eclipse.jst.j2ee.jca.test.JcaFactoryTest)  Time elapsed: 0 s
06:05:24 test_createSecurityPermission(org.eclipse.jst.j2ee.jca.test.JcaFactoryTest)  Time elapsed: 0 s
06:05:24 test_createOutboundResourceAdapter(org.eclipse.jst.j2ee.jca.test.JcaFactoryTest)  Time elapsed: 0 s
06:05:24 test_createLicense(org.eclipse.jst.j2ee.jca.test.JcaFactoryTest)  Time elapsed: 0 s
06:05:24 test_createResourceAdapter(org.eclipse.jst.j2ee.jca.test.JcaFactoryTest)  Time elapsed: 0 s
06:05:24 test_createInboundResourceAdapter(org.eclipse.jst.j2ee.jca.test.JcaFactoryTest)  Time elapsed: 0 s
06:05:24 test_createActivationSpec(org.eclipse.jst.j2ee.jca.test.JcaFactoryTest)  Time elapsed: 0 s
06:05:24 test_getJcaPackage(org.eclipse.jst.j2ee.jca.test.JcaFactoryTest)  Time elapsed: 0 s
06:05:24 test_createAuthenticationMechanism(org.eclipse.jst.j2ee.jca.test.JcaFactoryTest)  Time elapsed: 0 s
06:05:24 test_createMessageAdapter(org.eclipse.jst.j2ee.jca.test.JcaFactoryTest)  Time elapsed: 0 s
06:05:24 test_createRequiredConfigPropertyType(org.eclipse.jst.j2ee.jca.test.JcaFactoryTest)  Time elapsed: 0 s
06:05:24 test_createConfigProperty(org.eclipse.jst.j2ee.jca.test.JcaFactoryTest)  Time elapsed: 0 s
06:05:24 test_createConnectionDefinition(org.eclipse.jst.j2ee.jca.test.JcaFactoryTest)  Time elapsed: 0 s
06:05:24 test_createAdminObject(org.eclipse.jst.j2ee.jca.test.JcaFactoryTest)  Time elapsed: 0 s
06:05:24 test_JcaFactory(org.eclipse.jst.j2ee.jca.test.JcaFactoryTest)  Time elapsed: 0 s
06:05:24 test_createConnector(org.eclipse.jst.j2ee.jca.test.JcaFactoryTest)  Time elapsed: 0 s
06:05:24 test_createMessageListener(org.eclipse.jst.j2ee.jca.test.JcaFactoryTest)  Time elapsed: 0 s
06:05:24 test_createSecurityPermission(org.eclipse.jst.j2ee.jca.test.JcaFactoryTest)  Time elapsed: 0 s
06:05:24 test_createOutboundResourceAdapter(org.eclipse.jst.j2ee.jca.test.JcaFactoryTest)  Time elapsed: 0 s
06:05:24 test_createLicense(org.eclipse.jst.j2ee.jca.test.JcaFactoryTest)  Time elapsed: 0 s
06:05:24 test_createFormLoginConfig(org.eclipse.jst.j2ee.webapplication.test.WebapplicationFactoryTest)  Time elapsed: 0 s
06:05:24 test_createErrorCodeErrorPage(org.eclipse.jst.j2ee.webapplication.test.WebapplicationFactoryTest)  Time elapsed: 0 s
06:05:24 test_createMimeMapping(org.eclipse.jst.j2ee.webapplication.test.WebapplicationFactoryTest)  Time elapsed: 0 s
06:05:24 test_createExceptionTypeErrorPage(org.eclipse.jst.j2ee.webapplication.test.WebapplicationFactoryTest)  Time elapsed: 0 s
06:05:24 test_createTagLibRef(org.eclipse.jst.j2ee.webapplication.test.WebapplicationFactoryTest)  Time elapsed: 0 s
06:05:24 test_createLocalEncodingMapping(org.eclipse.jst.j2ee.webapplication.test.WebapplicationFactoryTest)  Time elapsed: 0 s
06:05:24 test_createServlet(org.eclipse.jst.j2ee.webapplication.test.WebapplicationFactoryTest)  Time elapsed: 0 s
06:05:24 test_createJSPType(org.eclipse.jst.j2ee.webapplication.test.WebapplicationFactoryTest)  Time elapsed: 0 s
06:05:24 test_createSessionConfig(org.eclipse.jst.j2ee.webapplication.test.WebapplicationFactoryTest)  Time elapsed: 0 s
06:05:24 test_createServletMapping(org.eclipse.jst.j2ee.webapplication.test.WebapplicationFactoryTest)  Time elapsed: 0 s
06:05:24 test_createURLPatternType(org.eclipse.jst.j2ee.webapplication.test.WebapplicationFactoryTest)  Time elapsed: 0 s
06:05:24 test_createLocalEncodingMappingList(org.eclipse.jst.j2ee.webapplication.test.WebapplicationFactoryTest)  Time elapsed: 0 s
06:05:24 test_createFilterMapping(org.eclipse.jst.j2ee.webapplication.test.WebapplicationFactoryTest)  Time elapsed: 0.001 s
06:05:24 test_createAuthConstraint(org.eclipse.jst.j2ee.webapplication.test.WebapplicationFactoryTest)  Time elapsed: 0 s
06:05:24 test_createUserDataConstraint(org.eclipse.jst.j2ee.webapplication.test.WebapplicationFactoryTest)  Time elapsed: 0 s
06:05:24 test_createFilter(org.eclipse.jst.j2ee.webapplication.test.WebapplicationFactoryTest)  Time elapsed: 0 s
06:05:24 test_createRoleNameType(org.eclipse.jst.j2ee.webapplication.test.WebapplicationFactoryTest)  Time elapsed: 0 s
06:05:24 test_createWelcomeFileList(org.eclipse.jst.j2ee.webapplication.test.WebapplicationFactoryTest)  Time elapsed: 0 s
06:05:24 test_createWebApp(org.eclipse.jst.j2ee.webapplication.test.WebapplicationFactoryTest)  Time elapsed: 0 s
06:05:24 test_createInitParam(org.eclipse.jst.j2ee.webapplication.test.WebapplicationFactoryTest)  Time elapsed: 0 s
06:05:24 test_createWelcomeFile(org.eclipse.jst.j2ee.webapplication.test.WebapplicationFactoryTest)  Time elapsed: 0 s
06:05:24 test_getWebapplicationPackage(org.eclipse.jst.j2ee.webapplication.test.WebapplicationFactoryTest)  Time elapsed: 0 s
06:05:24 test_createContextParam(org.eclipse.jst.j2ee.webapplication.test.WebapplicationFactoryTest)  Time elapsed: 0 s
06:05:24 test_createSecurityConstraint(org.eclipse.jst.j2ee.webapplication.test.WebapplicationFactoryTest)  Time elapsed: 0 s
06:05:24 test_createHTTPMethodType(org.eclipse.jst.j2ee.webapplication.test.WebapplicationFactoryTest)  Time elapsed: 0 s
06:05:24 test_createWebResourceCollection(org.eclipse.jst.j2ee.webapplication.test.WebapplicationFactoryTest)  Time elapsed: 0 s
06:05:24 test_createErrorPage(org.eclipse.jst.j2ee.webapplication.test.WebapplicationFactoryTest)  Time elapsed: 0 s
06:05:24 test_createServletType(org.eclipse.jst.j2ee.webapplication.test.WebapplicationFactoryTest)  Time elapsed: 0 s
06:05:24 test_createLoginConfig(org.eclipse.jst.j2ee.webapplication.test.WebapplicationFactoryTest)  Time elapsed: 0 s
06:05:24 test_createSOAPHeader(org.eclipse.jst.j2ee.webservice.wscommon.test.WscommonFactoryTest)  Time elapsed: 0 s
06:05:24 test_createDisplayNameType(org.eclipse.jst.j2ee.webservice.wscommon.test.WscommonFactoryTest)  Time elapsed: 0 s
06:05:24 test_getWscommonPackage(org.eclipse.jst.j2ee.webservice.wscommon.test.WscommonFactoryTest)  Time elapsed: 0 s
06:05:24 test_createDescriptionType(org.eclipse.jst.j2ee.webservice.wscommon.test.WscommonFactoryTest)  Time elapsed: 0 s
06:05:24 test_createPortName(org.eclipse.jst.j2ee.webservice.wscommon.test.WscommonFactoryTest)  Time elapsed: 0 s
06:05:24 test_createSOAPRole(org.eclipse.jst.j2ee.webservice.wscommon.test.WscommonFactoryTest)  Time elapsed: 0 s
06:05:24 test_createInitParam(org.eclipse.jst.j2ee.webservice.wscommon.test.WscommonFactoryTest)  Time elapsed: 0 s
06:05:24 test_createEJBLink(org.eclipse.jst.j2ee.webservice.wsdd.test.WsddFactoryTest)  Time elapsed: 0 s
06:05:24 test_createWSDLPort(org.eclipse.jst.j2ee.webservice.wsdd.test.WsddFactoryTest)  Time elapsed: 0 s
06:05:24 test_createPortComponent(org.eclipse.jst.j2ee.webservice.wsdd.test.WsddFactoryTest)  Time elapsed: 0 s
06:05:24 test_createServiceImplBean(org.eclipse.jst.j2ee.webservice.wsdd.test.WsddFactoryTest)  Time elapsed: 0 s
06:05:24 test_createWebServices(org.eclipse.jst.j2ee.webservice.wsdd.test.WsddFactoryTest)  Time elapsed: 0 s
06:05:24 test_createBeanLink(org.eclipse.jst.j2ee.webservice.wsdd.test.WsddFactoryTest)  Time elapsed: 0 s
06:05:24 test_createWebServiceDescription(org.eclipse.jst.j2ee.webservice.wsdd.test.WsddFactoryTest)  Time elapsed: 0 s
06:05:24 test_createHandler(org.eclipse.jst.j2ee.webservice.wsdd.test.WsddFactoryTest)  Time elapsed: 0 s
06:05:24 test_createServletLink(org.eclipse.jst.j2ee.webservice.wsdd.test.WsddFactoryTest)  Time elapsed: 0 s
06:05:24 Running org.eclipse.jst.j2ee.core.api.test.AllCoreAPITests
06:05:24 Tests run: 243, Failures: 0, Errors: 0, Skipped: 0, Time elapsed: 1.506 s - in org.eclipse.jst.j2ee.core.api.test.AllCoreAPITests
06:05:26 test_createEjbModule(org.eclipse.jst.j2ee.application.test.ApplicationFactoryTest)  Time elapsed: 0 s
06:05:26 test_createApplication(org.eclipse.jst.j2ee.application.test.ApplicationFactoryTest)  Time elapsed: 0 s
06:05:26 test_createConnectorModule(org.eclipse.jst.j2ee.application.test.ApplicationFactoryTest)  Time elapsed: 0 s
06:05:26 test_createWebModule(org.eclipse.jst.j2ee.application.test.ApplicationFactoryTest)  Time elapsed: 0 s
06:05:26 test_createJavaClientModule(org.eclipse.jst.j2ee.application.test.ApplicationFactoryTest)  Time elapsed: 0 s
06:05:26 test_createModule(org.eclipse.jst.j2ee.application.test.ApplicationFactoryTest)  Time elapsed: 0 s
06:05:26 test_getVersionID(org.eclipse.jst.j2ee.application.test.ApplicationTest)  Time elapsed: 0 s
06:05:26 test_getJ2EEVersionID(org.eclipse.jst.j2ee.application.test.ApplicationTest)  Time elapsed: 0 s
06:05:26 test_getSecurityRoleNamed(org.eclipse.jst.j2ee.application.test.ApplicationTest)  Time elapsed: 0 s
06:05:26 test_getModuleHavingAltDD(org.eclipse.jst.j2ee.application.test.ApplicationTest)  Time elapsed: 0 s
06:05:26 test_containsSecurityRole(org.eclipse.jst.j2ee.application.test.ApplicationTest)  Time elapsed: 0 s
06:05:26 test_getModule_2(org.eclipse.jst.j2ee.application.test.ApplicationTest)  Time elapsed: 0 s
06:05:26 test_getFirstModule(org.eclipse.jst.j2ee.application.test.ApplicationTest)  Time elapsed: 0 s
06:05:26 test_getVersionID(org.eclipse.jst.j2ee.client.test.ApplicationClientTest)  Time elapsed: 0.004 s
06:05:26 test_getJ2EEVersionID(org.eclipse.jst.j2ee.client.test.ApplicationClientTest)  Time elapsed: 0.004 s
06:05:26 test_getCallbackHandlerClassName(org.eclipse.jst.j2ee.client.test.ApplicationClientTest)  Time elapsed: 0 s
06:05:26 test_setCallbackHandlerClassName(org.eclipse.jst.j2ee.client.test.ApplicationClientTest)  Time elapsed: 0 s
06:05:26 test_ClientFactory(org.eclipse.jst.j2ee.client.test.ClientFactoryTest)  Time elapsed: 0 s
06:05:26 test_createApplicationClient(org.eclipse.jst.j2ee.client.test.ClientFactoryTest)  Time elapsed: 0 s
06:05:26 test_createCompatibilityDescriptionGroup(org.eclipse.jst.j2ee.common.test.CommonFactoryTest)  Time elapsed: 0 s
06:05:26 test_createUseCallerIdentity(org.eclipse.jst.j2ee.common.test.CommonFactoryTest)  Time elapsed: 0 s
06:05:26 test_createDescriptionGroup(org.eclipse.jst.j2ee.common.test.CommonFactoryTest)  Time elapsed: 0 s
06:05:26 test_createIconType(org.eclipse.jst.j2ee.common.test.CommonFactoryTest)  Time elapsed: 0 s
06:05:26 test_createResourceRef(org.eclipse.jst.j2ee.common.test.CommonFactoryTest)  Time elapsed: 0 s
06:05:26 test_createDisplayName(org.eclipse.jst.j2ee.common.test.CommonFactoryTest)  Time elapsed: 0 s
06:05:26 test_createIdentity(org.eclipse.jst.j2ee.common.test.CommonFactoryTest)  Time elapsed: 0 s
06:05:26 test_createSecurityIdentity(org.eclipse.jst.j2ee.common.test.CommonFactoryTest)  Time elapsed: 0 s
06:05:26 test_createResourceEnvRef(org.eclipse.jst.j2ee.common.test.CommonFactoryTest)  Time elapsed: 0 s
06:05:26 test_createDescription(org.eclipse.jst.j2ee.common.test.CommonFactoryTest)  Time elapsed: 0 s
06:05:26 test_createQName(org.eclipse.jst.j2ee.common.test.CommonFactoryTest)  Time elapsed: 0 s
06:05:26 test_CommonFactory(org.eclipse.jst.j2ee.common.test.CommonFactoryTest)  Time elapsed: 0 s
06:05:26 test_createParamValue(org.eclipse.jst.j2ee.common.test.CommonFactoryTest)  Time elapsed: 0 s
06:05:26 test_createEjbRef(org.eclipse.jst.j2ee.common.test.CommonFactoryTest)  Time elapsed: 0 s
06:05:26 test_createListener(org.eclipse.jst.j2ee.common.test.CommonFactoryTest)  Time elapsed: 0 s
06:05:26 test_createMessageDestination(org.eclipse.jst.j2ee.common.test.CommonFactoryTest)  Time elapsed: 0 s
06:05:26 test_createEnvEntry(org.eclipse.jst.j2ee.common.test.CommonFactoryTest)  Time elapsed: 0 s
06:05:26 test_createSecurityRole(org.eclipse.jst.j2ee.common.test.CommonFactoryTest)  Time elapsed: 0 s
06:05:26 test_createMessageDestinationRef(org.eclipse.jst.j2ee.common.test.CommonFactoryTest)  Time elapsed: 0 s
06:05:26 test_createEJBLocalRef(org.eclipse.jst.j2ee.common.test.CommonFactoryTest)  Time elapsed: 0 s
06:05:26 test_createSecurityRoleRef(org.eclipse.jst.j2ee.common.test.CommonFactoryTest)  Time elapsed: 0 s
06:05:26 test_createRunAsSpecifiedIdentity(org.eclipse.jst.j2ee.common.test.CommonFactoryTest)  Time elapsed: 0 s
06:05:26 test_isLinked(org.eclipse.jst.j2ee.common.test.EjbRefTest)  Time elapsed: 0 s
06:05:26 test_EjbRef(org.eclipse.jst.j2ee.common.test.EjbRefTest)  Time elapsed: 0 s
06:05:26 test_isEquivalent(org.eclipse.jst.j2ee.common.test.EjbRefTest)  Time elapsed: 0 s
06:05:26 test_isLocal(org.eclipse.jst.j2ee.common.test.EjbRefTest)  Time elapsed: 0 s
06:05:26 test_getLinkedEjb(org.eclipse.jst.j2ee.common.test.EjbRefTest)  Time elapsed: 0 s
06:05:26 test_setListenerClassName(org.eclipse.jst.j2ee.common.test.ListenerTest)  Time elapsed: 0.001 s
06:05:26 test_getListenerClassName(org.eclipse.jst.j2ee.common.test.ListenerTest)  Time elapsed: 0 s
06:05:26 test_setValues(org.eclipse.jst.j2ee.common.test.QNameTest)  Time elapsed: 0 s
06:05:26 test_getMethodPermissionMethodElements(org.eclipse.jst.j2ee.ejb.test.AssemblyDescriptorTest)  Time elapsed: 0.151 s
06:05:26 test_getMethodTransactionMethodElements(org.eclipse.jst.j2ee.ejb.test.AssemblyDescriptorTest)  Time elapsed: 0.13 s
06:05:26 test_getSecurityRoleNamed(org.eclipse.jst.j2ee.ejb.test.AssemblyDescriptorTest)  Time elapsed: 0.143 s
06:05:26 test_renameSecurityRole(org.eclipse.jst.j2ee.ejb.test.AssemblyDescriptorTest)  Time elapsed: 0.349 s
06:05:26 test_removeData(org.eclipse.jst.j2ee.ejb.test.AssemblyDescriptorTest)  Time elapsed: 0.135 s
06:05:26 test_getSetterName(org.eclipse.jst.j2ee.ejb.test.CMPAttributeTest)  Time elapsed: 0 s
06:05:26 test_getType(org.eclipse.jst.j2ee.ejb.test.CMPAttributeTest)  Time elapsed: 0 s
06:05:26 test_getOriginatingType(org.eclipse.jst.j2ee.ejb.test.CMPAttributeTest)  Time elapsed: 0 s
06:05:26 test_setDerived(org.eclipse.jst.j2ee.ejb.test.CMPAttributeTest)  Time elapsed: 0 s
06:05:26 test_setOriginatingType(org.eclipse.jst.j2ee.ejb.test.CMPAttributeTest)  Time elapsed: 0 s
06:05:26 test_isCMRField(org.eclipse.jst.j2ee.ejb.test.CMPAttributeTest)  Time elapsed: 0 s
06:05:26 test_getGetterName(org.eclipse.jst.j2ee.ejb.test.CMPAttributeTest)  Time elapsed: 0 s
06:05:26 test_isDerived(org.eclipse.jst.j2ee.ejb.test.CMPAttributeTest)  Time elapsed: 0 s
06:05:26 test_isKey(org.eclipse.jst.j2ee.ejb.test.CMPAttributeTest)  Time elapsed: 0 s
06:05:26 test_isPrimKeyField(org.eclipse.jst.j2ee.ejb.test.CMPAttributeTest)  Time elapsed: 0 s
06:05:26 test_getRole(org.eclipse.jst.j2ee.ejb.test.CMRFieldTest)  Time elapsed: 0 s
06:05:26 test_setCollectionTypeName(org.eclipse.jst.j2ee.ejb.test.CMRFieldTest)  Time elapsed: 0 s
06:05:26 test_setCollectionType(org.eclipse.jst.j2ee.ejb.test.CMRFieldTest)  Time elapsed: 0 s
06:05:26 test_getCollectionType(org.eclipse.jst.j2ee.ejb.test.CMRFieldTest)  Time elapsed: 0 s
06:05:26 test_setRole(org.eclipse.jst.j2ee.ejb.test.CMRFieldTest)  Time elapsed: 0 s
06:05:26 test_getCollectionTypeName(org.eclipse.jst.j2ee.ejb.test.CMRFieldTest)  Time elapsed: 0 s
06:05:26 test_isUnknownPrimaryKey(org.eclipse.jst.j2ee.ejb.test.ContainerManagedEntityTest)  Time elapsed: 0 s
06:05:26 test_addPersistentAttribute(org.eclipse.jst.j2ee.ejb.test.ContainerManagedEntityTest)  Time elapsed: 0 s
06:05:26 test_addKeyAttributeName(org.eclipse.jst.j2ee.ejb.test.ContainerManagedEntityTest)  Time elapsed: 0 s
06:05:26 test_getKeyAttribute(org.eclipse.jst.j2ee.ejb.test.ContainerManagedEntityTest)  Time elapsed: 0 s
06:05:26 test_isContainerManagedEntity(org.eclipse.jst.j2ee.ejb.test.ContainerManagedEntityTest)  Time elapsed: 0 s
06:05:26 test_getPrimaryKeyAttribute(org.eclipse.jst.j2ee.ejb.test.ContainerManagedEntityTest)  Time elapsed: 0 s
06:05:26 test_isVersion1_X(org.eclipse.jst.j2ee.ejb.test.ContainerManagedEntityTest)  Time elapsed: 0 s
06:05:26 test_isVersion2_X(org.eclipse.jst.j2ee.ejb.test.ContainerManagedEntityTest)  Time elapsed: 0 s
06:05:26 test_removePersistentAttribute_2(org.eclipse.jst.j2ee.ejb.test.ContainerManagedEntityTest)  Time elapsed: 0 s
06:05:26 test_listPersistentFieldNames(org.eclipse.jst.j2ee.ejb.test.ContainerManagedEntityTest)  Time elapsed: 0 s
06:05:26 test_isKeyAttribute(org.eclipse.jst.j2ee.ejb.test.ContainerManagedEntityTest)  Time elapsed: 0 s
06:05:26 test_getCMPVersionID(org.eclipse.jst.j2ee.ejb.test.ContainerManagedEntityTest)  Time elapsed: 0 s
06:05:26 test_setPrimKeyField(org.eclipse.jst.j2ee.ejb.test.ContainerManagedEntityTest)  Time elapsed: 0 s
06:05:26 test_addPersistentAttributeName(org.eclipse.jst.j2ee.ejb.test.ContainerManagedEntityTest)  Time elapsed: 0 s
06:05:26 test_removePersistentAttribute(org.eclipse.jst.j2ee.ejb.test.ContainerManagedEntityTest)  Time elapsed: 0 s
06:05:26 test_createActivationConfig(org.eclipse.jst.j2ee.ejb.test.EjbFactoryTest)  Time elapsed: 0 s
06:05:26 test_createExcludeList(org.eclipse.jst.j2ee.ejb.test.EjbFactoryTest)  Time elapsed: 0 s
06:05:26 test_createEJBRelationshipRole(org.eclipse.jst.j2ee.ejb.test.EjbFactoryTest)  Time elapsed: 0 s
06:05:26 test_createContainerManagedEntity(org.eclipse.jst.j2ee.ejb.test.EjbFactoryTest)  Time elapsed: 0 s
06:05:26 test_createMessageDrivenDestination(org.eclipse.jst.j2ee.ejb.test.EjbFactoryTest)  Time elapsed: 0 s
06:05:26 test_createMethodElement_2(org.eclipse.jst.j2ee.ejb.test.EjbFactoryTest)  Time elapsed: 0 s
06:05:26 test_createCMPAttribute(org.eclipse.jst.j2ee.ejb.test.EjbFactoryTest)  Time elapsed: 0 s
06:05:26 test_createSession(org.eclipse.jst.j2ee.ejb.test.EjbFactoryTest)  Time elapsed: 0 s
06:05:26 test_createMethodElementFrom(org.eclipse.jst.j2ee.ejb.test.EjbFactoryTest)  Time elapsed: 0 s
06:05:26 test_createEJBRelation(org.eclipse.jst.j2ee.ejb.test.EjbFactoryTest)  Time elapsed: 0 s
06:05:26 test_createMethodElementFrom_2(org.eclipse.jst.j2ee.ejb.test.EjbFactoryTest)  Time elapsed: 0 s
06:05:26 test_EjbFactory(org.eclipse.jst.j2ee.ejb.test.EjbFactoryTest)  Time elapsed: 0 s
06:05:26 test_createQuery(org.eclipse.jst.j2ee.ejb.test.EjbFactoryTest)  Time elapsed: 0 s
06:05:26 test_createQueryMethod(org.eclipse.jst.j2ee.ejb.test.EjbFactoryTest)  Time elapsed: 0 s
06:05:26 test_createActivationConfigProperty(org.eclipse.jst.j2ee.ejb.test.EjbFactoryTest)  Time elapsed: 0 s
06:05:26 test_createEJBJar(org.eclipse.jst.j2ee.ejb.test.EjbFactoryTest)  Time elapsed: 0 s
06:05:26 test_createMethodPermission(org.eclipse.jst.j2ee.ejb.test.EjbFactoryTest)  Time elapsed: 0 s
06:05:26 test_createEntity(org.eclipse.jst.j2ee.ejb.test.EjbFactoryTest)  Time elapsed: 0 s
06:05:26 test_createRelationships(org.eclipse.jst.j2ee.ejb.test.EjbFactoryTest)  Time elapsed: 0 s
06:05:26 test_createEJBMethodCategory(org.eclipse.jst.j2ee.ejb.test.EjbFactoryTest)  Time elapsed: 0 s
06:05:26 test_createMethodTransaction(org.eclipse.jst.j2ee.ejb.test.EjbFactoryTest)  Time elapsed: 0 s
06:05:26 test_createMethodElement(org.eclipse.jst.j2ee.ejb.test.EjbFactoryTest)  Time elapsed: 0 s
06:05:26 test_createAssemblyDescriptor(org.eclipse.jst.j2ee.ejb.test.EjbFactoryTest)  Time elapsed: 0 s
06:05:26 test_createRoleSource(org.eclipse.jst.j2ee.ejb.test.EjbFactoryTest)  Time elapsed: 0 s
06:05:26 test_createCMRField(org.eclipse.jst.j2ee.ejb.test.EjbFactoryTest)  Time elapsed: 0 s
06:05:26 test_createMessageDriven(org.eclipse.jst.j2ee.ejb.test.EjbFactoryTest)  Time elapsed: 0 s
06:05:26 test_isNavigable(org.eclipse.jst.j2ee.ejb.test.EJBRelationshipRoleTest)  Time elapsed: 0 s
06:05:26 test_getLogicalName(org.eclipse.jst.j2ee.ejb.test.EJBRelationshipRoleTest)  Time elapsed: 0 s
06:05:26 test_getName(org.eclipse.jst.j2ee.ejb.test.EJBRelationshipRoleTest)  Time elapsed: 0 s
06:05:26 test_isForward(org.eclipse.jst.j2ee.ejb.test.EJBRelationshipRoleTest)  Time elapsed: 0 s
06:05:26 test_isMany(org.eclipse.jst.j2ee.ejb.test.EJBRelationshipRoleTest)  Time elapsed: 0 s
06:05:26 test_setKey(org.eclipse.jst.j2ee.ejb.test.EJBRelationshipRoleTest)  Time elapsed: 0 s
06:05:26 test_EJBRelationshipRole(org.eclipse.jst.j2ee.ejb.test.EJBRelationshipRoleTest)  Time elapsed: 0 s
06:05:26 test_setFoward(org.eclipse.jst.j2ee.ejb.test.EJBRelationshipRoleTest)  Time elapsed: 0 s
06:05:26 test_setName(org.eclipse.jst.j2ee.ejb.test.EJBRelationshipRoleTest)  Time elapsed: 0 s
06:05:26 test_getSourceEntity(org.eclipse.jst.j2ee.ejb.test.EJBRelationshipRoleTest)  Time elapsed: 0 s
06:05:26 test_setRequired(org.eclipse.jst.j2ee.ejb.test.EJBRelationshipRoleTest)  Time elapsed: 0 s
06:05:26 test_isKey(org.eclipse.jst.j2ee.ejb.test.EJBRelationshipRoleTest)  Time elapsed: 0 s
06:05:26 test_getOpposite(org.eclipse.jst.j2ee.ejb.test.EJBRelationshipRoleTest)  Time elapsed: 0 s
06:05:26 test_containsRelationshipRole(org.eclipse.jst.j2ee.ejb.test.EJBRelationTest)  Time elapsed: 0 s
06:05:26 test_getSecondRole(org.eclipse.jst.j2ee.ejb.test.EJBRelationTest)  Time elapsed: 0 s
06:05:26 test_getFirstRole(org.eclipse.jst.j2ee.ejb.test.EJBRelationTest)  Time elapsed: 0 s
06:05:26 test_getOppositeRole(org.eclipse.jst.j2ee.ejb.test.EJBRelationTest)  Time elapsed: 0 s
06:05:26 test_EJBRelation(org.eclipse.jst.j2ee.ejb.test.EJBRelationTest)  Time elapsed: 0 s
06:05:26 test_setFoward(org.eclipse.jst.j2ee.ejb.test.EJBRelationTest)  Time elapsed: 0 s
06:05:26 test_setPrimaryKeyName(org.eclipse.jst.j2ee.ejb.test.EntityTest)  Time elapsed: 0.161 s
06:05:26 test_getPrimaryKeyName(org.eclipse.jst.j2ee.ejb.test.EntityTest)  Time elapsed: 0.143 s
06:05:26 test_initializeFromSignature(org.eclipse.jst.j2ee.ejb.test.MethodElementTest)  Time elapsed: 0 s
06:05:26 test_applyZeroParams(org.eclipse.jst.j2ee.ejb.test.MethodElementTest)  Time elapsed: 0 s
06:05:26 test_equalSignature(org.eclipse.jst.j2ee.ejb.test.MethodElementTest)  Time elapsed: 0 s
06:05:26 test_isRemote(org.eclipse.jst.j2ee.ejb.test.MethodElementTest)  Time elapsed: 0 s
06:05:26 test_getTypeJavaClass(org.eclipse.jst.j2ee.ejb.test.MethodElementTest)  Time elapsed: 0.151 s
06:05:26 test_isHome(org.eclipse.jst.j2ee.ejb.test.MethodElementTest)  Time elapsed: 0.001 s
06:05:26 test_getSignature(org.eclipse.jst.j2ee.ejb.test.MethodElementTest)  Time elapsed: 0 s
06:05:26 test_nameAndParamsEquals(org.eclipse.jst.j2ee.ejb.test.MethodElementTest)  Time elapsed: 0 s
06:05:26 test_isLocalHome(org.eclipse.jst.j2ee.ejb.test.MethodElementTest)  Time elapsed: 0 s
06:05:26 test_isUnspecified(org.eclipse.jst.j2ee.ejb.test.MethodElementTest)  Time elapsed: 0 s
06:05:26 test_isEquivalent(org.eclipse.jst.j2ee.ejb.test.MethodElementTest)  Time elapsed: 0 s
06:05:26 test_MethodElement(org.eclipse.jst.j2ee.ejb.test.MethodElementTest)  Time elapsed: 0 s
06:05:26 test_hasMethodParams(org.eclipse.jst.j2ee.ejb.test.MethodElementTest)  Time elapsed: 0 s
06:05:26 test_isLocal(org.eclipse.jst.j2ee.ejb.test.MethodElementTest)  Time elapsed: 0 s
06:05:26 test_isValid(org.eclipse.jst.j2ee.ejb.test.MethodElementTest)  Time elapsed: 0.001 s
06:05:26 test_getMethodParams(org.eclipse.jst.j2ee.ejb.test.MethodElementTest)  Time elapsed: 0 s
06:05:26 test_isDefault(org.eclipse.jst.j2ee.ejb.test.MethodElementTest)  Time elapsed: 0 s
06:05:26 test_addMethodParams(org.eclipse.jst.j2ee.ejb.test.MethodElementTest)  Time elapsed: 0 s
06:05:26 test_removeMethodParams(org.eclipse.jst.j2ee.ejb.test.MethodElementTest)  Time elapsed: 0 s
06:05:26 testEJBJarPopulation(org.eclipse.jst.j2ee.ejb.test.MethodElementTest)  Time elapsed: 0 s
06:05:26 test14EJBJarPopulation(org.eclipse.jst.j2ee.ejb.test.MethodElementTest)  Time elapsed: 0 s
06:05:26 test_MethodPermission(org.eclipse.jst.j2ee.ejb.test.MethodPermissionTest)  Time elapsed: 0 s
06:05:26 test_isEquivalent(org.eclipse.jst.j2ee.ejb.test.MethodPermissionTest)  Time elapsed: 0 s
06:05:26 test_hasSecurityRole(org.eclipse.jst.j2ee.ejb.test.MethodPermissionTest)  Time elapsed: 0 s
06:05:26 test_getSecurityRole(org.eclipse.jst.j2ee.ejb.test.MethodPermissionTest)  Time elapsed: 0 s
06:05:26 test_hasSecurityRole_2(org.eclipse.jst.j2ee.ejb.test.MethodPermissionTest)  Time elapsed: 0 s
06:05:26 test_getClientTypeJavaClasses(org.eclipse.jst.j2ee.ejb.test.QueryMethodTest)  Time elapsed: 0.121 s
06:05:26 test_isRemoteResultMapping(org.eclipse.jst.j2ee.ejb.test.QueryTest)  Time elapsed: 0 s
06:05:26 test_isLocalResultMapping(org.eclipse.jst.j2ee.ejb.test.QueryTest)  Time elapsed: 0 s
06:05:26 test_Query(org.eclipse.jst.j2ee.ejb.test.QueryTest)  Time elapsed: 0 s
06:05:26 test_hasServiceEndpoint(org.eclipse.jst.j2ee.ejb.test.SessionTest)  Time elapsed: 0 s
06:05:26 test_getServiceEndpointName(org.eclipse.jst.j2ee.ejb.test.SessionTest)  Time elapsed: 0 s
06:05:26 test_setServiceEndpointName(org.eclipse.jst.j2ee.ejb.test.SessionTest)  Time elapsed: 0 s
06:05:26 test_getVersionID(org.eclipse.jst.j2ee.jca.test.ConnectorTest)  Time elapsed: 0.001 s
06:05:26 test_createResourceAdapter(org.eclipse.jst.j2ee.jca.test.JcaFactoryTest)  Time elapsed: 0 s
06:05:26 test_createInboundResourceAdapter(org.eclipse.jst.j2ee.jca.test.JcaFactoryTest)  Time elapsed: 0 s
06:05:26 test_createActivationSpec(org.eclipse.jst.j2ee.jca.test.JcaFactoryTest)  Time elapsed: 0 s
06:05:26 test_getJcaPackage(org.eclipse.jst.j2ee.jca.test.JcaFactoryTest)  Time elapsed: 0 s
06:05:26 test_createAuthenticationMechanism(org.eclipse.jst.j2ee.jca.test.JcaFactoryTest)  Time elapsed: 0 s
06:05:26 test_createMessageAdapter(org.eclipse.jst.j2ee.jca.test.JcaFactoryTest)  Time elapsed: 0 s
06:05:26 test_createRequiredConfigPropertyType(org.eclipse.jst.j2ee.jca.test.JcaFactoryTest)  Time elapsed: 0 s
06:05:26 test_createConfigProperty(org.eclipse.jst.j2ee.jca.test.JcaFactoryTest)  Time elapsed: 0 s
06:05:26 test_createConnectionDefinition(org.eclipse.jst.j2ee.jca.test.JcaFactoryTest)  Time elapsed: 0 s
06:05:26 test_createAdminObject(org.eclipse.jst.j2ee.jca.test.JcaFactoryTest)  Time elapsed: 0 s
06:05:26 test_JcaFactory(org.eclipse.jst.j2ee.jca.test.JcaFactoryTest)  Time elapsed: 0 s
06:05:26 test_createConnector(org.eclipse.jst.j2ee.jca.test.JcaFactoryTest)  Time elapsed: 0 s
06:05:26 test_createMessageListener(org.eclipse.jst.j2ee.jca.test.JcaFactoryTest)  Time elapsed: 0 s
06:05:26 test_createSecurityPermission(org.eclipse.jst.j2ee.jca.test.JcaFactoryTest)  Time elapsed: 0 s
06:05:26 test_createOutboundResourceAdapter(org.eclipse.jst.j2ee.jca.test.JcaFactoryTest)  Time elapsed: 0 s
06:05:26 test_createLicense(org.eclipse.jst.j2ee.jca.test.JcaFactoryTest)  Time elapsed: 0 s
06:05:26 test_createResourceAdapter(org.eclipse.jst.j2ee.jca.test.JcaFactoryTest)  Time elapsed: 0 s
06:05:26 test_createInboundResourceAdapter(org.eclipse.jst.j2ee.jca.test.JcaFactoryTest)  Time elapsed: 0 s
06:05:26 test_createActivationSpec(org.eclipse.jst.j2ee.jca.test.JcaFactoryTest)  Time elapsed: 0 s
06:05:26 test_getJcaPackage(org.eclipse.jst.j2ee.jca.test.JcaFactoryTest)  Time elapsed: 0 s
06:05:26 test_createAuthenticationMechanism(org.eclipse.jst.j2ee.jca.test.JcaFactoryTest)  Time elapsed: 0 s
06:05:26 test_createMessageAdapter(org.eclipse.jst.j2ee.jca.test.JcaFactoryTest)  Time elapsed: 0 s
06:05:26 test_createRequiredConfigPropertyType(org.eclipse.jst.j2ee.jca.test.JcaFactoryTest)  Time elapsed: 0 s
06:05:26 test_createConfigProperty(org.eclipse.jst.j2ee.jca.test.JcaFactoryTest)  Time elapsed: 0 s
06:05:26 test_createConnectionDefinition(org.eclipse.jst.j2ee.jca.test.JcaFactoryTest)  Time elapsed: 0 s
06:05:26 test_createAdminObject(org.eclipse.jst.j2ee.jca.test.JcaFactoryTest)  Time elapsed: 0 s
06:05:26 test_JcaFactory(org.eclipse.jst.j2ee.jca.test.JcaFactoryTest)  Time elapsed: 0 s
06:05:26 test_createConnector(org.eclipse.jst.j2ee.jca.test.JcaFactoryTest)  Time elapsed: 0 s
06:05:26 test_createMessageListener(org.eclipse.jst.j2ee.jca.test.JcaFactoryTest)  Time elapsed: 0 s
06:05:26 test_createSecurityPermission(org.eclipse.jst.j2ee.jca.test.JcaFactoryTest)  Time elapsed: 0 s
06:05:26 test_createOutboundResourceAdapter(org.eclipse.jst.j2ee.jca.test.JcaFactoryTest)  Time elapsed: 0 s
06:05:26 test_createLicense(org.eclipse.jst.j2ee.jca.test.JcaFactoryTest)  Time elapsed: 0 s
06:05:26 test_createFormLoginConfig(org.eclipse.jst.j2ee.webapplication.test.WebapplicationFactoryTest)  Time elapsed: 0 s
06:05:26 test_createErrorCodeErrorPage(org.eclipse.jst.j2ee.webapplication.test.WebapplicationFactoryTest)  Time elapsed: 0 s
06:05:26 test_createMimeMapping(org.eclipse.jst.j2ee.webapplication.test.WebapplicationFactoryTest)  Time elapsed: 0 s
06:05:26 test_createExceptionTypeErrorPage(org.eclipse.jst.j2ee.webapplication.test.WebapplicationFactoryTest)  Time elapsed: 0 s
06:05:26 test_createTagLibRef(org.eclipse.jst.j2ee.webapplication.test.WebapplicationFactoryTest)  Time elapsed: 0 s
06:05:26 test_createLocalEncodingMapping(org.eclipse.jst.j2ee.webapplication.test.WebapplicationFactoryTest)  Time elapsed: 0 s
06:05:26 test_createServlet(org.eclipse.jst.j2ee.webapplication.test.WebapplicationFactoryTest)  Time elapsed: 0 s
06:05:26 test_createJSPType(org.eclipse.jst.j2ee.webapplication.test.WebapplicationFactoryTest)  Time elapsed: 0 s
06:05:26 test_createSessionConfig(org.eclipse.jst.j2ee.webapplication.test.WebapplicationFactoryTest)  Time elapsed: 0 s
06:05:26 test_createServletMapping(org.eclipse.jst.j2ee.webapplication.test.WebapplicationFactoryTest)  Time elapsed: 0 s
06:05:26 test_createURLPatternType(org.eclipse.jst.j2ee.webapplication.test.WebapplicationFactoryTest)  Time elapsed: 0 s
06:05:26 test_createLocalEncodingMappingList(org.eclipse.jst.j2ee.webapplication.test.WebapplicationFactoryTest)  Time elapsed: 0 s
06:05:26 test_createFilterMapping(org.eclipse.jst.j2ee.webapplication.test.WebapplicationFactoryTest)  Time elapsed: 0 s
06:05:26 test_createAuthConstraint(org.eclipse.jst.j2ee.webapplication.test.WebapplicationFactoryTest)  Time elapsed: 0 s
06:05:26 test_createUserDataConstraint(org.eclipse.jst.j2ee.webapplication.test.WebapplicationFactoryTest)  Time elapsed: 0 s
06:05:26 test_createFilter(org.eclipse.jst.j2ee.webapplication.test.WebapplicationFactoryTest)  Time elapsed: 0 s
06:05:26 test_createRoleNameType(org.eclipse.jst.j2ee.webapplication.test.WebapplicationFactoryTest)  Time elapsed: 0 s
06:05:26 test_createWelcomeFileList(org.eclipse.jst.j2ee.webapplication.test.WebapplicationFactoryTest)  Time elapsed: 0 s
06:05:26 test_createWebApp(org.eclipse.jst.j2ee.webapplication.test.WebapplicationFactoryTest)  Time elapsed: 0 s
06:05:26 test_createInitParam(org.eclipse.jst.j2ee.webapplication.test.WebapplicationFactoryTest)  Time elapsed: 0 s
06:05:26 test_createWelcomeFile(org.eclipse.jst.j2ee.webapplication.test.WebapplicationFactoryTest)  Time elapsed: 0 s
06:05:26 test_getWebapplicationPackage(org.eclipse.jst.j2ee.webapplication.test.WebapplicationFactoryTest)  Time elapsed: 0 s
06:05:26 test_createContextParam(org.eclipse.jst.j2ee.webapplication.test.WebapplicationFactoryTest)  Time elapsed: 0 s
06:05:26 test_createSecurityConstraint(org.eclipse.jst.j2ee.webapplication.test.WebapplicationFactoryTest)  Time elapsed: 0 s
06:05:26 test_createHTTPMethodType(org.eclipse.jst.j2ee.webapplication.test.WebapplicationFactoryTest)  Time elapsed: 0 s
06:05:26 test_createWebResourceCollection(org.eclipse.jst.j2ee.webapplication.test.WebapplicationFactoryTest)  Time elapsed: 0 s
06:05:26 test_createErrorPage(org.eclipse.jst.j2ee.webapplication.test.WebapplicationFactoryTest)  Time elapsed: 0 s
06:05:26 test_createServletType(org.eclipse.jst.j2ee.webapplication.test.WebapplicationFactoryTest)  Time elapsed: 0 s
06:05:26 test_createLoginConfig(org.eclipse.jst.j2ee.webapplication.test.WebapplicationFactoryTest)  Time elapsed: 0 s
06:05:26 test_createSOAPHeader(org.eclipse.jst.j2ee.webservice.wscommon.test.WscommonFactoryTest)  Time elapsed: 0 s
06:05:26 test_createDisplayNameType(org.eclipse.jst.j2ee.webservice.wscommon.test.WscommonFactoryTest)  Time elapsed: 0 s
06:05:26 test_getWscommonPackage(org.eclipse.jst.j2ee.webservice.wscommon.test.WscommonFactoryTest)  Time elapsed: 0 s
06:05:26 test_createDescriptionType(org.eclipse.jst.j2ee.webservice.wscommon.test.WscommonFactoryTest)  Time elapsed: 0 s
06:05:26 test_createPortName(org.eclipse.jst.j2ee.webservice.wscommon.test.WscommonFactoryTest)  Time elapsed: 0 s
06:05:26 test_createSOAPRole(org.eclipse.jst.j2ee.webservice.wscommon.test.WscommonFactoryTest)  Time elapsed: 0 s
06:05:26 test_createInitParam(org.eclipse.jst.j2ee.webservice.wscommon.test.WscommonFactoryTest)  Time elapsed: 0 s
06:05:26 test_createEJBLink(org.eclipse.jst.j2ee.webservice.wsdd.test.WsddFactoryTest)  Time elapsed: 0 s
06:05:26 test_createWSDLPort(org.eclipse.jst.j2ee.webservice.wsdd.test.WsddFactoryTest)  Time elapsed: 0 s
06:05:26 test_createPortComponent(org.eclipse.jst.j2ee.webservice.wsdd.test.WsddFactoryTest)  Time elapsed: 0 s
06:05:26 test_createServiceImplBean(org.eclipse.jst.j2ee.webservice.wsdd.test.WsddFactoryTest)  Time elapsed: 0 s
06:05:26 test_createWebServices(org.eclipse.jst.j2ee.webservice.wsdd.test.WsddFactoryTest)  Time elapsed: 0 s
06:05:26 test_createBeanLink(org.eclipse.jst.j2ee.webservice.wsdd.test.WsddFactoryTest)  Time elapsed: 0 s
06:05:26 test_createWebServiceDescription(org.eclipse.jst.j2ee.webservice.wsdd.test.WsddFactoryTest)  Time elapsed: 0 s
06:05:26 test_createHandler(org.eclipse.jst.j2ee.webservice.wsdd.test.WsddFactoryTest)  Time elapsed: 0 s
06:05:26 test_createServletLink(org.eclipse.jst.j2ee.webservice.wsdd.test.WsddFactoryTest)  Time elapsed: 0 s
06:05:26 Running org.eclipse.jst.j2ee.client.test.ApplicationClientTest
06:05:26 Tests run: 4, Failures: 0, Errors: 0, Skipped: 0, Time elapsed: 0.013 s - in org.eclipse.jst.j2ee.client.test.ApplicationClientTest
06:05:26 test_getVersionID(org.eclipse.jst.j2ee.client.test.ApplicationClientTest)  Time elapsed: 0.007 s
06:05:26 test_getJ2EEVersionID(org.eclipse.jst.j2ee.client.test.ApplicationClientTest)  Time elapsed: 0.006 s
06:05:26 test_getCallbackHandlerClassName(org.eclipse.jst.j2ee.client.test.ApplicationClientTest)  Time elapsed: 0 s
06:05:26 test_setCallbackHandlerClassName(org.eclipse.jst.j2ee.client.test.ApplicationClientTest)  Time elapsed: 0 s
06:05:26 Running org.eclipse.jst.j2ee.client.test.ClientFactoryTest
06:05:26 Tests run: 2, Failures: 0, Errors: 0, Skipped: 0, Time elapsed: 0.001 s - in org.eclipse.jst.j2ee.client.test.ClientFactoryTest
06:05:26 test_ClientFactory(org.eclipse.jst.j2ee.client.test.ClientFactoryTest)  Time elapsed: 0 s
06:05:26 test_createApplicationClient(org.eclipse.jst.j2ee.client.test.ClientFactoryTest)  Time elapsed: 0 s
06:05:26 Running org.eclipse.jst.j2ee.application.test.ApplicationFactoryTest
06:05:26 Tests run: 6, Failures: 0, Errors: 0, Skipped: 0, Time elapsed: 0.001 s - in org.eclipse.jst.j2ee.application.test.ApplicationFactoryTest
06:05:26 test_createEjbModule(org.eclipse.jst.j2ee.application.test.ApplicationFactoryTest)  Time elapsed: 0 s
06:05:26 test_createApplication(org.eclipse.jst.j2ee.application.test.ApplicationFactoryTest)  Time elapsed: 0 s
06:05:26 test_createConnectorModule(org.eclipse.jst.j2ee.application.test.ApplicationFactoryTest)  Time elapsed: 0 s
06:05:26 test_createWebModule(org.eclipse.jst.j2ee.application.test.ApplicationFactoryTest)  Time elapsed: 0 s
06:05:26 test_createJavaClientModule(org.eclipse.jst.j2ee.application.test.ApplicationFactoryTest)  Time elapsed: 0 s
06:05:26 test_createModule(org.eclipse.jst.j2ee.application.test.ApplicationFactoryTest)  Time elapsed: 0 s
06:05:26 Running org.eclipse.jst.j2ee.application.test.ApplicationTest
06:05:26 Tests run: 7, Failures: 0, Errors: 0, Skipped: 0, Time elapsed: 0.001 s - in org.eclipse.jst.j2ee.application.test.ApplicationTest
06:05:26 test_getVersionID(org.eclipse.jst.j2ee.application.test.ApplicationTest)  Time elapsed: 0 s
06:05:26 test_getJ2EEVersionID(org.eclipse.jst.j2ee.application.test.ApplicationTest)  Time elapsed: 0.001 s
06:05:26 test_getSecurityRoleNamed(org.eclipse.jst.j2ee.application.test.ApplicationTest)  Time elapsed: 0 s
06:05:26 test_getModuleHavingAltDD(org.eclipse.jst.j2ee.application.test.ApplicationTest)  Time elapsed: 0 s
06:05:26 test_containsSecurityRole(org.eclipse.jst.j2ee.application.test.ApplicationTest)  Time elapsed: 0 s
06:05:26 test_getModule_2(org.eclipse.jst.j2ee.application.test.ApplicationTest)  Time elapsed: 0 s
06:05:26 test_getFirstModule(org.eclipse.jst.j2ee.application.test.ApplicationTest)  Time elapsed: 0 s
06:05:26 Running org.eclipse.jst.j2ee.jca.test.JcaFactoryTest
06:05:26 Tests run: 16, Failures: 0, Errors: 0, Skipped: 0, Time elapsed: 0.001 s - in org.eclipse.jst.j2ee.jca.test.JcaFactoryTest
06:05:26 test_createResourceAdapter(org.eclipse.jst.j2ee.jca.test.JcaFactoryTest)  Time elapsed: 0 s
06:05:26 test_createInboundResourceAdapter(org.eclipse.jst.j2ee.jca.test.JcaFactoryTest)  Time elapsed: 0 s
06:05:26 test_createActivationSpec(org.eclipse.jst.j2ee.jca.test.JcaFactoryTest)  Time elapsed: 0 s
06:05:26 test_getJcaPackage(org.eclipse.jst.j2ee.jca.test.JcaFactoryTest)  Time elapsed: 0 s
06:05:26 test_createAuthenticationMechanism(org.eclipse.jst.j2ee.jca.test.JcaFactoryTest)  Time elapsed: 0 s
06:05:26 test_createMessageAdapter(org.eclipse.jst.j2ee.jca.test.JcaFactoryTest)  Time elapsed: 0 s
06:05:26 test_createRequiredConfigPropertyType(org.eclipse.jst.j2ee.jca.test.JcaFactoryTest)  Time elapsed: 0 s
06:05:26 test_createConfigProperty(org.eclipse.jst.j2ee.jca.test.JcaFactoryTest)  Time elapsed: 0.001 s
06:05:26 test_createConnectionDefinition(org.eclipse.jst.j2ee.jca.test.JcaFactoryTest)  Time elapsed: 0 s
06:05:26 test_createAdminObject(org.eclipse.jst.j2ee.jca.test.JcaFactoryTest)  Time elapsed: 0 s
06:05:26 test_JcaFactory(org.eclipse.jst.j2ee.jca.test.JcaFactoryTest)  Time elapsed: 0 s
06:05:26 test_createConnector(org.eclipse.jst.j2ee.jca.test.JcaFactoryTest)  Time elapsed: 0 s
06:05:26 test_createMessageListener(org.eclipse.jst.j2ee.jca.test.JcaFactoryTest)  Time elapsed: 0 s
06:05:26 test_createSecurityPermission(org.eclipse.jst.j2ee.jca.test.JcaFactoryTest)  Time elapsed: 0 s
06:05:26 test_createOutboundResourceAdapter(org.eclipse.jst.j2ee.jca.test.JcaFactoryTest)  Time elapsed: 0 s
06:05:26 test_createLicense(org.eclipse.jst.j2ee.jca.test.JcaFactoryTest)  Time elapsed: 0 s
06:05:26 Running org.eclipse.jst.j2ee.jca.test.ConnectorTest
06:05:26 Tests run: 1, Failures: 0, Errors: 0, Skipped: 0, Time elapsed: 0.001 s - in org.eclipse.jst.j2ee.jca.test.ConnectorTest
06:05:26 test_getVersionID(org.eclipse.jst.j2ee.jca.test.ConnectorTest)  Time elapsed: 0 s
06:05:26 Running org.eclipse.jst.j2ee.jsp.test.JspFactoryTest
06:05:26 Tests run: 16, Failures: 0, Errors: 0, Skipped: 0, Time elapsed: 0.001 s - in org.eclipse.jst.j2ee.jsp.test.JspFactoryTest
06:05:26 test_createResourceAdapter(org.eclipse.jst.j2ee.jca.test.JcaFactoryTest)  Time elapsed: 0 s
06:05:26 test_createInboundResourceAdapter(org.eclipse.jst.j2ee.jca.test.JcaFactoryTest)  Time elapsed: 0 s
06:05:26 test_createActivationSpec(org.eclipse.jst.j2ee.jca.test.JcaFactoryTest)  Time elapsed: 0 s
06:05:26 test_getJcaPackage(org.eclipse.jst.j2ee.jca.test.JcaFactoryTest)  Time elapsed: 0 s
06:05:26 test_createAuthenticationMechanism(org.eclipse.jst.j2ee.jca.test.JcaFactoryTest)  Time elapsed: 0 s
06:05:26 test_createMessageAdapter(org.eclipse.jst.j2ee.jca.test.JcaFactoryTest)  Time elapsed: 0 s
06:05:26 test_createRequiredConfigPropertyType(org.eclipse.jst.j2ee.jca.test.JcaFactoryTest)  Time elapsed: 0 s
06:05:26 test_createConfigProperty(org.eclipse.jst.j2ee.jca.test.JcaFactoryTest)  Time elapsed: 0 s
06:05:26 test_createConnectionDefinition(org.eclipse.jst.j2ee.jca.test.JcaFactoryTest)  Time elapsed: 0 s
06:05:26 test_createAdminObject(org.eclipse.jst.j2ee.jca.test.JcaFactoryTest)  Time elapsed: 0 s
06:05:26 test_JcaFactory(org.eclipse.jst.j2ee.jca.test.JcaFactoryTest)  Time elapsed: 0 s
06:05:26 test_createConnector(org.eclipse.jst.j2ee.jca.test.JcaFactoryTest)  Time elapsed: 0 s
06:05:26 test_createMessageListener(org.eclipse.jst.j2ee.jca.test.JcaFactoryTest)  Time elapsed: 0 s
06:05:26 test_createSecurityPermission(org.eclipse.jst.j2ee.jca.test.JcaFactoryTest)  Time elapsed: 0 s
06:05:26 test_createOutboundResourceAdapter(org.eclipse.jst.j2ee.jca.test.JcaFactoryTest)  Time elapsed: 0 s
06:05:26 test_createLicense(org.eclipse.jst.j2ee.jca.test.JcaFactoryTest)  Time elapsed: 0 s
06:05:26 Running org.eclipse.jst.j2ee.webapplication.test.WebapplicationFactoryTest
06:05:26 Tests run: 29, Failures: 0, Errors: 0, Skipped: 0, Time elapsed: 0.002 s - in org.eclipse.jst.j2ee.webapplication.test.WebapplicationFactoryTest
06:05:26 test_createFormLoginConfig(org.eclipse.jst.j2ee.webapplication.test.WebapplicationFactoryTest)  Time elapsed: 0 s
06:05:26 test_createErrorCodeErrorPage(org.eclipse.jst.j2ee.webapplication.test.WebapplicationFactoryTest)  Time elapsed: 0 s
06:05:26 test_createMimeMapping(org.eclipse.jst.j2ee.webapplication.test.WebapplicationFactoryTest)  Time elapsed: 0 s
06:05:26 test_createExceptionTypeErrorPage(org.eclipse.jst.j2ee.webapplication.test.WebapplicationFactoryTest)  Time elapsed: 0 s
06:05:26 test_createTagLibRef(org.eclipse.jst.j2ee.webapplication.test.WebapplicationFactoryTest)  Time elapsed: 0 s
06:05:26 test_createLocalEncodingMapping(org.eclipse.jst.j2ee.webapplication.test.WebapplicationFactoryTest)  Time elapsed: 0 s
06:05:26 test_createServlet(org.eclipse.jst.j2ee.webapplication.test.WebapplicationFactoryTest)  Time elapsed: 0 s
06:05:26 test_createJSPType(org.eclipse.jst.j2ee.webapplication.test.WebapplicationFactoryTest)  Time elapsed: 0 s
06:05:26 test_createSessionConfig(org.eclipse.jst.j2ee.webapplication.test.WebapplicationFactoryTest)  Time elapsed: 0 s
06:05:26 test_createServletMapping(org.eclipse.jst.j2ee.webapplication.test.WebapplicationFactoryTest)  Time elapsed: 0 s
06:05:26 test_createURLPatternType(org.eclipse.jst.j2ee.webapplication.test.WebapplicationFactoryTest)  Time elapsed: 0 s
06:05:26 test_createLocalEncodingMappingList(org.eclipse.jst.j2ee.webapplication.test.WebapplicationFactoryTest)  Time elapsed: 0 s
06:05:26 test_createFilterMapping(org.eclipse.jst.j2ee.webapplication.test.WebapplicationFactoryTest)  Time elapsed: 0 s
06:05:26 test_createAuthConstraint(org.eclipse.jst.j2ee.webapplication.test.WebapplicationFactoryTest)  Time elapsed: 0 s
06:05:26 test_createUserDataConstraint(org.eclipse.jst.j2ee.webapplication.test.WebapplicationFactoryTest)  Time elapsed: 0 s
06:05:26 test_createFilter(org.eclipse.jst.j2ee.webapplication.test.WebapplicationFactoryTest)  Time elapsed: 0 s
06:05:26 test_createRoleNameType(org.eclipse.jst.j2ee.webapplication.test.WebapplicationFactoryTest)  Time elapsed: 0 s
06:05:26 test_createWelcomeFileList(org.eclipse.jst.j2ee.webapplication.test.WebapplicationFactoryTest)  Time elapsed: 0 s
06:05:26 test_createWebApp(org.eclipse.jst.j2ee.webapplication.test.WebapplicationFactoryTest)  Time elapsed: 0 s
06:05:26 test_createInitParam(org.eclipse.jst.j2ee.webapplication.test.WebapplicationFactoryTest)  Time elapsed: 0 s
06:05:26 test_createWelcomeFile(org.eclipse.jst.j2ee.webapplication.test.WebapplicationFactoryTest)  Time elapsed: 0 s
06:05:26 test_getWebapplicationPackage(org.eclipse.jst.j2ee.webapplication.test.WebapplicationFactoryTest)  Time elapsed: 0.001 s
06:05:26 test_createContextParam(org.eclipse.jst.j2ee.webapplication.test.WebapplicationFactoryTest)  Time elapsed: 0 s
06:05:26 test_createSecurityConstraint(org.eclipse.jst.j2ee.webapplication.test.WebapplicationFactoryTest)  Time elapsed: 0 s
06:05:26 test_createHTTPMethodType(org.eclipse.jst.j2ee.webapplication.test.WebapplicationFactoryTest)  Time elapsed: 0 s
06:05:26 test_createWebResourceCollection(org.eclipse.jst.j2ee.webapplication.test.WebapplicationFactoryTest)  Time elapsed: 0 s
06:05:26 test_createErrorPage(org.eclipse.jst.j2ee.webapplication.test.WebapplicationFactoryTest)  Time elapsed: 0 s
06:05:26 test_createServletType(org.eclipse.jst.j2ee.webapplication.test.WebapplicationFactoryTest)  Time elapsed: 0 s
06:05:26 test_createLoginConfig(org.eclipse.jst.j2ee.webapplication.test.WebapplicationFactoryTest)  Time elapsed: 0 s
06:05:26 
06:05:26 Results:
06:05:26 
06:05:26 Failures: 
06:05:26   ResourceTests.testResourceCreation:76 The resource should be unloaded
06:05:26 Errors: 
06:05:26   CopyTests.testAddCopyDirectory:78 » OpenFailure IWAE0037E Could not open /home...
06:05:26   CopyTests.testAddCopyModule:100 » OpenFailure IWAE0037E Could not open /home/j...
06:05:26   CopyTests.testAddCopyModuleFilesToEAR:139 » OpenFailure IWAE0037E Could not op...
06:05:26   CopyTests.testAddCopyStandaloneModule:167 » OpenFailure IWAE0037E Could not op...
06:05:26   CopyTests.testAddRenameAndDelete:184 » OpenFailure IWAE0037E Could not open /h...
06:05:26   CopyTests.testAddRenameAndDeleteStandalone:218 » OpenFailure IWAE0037E Could n...
06:05:26   DefectVerificationTests.testFilterMappingTranslator:83 » OpenFailure IWAE0037E...
06:05:26   DefectVerificationTests.testFormerDefect297:109 » OpenFailure IWAE0037E Could ...
06:05:26   DefectVerificationTests.testReadCrimsonCase:261 » OpenFailure IWAE0037E Could ...
06:05:26   DefectVerificationTests.testSavingEARWhileDeploying:172 » OpenFailure IWAE0037...
06:05:26   DefectVerificationTests.testServiceQNameTranslator:216 » OpenFailure IWAE0037E...
06:05:26   RarFileTests.testJ2Cauth:193 » OpenFailure IWAE0037E Could not open /home/jenk...
06:05:26   RarFileTests.testOpenAndExtract:153 » OpenFailure IWAE0037E Could not open /ho...
06:05:26   RarFileTests.testOpenAndRead:165 » OpenFailure IWAE0037E Could not open /home/...
06:05:26   RarFileTests.testSaveRarEar:178 » OpenFailure IWAE0037E Could not open /home/j...
06:05:26   RarFileTests.testaddCopyModule:114 » OpenFailure IWAE0037E Could not open /hom...
06:05:26   RarFileTests.testexpandRarModule:132 » OpenFailure IWAE0037E Could not open /h...
06:05:26   RarFileTests.testopenRarEar:172 » OpenFailure IWAE0037E Could not open /home/j...
06:05:26   ResourceTests.testResourceDirty:95 » OpenFailure IWAE0037E Could not open /hom...
06:05:26   SaveTests.testSave:63 » OpenFailure IWAE0037E Could not open /home/jenkins/age...
06:05:26   SaveTests.testSaveDirectory:93 » OpenFailure IWAE0037E Could not open /home/je...
06:05:26   SecurityRoleTests.testPushDownCopy:53 » OpenFailure IWAE0037E Could not open /...
06:05:26   SecurityRoleTests.testRollupAddAndPushDown:73 » OpenFailure IWAE0037E Could no...
06:05:26   SimpleTests.testContainerManagedEntityExtensionRead:110 » OpenFailure IWAE0037...
06:05:26   SimpleTests.testEJB11JarAdd:117 » OpenFailure IWAE0037E Could not open /home/j...
06:05:26   SimpleTests.testEJBSetAbstractSchemaName:125 » OpenFailure IWAE0037E Could not...
06:05:26   SimpleTests.testIndexing:142 » OpenFailure IWAE0037E Could not open /home/jenk...
06:05:26   SimpleTests.testIndexingWithCollections:173 » OpenFailure IWAE0037E Could not ...
06:05:26   SimpleTests.testOpenAndExtract1:213 » OpenFailure IWAE0037E Could not open /ho...
06:05:26   SimpleTests.testOpenAndExtract2:233 » OpenFailure IWAE0037E Could not open /ho...
06:05:26   SimpleTests.testOpenAndExtract3:253 » OpenFailure IWAE0037E Could not open /ho...
06:05:26   SimpleTests.testOpenAndRead:265 » OpenFailure IWAE0037E Could not open /home/j...
06:05:26   SimpleTests.testOpenAndSaveAsJarFile:292 » OpenFailure IWAE0037E Could not ope...
06:05:26   SimpleTests.testOpenDirectoryAndSaveAsJarFile:305 » OpenFailure IWAE0037E Coul...
06:05:26   SimpleTests.testReadEmptyTags:425 » OpenFailure IWAE0037E Could not open /home...
06:05:26   SimpleTests.testSafeClose:319 » OpenFailure IWAE0037E Could not open /home/jen...
06:05:26   SimpleTests.testSaveFailure:352 » OpenFailure IWAE0037E Could not open /home/j...
06:05:26   SimpleTests.testXmlValidation:387 » OpenFailure IWAE0037E Could not open /home...
06:05:26   WARFileTests.testAddCopyClass:56 » OpenFailure IWAE0037E Could not open /home/...
06:05:26   WARFileTests.testAddCopyLib:77 » OpenFailure IWAE0037E Could not open /home/je...
06:05:26   WARFileTests.testListClassesAndLibs:96 » OpenFailure IWAE0037E Could not open ...
06:05:26 
06:05:26 Tests run: 887, Failures: 1, Errors: 41, Skipped: 0
06:05:26 
06:05:26 [INFO] 
06:05:27 [INFO] ------------------------------------------------------------------------
06:05:27 [INFO] Skipping org.eclipse.jst.j2ee.tests
06:05:27 [INFO] This project has been banned from the build due to previous failures.
06:05:27 [INFO] ------------------------------------------------------------------------
06:05:27 [INFO] 
06:05:27 [INFO] ------------------------------------------------------------------------
06:05:27 [INFO] Skipping org.eclipse.jst.jee.tests
06:05:27 [INFO] This project has been banned from the build due to previous failures.
06:05:27 [INFO] ------------------------------------------------------------------------
06:05:27 [INFO] 
06:05:27 [INFO] ------------------------------------------------------------------------
06:05:27 [INFO] Skipping org.eclipse.jst.servlet.tests
06:05:27 [INFO] This project has been banned from the build due to previous failures.
06:05:27 [INFO] ------------------------------------------------------------------------
06:05:27 [INFO] 
06:05:27 [INFO] ----< org.eclipse.webtools.javaee:org.eclipse.jst.validation.test >-----
06:05:27 [INFO] Building org.eclipse.jst.validation.test 1.1.300-SNAPSHOT        [47/51]
06:05:27 [INFO] ------------------------[ eclipse-test-plugin ]-------------------------
06:05:27 [INFO] 
06:05:27 [INFO] --- maven-clean-plugin:2.5:clean (default-clean) @ org.eclipse.jst.validation.test ---
06:05:27 [INFO] 
06:05:27 [INFO] --- tycho-packaging-plugin:2.2.0:build-qualifier (default-build-qualifier) @ org.eclipse.jst.validation.test ---
06:05:27 [INFO] The project's OSGi version is 1.1.300.v202103311810
06:05:27 [INFO] 
06:05:27 [INFO] --- tycho-packaging-plugin:2.2.0:validate-id (default-validate-id) @ org.eclipse.jst.validation.test ---
06:05:27 [INFO] 
06:05:27 [INFO] --- tycho-packaging-plugin:2.2.0:validate-version (default-validate-version) @ org.eclipse.jst.validation.test ---
06:05:27 [INFO] 
06:05:27 [INFO] --- build-helper-maven-plugin:3.0.0:regex-property (regex-property) @ org.eclipse.jst.validation.test ---
06:05:27 [INFO] 
06:05:27 [INFO] --- maven-resources-plugin:2.4.3:resources (default-resources) @ org.eclipse.jst.validation.test ---
06:05:27 [WARNING] Using platform encoding (UTF-8 actually) to copy filtered resources, i.e. build is platform dependent!
06:05:27 [INFO] skip non existing resourceDirectory /home/jenkins/agent/workspace/webtools-javaee-gerrit_master/tests/org.eclipse.jst.validation.test/src/main/resources
06:05:27 [INFO] 
06:05:27 [INFO] --- tycho-compiler-plugin:2.2.0:compile (default-compile) @ org.eclipse.jst.validation.test ---
06:05:27 [INFO] Compiling 53 source files to /home/jenkins/agent/workspace/webtools-javaee-gerrit_master/tests/org.eclipse.jst.validation.test/target/classes
06:05:27 [INFO] 
06:05:27 [INFO] --- maven-resources-plugin:2.4.3:testResources (default-testResources) @ org.eclipse.jst.validation.test ---
06:05:27 [WARNING] Using platform encoding (UTF-8 actually) to copy filtered resources, i.e. build is platform dependent!
06:05:27 [INFO] skip non existing resourceDirectory /home/jenkins/agent/workspace/webtools-javaee-gerrit_master/tests/org.eclipse.jst.validation.test/src/test/resources
06:05:27 [INFO] 
06:05:27 [INFO] --- tycho-source-plugin:2.2.0:plugin-source (plugin-source) @ org.eclipse.jst.validation.test ---
06:05:27 [INFO] Building jar: /home/jenkins/agent/workspace/webtools-javaee-gerrit_master/tests/org.eclipse.jst.validation.test/target/org.eclipse.jst.validation.test-1.1.300-SNAPSHOT-sources.jar
06:05:27 [INFO] 
06:05:27 [INFO] --- target-platform-configuration:2.2.0:target-platform (default-target-platform) @ org.eclipse.jst.validation.test ---
06:05:27 [INFO] 
06:05:27 [INFO] --- tycho-packaging-plugin:2.2.0:package-plugin (default-package-plugin) @ org.eclipse.jst.validation.test ---
06:05:27 [INFO] Building jar: /home/jenkins/agent/workspace/webtools-javaee-gerrit_master/tests/org.eclipse.jst.validation.test/validationtest.jar
06:05:27 [INFO] Building jar: /home/jenkins/agent/workspace/webtools-javaee-gerrit_master/tests/org.eclipse.jst.validation.test/target/org.eclipse.jst.validation.test-1.1.300-SNAPSHOT.jar
06:05:28 [INFO] 
06:05:28 [INFO] --- tycho-p2-plugin:2.2.0:p2-metadata-default (default-p2-metadata-default) @ org.eclipse.jst.validation.test ---
06:05:28 [INFO] 
06:05:28 [INFO] --- tycho-surefire-plugin:2.2.0:test (default-test) @ org.eclipse.jst.validation.test ---
06:05:28 [INFO] Executing Test Runtime with timeout 0, logs (if any) will be placed at: /home/jenkins/agent/workspace/webtools-javaee-gerrit_master/tests/org.eclipse.jst.validation.test/target/work/data/.metadata/.log
06:05:28 [INFO] Command line:
06:05:28 	[/opt/tools/java/openjdk/jdk-11/11.0.2+9/bin/java, -Dosgi.noShutdown=false, -Dosgi.os=linux, -Dosgi.ws=gtk, -Dosgi.arch=x86_64, -Dosgi.clean=true, -jar, /home/jenkins/agent/workspace/webtools-javaee-gerrit_master/.repository/p2/osgi/bundle/org.eclipse.equinox.launcher/1.6.200.v20210416-2027/org.eclipse.equinox.launcher-1.6.200.v20210416-2027.jar, -data, /home/jenkins/agent/workspace/webtools-javaee-gerrit_master/tests/org.eclipse.jst.validation.test/target/work/data, -install, /home/jenkins/agent/workspace/webtools-javaee-gerrit_master/tests/org.eclipse.jst.validation.test/target/work, -configuration, /home/jenkins/agent/workspace/webtools-javaee-gerrit_master/tests/org.eclipse.jst.validation.test/target/work/configuration, -application, org.eclipse.tycho.surefire.osgibooter.headlesstest, -testproperties, /home/jenkins/agent/workspace/webtools-javaee-gerrit_master/tests/org.eclipse.jst.validation.test/target/surefire.properties]
06:05:28 Running org.eclipse.jst.validation.test.junit.ValidatorTest
06:05:30 Tests run: 1, Failures: 0, Errors: 0, Skipped: 1, Time elapsed: 0.006 s - in org.eclipse.jst.validation.test.junit.ValidatorTest
06:05:30 org.eclipse.jst.validation.test.junit.ValidatorTest skipped
06:05:30 Running org.eclipse.jst.validation.test.junit.OperationTest
06:05:30 Tests run: 1, Failures: 0, Errors: 0, Skipped: 1, Time elapsed: 0 s - in org.eclipse.jst.validation.test.junit.OperationTest
06:05:30 org.eclipse.jst.validation.test.junit.OperationTest skipped
06:05:30 Running org.eclipse.jst.validation.api.test.ValidationRegistryApiTest
06:05:30 Tests run: 1, Failures: 0, Errors: 0, Skipped: 0, Time elapsed: 0.286 s - in org.eclipse.jst.validation.api.test.ValidationRegistryApiTest
06:05:30 test_getValidator(org.eclipse.jst.validation.api.test.ValidationRegistryApiTest)  Time elapsed: 0.28 s
06:05:30 
06:05:30 Results:
06:05:30 
06:05:30 Tests run: 3, Failures: 0, Errors: 0, Skipped: 2
06:05:30 
06:05:30 [INFO] All tests passed!
06:05:31 [INFO] 
06:05:31 [INFO] --- tycho-pack200a-plugin:2.2.0:normalize (pack200-normalize) @ org.eclipse.jst.validation.test ---
06:05:31 [INFO] Pack200 normalizing jar /home/jenkins/agent/workspace/webtools-javaee-gerrit_master/tests/org.eclipse.jst.validation.test/target/org.eclipse.jst.validation.test-1.1.300-SNAPSHOT.jar
06:05:31 [INFO] 
06:05:31 [INFO] --- eclipse-jarsigner-plugin:1.1.4:sign (sign) @ org.eclipse.jst.validation.test ---
06:05:31 [INFO] Signing of nested jars of '/home/jenkins/agent/workspace/webtools-javaee-gerrit_master/tests/org.eclipse.jst.validation.test/target/org.eclipse.jst.validation.test-1.1.300-SNAPSHOT.jar_unpacked_12657550903537509680/testInput/FWK/BVT/opConstr.jar' is disabled.
06:05:31 [INFO] Signing jar: /home/jenkins/agent/workspace/webtools-javaee-gerrit_master/tests/org.eclipse.jst.validation.test/target/org.eclipse.jst.validation.test-1.1.300-SNAPSHOT.jar_unpacked_12657550903537509680/testInput/FWK/BVT/opConstr.jar
06:05:31 [INFO] Signing of nested jars of '/home/jenkins/agent/workspace/webtools-javaee-gerrit_master/tests/org.eclipse.jst.validation.test/target/org.eclipse.jst.validation.test-1.1.300-SNAPSHOT.jar_unpacked_12657550903537509680/testInput/Properties/aProperties.jar' is disabled.
06:05:33 [INFO] Signing jar: /home/jenkins/agent/workspace/webtools-javaee-gerrit_master/tests/org.eclipse.jst.validation.test/target/org.eclipse.jst.validation.test-1.1.300-SNAPSHOT.jar_unpacked_12657550903537509680/testInput/Properties/aProperties.jar
06:05:33 [INFO] Signing of nested jars of '/home/jenkins/agent/workspace/webtools-javaee-gerrit_master/tests/org.eclipse.jst.validation.test/target/org.eclipse.jst.validation.test-1.1.300-SNAPSHOT.jar_unpacked_12657550903537509680/validationtest.jar' is disabled.
06:05:34 [INFO] Signing jar: /home/jenkins/agent/workspace/webtools-javaee-gerrit_master/tests/org.eclipse.jst.validation.test/target/org.eclipse.jst.validation.test-1.1.300-SNAPSHOT.jar_unpacked_12657550903537509680/validationtest.jar
06:05:34 [INFO] Signing jar: /home/jenkins/agent/workspace/webtools-javaee-gerrit_master/tests/org.eclipse.jst.validation.test/target/org.eclipse.jst.validation.test-1.1.300-SNAPSHOT.jar
06:05:35 [INFO] Signing jar: /home/jenkins/agent/workspace/webtools-javaee-gerrit_master/tests/org.eclipse.jst.validation.test/target/org.eclipse.jst.validation.test-1.1.300-SNAPSHOT-sources.jar
06:05:36 [INFO] 
06:05:38 [INFO] --- tycho-pack200b-plugin:2.2.0:pack (pack200-pack) @ org.eclipse.jst.validation.test ---
06:05:38 [INFO] Pack200 packing jar /home/jenkins/agent/workspace/webtools-javaee-gerrit_master/tests/org.eclipse.jst.validation.test/target/org.eclipse.jst.validation.test-1.1.300-SNAPSHOT.jar
06:05:38 [INFO] 
06:05:38 [INFO] --- tycho-p2-plugin:2.2.0:p2-metadata (p2-metadata) @ org.eclipse.jst.validation.test ---
06:05:38 [INFO] No baseline version MavenProject: org.eclipse.webtools.javaee:org.eclipse.jst.validation.test:1.1.300-SNAPSHOT @ /home/jenkins/agent/workspace/webtools-javaee-gerrit_master/tests/org.eclipse.jst.validation.test/pom.xml
06:05:38 [INFO] 
06:05:38 [INFO] --- maven-install-plugin:2.3.1:install (default-install) @ org.eclipse.jst.validation.test ---
06:05:38 [INFO] Installing /home/jenkins/agent/workspace/webtools-javaee-gerrit_master/tests/org.eclipse.jst.validation.test/target/org.eclipse.jst.validation.test-1.1.300-SNAPSHOT.jar to /home/jenkins/agent/workspace/webtools-javaee-gerrit_master/.repository/org/eclipse/webtools/javaee/org.eclipse.jst.validation.test/1.1.300-SNAPSHOT/org.eclipse.jst.validation.test-1.1.300-SNAPSHOT.jar
06:05:38 [INFO] Installing /home/jenkins/agent/workspace/webtools-javaee-gerrit_master/tests/org.eclipse.jst.validation.test/pom.xml to /home/jenkins/agent/workspace/webtools-javaee-gerrit_master/.repository/org/eclipse/webtools/javaee/org.eclipse.jst.validation.test/1.1.300-SNAPSHOT/org.eclipse.jst.validation.test-1.1.300-SNAPSHOT.pom
06:05:38 [INFO] Installing /home/jenkins/agent/workspace/webtools-javaee-gerrit_master/tests/org.eclipse.jst.validation.test/target/org.eclipse.jst.validation.test-1.1.300-SNAPSHOT-sources.jar to /home/jenkins/agent/workspace/webtools-javaee-gerrit_master/.repository/org/eclipse/webtools/javaee/org.eclipse.jst.validation.test/1.1.300-SNAPSHOT/org.eclipse.jst.validation.test-1.1.300-SNAPSHOT-sources.jar
06:05:38 [INFO] Installing /home/jenkins/agent/workspace/webtools-javaee-gerrit_master/tests/org.eclipse.jst.validation.test/target/org.eclipse.jst.validation.test-1.1.300-SNAPSHOT.jar.pack.gz to /home/jenkins/agent/workspace/webtools-javaee-gerrit_master/.repository/org/eclipse/webtools/javaee/org.eclipse.jst.validation.test/1.1.300-SNAPSHOT/org.eclipse.jst.validation.test-1.1.300-SNAPSHOT-pack200.jar.pack.gz
06:05:38 [INFO] Installing /home/jenkins/agent/workspace/webtools-javaee-gerrit_master/tests/org.eclipse.jst.validation.test/target/p2content.xml to /home/jenkins/agent/workspace/webtools-javaee-gerrit_master/.repository/org/eclipse/webtools/javaee/org.eclipse.jst.validation.test/1.1.300-SNAPSHOT/org.eclipse.jst.validation.test-1.1.300-SNAPSHOT-p2metadata.xml
06:05:38 [INFO] Installing /home/jenkins/agent/workspace/webtools-javaee-gerrit_master/tests/org.eclipse.jst.validation.test/target/p2artifacts.xml to /home/jenkins/agent/workspace/webtools-javaee-gerrit_master/.repository/org/eclipse/webtools/javaee/org.eclipse.jst.validation.test/1.1.300-SNAPSHOT/org.eclipse.jst.validation.test-1.1.300-SNAPSHOT-p2artifacts.xml
06:05:38 [INFO] 
06:05:38 [INFO] --- tycho-p2-plugin:2.2.0:update-local-index (default-update-local-index) @ org.eclipse.jst.validation.test ---
06:05:38 [INFO] 
06:05:38 [INFO] ------------------------------------------------------------------------
06:05:38 [INFO] Skipping org.eclipse.webtools.javaee.site
06:05:38 [INFO] This project has been banned from the build due to previous failures.
06:05:38 [INFO] ------------------------------------------------------------------------
06:05:38 [INFO] ------------------------------------------------------------------------
06:05:38 [INFO] Reactor Summary:
06:05:38 [INFO] 
06:05:38 [INFO] org.eclipse.webtools.javaee 3.6.0-SNAPSHOT ......... SUCCESS [ 16.066 s]
06:05:38 [INFO] javaee.docs 3.6.0-SNAPSHOT ......................... SUCCESS [  0.009 s]
06:05:38 [INFO] org.eclipse.jst.ejb.doc.user 1.1.301-SNAPSHOT ...... SUCCESS [ 14.405 s]
06:05:38 [INFO] org.eclipse.jst.ejb.ui.infopop 1.0.300-SNAPSHOT .... SUCCESS [  2.962 s]
06:05:38 [INFO] org.eclipse.jst.j2ee.doc.user 1.1.400-SNAPSHOT ..... SUCCESS [  2.550 s]
06:05:38 [INFO] org.eclipse.jst.j2ee.infopop 1.0.300-SNAPSHOT ...... SUCCESS [  2.535 s]
06:05:38 [INFO] org.eclipse.jst.servlet.ui.infopop 1.0.500-SNAPSHOT  SUCCESS [  2.708 s]
06:05:38 [INFO] javaee.plugins 3.6.0-SNAPSHOT ...................... SUCCESS [  0.006 s]
06:05:38 [INFO] org.eclipse.jem.proxy 2.1.0-SNAPSHOT ............... SUCCESS [  7.721 s]
06:05:38 [INFO] org.eclipse.jem 2.0.600-SNAPSHOT ................... SUCCESS [  4.723 s]
06:05:38 [INFO] org.eclipse.jem.workbench 2.1.0-SNAPSHOT ........... SUCCESS [  4.562 s]
06:05:38 [INFO] org.eclipse.jem.beaninfo.vm.common 2.1.0-SNAPSHOT .. SUCCESS [  2.536 s]
06:05:38 [INFO] org.eclipse.jem.beaninfo.vm 2.1.0-SNAPSHOT ......... SUCCESS [  2.809 s]
06:05:38 [INFO] org.eclipse.jem.beaninfo 2.0.300-SNAPSHOT .......... SUCCESS [  3.875 s]
06:05:38 [INFO] org.eclipse.jst.common.annotations.core 1.1.300-SNAPSHOT SUCCESS [  2.833 s]
06:05:38 [INFO] org.eclipse.jst.common.annotations.controller 1.1.300-SNAPSHOT SUCCESS [  3.851 s]
06:05:38 [INFO] org.eclipse.jst.common.annotations.ui 1.1.300-SNAPSHOT SUCCESS [  2.903 s]
06:05:38 [INFO] org.eclipse.jst.common.frameworks 1.1.701-SNAPSHOT . SUCCESS [  3.822 s]
06:05:38 [INFO] org.eclipse.jst.common.ui 1.0.301-SNAPSHOT ......... SUCCESS [  2.986 s]
06:05:38 [INFO] org.eclipse.jst.j2ee.core 1.4.100-SNAPSHOT ......... SUCCESS [ 14.744 s]
06:05:38 [INFO] org.eclipse.jst.j2ee 1.2.500-SNAPSHOT .............. SUCCESS [  8.114 s]
06:05:38 [INFO] org.eclipse.jst.j2ee.jca 1.1.1000-SNAPSHOT ......... SUCCESS [  4.192 s]
06:05:38 [INFO] org.eclipse.jst.jee 1.0.1000-SNAPSHOT .............. SUCCESS [  4.340 s]
06:05:38 [INFO] org.eclipse.jst.j2ee.ejb 1.1.901-SNAPSHOT .......... SUCCESS [  4.563 s]
06:05:38 [INFO] org.eclipse.jst.j2ee.ejb.annotation.model 1.1.500-SNAPSHOT SUCCESS [  6.954 s]
06:05:38 [INFO] org.eclipse.jst.j2ee.web 1.1.1100-SNAPSHOT ......... SUCCESS [  6.157 s]
06:05:38 [INFO] org.eclipse.jst.j2ee.ui 1.1.931-SNAPSHOT ........... SUCCESS [ 12.807 s]
06:05:38 [INFO] org.eclipse.jst.j2ee.jca.ui 1.1.601-SNAPSHOT ....... SUCCESS [  3.950 s]
06:05:38 [INFO] org.eclipse.jst.j2ee.navigator.ui 1.1.800-SNAPSHOT . SUCCESS [  5.865 s]
06:05:38 [INFO] org.eclipse.jst.jee.ui 1.0.901-SNAPSHOT ............ SUCCESS [  6.989 s]
06:05:38 [INFO] org.eclipse.jst.ejb.ui 1.1.911-SNAPSHOT ............ SUCCESS [  4.239 s]
06:05:38 [INFO] org.eclipse.jst.j2ee.ejb.annotations.emitter 1.1.300-SNAPSHOT SUCCESS [  4.068 s]
06:05:38 [INFO] org.eclipse.jst.j2ee.ejb.annotations.ui 1.2.0-SNAPSHOT SUCCESS [  3.304 s]
06:05:38 [INFO] org.eclipse.jst.j2ee.ejb.annotations.xdoclet 1.2.300-SNAPSHOT SUCCESS [  2.823 s]
06:05:38 [INFO] org.eclipse.jst.j2ee.webservice 1.1.700-SNAPSHOT ... SUCCESS [  4.738 s]
06:05:38 [INFO] org.eclipse.jst.j2ee.webservice.ui 1.1.800-SNAPSHOT  SUCCESS [  2.950 s]
06:05:38 [INFO] org.eclipse.jst.j2ee.xdoclet.runtime 1.2.0-SNAPSHOT  SUCCESS [  3.064 s]
06:05:38 [INFO] org.eclipse.jst.jee.ejb 1.0.500-SNAPSHOT ........... SUCCESS [  3.846 s]
06:05:38 [INFO] org.eclipse.jst.jee.web 1.0.800-SNAPSHOT ........... SUCCESS [  3.085 s]
06:05:38 [INFO] org.eclipse.jst.servlet.ui 1.1.1100-SNAPSHOT ....... SUCCESS [  3.324 s]
06:05:38 [INFO] org.eclipse.wtp.jee.capabilities 1.0.100-SNAPSHOT .. SUCCESS [  2.579 s]
06:05:38 [INFO] javaee.tests 3.6.0-SNAPSHOT ........................ SUCCESS [  0.030 s]
06:05:38 [INFO] org.eclipse.jst.validation.sample 1.1.100-SNAPSHOT . SUCCESS [  5.450 s]
06:05:38 [INFO] org.eclipse.jst.ejb.ui.tests 1.0.0-SNAPSHOT ........ SUCCESS [  7.941 s]
06:05:38 [INFO] org.eclipse.jem.tests 1.3.0-SNAPSHOT ............... SUCCESS [  7.942 s]
06:05:38 [INFO] org.eclipse.jst.j2ee.core.tests 1.1.600-SNAPSHOT ... FAILURE [ 21.243 s]
06:05:38 [INFO] org.eclipse.jst.j2ee.tests 1.1.800-SNAPSHOT ........ SKIPPED
06:05:38 [INFO] org.eclipse.jst.jee.tests 1.0.100-SNAPSHOT ......... SKIPPED
06:05:38 [INFO] org.eclipse.jst.servlet.tests 1.2.0-SNAPSHOT ....... SKIPPED
06:05:38 [INFO] org.eclipse.jst.validation.test 1.1.300-SNAPSHOT ... SUCCESS [ 10.313 s]
06:05:38 [INFO] org.eclipse.webtools.javaee.site 3.6.0-SNAPSHOT .... SKIPPED
06:05:38 [INFO] ------------------------------------------------------------------------
06:05:38 [INFO] BUILD FAILURE
06:05:38 [INFO] ------------------------------------------------------------------------
06:05:38 [INFO] Total time:  06:19 min
06:05:38 [INFO] Finished at: 2021-06-29T10:05:38Z
06:05:38 [INFO] ------------------------------------------------------------------------
06:05:38 [ERROR] Failed to execute goal org.eclipse.tycho:tycho-surefire-plugin:2.2.0:test (default-test) on project org.eclipse.jst.j2ee.core.tests: There are test failures.
06:05:38 [ERROR] 
06:05:38 [ERROR] Please refer to /home/jenkins/agent/workspace/webtools-javaee-gerrit_master/tests/org.eclipse.jst.j2ee.core.tests/target/surefire-reports for the individual test results.
06:05:38 [ERROR] -> [Help 1]
06:05:38 org.apache.maven.lifecycle.LifecycleExecutionException: Failed to execute goal org.eclipse.tycho:tycho-surefire-plugin:2.2.0:test (default-test) on project org.eclipse.jst.j2ee.core.tests: There are test failures.
06:05:38 
06:05:38 Please refer to /home/jenkins/agent/workspace/webtools-javaee-gerrit_master/tests/org.eclipse.jst.j2ee.core.tests/target/surefire-reports for the individual test results.
06:05:38     at org.apache.maven.lifecycle.internal.MojoExecutor.execute (MojoExecutor.java:215)
06:05:38     at org.apache.maven.lifecycle.internal.MojoExecutor.execute (MojoExecutor.java:156)
06:05:38     at org.apache.maven.lifecycle.internal.MojoExecutor.execute (MojoExecutor.java:148)
06:05:38     at org.apache.maven.lifecycle.internal.LifecycleModuleBuilder.buildProject (LifecycleModuleBuilder.java:117)
06:05:38     at org.apache.maven.lifecycle.internal.LifecycleModuleBuilder.buildProject (LifecycleModuleBuilder.java:81)
06:05:38     at org.apache.maven.lifecycle.internal.builder.singlethreaded.SingleThreadedBuilder.build (SingleThreadedBuilder.java:56)
06:05:38     at org.apache.maven.lifecycle.internal.LifecycleStarter.execute (LifecycleStarter.java:128)
06:05:38     at org.apache.maven.DefaultMaven.doExecute (DefaultMaven.java:305)
06:05:38     at org.apache.maven.DefaultMaven.doExecute (DefaultMaven.java:192)
06:05:38     at org.apache.maven.DefaultMaven.execute (DefaultMaven.java:105)
06:05:38     at org.apache.maven.cli.MavenCli.execute (MavenCli.java:957)
06:05:38     at org.apache.maven.cli.MavenCli.doMain (MavenCli.java:289)
06:05:38     at org.apache.maven.cli.MavenCli.main (MavenCli.java:193)
06:05:38     at jdk.internal.reflect.NativeMethodAccessorImpl.invoke0 (Native Method)
06:05:38     at jdk.internal.reflect.NativeMethodAccessorImpl.invoke (NativeMethodAccessorImpl.java:62)
06:05:38     at jdk.internal.reflect.DelegatingMethodAccessorImpl.invoke (DelegatingMethodAccessorImpl.java:43)
06:05:38     at java.lang.reflect.Method.invoke (Method.java:566)
06:05:38     at org.codehaus.plexus.classworlds.launcher.Launcher.launchEnhanced (Launcher.java:282)
06:05:38     at org.codehaus.plexus.classworlds.launcher.Launcher.launch (Launcher.java:225)
06:05:38     at org.codehaus.plexus.classworlds.launcher.Launcher.mainWithExitCode (Launcher.java:406)
06:05:38     at org.codehaus.plexus.classworlds.launcher.Launcher.main (Launcher.java:347)
06:05:38 Caused by: org.apache.maven.plugin.MojoFailureException: There are test failures.
06:05:38 
06:05:38 Please refer to /home/jenkins/agent/workspace/webtools-javaee-gerrit_master/tests/org.eclipse.jst.j2ee.core.tests/target/surefire-reports for the individual test results.
06:05:38     at org.eclipse.tycho.surefire.TestMojo.runTest (TestMojo.java:1070)
06:05:38     at org.eclipse.tycho.surefire.TestMojo.execute (TestMojo.java:714)
06:05:38     at org.apache.maven.plugin.DefaultBuildPluginManager.executeMojo (DefaultBuildPluginManager.java:137)
06:05:38     at org.apache.maven.lifecycle.internal.MojoExecutor.execute (MojoExecutor.java:210)
06:05:38     at org.apache.maven.lifecycle.internal.MojoExecutor.execute (MojoExecutor.java:156)
06:05:38     at org.apache.maven.lifecycle.internal.MojoExecutor.execute (MojoExecutor.java:148)
06:05:38     at org.apache.maven.lifecycle.internal.LifecycleModuleBuilder.buildProject (LifecycleModuleBuilder.java:117)
06:05:38     at org.apache.maven.lifecycle.internal.LifecycleModuleBuilder.buildProject (LifecycleModuleBuilder.java:81)
06:05:38     at org.apache.maven.lifecycle.internal.builder.singlethreaded.SingleThreadedBuilder.build (SingleThreadedBuilder.java:56)
06:05:38     at org.apache.maven.lifecycle.internal.LifecycleStarter.execute (LifecycleStarter.java:128)
06:05:38     at org.apache.maven.DefaultMaven.doExecute (DefaultMaven.java:305)
06:05:38     at org.apache.maven.DefaultMaven.doExecute (DefaultMaven.java:192)
06:05:38     at org.apache.maven.DefaultMaven.execute (DefaultMaven.java:105)
06:05:38     at org.apache.maven.cli.MavenCli.execute (MavenCli.java:957)
06:05:38     at org.apache.maven.cli.MavenCli.doMain (MavenCli.java:289)
06:05:38     at org.apache.maven.cli.MavenCli.main (MavenCli.java:193)
06:05:38     at jdk.internal.reflect.NativeMethodAccessorImpl.invoke0 (Native Method)
06:05:38     at jdk.internal.reflect.NativeMethodAccessorImpl.invoke (NativeMethodAccessorImpl.java:62)
06:05:38     at jdk.internal.reflect.DelegatingMethodAccessorImpl.invoke (DelegatingMethodAccessorImpl.java:43)
06:05:38     at java.lang.reflect.Method.invoke (Method.java:566)
06:05:38     at org.codehaus.plexus.classworlds.launcher.Launcher.launchEnhanced (Launcher.java:282)
06:05:38     at org.codehaus.plexus.classworlds.launcher.Launcher.launch (Launcher.java:225)
06:05:38     at org.codehaus.plexus.classworlds.launcher.Launcher.mainWithExitCode (Launcher.java:406)
06:05:38     at org.codehaus.plexus.classworlds.launcher.Launcher.main (Launcher.java:347)
06:05:38 [ERROR] 
06:05:38 [ERROR] Re-run Maven using the -X switch to enable full debug logging.
06:05:38 [ERROR] 
06:05:38 [ERROR] For more information about the errors and possible solutions, please read the following articles:
06:05:38 [ERROR] [Help 1] http://cwiki.apache.org/confluence/display/MAVEN/MojoFailureException
06:05:38 [ERROR] 
06:05:38 [ERROR] After correcting the problems, you can resume the build with the command
06:05:38 [ERROR]   mvn <args> -rf :org.eclipse.jst.j2ee.core.tests
06:05:38 Build step 'Invoke top-level Maven targets' marked build as failure
06:05:39 Taking screenshot.
06:05:39 [webtools-javaee-gerrit_master] $ echo $XAUTHORITY
06:05:39 /home/jenkins/agent/workspace/webtools-javaee-gerrit_master/.Xauthority-8025493469190698116
06:05:39 [webtools-javaee-gerrit_master] $ ls -l $XAUTHORITY
06:05:39 -rw-r--r--. 1 jenkins 1000750000 0 Jun 29 09:59 /home/jenkins/agent/workspace/webtools-javaee-gerrit_master/.Xauthority-8025493469190698116
06:05:39 [webtools-javaee-gerrit_master] $ import -window root -display :59 screenshot.jpg
06:05:39 Terminating xvnc.
06:05:39 Recording test results
06:05:52 [Checks API] No suitable checks publisher found.
06:05:53 Finished: FAILURE