Console Output

Skipping 640 KB.. Full Log
    	at junit.framework.TestCase.runTest(TestCase.java:177)
23:26:06     	at junit.framework.TestCase.runBare(TestCase.java:142)
23:26:06     	at junit.framework.TestResult$1.protect(TestResult.java:122)
23:26:06     	at junit.framework.TestResult.runProtected(TestResult.java:142)
23:26:06     	at junit.framework.TestResult.run(TestResult.java:125)
23:26:06     	at junit.framework.TestCase.run(TestCase.java:130)
23:26:06     	at junit.framework.TestSuite.runTest(TestSuite.java:241)
23:26:06     	at junit.framework.TestSuite.run(TestSuite.java:236)
23:26:06     	at org.junit.internal.runners.JUnit38ClassRunner.run(JUnit38ClassRunner.java:90)
23:26:06     	at org.apache.maven.surefire.junit4.JUnit4Provider.execute(JUnit4Provider.java:365)
23:26:06     	at org.apache.maven.surefire.junit4.JUnit4Provider.executeWithRerun(JUnit4Provider.java:273)
23:26:06     	at org.apache.maven.surefire.junit4.JUnit4Provider.executeTestSet(JUnit4Provider.java:238)
23:26:06     	at org.apache.maven.surefire.junit4.JUnit4Provider.invoke(JUnit4Provider.java:159)
23:26:06     	at java.base/jdk.internal.reflect.NativeMethodAccessorImpl.invoke0(Native Method)
23:26:06     	at java.base/jdk.internal.reflect.NativeMethodAccessorImpl.invoke(NativeMethodAccessorImpl.java:62)
23:26:06     	at java.base/jdk.internal.reflect.DelegatingMethodAccessorImpl.invoke(DelegatingMethodAccessorImpl.java:43)
23:26:06     	at java.base/java.lang.reflect.Method.invoke(Method.java:566)
23:26:06     	at org.apache.maven.surefire.util.ReflectionUtils.invokeMethodWithArray2(ReflectionUtils.java:206)
23:26:06     	at org.apache.maven.surefire.booter.ProviderFactory$ProviderProxy.invoke(ProviderFactory.java:161)
23:26:06     	at org.apache.maven.surefire.booter.ProviderFactory.invokeProvider(ProviderFactory.java:84)
23:26:06     	at org.eclipse.tycho.surefire.osgibooter.OsgiSurefireBooter.run(OsgiSurefireBooter.java:116)
23:26:06     	at org.eclipse.tycho.surefire.osgibooter.HeadlessTestApplication.start(HeadlessTestApplication.java:23)
23:26:06     	at org.eclipse.equinox.internal.app.EclipseAppHandle.run(EclipseAppHandle.java:203)
23:26:06     	at org.eclipse.core.runtime.internal.adaptor.EclipseAppLauncher.runApplication(EclipseAppLauncher.java:134)
23:26:06     	at org.eclipse.core.runtime.internal.adaptor.EclipseAppLauncher.start(EclipseAppLauncher.java:104)
23:26:06     	at org.eclipse.core.runtime.adaptor.EclipseStarter.run(EclipseStarter.java:401)
23:26:06     	at org.eclipse.core.runtime.adaptor.EclipseStarter.run(EclipseStarter.java:255)
23:26:06     	at java.base/jdk.internal.reflect.NativeMethodAccessorImpl.invoke0(Native Method)
23:26:06     	at java.base/jdk.internal.reflect.NativeMethodAccessorImpl.invoke(NativeMethodAccessorImpl.java:62)
23:26:06     	at java.base/jdk.internal.reflect.DelegatingMethodAccessorImpl.invoke(DelegatingMethodAccessorImpl.java:43)
23:26:06     	at java.base/java.lang.reflect.Method.invoke(Method.java:566)
23:26:06     	at org.eclipse.equinox.launcher.Main.invokeFramework(Main.java:654)
23:26:06     	at org.eclipse.equinox.launcher.Main.basicRun(Main.java:591)
23:26:06     	at org.eclipse.equinox.launcher.Main.run(Main.java:1462)
23:26:06     	at org.eclipse.equinox.launcher.Main.main(Main.java:1435)
23:26:06 
23:26:06 *** ERROR ***: Fri Jun 04 03:26:06 UTC 2021    IWAE0037E Could not open /home/jenkins/agent/workspace/webtools-javaee-gerrit_master/tests/org.eclipse.jst.j2ee.core.tests/commonArchiveResources/WSSecured_InsuranceServices_EJB_WS.ear
23:26:06 
23:26:06 *** ERROR ***: Fri Jun 04 03:26:06 UTC 2021    java.io.FileNotFoundException: IWAE0036E URI Name: /home/jenkins/agent/workspace/webtools-javaee-gerrit_master/tests/org.eclipse.jst.j2ee.core.tests/commonArchiveResources/WSSecured_InsuranceServices_EJB_WS.ear; File name: /home/jenkins/agent/workspace/webtools-javaee-gerrit_master/tests/org.eclipse.jst.j2ee.core.tests/commonArchiveResources/WSSecured_InsuranceServices_EJB_WS.ear
23:26:06     	at org.eclipse.jst.j2ee.commonarchivecore.internal.impl.CommonarchiveFactoryImpl.createLoadStrategy(CommonarchiveFactoryImpl.java:342)
23:26:06     	at org.eclipse.jst.j2ee.commonarchivecore.internal.impl.CommonarchiveFactoryImpl.primOpenArchive(CommonarchiveFactoryImpl.java:876)
23:26:06     	at org.eclipse.jst.j2ee.commonarchivecore.internal.impl.CommonarchiveFactoryImpl.openEARFile(CommonarchiveFactoryImpl.java:639)
23:26:06     	at org.eclipse.jst.j2ee.archive.test.DefectVerificationTests.testServiceQNameTranslator(DefectVerificationTests.java:216)
23:26:06     	at java.base/jdk.internal.reflect.NativeMethodAccessorImpl.invoke0(Native Method)
23:26:06     	at java.base/jdk.internal.reflect.NativeMethodAccessorImpl.invoke(NativeMethodAccessorImpl.java:62)
23:26:06     	at java.base/jdk.internal.reflect.DelegatingMethodAccessorImpl.invoke(DelegatingMethodAccessorImpl.java:43)
23:26:06     	at java.base/java.lang.reflect.Method.invoke(Method.java:566)
23:26:06     	at junit.framework.TestCase.runTest(TestCase.java:177)
23:26:06     	at junit.framework.TestCase.runBare(TestCase.java:142)
23:26:06     	at junit.framework.TestResult$1.protect(TestResult.java:122)
23:26:06     	at junit.framework.TestResult.runProtected(TestResult.java:142)
23:26:06     	at junit.framework.TestResult.run(TestResult.java:125)
23:26:06     	at junit.framework.TestCase.run(TestCase.java:130)
23:26:06     	at junit.framework.TestSuite.runTest(TestSuite.java:241)
23:26:06     	at junit.framework.TestSuite.run(TestSuite.java:236)
23:26:06     	at org.junit.internal.runners.JUnit38ClassRunner.run(JUnit38ClassRunner.java:90)
23:26:06     	at org.apache.maven.surefire.junit4.JUnit4Provider.execute(JUnit4Provider.java:365)
23:26:06     	at org.apache.maven.surefire.junit4.JUnit4Provider.executeWithRerun(JUnit4Provider.java:273)
23:26:06     	at org.apache.maven.surefire.junit4.JUnit4Provider.executeTestSet(JUnit4Provider.java:238)
23:26:06     	at org.apache.maven.surefire.junit4.JUnit4Provider.invoke(JUnit4Provider.java:159)
23:26:06     	at java.base/jdk.internal.reflect.NativeMethodAccessorImpl.invoke0(Native Method)
23:26:06     	at java.base/jdk.internal.reflect.NativeMethodAccessorImpl.invoke(NativeMethodAccessorImpl.java:62)
23:26:06     	at java.base/jdk.internal.reflect.DelegatingMethodAccessorImpl.invoke(DelegatingMethodAccessorImpl.java:43)
23:26:06     	at java.base/java.lang.reflect.Method.invoke(Method.java:566)
23:26:06     	at org.apache.maven.surefire.util.ReflectionUtils.invokeMethodWithArray2(ReflectionUtils.java:206)
23:26:06     	at org.apache.maven.surefire.booter.ProviderFactory$ProviderProxy.invoke(ProviderFactory.java:161)
23:26:06     	at org.apache.maven.surefire.booter.ProviderFactory.invokeProvider(ProviderFactory.java:84)
23:26:06     	at org.eclipse.tycho.surefire.osgibooter.OsgiSurefireBooter.run(OsgiSurefireBooter.java:116)
23:26:06     	at org.eclipse.tycho.surefire.osgibooter.HeadlessTestApplication.start(HeadlessTestApplication.java:23)
23:26:06     	at org.eclipse.equinox.internal.app.EclipseAppHandle.run(EclipseAppHandle.java:203)
23:26:06     	at org.eclipse.core.runtime.internal.adaptor.EclipseAppLauncher.runApplication(EclipseAppLauncher.java:134)
23:26:06     	at org.eclipse.core.runtime.internal.adaptor.EclipseAppLauncher.start(EclipseAppLauncher.java:104)
23:26:06     	at org.eclipse.core.runtime.adaptor.EclipseStarter.run(EclipseStarter.java:401)
23:26:06     	at org.eclipse.core.runtime.adaptor.EclipseStarter.run(EclipseStarter.java:255)
23:26:06     	at java.base/jdk.internal.reflect.NativeMethodAccessorImpl.invoke0(Native Method)
23:26:06     	at java.base/jdk.internal.reflect.NativeMethodAccessorImpl.invoke(NativeMethodAccessorImpl.java:62)
23:26:06     	at java.base/jdk.internal.reflect.DelegatingMethodAccessorImpl.invoke(DelegatingMethodAccessorImpl.java:43)
23:26:06     	at java.base/java.lang.reflect.Method.invoke(Method.java:566)
23:26:06     	at org.eclipse.equinox.launcher.Main.invokeFramework(Main.java:654)
23:26:06     	at org.eclipse.equinox.launcher.Main.basicRun(Main.java:591)
23:26:06     	at org.eclipse.equinox.launcher.Main.run(Main.java:1462)
23:26:06     	at org.eclipse.equinox.launcher.Main.main(Main.java:1435)
23:26:06 
23:26:06 *** ERROR ***: Fri Jun 04 03:26:06 UTC 2021    java.io.FileNotFoundException: IWAE0036E URI Name: /home/jenkins/agent/workspace/webtools-javaee-gerrit_master/tests/org.eclipse.jst.j2ee.core.tests/commonArchiveResources/WSSecured_InsuranceServices_EJB_WS.ear; File name: /home/jenkins/agent/workspace/webtools-javaee-gerrit_master/tests/org.eclipse.jst.j2ee.core.tests/commonArchiveResources/WSSecured_InsuranceServices_EJB_WS.ear
23:26:06     	at org.eclipse.jst.j2ee.commonarchivecore.internal.impl.CommonarchiveFactoryImpl.createLoadStrategy(CommonarchiveFactoryImpl.java:342)
23:26:06     	at org.eclipse.jst.j2ee.commonarchivecore.internal.impl.CommonarchiveFactoryImpl.primOpenArchive(CommonarchiveFactoryImpl.java:876)
23:26:06     	at org.eclipse.jst.j2ee.commonarchivecore.internal.impl.CommonarchiveFactoryImpl.openEARFile(CommonarchiveFactoryImpl.java:639)
23:26:06     	at org.eclipse.jst.j2ee.archive.test.DefectVerificationTests.testServiceQNameTranslator(DefectVerificationTests.java:216)
23:26:06     	at java.base/jdk.internal.reflect.NativeMethodAccessorImpl.invoke0(Native Method)
23:26:06     	at java.base/jdk.internal.reflect.NativeMethodAccessorImpl.invoke(NativeMethodAccessorImpl.java:62)
23:26:06     	at java.base/jdk.internal.reflect.DelegatingMethodAccessorImpl.invoke(DelegatingMethodAccessorImpl.java:43)
23:26:06     	at java.base/java.lang.reflect.Method.invoke(Method.java:566)
23:26:06     	at junit.framework.TestCase.runTest(TestCase.java:177)
23:26:06     	at junit.framework.TestCase.runBare(TestCase.java:142)
23:26:06     	at junit.framework.TestResult$1.protect(TestResult.java:122)
23:26:06     	at junit.framework.TestResult.runProtected(TestResult.java:142)
23:26:06     	at junit.framework.TestResult.run(TestResult.java:125)
23:26:06     	at junit.framework.TestCase.run(TestCase.java:130)
23:26:06     	at junit.framework.TestSuite.runTest(TestSuite.java:241)
23:26:06     	at junit.framework.TestSuite.run(TestSuite.java:236)
23:26:06     	at org.junit.internal.runners.JUnit38ClassRunner.run(JUnit38ClassRunner.java:90)
23:26:06     	at org.apache.maven.surefire.junit4.JUnit4Provider.execute(JUnit4Provider.java:365)
23:26:06     	at org.apache.maven.surefire.junit4.JUnit4Provider.executeWithRerun(JUnit4Provider.java:273)
23:26:06     	at org.apache.maven.surefire.junit4.JUnit4Provider.executeTestSet(JUnit4Provider.java:238)
23:26:06     	at org.apache.maven.surefire.junit4.JUnit4Provider.invoke(JUnit4Provider.java:159)
23:26:06     	at java.base/jdk.internal.reflect.NativeMethodAccessorImpl.invoke0(Native Method)
23:26:06     	at java.base/jdk.internal.reflect.NativeMethodAccessorImpl.invoke(NativeMethodAccessorImpl.java:62)
23:26:06     	at java.base/jdk.internal.reflect.DelegatingMethodAccessorImpl.invoke(DelegatingMethodAccessorImpl.java:43)
23:26:06     	at java.base/java.lang.reflect.Method.invoke(Method.java:566)
23:26:06     	at org.apache.maven.surefire.util.ReflectionUtils.invokeMethodWithArray2(ReflectionUtils.java:206)
23:26:06     	at org.apache.maven.surefire.booter.ProviderFactory$ProviderProxy.invoke(ProviderFactory.java:161)
23:26:06     	at org.apache.maven.surefire.booter.ProviderFactory.invokeProvider(ProviderFactory.java:84)
23:26:06     	at org.eclipse.tycho.surefire.osgibooter.OsgiSurefireBooter.run(OsgiSurefireBooter.java:116)
23:26:06     	at org.eclipse.tycho.surefire.osgibooter.HeadlessTestApplication.start(HeadlessTestApplication.java:23)
23:26:06     	at org.eclipse.equinox.internal.app.EclipseAppHandle.run(EclipseAppHandle.java:203)
23:26:06     	at org.eclipse.core.runtime.internal.adaptor.EclipseAppLauncher.runApplication(EclipseAppLauncher.java:134)
23:26:06     	at org.eclipse.core.runtime.internal.adaptor.EclipseAppLauncher.start(EclipseAppLauncher.java:104)
23:26:06     	at org.eclipse.core.runtime.adaptor.EclipseStarter.run(EclipseStarter.java:401)
23:26:06     	at org.eclipse.core.runtime.adaptor.EclipseStarter.run(EclipseStarter.java:255)
23:26:06     	at java.base/jdk.internal.reflect.NativeMethodAccessorImpl.invoke0(Native Method)
23:26:06     	at java.base/jdk.internal.reflect.NativeMethodAccessorImpl.invoke(NativeMethodAccessorImpl.java:62)
23:26:06     	at java.base/jdk.internal.reflect.DelegatingMethodAccessorImpl.invoke(DelegatingMethodAccessorImpl.java:43)
23:26:06     	at java.base/java.lang.reflect.Method.invoke(Method.java:566)
23:26:06     	at org.eclipse.equinox.launcher.Main.invokeFramework(Main.java:654)
23:26:06     	at org.eclipse.equinox.launcher.Main.basicRun(Main.java:591)
23:26:06     	at org.eclipse.equinox.launcher.Main.run(Main.java:1462)
23:26:06     	at org.eclipse.equinox.launcher.Main.main(Main.java:1435)
23:26:06 
23:26:06 *** ERROR ***: Fri Jun 04 03:26:06 UTC 2021    IWAE0037E Could not open /home/jenkins/agent/workspace/webtools-javaee-gerrit_master/tests/org.eclipse.jst.j2ee.core.tests/commonArchiveResources/WSSecured_InsuranceServices_EJB_WS.ear
23:26:06     IWAE0036E URI Name: /home/jenkins/agent/workspace/webtools-javaee-gerrit_master/tests/org.eclipse.jst.j2ee.core.tests/commonArchiveResources/WSSecured_InsuranceServices_EJB_WS.ear; File name: /home/jenkins/agent/workspace/webtools-javaee-gerrit_master/tests/org.eclipse.jst.j2ee.core.tests/commonArchiveResources/WSSecured_InsuranceServices_EJB_WS.ear
23:26:06 Tests run: 7, Failures: 0, Errors: 5, Skipped: 0, Time elapsed: 0.056 s <<< FAILURE! - in org.eclipse.jst.j2ee.archive.test.DefectVerificationTests
23:26:06 testSavingEARWhileDeploying(org.eclipse.jst.j2ee.archive.test.DefectVerificationTests)  Time elapsed: 0.018 s  <<< ERROR!
23:26:06 org.eclipse.jst.j2ee.commonarchivecore.internal.exception.OpenFailureException: IWAE0037E Could not open /home/jenkins/agent/workspace/webtools-javaee-gerrit_master/tests/org.eclipse.jst.j2ee.core.tests/commonArchiveResources/AuctionApp.ear
23:26:06 	at org.eclipse.jst.j2ee.archive.test.DefectVerificationTests.testSavingEARWhileDeploying(DefectVerificationTests.java:172)
23:26:06 Caused by: java.io.FileNotFoundException: IWAE0036E URI Name: /home/jenkins/agent/workspace/webtools-javaee-gerrit_master/tests/org.eclipse.jst.j2ee.core.tests/commonArchiveResources/AuctionApp.ear; File name: /home/jenkins/agent/workspace/webtools-javaee-gerrit_master/tests/org.eclipse.jst.j2ee.core.tests/commonArchiveResources/AuctionApp.ear
23:26:06 	at org.eclipse.jst.j2ee.archive.test.DefectVerificationTests.testSavingEARWhileDeploying(DefectVerificationTests.java:172)
23:26:06 
23:26:06 testFilterMappingTranslator(org.eclipse.jst.j2ee.archive.test.DefectVerificationTests)  Time elapsed: 0 s  <<< ERROR!
23:26:06 org.eclipse.jst.j2ee.commonarchivecore.internal.exception.OpenFailureException: IWAE0037E Could not open /home/jenkins/agent/workspace/webtools-javaee-gerrit_master/tests/org.eclipse.jst.j2ee.core.tests/commonArchiveResources/QIDefectsNew.ear
23:26:06 	at org.eclipse.jst.j2ee.archive.test.DefectVerificationTests.testFilterMappingTranslator(DefectVerificationTests.java:83)
23:26:06 Caused by: java.io.FileNotFoundException: IWAE0036E URI Name: /home/jenkins/agent/workspace/webtools-javaee-gerrit_master/tests/org.eclipse.jst.j2ee.core.tests/commonArchiveResources/QIDefectsNew.ear; File name: /home/jenkins/agent/workspace/webtools-javaee-gerrit_master/tests/org.eclipse.jst.j2ee.core.tests/commonArchiveResources/QIDefectsNew.ear
23:26:06 	at org.eclipse.jst.j2ee.archive.test.DefectVerificationTests.testFilterMappingTranslator(DefectVerificationTests.java:83)
23:26:06 
23:26:06 testReadCrimsonCase(org.eclipse.jst.j2ee.archive.test.DefectVerificationTests)  Time elapsed: 0.023 s  <<< ERROR!
23:26:06 org.eclipse.jst.j2ee.commonarchivecore.internal.exception.OpenFailureException: IWAE0037E Could not open /home/jenkins/agent/workspace/webtools-javaee-gerrit_master/tests/org.eclipse.jst.j2ee.core.tests/commonArchiveResources/ejb_sam_Hello.ear
23:26:06 	at org.eclipse.jst.j2ee.archive.test.DefectVerificationTests.testReadCrimsonCase(DefectVerificationTests.java:261)
23:26:06 Caused by: java.io.FileNotFoundException: IWAE0036E URI Name: /home/jenkins/agent/workspace/webtools-javaee-gerrit_master/tests/org.eclipse.jst.j2ee.core.tests/commonArchiveResources/ejb_sam_Hello.ear; File name: /home/jenkins/agent/workspace/webtools-javaee-gerrit_master/tests/org.eclipse.jst.j2ee.core.tests/commonArchiveResources/ejb_sam_Hello.ear
23:26:06 	at org.eclipse.jst.j2ee.archive.test.DefectVerificationTests.testReadCrimsonCase(DefectVerificationTests.java:261)
23:26:06 
23:26:06 testFormerDefect297(org.eclipse.jst.j2ee.archive.test.DefectVerificationTests)  Time elapsed: 0 s  <<< ERROR!
23:26:06 org.eclipse.jst.j2ee.commonarchivecore.internal.exception.OpenFailureException: IWAE0037E Could not open /home/jenkins/agent/workspace/webtools-javaee-gerrit_master/tests/org.eclipse.jst.j2ee.core.tests/commonArchiveResources/sample.ear
23:26:06 	at org.eclipse.jst.j2ee.archive.test.DefectVerificationTests.testFormerDefect297(DefectVerificationTests.java:109)
23:26:06 Caused by: java.io.FileNotFoundException: IWAE0036E URI Name: /home/jenkins/agent/workspace/webtools-javaee-gerrit_master/tests/org.eclipse.jst.j2ee.core.tests/commonArchiveResources/sample.ear; File name: /home/jenkins/agent/workspace/webtools-javaee-gerrit_master/tests/org.eclipse.jst.j2ee.core.tests/commonArchiveResources/sample.ear
23:26:06 	at org.eclipse.jst.j2ee.archive.test.DefectVerificationTests.testFormerDefect297(DefectVerificationTests.java:109)
23:26:06 
23:26:06 testServiceQNameTranslator(org.eclipse.jst.j2ee.archive.test.DefectVerificationTests)  Time elapsed: 0.002 s  <<< ERROR!
23:26:06 org.eclipse.jst.j2ee.commonarchivecore.internal.exception.OpenFailureException: IWAE0037E Could not open /home/jenkins/agent/workspace/webtools-javaee-gerrit_master/tests/org.eclipse.jst.j2ee.core.tests/commonArchiveResources/WSSecured_InsuranceServices_EJB_WS.ear
23:26:06 	at org.eclipse.jst.j2ee.archive.test.DefectVerificationTests.testServiceQNameTranslator(DefectVerificationTests.java:216)
23:26:06 Caused by: java.io.FileNotFoundException: IWAE0036E URI Name: /home/jenkins/agent/workspace/webtools-javaee-gerrit_master/tests/org.eclipse.jst.j2ee.core.tests/commonArchiveResources/WSSecured_InsuranceServices_EJB_WS.ear; File name: /home/jenkins/agent/workspace/webtools-javaee-gerrit_master/tests/org.eclipse.jst.j2ee.core.tests/commonArchiveResources/WSSecured_InsuranceServices_EJB_WS.ear
23:26:06 	at org.eclipse.jst.j2ee.archive.test.DefectVerificationTests.testServiceQNameTranslator(DefectVerificationTests.java:216)
23:26:06 
23:26:06 testCreatingEARFile(org.eclipse.jst.j2ee.archive.test.DefectVerificationTests)  Time elapsed: 0.001 s
23:26:06 testFormerDefect1459(org.eclipse.jst.j2ee.archive.test.DefectVerificationTests)  Time elapsed: 0.01 s
23:26:06 Running org.eclipse.jst.j2ee.archive.test.SecurityRoleTests
23:26:06 Tests run: 2, Failures: 0, Errors: 2, Skipped: 0, Time elapsed: 0.002 s <<< FAILURE! - in org.eclipse.jst.j2ee.archive.test.SecurityRoleTests
23:26:06 testRollupAddAndPushDown(org.eclipse.jst.j2ee.archive.test.SecurityRoleTests)  Time elapsed: 0.001 s  <<< ERROR!
23:26:06 org.eclipse.jst.j2ee.commonarchivecore.internal.exception.OpenFailureException: IWAE0037E Could not open /home/jenkins/agent/workspace/webtools-javaee-gerrit_master/tests/org.eclipse.jst.j2ee.core.tests/commonArchiveResources/sample.ear
23:26:06 	at org.eclipse.jst.j2ee.archive.test.SecurityRoleTests.testRollupAddAndPushDown(SecurityRoleTests.java:73)
23:26:06 Caused by: java.io.FileNotFoundException: IWAE0036E URI Name: /home/jenkins/agent/workspace/webtools-javaee-gerrit_master/tests/org.eclipse.jst.j2ee.core.tests/commonArchiveResources/sample.ear; File name: /home/jenkins/agent/workspace/webtools-javaee-gerrit_master/tests/org.eclipse.jst.j2ee.core.tests/commonArchiveResources/sample.ear
23:26:06 	at org.eclipse.jst.j2ee.archive.test.SecurityRoleTests.testRollupAddAndPushDown(SecurityRoleTests.java:73)
23:26:06 
23:26:06 testPushDownCopy(org.eclipse.jst.j2ee.archive.test.SecurityRoleTests)  Time elapsed: 0 s  <<< ERROR!
23:26:06 org.eclipse.jst.j2ee.commonarchivecore.internal.exception.OpenFailureException: IWAE0037E Could not open /home/jenkins/agent/workspace/webtools-javaee-gerrit_master/tests/org.eclipse.jst.j2ee.core.tests/commonArchiveResources/sample.ear
23:26:06 	at org.eclipse.jst.j2ee.archive.test.SecurityRoleTests.testPushDownCopy(SecurityRoleTests.java:53)
23:26:06 Caused by: java.io.FileNotFoundException: IWAE0036E URI Name: /home/jenkins/agent/workspace/webtools-javaee-gerrit_master/tests/org.eclipse.jst.j2ee.core.tests/commonArchiveResources/sample.ear; File name: /home/jenkins/agent/workspace/webtools-javaee-gerrit_master/tests/org.eclipse.jst.j2ee.core.tests/commonArchiveResources/sample.ear
23:26:06 	at org.eclipse.jst.j2ee.archive.test.SecurityRoleTests.testPushDownCopy(SecurityRoleTests.java:53)
23:26:06 
23:26:06 Running org.eclipse.jst.j2ee.archive.test.TestInvalidXmlMultiplicity
23:26:06 Tests run: 3, Failures: 0, Errors: 0, Skipped: 0, Time elapsed: 0.001 s - in org.eclipse.jst.j2ee.archive.test.TestInvalidXmlMultiplicity
23:26:06 test1(org.eclipse.jst.j2ee.archive.test.TestInvalidXmlMultiplicity)  Time elapsed: 0 s
23:26:06 test2(org.eclipse.jst.j2ee.archive.test.TestInvalidXmlMultiplicity)  Time elapsed: 0 s
23:26:06 test3(org.eclipse.jst.j2ee.archive.test.TestInvalidXmlMultiplicity)  Time elapsed: 0 s
23:26:06 Running org.eclipse.jst.j2ee.archive.test.CopyTests
23:26:06 Tests run: 6, Failures: 0, Errors: 6, Skipped: 0, Time elapsed: 0.003 s <<< FAILURE! - in org.eclipse.jst.j2ee.archive.test.CopyTests
23:26:06 testAddCopyModuleFilesToEAR(org.eclipse.jst.j2ee.archive.test.CopyTests)  Time elapsed: 0.001 s  <<< ERROR!
23:26:06 org.eclipse.jst.j2ee.commonarchivecore.internal.exception.OpenFailureException: IWAE0037E Could not open /home/jenkins/agent/workspace/webtools-javaee-gerrit_master/tests/org.eclipse.jst.j2ee.core.tests/commonArchiveResources/bankejbs.jar
23:26:06 	at org.eclipse.jst.j2ee.archive.test.CopyTests.testAddCopyModuleFilesToEAR(CopyTests.java:139)
23:26:06 Caused by: java.io.FileNotFoundException: IWAE0036E URI Name: /home/jenkins/agent/workspace/webtools-javaee-gerrit_master/tests/org.eclipse.jst.j2ee.core.tests/commonArchiveResources/bankejbs.jar; File name: /home/jenkins/agent/workspace/webtools-javaee-gerrit_master/tests/org.eclipse.jst.j2ee.core.tests/commonArchiveResources/bankejbs.jar
23:26:06 	at org.eclipse.jst.j2ee.archive.test.CopyTests.testAddCopyModuleFilesToEAR(CopyTests.java:139)
23:26:06 
23:26:06 testAddRenameAndDeleteStandalone(org.eclipse.jst.j2ee.archive.test.CopyTests)  Time elapsed: 0 s  <<< ERROR!
23:26:06 org.eclipse.jst.j2ee.commonarchivecore.internal.exception.OpenFailureException: IWAE0037E Could not open /home/jenkins/agent/workspace/webtools-javaee-gerrit_master/tests/org.eclipse.jst.j2ee.core.tests/commonArchiveResources/bankejbs.jar
23:26:06 	at org.eclipse.jst.j2ee.archive.test.CopyTests.testAddRenameAndDeleteStandalone(CopyTests.java:218)
23:26:06 Caused by: java.io.FileNotFoundException: IWAE0036E URI Name: /home/jenkins/agent/workspace/webtools-javaee-gerrit_master/tests/org.eclipse.jst.j2ee.core.tests/commonArchiveResources/bankejbs.jar; File name: /home/jenkins/agent/workspace/webtools-javaee-gerrit_master/tests/org.eclipse.jst.j2ee.core.tests/commonArchiveResources/bankejbs.jar
23:26:06 	at org.eclipse.jst.j2ee.archive.test.CopyTests.testAddRenameAndDeleteStandalone(CopyTests.java:218)
23:26:06 
23:26:06 testAddCopyDirectory(org.eclipse.jst.j2ee.archive.test.CopyTests)  Time elapsed: 0 s  <<< ERROR!
23:26:06 org.eclipse.jst.j2ee.commonarchivecore.internal.exception.OpenFailureException: IWAE0037E Could not open /home/jenkins/agent/workspace/webtools-javaee-gerrit_master/tests/org.eclipse.jst.j2ee.core.tests/commonArchiveResources/example2.war
23:26:06 	at org.eclipse.jst.j2ee.archive.test.CopyTests.testAddCopyDirectory(CopyTests.java:78)
23:26:06 Caused by: java.io.FileNotFoundException: IWAE0036E URI Name: /home/jenkins/agent/workspace/webtools-javaee-gerrit_master/tests/org.eclipse.jst.j2ee.core.tests/commonArchiveResources/example2.war; File name: /home/jenkins/agent/workspace/webtools-javaee-gerrit_master/tests/org.eclipse.jst.j2ee.core.tests/commonArchiveResources/example2.war
23:26:06 	at org.eclipse.jst.j2ee.archive.test.CopyTests.testAddCopyDirectory(CopyTests.java:78)
23:26:06 
23:26:06 testAddCopyModule(org.eclipse.jst.j2ee.archive.test.CopyTests)  Time elapsed: 0.001 s  <<< ERROR!
23:26:06 org.eclipse.jst.j2ee.commonarchivecore.internal.exception.OpenFailureException: IWAE0037E Could not open /home/jenkins/agent/workspace/webtools-javaee-gerrit_master/tests/org.eclipse.jst.j2ee.core.tests/commonArchiveResources/sample.ear
23:26:06 	at org.eclipse.jst.j2ee.archive.test.CopyTests.testAddCopyModule(CopyTests.java:100)
23:26:06 Caused by: java.io.FileNotFoundException: IWAE0036E URI Name: /home/jenkins/agent/workspace/webtools-javaee-gerrit_master/tests/org.eclipse.jst.j2ee.core.tests/commonArchiveResources/sample.ear; File name: /home/jenkins/agent/workspace/webtools-javaee-gerrit_master/tests/org.eclipse.jst.j2ee.core.tests/commonArchiveResources/sample.ear
23:26:06 	at org.eclipse.jst.j2ee.archive.test.CopyTests.testAddCopyModule(CopyTests.java:100)
23:26:06 
23:26:06 testAddRenameAndDelete(org.eclipse.jst.j2ee.archive.test.CopyTests)  Time elapsed: 0 s  <<< ERROR!
23:26:06 org.eclipse.jst.j2ee.commonarchivecore.internal.exception.OpenFailureException: IWAE0037E Could not open /home/jenkins/agent/workspace/webtools-javaee-gerrit_master/tests/org.eclipse.jst.j2ee.core.tests/commonArchiveResources/sample.ear
23:26:06 	at org.eclipse.jst.j2ee.archive.test.CopyTests.testAddRenameAndDelete(CopyTests.java:184)
23:26:06 Caused by: java.io.FileNotFoundException: IWAE0036E URI Name: /home/jenkins/agent/workspace/webtools-javaee-gerrit_master/tests/org.eclipse.jst.j2ee.core.tests/commonArchiveResources/sample.ear; File name: /home/jenkins/agent/workspace/webtools-javaee-gerrit_master/tests/org.eclipse.jst.j2ee.core.tests/commonArchiveResources/sample.ear
23:26:06 	at org.eclipse.jst.j2ee.archive.test.CopyTests.testAddRenameAndDelete(CopyTests.java:184)
23:26:06 
23:26:06 testAddCopyStandaloneModule(org.eclipse.jst.j2ee.archive.test.CopyTests)  Time elapsed: 0 s  <<< ERROR!
23:26:06 org.eclipse.jst.j2ee.commonarchivecore.internal.exception.OpenFailureException: IWAE0037E Could not open /home/jenkins/agent/workspace/webtools-javaee-gerrit_master/tests/org.eclipse.jst.j2ee.core.tests/commonArchiveResources/bankejbs.jar
23:26:06 	at org.eclipse.jst.j2ee.archive.test.CopyTests.testAddCopyStandaloneModule(CopyTests.java:167)
23:26:06 Caused by: java.io.FileNotFoundException: IWAE0036E URI Name: /home/jenkins/agent/workspace/webtools-javaee-gerrit_master/tests/org.eclipse.jst.j2ee.core.tests/commonArchiveResources/bankejbs.jar; File name: /home/jenkins/agent/workspace/webtools-javaee-gerrit_master/tests/org.eclipse.jst.j2ee.core.tests/commonArchiveResources/bankejbs.jar
23:26:06 	at org.eclipse.jst.j2ee.archive.test.CopyTests.testAddCopyStandaloneModule(CopyTests.java:167)
23:26:06 
23:26:06 Running org.eclipse.jst.j2ee.archive.test.ResourceTests
23:26:06 Tests run: 2, Failures: 1, Errors: 1, Skipped: 0, Time elapsed: 0.087 s <<< FAILURE! - in org.eclipse.jst.j2ee.archive.test.ResourceTests
23:26:06 testResourceDirty(org.eclipse.jst.j2ee.archive.test.ResourceTests)  Time elapsed: 0 s  <<< ERROR!
23:26:06 org.eclipse.jst.j2ee.commonarchivecore.internal.exception.OpenFailureException: IWAE0037E Could not open /home/jenkins/agent/workspace/webtools-javaee-gerrit_master/tests/org.eclipse.jst.j2ee.core.tests/commonArchiveResources/bankejbs.jar
23:26:06 	at org.eclipse.jst.j2ee.archive.test.ResourceTests.testResourceDirty(ResourceTests.java:95)
23:26:06 Caused by: java.io.FileNotFoundException: IWAE0036E URI Name: /home/jenkins/agent/workspace/webtools-javaee-gerrit_master/tests/org.eclipse.jst.j2ee.core.tests/commonArchiveResources/bankejbs.jar; File name: /home/jenkins/agent/workspace/webtools-javaee-gerrit_master/tests/org.eclipse.jst.j2ee.core.tests/commonArchiveResources/bankejbs.jar
23:26:06 	at org.eclipse.jst.j2ee.archive.test.ResourceTests.testResourceDirty(ResourceTests.java:95)
23:26:06 
23:26:06 testResourceCreation(org.eclipse.jst.j2ee.archive.test.ResourceTests)  Time elapsed: 0.086 s  <<< FAILURE!
23:26:06 junit.framework.AssertionFailedError: The resource should be unloaded
23:26:06 	at org.eclipse.jst.j2ee.archive.test.ResourceTests.testResourceCreation(ResourceTests.java:76)
23:26:06 
23:26:06 Running org.eclipse.jst.j2ee.archive.test.SaveTests
23:26:06 Tests run: 2, Failures: 0, Errors: 2, Skipped: 0, Time elapsed: 0.001 s <<< FAILURE! - in org.eclipse.jst.j2ee.archive.test.SaveTests
23:26:06 testSave(org.eclipse.jst.j2ee.archive.test.SaveTests)  Time elapsed: 0 s  <<< ERROR!
23:26:06 org.eclipse.jst.j2ee.commonarchivecore.internal.exception.OpenFailureException: IWAE0037E Could not open /home/jenkins/agent/workspace/webtools-javaee-gerrit_master/tests/org.eclipse.jst.j2ee.core.tests/commonArchiveResources/example2.war
23:26:06 	at org.eclipse.jst.j2ee.archive.test.SaveTests.testSave(SaveTests.java:63)
23:26:06 Caused by: java.io.FileNotFoundException: IWAE0036E URI Name: /home/jenkins/agent/workspace/webtools-javaee-gerrit_master/tests/org.eclipse.jst.j2ee.core.tests/commonArchiveResources/example2.war; File name: /home/jenkins/agent/workspace/webtools-javaee-gerrit_master/tests/org.eclipse.jst.j2ee.core.tests/commonArchiveResources/example2.war
23:26:06 	at org.eclipse.jst.j2ee.archive.test.SaveTests.testSave(SaveTests.java:63)
23:26:06 
23:26:06 testSaveDirectory(org.eclipse.jst.j2ee.archive.test.SaveTests)  Time elapsed: 0 s  <<< ERROR!
23:26:06 org.eclipse.jst.j2ee.commonarchivecore.internal.exception.OpenFailureException: IWAE0037E Could not open /home/jenkins/agent/workspace/webtools-javaee-gerrit_master/tests/org.eclipse.jst.j2ee.core.tests/commonArchiveResources/sample.ear
23:26:06 	at org.eclipse.jst.j2ee.archive.test.SaveTests.testSaveDirectory(SaveTests.java:93)
23:26:06 Caused by: java.io.FileNotFoundException: IWAE0036E URI Name: /home/jenkins/agent/workspace/webtools-javaee-gerrit_master/tests/org.eclipse.jst.j2ee.core.tests/commonArchiveResources/sample.ear; File name: /home/jenkins/agent/workspace/webtools-javaee-gerrit_master/tests/org.eclipse.jst.j2ee.core.tests/commonArchiveResources/sample.ear
23:26:06 	at org.eclipse.jst.j2ee.archive.test.SaveTests.testSaveDirectory(SaveTests.java:93)
23:26:06 
23:26:06 Running org.eclipse.jst.j2ee.archive.test.ClientContainerResourceLoadTest
23:26:06 org.eclipse.jst.j2ee.commonarchivecore.internal.exception.OpenFailureException: IWAE0037E Could not open /home/jenkins/agent/workspace/webtools-javaee-gerrit_master/tests/org.eclipse.jst.j2ee.core.tests/commonArchiveResources/mtapp2.ear
23:26:06 Stack trace of nested exception:
23:26:06 java.io.FileNotFoundException: IWAE0036E URI Name: /home/jenkins/agent/workspace/webtools-javaee-gerrit_master/tests/org.eclipse.jst.j2ee.core.tests/commonArchiveResources/mtapp2.ear; File name: /home/jenkins/agent/workspace/webtools-javaee-gerrit_master/tests/org.eclipse.jst.j2ee.core.tests/commonArchiveResources/mtapp2.ear
23:26:06 	at org.eclipse.jst.j2ee.commonarchivecore.internal.impl.CommonarchiveFactoryImpl.createLoadStrategy(CommonarchiveFactoryImpl.java:342)
23:26:06 	at org.eclipse.jst.j2ee.commonarchivecore.internal.impl.CommonarchiveFactoryImpl.primOpenArchive(CommonarchiveFactoryImpl.java:876)
23:26:06 	at org.eclipse.jst.j2ee.commonarchivecore.internal.impl.CommonarchiveFactoryImpl.primOpenArchive(CommonarchiveFactoryImpl.java:902)
23:26:06 	at org.eclipse.jst.j2ee.commonarchivecore.internal.impl.CommonarchiveFactoryImpl.openEARFile(CommonarchiveFactoryImpl.java:657)
23:26:06 	at org.eclipse.jst.j2ee.archive.test.ClientContainerResourceLoadTest.testClientContainerLoad(ClientContainerResourceLoadTest.java:57)
23:26:06 	at java.base/jdk.internal.reflect.NativeMethodAccessorImpl.invoke0(Native Method)
23:26:06 	at java.base/jdk.internal.reflect.NativeMethodAccessorImpl.invoke(NativeMethodAccessorImpl.java:62)
23:26:06 	at java.base/jdk.internal.reflect.DelegatingMethodAccessorImpl.invoke(DelegatingMethodAccessorImpl.java:43)
23:26:06 	at java.base/java.lang.reflect.Method.invoke(Method.java:566)
23:26:06 	at junit.framework.TestCase.runTest(TestCase.java:177)
23:26:06 	at junit.framework.TestCase.runBare(TestCase.java:142)
23:26:06 	at junit.framework.TestResult$1.protect(TestResult.java:122)
23:26:06 	at junit.framework.TestResult.runProtected(TestResult.java:142)
23:26:06 	at junit.framework.TestResult.run(TestResult.java:125)
23:26:06 	at junit.framework.TestCase.run(TestCase.java:130)
23:26:06 	at junit.framework.TestSuite.runTest(TestSuite.java:241)
23:26:06 	at junit.framework.TestSuite.run(TestSuite.java:236)
23:26:06 	at org.junit.internal.runners.JUnit38ClassRunner.run(JUnit38ClassRunner.java:90)
23:26:06 	at org.apache.maven.surefire.junit4.JUnit4Provider.execute(JUnit4Provider.java:365)
23:26:06 	at org.apache.maven.surefire.junit4.JUnit4Provider.executeWithRerun(JUnit4Provider.java:273)
23:26:06 	at org.apache.maven.surefire.junit4.JUnit4Provider.executeTestSet(JUnit4Provider.java:238)
23:26:06 	at org.apache.maven.surefire.junit4.JUnit4Provider.invoke(JUnit4Provider.java:159)
23:26:06 	at java.base/jdk.internal.reflect.NativeMethodAccessorImpl.invoke0(Native Method)
23:26:06 	at java.base/jdk.internal.reflect.NativeMethodAccessorImpl.invoke(NativeMethodAccessorImpl.java:62)
23:26:06 	at java.base/jdk.internal.reflect.DelegatingMethodAccessorImpl.invoke(DelegatingMethodAccessorImpl.java:43)
23:26:06 	at java.base/java.lang.reflect.Method.invoke(Method.java:566)
23:26:06 	at org.apache.maven.surefire.util.ReflectionUtils.invokeMethodWithArray2(ReflectionUtils.java:206)
23:26:06 	at org.apache.maven.surefire.booter.ProviderFactory$ProviderProxy.invoke(ProviderFactory.java:161)
23:26:06 	at org.apache.maven.surefire.booter.ProviderFactory.invokeProvider(ProviderFactory.java:84)
23:26:06 	at org.eclipse.tycho.surefire.osgibooter.OsgiSurefireBooter.run(OsgiSurefireBooter.java:116)
23:26:06 	at org.eclipse.tycho.surefire.osgibooter.HeadlessTestApplication.start(HeadlessTestApplication.java:23)
23:26:06 	at org.eclipse.equinox.internal.app.EclipseAppHandle.run(EclipseAppHandle.java:203)
23:26:06 	at org.eclipse.core.runtime.internal.adaptor.EclipseAppLauncher.runApplication(EclipseAppLauncher.java:134)
23:26:06 	at org.eclipse.core.runtime.internal.adaptor.EclipseAppLauncher.start(EclipseAppLauncher.java:104)
23:26:06 	at org.eclipse.core.runtime.adaptor.EclipseStarter.run(EclipseStarter.java:401)
23:26:06 	at org.eclipse.core.runtime.adaptor.EclipseStarter.run(EclipseStarter.java:255)
23:26:06 	at java.base/jdk.internal.reflect.NativeMethodAccessorImpl.invoke0(Native Method)
23:26:06 	at java.base/jdk.internal.reflect.NativeMethodAccessorImpl.invoke(NativeMethodAccessorImpl.java:62)
23:26:06 	at java.base/jdk.internal.reflect.DelegatingMethodAccessorImpl.invoke(DelegatingMethodAccessorImpl.java:43)
23:26:06 	at java.base/java.lang.reflect.Method.invoke(Method.java:566)
23:26:06 	at org.eclipse.equinox.launcher.Main.invokeFramework(Main.java:654)
23:26:06 	at org.eclipse.equinox.launcher.Main.basicRun(Main.java:591)
23:26:06 	at org.eclipse.equinox.launcher.Main.run(Main.java:1462)
23:26:06 	at org.eclipse.equinox.launcher.Main.main(Main.java:1435)
23:26:06 Tests run: 1, Failures: 0, Errors: 0, Skipped: 0, Time elapsed: 0.004 s - in org.eclipse.jst.j2ee.archive.test.ClientContainerResourceLoadTest
23:26:06 testClientContainerLoad(org.eclipse.jst.j2ee.archive.test.ClientContainerResourceLoadTest)  Time elapsed: 0.003 s
23:26:06 Running org.eclipse.jst.j2ee.archive.test.LooseArchiveTests
23:26:06 Tests run: 5, Failures: 0, Errors: 0, Skipped: 0, Time elapsed: 0.323 s - in org.eclipse.jst.j2ee.archive.test.LooseArchiveTests
23:26:06 testLooseConfigCreation(org.eclipse.jst.j2ee.archive.test.LooseArchiveTests)  Time elapsed: 0.069 s
23:26:06 testLooseAppCreation(org.eclipse.jst.j2ee.archive.test.LooseArchiveTests)  Time elapsed: 0.009 s
23:26:06 testLooseConfigOpenAndSave(org.eclipse.jst.j2ee.archive.test.LooseArchiveTests)  Time elapsed: 0.11 s
23:26:06 testLooseConfigOpenAndReOpen(org.eclipse.jst.j2ee.archive.test.LooseArchiveTests)  Time elapsed: 0.022 s
23:26:06 testLooseConfigUnimodeOpenAndSave(org.eclipse.jst.j2ee.archive.test.LooseArchiveTests)  Time elapsed: 0.111 s
23:26:06 Running org.eclipse.jst.j2ee.archive.test.DiscriminatorTest
23:26:06 Tests run: 1, Failures: 0, Errors: 0, Skipped: 0, Time elapsed: 0 s - in org.eclipse.jst.j2ee.archive.test.DiscriminatorTest
23:26:06 testDiscriminator(org.eclipse.jst.j2ee.archive.test.DiscriminatorTest)  Time elapsed: 0 s
23:26:06 Running org.eclipse.jst.j2ee.archive.test.WARFileTests
23:26:06 Tests run: 3, Failures: 0, Errors: 3, Skipped: 0, Time elapsed: 0.002 s <<< FAILURE! - in org.eclipse.jst.j2ee.archive.test.WARFileTests
23:26:07 testAddCopyLib(org.eclipse.jst.j2ee.archive.test.WARFileTests)  Time elapsed: 0 s  <<< ERROR!
23:26:07 org.eclipse.jst.j2ee.commonarchivecore.internal.exception.OpenFailureException: IWAE0037E Could not open /home/jenkins/agent/workspace/webtools-javaee-gerrit_master/tests/org.eclipse.jst.j2ee.core.tests/commonArchiveResources/example2.war
23:26:07 	at org.eclipse.jst.j2ee.archive.test.WARFileTests.testAddCopyLib(WARFileTests.java:77)
23:26:07 Caused by: java.io.FileNotFoundException: IWAE0036E URI Name: /home/jenkins/agent/workspace/webtools-javaee-gerrit_master/tests/org.eclipse.jst.j2ee.core.tests/commonArchiveResources/example2.war; File name: /home/jenkins/agent/workspace/webtools-javaee-gerrit_master/tests/org.eclipse.jst.j2ee.core.tests/commonArchiveResources/example2.war
23:26:07 	at org.eclipse.jst.j2ee.archive.test.WARFileTests.testAddCopyLib(WARFileTests.java:77)
23:26:07 
23:26:07 testAddCopyClass(org.eclipse.jst.j2ee.archive.test.WARFileTests)  Time elapsed: 0 s  <<< ERROR!
23:26:07 org.eclipse.jst.j2ee.commonarchivecore.internal.exception.OpenFailureException: IWAE0037E Could not open /home/jenkins/agent/workspace/webtools-javaee-gerrit_master/tests/org.eclipse.jst.j2ee.core.tests/commonArchiveResources/example2.war
23:26:07 	at org.eclipse.jst.j2ee.archive.test.WARFileTests.testAddCopyClass(WARFileTests.java:56)
23:26:07 Caused by: java.io.FileNotFoundException: IWAE0036E URI Name: /home/jenkins/agent/workspace/webtools-javaee-gerrit_master/tests/org.eclipse.jst.j2ee.core.tests/commonArchiveResources/example2.war; File name: /home/jenkins/agent/workspace/webtools-javaee-gerrit_master/tests/org.eclipse.jst.j2ee.core.tests/commonArchiveResources/example2.war
23:26:07 	at org.eclipse.jst.j2ee.archive.test.WARFileTests.testAddCopyClass(WARFileTests.java:56)
23:26:07 
23:26:07 testListClassesAndLibs(org.eclipse.jst.j2ee.archive.test.WARFileTests)  Time elapsed: 0 s  <<< ERROR!
23:26:07 org.eclipse.jst.j2ee.commonarchivecore.internal.exception.OpenFailureException: IWAE0037E Could not open /home/jenkins/agent/workspace/webtools-javaee-gerrit_master/tests/org.eclipse.jst.j2ee.core.tests/commonArchiveResources/example2.war
23:26:07 	at org.eclipse.jst.j2ee.archive.test.WARFileTests.testListClassesAndLibs(WARFileTests.java:96)
23:26:07 Caused by: java.io.FileNotFoundException: IWAE0036E URI Name: /home/jenkins/agent/workspace/webtools-javaee-gerrit_master/tests/org.eclipse.jst.j2ee.core.tests/commonArchiveResources/example2.war; File name: /home/jenkins/agent/workspace/webtools-javaee-gerrit_master/tests/org.eclipse.jst.j2ee.core.tests/commonArchiveResources/example2.war
23:26:07 	at org.eclipse.jst.j2ee.archive.test.WARFileTests.testListClassesAndLibs(WARFileTests.java:96)
23:26:07 
23:26:07 Running org.eclipse.jst.j2ee.archive.test.JavaTests
23:26:07 Tests run: 1, Failures: 0, Errors: 0, Skipped: 0, Time elapsed: 0.001 s - in org.eclipse.jst.j2ee.archive.test.JavaTests
23:26:07 testJavaReflection(org.eclipse.jst.j2ee.archive.test.JavaTests)  Time elapsed: 0 s
23:26:07 Running org.eclipse.jst.j2ee.archive.test.RarFileTests
23:26:07 Tests run: 7, Failures: 0, Errors: 7, Skipped: 0, Time elapsed: 0.003 s <<< FAILURE! - in org.eclipse.jst.j2ee.archive.test.RarFileTests
23:26:07 testOpenAndRead(org.eclipse.jst.j2ee.archive.test.RarFileTests)  Time elapsed: 0 s  <<< ERROR!
23:26:07 org.eclipse.jst.j2ee.commonarchivecore.internal.exception.OpenFailureException: IWAE0037E Could not open /home/jenkins/agent/workspace/webtools-javaee-gerrit_master/tests/org.eclipse.jst.j2ee.core.tests/commonArchiveResources/sample.rar
23:26:07 	at org.eclipse.jst.j2ee.archive.test.RarFileTests.testOpenAndRead(RarFileTests.java:165)
23:26:07 Caused by: java.io.FileNotFoundException: IWAE0036E URI Name: /home/jenkins/agent/workspace/webtools-javaee-gerrit_master/tests/org.eclipse.jst.j2ee.core.tests/commonArchiveResources/sample.rar; File name: /home/jenkins/agent/workspace/webtools-javaee-gerrit_master/tests/org.eclipse.jst.j2ee.core.tests/commonArchiveResources/sample.rar
23:26:07 	at org.eclipse.jst.j2ee.archive.test.RarFileTests.testOpenAndRead(RarFileTests.java:165)
23:26:07 
23:26:07 testaddCopyModule(org.eclipse.jst.j2ee.archive.test.RarFileTests)  Time elapsed: 0 s  <<< ERROR!
23:26:07 org.eclipse.jst.j2ee.commonarchivecore.internal.exception.OpenFailureException: IWAE0037E Could not open /home/jenkins/agent/workspace/webtools-javaee-gerrit_master/tests/org.eclipse.jst.j2ee.core.tests/commonArchiveResources/sample.rar
23:26:07 	at org.eclipse.jst.j2ee.archive.test.RarFileTests.testaddCopyModule(RarFileTests.java:114)
23:26:07 Caused by: java.io.FileNotFoundException: IWAE0036E URI Name: /home/jenkins/agent/workspace/webtools-javaee-gerrit_master/tests/org.eclipse.jst.j2ee.core.tests/commonArchiveResources/sample.rar; File name: /home/jenkins/agent/workspace/webtools-javaee-gerrit_master/tests/org.eclipse.jst.j2ee.core.tests/commonArchiveResources/sample.rar
23:26:07 	at org.eclipse.jst.j2ee.archive.test.RarFileTests.testaddCopyModule(RarFileTests.java:114)
23:26:07 
23:26:07 testSaveRarEar(org.eclipse.jst.j2ee.archive.test.RarFileTests)  Time elapsed: 0 s  <<< ERROR!
23:26:07 org.eclipse.jst.j2ee.commonarchivecore.internal.exception.OpenFailureException: IWAE0037E Could not open /home/jenkins/agent/workspace/webtools-javaee-gerrit_master/tests/org.eclipse.jst.j2ee.core.tests/commonArchiveResources/sample.rar
23:26:07 	at org.eclipse.jst.j2ee.archive.test.RarFileTests.testSaveRarEar(RarFileTests.java:178)
23:26:07 Caused by: java.io.FileNotFoundException: IWAE0036E URI Name: /home/jenkins/agent/workspace/webtools-javaee-gerrit_master/tests/org.eclipse.jst.j2ee.core.tests/commonArchiveResources/sample.rar; File name: /home/jenkins/agent/workspace/webtools-javaee-gerrit_master/tests/org.eclipse.jst.j2ee.core.tests/commonArchiveResources/sample.rar
23:26:07 	at org.eclipse.jst.j2ee.archive.test.RarFileTests.testSaveRarEar(RarFileTests.java:178)
23:26:07 
23:26:07 testexpandRarModule(org.eclipse.jst.j2ee.archive.test.RarFileTests)  Time elapsed: 0.001 s  <<< ERROR!
23:26:07 org.eclipse.jst.j2ee.commonarchivecore.internal.exception.OpenFailureException: IWAE0037E Could not open /home/jenkins/agent/workspace/webtools-javaee-gerrit_master/tests/org.eclipse.jst.j2ee.core.tests/commonArchiveResources/sample.rar
23:26:07 	at org.eclipse.jst.j2ee.archive.test.RarFileTests.testexpandRarModule(RarFileTests.java:132)
23:26:07 Caused by: java.io.FileNotFoundException: IWAE0036E URI Name: /home/jenkins/agent/workspace/webtools-javaee-gerrit_master/tests/org.eclipse.jst.j2ee.core.tests/commonArchiveResources/sample.rar; File name: /home/jenkins/agent/workspace/webtools-javaee-gerrit_master/tests/org.eclipse.jst.j2ee.core.tests/commonArchiveResources/sample.rar
23:26:07 	at org.eclipse.jst.j2ee.archive.test.RarFileTests.testexpandRarModule(RarFileTests.java:132)
23:26:07 
23:26:07 testJ2Cauth(org.eclipse.jst.j2ee.archive.test.RarFileTests)  Time elapsed: 0 s  <<< ERROR!
23:26:07 org.eclipse.jst.j2ee.commonarchivecore.internal.exception.OpenFailureException: IWAE0037E Could not open /home/jenkins/agent/workspace/webtools-javaee-gerrit_master/tests/org.eclipse.jst.j2ee.core.tests/commonArchiveResources/sample.rar
23:26:07 	at org.eclipse.jst.j2ee.archive.test.RarFileTests.testJ2Cauth(RarFileTests.java:193)
23:26:07 Caused by: java.io.FileNotFoundException: IWAE0036E URI Name: /home/jenkins/agent/workspace/webtools-javaee-gerrit_master/tests/org.eclipse.jst.j2ee.core.tests/commonArchiveResources/sample.rar; File name: /home/jenkins/agent/workspace/webtools-javaee-gerrit_master/tests/org.eclipse.jst.j2ee.core.tests/commonArchiveResources/sample.rar
23:26:07 	at org.eclipse.jst.j2ee.archive.test.RarFileTests.testJ2Cauth(RarFileTests.java:193)
23:26:07 
23:26:07 testOpenAndExtract(org.eclipse.jst.j2ee.archive.test.RarFileTests)  Time elapsed: 0 s  <<< ERROR!
23:26:07 org.eclipse.jst.j2ee.commonarchivecore.internal.exception.OpenFailureException: IWAE0037E Could not open /home/jenkins/agent/workspace/webtools-javaee-gerrit_master/tests/org.eclipse.jst.j2ee.core.tests/commonArchiveResources/sample.rar
23:26:07 	at org.eclipse.jst.j2ee.archive.test.RarFileTests.testOpenAndExtract(RarFileTests.java:153)
23:26:07 Caused by: java.io.FileNotFoundException: IWAE0036E URI Name: /home/jenkins/agent/workspace/webtools-javaee-gerrit_master/tests/org.eclipse.jst.j2ee.core.tests/commonArchiveResources/sample.rar; File name: /home/jenkins/agent/workspace/webtools-javaee-gerrit_master/tests/org.eclipse.jst.j2ee.core.tests/commonArchiveResources/sample.rar
23:26:07 	at org.eclipse.jst.j2ee.archive.test.RarFileTests.testOpenAndExtract(RarFileTests.java:153)
23:26:07 
23:26:07 testopenRarEar(org.eclipse.jst.j2ee.archive.test.RarFileTests)  Time elapsed: 0 s  <<< ERROR!
23:26:07 org.eclipse.jst.j2ee.commonarchivecore.internal.exception.OpenFailureException: IWAE0037E Could not open /home/jenkins/agent/workspace/webtools-javaee-gerrit_master/tests/org.eclipse.jst.j2ee.core.tests/commonArchiveResources/testrar.ear
23:26:07 	at org.eclipse.jst.j2ee.archive.test.RarFileTests.testopenRarEar(RarFileTests.java:172)
23:26:07 Caused by: java.io.FileNotFoundException: IWAE0036E URI Name: /home/jenkins/agent/workspace/webtools-javaee-gerrit_master/tests/org.eclipse.jst.j2ee.core.tests/commonArchiveResources/testrar.ear; File name: /home/jenkins/agent/workspace/webtools-javaee-gerrit_master/tests/org.eclipse.jst.j2ee.core.tests/commonArchiveResources/testrar.ear
23:26:07 	at org.eclipse.jst.j2ee.archive.test.RarFileTests.testopenRarEar(RarFileTests.java:172)
23:26:07 
23:26:07 Running org.eclipse.jst.j2ee.archive.test.TestModuleClassLoading
23:26:07 org.eclipse.jst.j2ee.commonarchivecore.internal.exception.OpenFailureException: IWAE0037E Could not open /home/jenkins/agent/workspace/webtools-javaee-gerrit_master/tests/org.eclipse.jst.j2ee.core.tests/commonArchiveResources/PROTO.ear
23:26:07 org.eclipse.jst.j2ee.commonarchivecore.internal.exception.OpenFailureException: IWAE0037E Could not open /home/jenkins/agent/workspace/webtools-javaee-gerrit_master/tests/org.eclipse.jst.j2ee.core.tests/commonArchiveResources/SEIinAnotherJar.ear
23:26:07 org.eclipse.jst.j2ee.commonarchivecore.internal.exception.OpenFailureException: IWAE0037E Could not open /home/jenkins/agent/workspace/webtools-javaee-gerrit_master/tests/org.eclipse.jst.j2ee.core.tests/commonArchiveResources/SEIinWEB-INF_lib_jar.ear
23:26:07 Tests run: 1, Failures: 0, Errors: 0, Skipped: 0, Time elapsed: 0.002 s - in org.eclipse.jst.j2ee.archive.test.TestModuleClassLoading
23:26:07 testAddModuleClassLoading(org.eclipse.jst.j2ee.archive.test.TestModuleClassLoading)  Time elapsed: 0 s
23:26:07 Running org.eclipse.jst.j2ee.ejb.test.CMRFieldTest
23:26:07 Tests run: 6, Failures: 0, Errors: 0, Skipped: 0, Time elapsed: 0.003 s - in org.eclipse.jst.j2ee.ejb.test.CMRFieldTest
23:26:07 test_getRole(org.eclipse.jst.j2ee.ejb.test.CMRFieldTest)  Time elapsed: 0 s
23:26:07 test_setCollectionTypeName(org.eclipse.jst.j2ee.ejb.test.CMRFieldTest)  Time elapsed: 0 s
23:26:07 test_setCollectionType(org.eclipse.jst.j2ee.ejb.test.CMRFieldTest)  Time elapsed: 0 s
23:26:07 test_getCollectionType(org.eclipse.jst.j2ee.ejb.test.CMRFieldTest)  Time elapsed: 0 s
23:26:07 test_setRole(org.eclipse.jst.j2ee.ejb.test.CMRFieldTest)  Time elapsed: 0.001 s
23:26:07 test_getCollectionTypeName(org.eclipse.jst.j2ee.ejb.test.CMRFieldTest)  Time elapsed: 0 s
23:26:07 Running org.eclipse.jst.j2ee.ejb.test.MethodPermissionTest
23:26:07 Tests run: 5, Failures: 0, Errors: 0, Skipped: 0, Time elapsed: 0.002 s - in org.eclipse.jst.j2ee.ejb.test.MethodPermissionTest
23:26:07 test_MethodPermission(org.eclipse.jst.j2ee.ejb.test.MethodPermissionTest)  Time elapsed: 0 s
23:26:07 test_isEquivalent(org.eclipse.jst.j2ee.ejb.test.MethodPermissionTest)  Time elapsed: 0.001 s
23:26:07 test_hasSecurityRole(org.eclipse.jst.j2ee.ejb.test.MethodPermissionTest)  Time elapsed: 0 s
23:26:07 test_getSecurityRole(org.eclipse.jst.j2ee.ejb.test.MethodPermissionTest)  Time elapsed: 0 s
23:26:07 test_hasSecurityRole_2(org.eclipse.jst.j2ee.ejb.test.MethodPermissionTest)  Time elapsed: 0 s
23:26:07 Running org.eclipse.jst.j2ee.ejb.test.EJBRelationTest
23:26:07 Tests run: 6, Failures: 0, Errors: 0, Skipped: 0, Time elapsed: 0.003 s - in org.eclipse.jst.j2ee.ejb.test.EJBRelationTest
23:26:07 test_containsRelationshipRole(org.eclipse.jst.j2ee.ejb.test.EJBRelationTest)  Time elapsed: 0 s
23:26:07 test_getSecondRole(org.eclipse.jst.j2ee.ejb.test.EJBRelationTest)  Time elapsed: 0 s
23:26:07 test_getFirstRole(org.eclipse.jst.j2ee.ejb.test.EJBRelationTest)  Time elapsed: 0 s
23:26:07 test_getOppositeRole(org.eclipse.jst.j2ee.ejb.test.EJBRelationTest)  Time elapsed: 0 s
23:26:07 test_EJBRelation(org.eclipse.jst.j2ee.ejb.test.EJBRelationTest)  Time elapsed: 0 s
23:26:07 test_setFoward(org.eclipse.jst.j2ee.ejb.test.EJBRelationTest)  Time elapsed: 0 s
23:26:07 Running org.eclipse.jst.j2ee.ejb.test.ContainerManagedEntityTest
23:26:07 Tests run: 15, Failures: 0, Errors: 0, Skipped: 0, Time elapsed: 0.004 s - in org.eclipse.jst.j2ee.ejb.test.ContainerManagedEntityTest
23:26:07 test_isUnknownPrimaryKey(org.eclipse.jst.j2ee.ejb.test.ContainerManagedEntityTest)  Time elapsed: 0 s
23:26:07 test_addPersistentAttribute(org.eclipse.jst.j2ee.ejb.test.ContainerManagedEntityTest)  Time elapsed: 0 s
23:26:07 test_addKeyAttributeName(org.eclipse.jst.j2ee.ejb.test.ContainerManagedEntityTest)  Time elapsed: 0.001 s
23:26:07 test_getKeyAttribute(org.eclipse.jst.j2ee.ejb.test.ContainerManagedEntityTest)  Time elapsed: 0 s
23:26:07 test_isContainerManagedEntity(org.eclipse.jst.j2ee.ejb.test.ContainerManagedEntityTest)  Time elapsed: 0 s
23:26:07 test_getPrimaryKeyAttribute(org.eclipse.jst.j2ee.ejb.test.ContainerManagedEntityTest)  Time elapsed: 0 s
23:26:07 test_isVersion1_X(org.eclipse.jst.j2ee.ejb.test.ContainerManagedEntityTest)  Time elapsed: 0 s
23:26:07 test_isVersion2_X(org.eclipse.jst.j2ee.ejb.test.ContainerManagedEntityTest)  Time elapsed: 0 s
23:26:07 test_removePersistentAttribute_2(org.eclipse.jst.j2ee.ejb.test.ContainerManagedEntityTest)  Time elapsed: 0 s
23:26:07 test_listPersistentFieldNames(org.eclipse.jst.j2ee.ejb.test.ContainerManagedEntityTest)  Time elapsed: 0 s
23:26:07 test_isKeyAttribute(org.eclipse.jst.j2ee.ejb.test.ContainerManagedEntityTest)  Time elapsed: 0 s
23:26:07 test_getCMPVersionID(org.eclipse.jst.j2ee.ejb.test.ContainerManagedEntityTest)  Time elapsed: 0 s
23:26:07 test_setPrimKeyField(org.eclipse.jst.j2ee.ejb.test.ContainerManagedEntityTest)  Time elapsed: 0 s
23:26:07 test_addPersistentAttributeName(org.eclipse.jst.j2ee.ejb.test.ContainerManagedEntityTest)  Time elapsed: 0 s
23:26:07 test_removePersistentAttribute(org.eclipse.jst.j2ee.ejb.test.ContainerManagedEntityTest)  Time elapsed: 0 s
23:26:07 Running org.eclipse.jst.j2ee.ejb.test.EJBJarTest
23:26:07 Tests run: 15, Failures: 0, Errors: 0, Skipped: 0, Time elapsed: 0.005 s - in org.eclipse.jst.j2ee.ejb.test.EJBJarTest
23:26:07 test_EJBJar(org.eclipse.jst.j2ee.ejb.test.EJBJarTest)  Time elapsed: 0 s
23:26:07 test_containsContainerManagedBeans(org.eclipse.jst.j2ee.ejb.test.EJBJarTest)  Time elapsed: 0.001 s
23:26:07 test_containsSecurityRole(org.eclipse.jst.j2ee.ejb.test.EJBJarTest)  Time elapsed: 0 s
23:26:07 test_getBeanManagedBeans(org.eclipse.jst.j2ee.ejb.test.EJBJarTest)  Time elapsed: 0 s
23:26:07 test_getContainerManagedBeans(org.eclipse.jst.j2ee.ejb.test.EJBJarTest)  Time elapsed: 0 s
23:26:07 test_getEJB11ContainerManagedBeans(org.eclipse.jst.j2ee.ejb.test.EJBJarTest)  Time elapsed: 0 s
23:26:07 test_getEJB20ContainerManagedBeans(org.eclipse.jst.j2ee.ejb.test.EJBJarTest)  Time elapsed: 0.001 s
23:26:07 test_getMessageDrivenBeans(org.eclipse.jst.j2ee.ejb.test.EJBJarTest)  Time elapsed: 0 s
23:26:07 test_getEjbRelations(org.eclipse.jst.j2ee.ejb.test.EJBJarTest)  Time elapsed: 0 s
23:26:07 test_getEnterpiseBeanFromRef(org.eclipse.jst.j2ee.ejb.test.EJBJarTest)  Time elapsed: 0 s
23:26:07 test_getEnterpriseBeanNamed(org.eclipse.jst.j2ee.ejb.test.EJBJarTest)  Time elapsed: 0.001 s
23:26:07 test_getEnterpriseBeansWithReference(org.eclipse.jst.j2ee.ejb.test.EJBJarTest)  Time elapsed: 0 s
23:26:07 test_getEnterpriseBeanWithReference(org.eclipse.jst.j2ee.ejb.test.EJBJarTest)  Time elapsed: 0 s
23:26:07 test_getSessionBeans(org.eclipse.jst.j2ee.ejb.test.EJBJarTest)  Time elapsed: 0 s
23:26:07 test_getEJBRelation(org.eclipse.jst.j2ee.ejb.test.EJBJarTest)  Time elapsed: 0 s
23:26:07 Running org.eclipse.jst.j2ee.ejb.test.QueryMethodTest
23:26:07 Tests run: 1, Failures: 0, Errors: 0, Skipped: 0, Time elapsed: 0.62 s - in org.eclipse.jst.j2ee.ejb.test.QueryMethodTest
23:26:07 test_getClientTypeJavaClasses(org.eclipse.jst.j2ee.ejb.test.QueryMethodTest)  Time elapsed: 0.619 s
23:26:07 Running org.eclipse.jst.j2ee.ejb.test.QueryTest
23:26:07 Tests run: 3, Failures: 0, Errors: 0, Skipped: 0, Time elapsed: 0.002 s - in org.eclipse.jst.j2ee.ejb.test.QueryTest
23:26:07 test_isRemoteResultMapping(org.eclipse.jst.j2ee.ejb.test.QueryTest)  Time elapsed: 0.001 s
23:26:07 test_isLocalResultMapping(org.eclipse.jst.j2ee.ejb.test.QueryTest)  Time elapsed: 0 s
23:26:07 test_Query(org.eclipse.jst.j2ee.ejb.test.QueryTest)  Time elapsed: 0 s
23:26:07 Running org.eclipse.jst.j2ee.ejb.test.CMPAttributeTest
23:26:07 Tests run: 10, Failures: 0, Errors: 0, Skipped: 0, Time elapsed: 0.004 s - in org.eclipse.jst.j2ee.ejb.test.CMPAttributeTest
23:26:07 test_getSetterName(org.eclipse.jst.j2ee.ejb.test.CMPAttributeTest)  Time elapsed: 0 s
23:26:07 test_getType(org.eclipse.jst.j2ee.ejb.test.CMPAttributeTest)  Time elapsed: 0.001 s
23:26:07 test_getOriginatingType(org.eclipse.jst.j2ee.ejb.test.CMPAttributeTest)  Time elapsed: 0 s
23:26:07 test_setDerived(org.eclipse.jst.j2ee.ejb.test.CMPAttributeTest)  Time elapsed: 0 s
23:26:07 test_setOriginatingType(org.eclipse.jst.j2ee.ejb.test.CMPAttributeTest)  Time elapsed: 0 s
23:26:07 test_isCMRField(org.eclipse.jst.j2ee.ejb.test.CMPAttributeTest)  Time elapsed: 0 s
23:26:07 test_getGetterName(org.eclipse.jst.j2ee.ejb.test.CMPAttributeTest)  Time elapsed: 0 s
23:26:07 test_isDerived(org.eclipse.jst.j2ee.ejb.test.CMPAttributeTest)  Time elapsed: 0 s
23:26:07 test_isKey(org.eclipse.jst.j2ee.ejb.test.CMPAttributeTest)  Time elapsed: 0.001 s
23:26:07 test_isPrimKeyField(org.eclipse.jst.j2ee.ejb.test.CMPAttributeTest)  Time elapsed: 0 s
23:26:07 Running org.eclipse.jst.j2ee.ejb.test.EntityTest
23:26:07 Tests run: 2, Failures: 0, Errors: 0, Skipped: 0, Time elapsed: 0.624 s - in org.eclipse.jst.j2ee.ejb.test.EntityTest
23:26:08 test_setPrimaryKeyName(org.eclipse.jst.j2ee.ejb.test.EntityTest)  Time elapsed: 0.341 s
23:26:08 test_getPrimaryKeyName(org.eclipse.jst.j2ee.ejb.test.EntityTest)  Time elapsed: 0.282 s
23:26:08 Running org.eclipse.jst.j2ee.ejb.test.MethodElementTest
23:26:08 Tests run: 21, Failures: 0, Errors: 0, Skipped: 0, Time elapsed: 0.417 s - in org.eclipse.jst.j2ee.ejb.test.MethodElementTest
23:26:08 test_initializeFromSignature(org.eclipse.jst.j2ee.ejb.test.MethodElementTest)  Time elapsed: 0 s
23:26:08 test_applyZeroParams(org.eclipse.jst.j2ee.ejb.test.MethodElementTest)  Time elapsed: 0 s
23:26:08 test_equalSignature(org.eclipse.jst.j2ee.ejb.test.MethodElementTest)  Time elapsed: 0 s
23:26:08 test_isRemote(org.eclipse.jst.j2ee.ejb.test.MethodElementTest)  Time elapsed: 0 s
23:26:08 test_getTypeJavaClass(org.eclipse.jst.j2ee.ejb.test.MethodElementTest)  Time elapsed: 0.407 s
23:26:08 test_isHome(org.eclipse.jst.j2ee.ejb.test.MethodElementTest)  Time elapsed: 0 s
23:26:08 test_getSignature(org.eclipse.jst.j2ee.ejb.test.MethodElementTest)  Time elapsed: 0.001 s
23:26:08 test_nameAndParamsEquals(org.eclipse.jst.j2ee.ejb.test.MethodElementTest)  Time elapsed: 0.002 s
23:26:08 test_isLocalHome(org.eclipse.jst.j2ee.ejb.test.MethodElementTest)  Time elapsed: 0 s
23:26:08 test_isUnspecified(org.eclipse.jst.j2ee.ejb.test.MethodElementTest)  Time elapsed: 0 s
23:26:08 test_isEquivalent(org.eclipse.jst.j2ee.ejb.test.MethodElementTest)  Time elapsed: 0.001 s
23:26:08 test_MethodElement(org.eclipse.jst.j2ee.ejb.test.MethodElementTest)  Time elapsed: 0 s
23:26:08 test_hasMethodParams(org.eclipse.jst.j2ee.ejb.test.MethodElementTest)  Time elapsed: 0 s
23:26:08 test_isLocal(org.eclipse.jst.j2ee.ejb.test.MethodElementTest)  Time elapsed: 0 s
23:26:08 test_isValid(org.eclipse.jst.j2ee.ejb.test.MethodElementTest)  Time elapsed: 0 s
23:26:08 test_getMethodParams(org.eclipse.jst.j2ee.ejb.test.MethodElementTest)  Time elapsed: 0 s
23:26:08 test_isDefault(org.eclipse.jst.j2ee.ejb.test.MethodElementTest)  Time elapsed: 0 s
23:26:08 test_addMethodParams(org.eclipse.jst.j2ee.ejb.test.MethodElementTest)  Time elapsed: 0.001 s
23:26:08 test_removeMethodParams(org.eclipse.jst.j2ee.ejb.test.MethodElementTest)  Time elapsed: 0 s
23:26:08 testEJBJarPopulation(org.eclipse.jst.j2ee.ejb.test.MethodElementTest)  Time elapsed: 0 s
23:26:08 test14EJBJarPopulation(org.eclipse.jst.j2ee.ejb.test.MethodElementTest)  Time elapsed: 0 s
23:26:08 Running org.eclipse.jst.j2ee.ejb.test.EJBRelationshipRoleTest
23:26:08 Tests run: 13, Failures: 0, Errors: 0, Skipped: 0, Time elapsed: 0.005 s - in org.eclipse.jst.j2ee.ejb.test.EJBRelationshipRoleTest
23:26:08 test_isNavigable(org.eclipse.jst.j2ee.ejb.test.EJBRelationshipRoleTest)  Time elapsed: 0.001 s
23:26:08 test_getLogicalName(org.eclipse.jst.j2ee.ejb.test.EJBRelationshipRoleTest)  Time elapsed: 0 s
23:26:08 test_getName(org.eclipse.jst.j2ee.ejb.test.EJBRelationshipRoleTest)  Time elapsed: 0 s
23:26:08 test_isForward(org.eclipse.jst.j2ee.ejb.test.EJBRelationshipRoleTest)  Time elapsed: 0 s
23:26:08 test_isMany(org.eclipse.jst.j2ee.ejb.test.EJBRelationshipRoleTest)  Time elapsed: 0 s
23:26:08 test_setKey(org.eclipse.jst.j2ee.ejb.test.EJBRelationshipRoleTest)  Time elapsed: 0.002 s
23:26:08 test_EJBRelationshipRole(org.eclipse.jst.j2ee.ejb.test.EJBRelationshipRoleTest)  Time elapsed: 0 s
23:26:08 test_setFoward(org.eclipse.jst.j2ee.ejb.test.EJBRelationshipRoleTest)  Time elapsed: 0 s
23:26:08 test_setName(org.eclipse.jst.j2ee.ejb.test.EJBRelationshipRoleTest)  Time elapsed: 0.001 s
23:26:08 test_getSourceEntity(org.eclipse.jst.j2ee.ejb.test.EJBRelationshipRoleTest)  Time elapsed: 0 s
23:26:08 test_setRequired(org.eclipse.jst.j2ee.ejb.test.EJBRelationshipRoleTest)  Time elapsed: 0 s
23:26:08 test_isKey(org.eclipse.jst.j2ee.ejb.test.EJBRelationshipRoleTest)  Time elapsed: 0 s
23:26:08 test_getOpposite(org.eclipse.jst.j2ee.ejb.test.EJBRelationshipRoleTest)  Time elapsed: 0 s
23:26:08 Running org.eclipse.jst.j2ee.ejb.test.AssemblyDescriptorTest
23:26:08 Tests run: 5, Failures: 0, Errors: 0, Skipped: 0, Time elapsed: 1.469 s - in org.eclipse.jst.j2ee.ejb.test.AssemblyDescriptorTest
23:26:10 test_getMethodPermissionMethodElements(org.eclipse.jst.j2ee.ejb.test.AssemblyDescriptorTest)  Time elapsed: 0.292 s
23:26:10 test_getMethodTransactionMethodElements(org.eclipse.jst.j2ee.ejb.test.AssemblyDescriptorTest)  Time elapsed: 0.276 s
23:26:10 test_getSecurityRoleNamed(org.eclipse.jst.j2ee.ejb.test.AssemblyDescriptorTest)  Time elapsed: 0.279 s
23:26:10 test_renameSecurityRole(org.eclipse.jst.j2ee.ejb.test.AssemblyDescriptorTest)  Time elapsed: 0.348 s
23:26:10 test_removeData(org.eclipse.jst.j2ee.ejb.test.AssemblyDescriptorTest)  Time elapsed: 0.273 s
23:26:10 Running org.eclipse.jst.j2ee.ejb.test.MethodTransactionTest
23:26:10 Tests run: 2, Failures: 0, Errors: 0, Skipped: 0, Time elapsed: 0.281 s - in org.eclipse.jst.j2ee.ejb.test.MethodTransactionTest
23:26:10 test_isEquivalent(org.eclipse.jst.j2ee.ejb.test.MethodTransactionTest)  Time elapsed: 0 s
23:26:10 test_getMethodElements(org.eclipse.jst.j2ee.ejb.test.MethodTransactionTest)  Time elapsed: 0.28 s
23:26:10 Running org.eclipse.jst.j2ee.ejb.test.SessionTest
23:26:10 Tests run: 3, Failures: 0, Errors: 0, Skipped: 0, Time elapsed: 0.001 s - in org.eclipse.jst.j2ee.ejb.test.SessionTest
23:26:10 test_hasServiceEndpoint(org.eclipse.jst.j2ee.ejb.test.SessionTest)  Time elapsed: 0 s
23:26:10 test_getServiceEndpointName(org.eclipse.jst.j2ee.ejb.test.SessionTest)  Time elapsed: 0 s
23:26:10 test_setServiceEndpointName(org.eclipse.jst.j2ee.ejb.test.SessionTest)  Time elapsed: 0 s
23:26:10 Running org.eclipse.jst.j2ee.ejb.test.EjbFactoryTest
23:26:10 Tests run: 26, Failures: 0, Errors: 0, Skipped: 0, Time elapsed: 0.009 s - in org.eclipse.jst.j2ee.ejb.test.EjbFactoryTest
23:26:10 test_createActivationConfig(org.eclipse.jst.j2ee.ejb.test.EjbFactoryTest)  Time elapsed: 0 s
23:26:10 test_createExcludeList(org.eclipse.jst.j2ee.ejb.test.EjbFactoryTest)  Time elapsed: 0 s
23:26:10 test_createEJBRelationshipRole(org.eclipse.jst.j2ee.ejb.test.EjbFactoryTest)  Time elapsed: 0 s
23:26:10 test_createContainerManagedEntity(org.eclipse.jst.j2ee.ejb.test.EjbFactoryTest)  Time elapsed: 0 s
23:26:10 test_createMessageDrivenDestination(org.eclipse.jst.j2ee.ejb.test.EjbFactoryTest)  Time elapsed: 0 s
23:26:10 test_createMethodElement_2(org.eclipse.jst.j2ee.ejb.test.EjbFactoryTest)  Time elapsed: 0 s
23:26:10 test_createCMPAttribute(org.eclipse.jst.j2ee.ejb.test.EjbFactoryTest)  Time elapsed: 0 s
23:26:10 test_createSession(org.eclipse.jst.j2ee.ejb.test.EjbFactoryTest)  Time elapsed: 0.001 s
23:26:10 test_createMethodElementFrom(org.eclipse.jst.j2ee.ejb.test.EjbFactoryTest)  Time elapsed: 0 s
23:26:10 test_createEJBRelation(org.eclipse.jst.j2ee.ejb.test.EjbFactoryTest)  Time elapsed: 0 s
23:26:10 test_createMethodElementFrom_2(org.eclipse.jst.j2ee.ejb.test.EjbFactoryTest)  Time elapsed: 0 s
23:26:10 test_EjbFactory(org.eclipse.jst.j2ee.ejb.test.EjbFactoryTest)  Time elapsed: 0 s
23:26:10 test_createQuery(org.eclipse.jst.j2ee.ejb.test.EjbFactoryTest)  Time elapsed: 0 s
23:26:10 test_createQueryMethod(org.eclipse.jst.j2ee.ejb.test.EjbFactoryTest)  Time elapsed: 0 s
23:26:10 test_createActivationConfigProperty(org.eclipse.jst.j2ee.ejb.test.EjbFactoryTest)  Time elapsed: 0 s
23:26:10 test_createEJBJar(org.eclipse.jst.j2ee.ejb.test.EjbFactoryTest)  Time elapsed: 0 s
23:26:10 test_createMethodPermission(org.eclipse.jst.j2ee.ejb.test.EjbFactoryTest)  Time elapsed: 0 s
23:26:10 test_createEntity(org.eclipse.jst.j2ee.ejb.test.EjbFactoryTest)  Time elapsed: 0.001 s
23:26:10 test_createRelationships(org.eclipse.jst.j2ee.ejb.test.EjbFactoryTest)  Time elapsed: 0 s
23:26:10 test_createEJBMethodCategory(org.eclipse.jst.j2ee.ejb.test.EjbFactoryTest)  Time elapsed: 0 s
23:26:10 test_createMethodTransaction(org.eclipse.jst.j2ee.ejb.test.EjbFactoryTest)  Time elapsed: 0 s
23:26:10 test_createMethodElement(org.eclipse.jst.j2ee.ejb.test.EjbFactoryTest)  Time elapsed: 0 s
23:26:10 test_createAssemblyDescriptor(org.eclipse.jst.j2ee.ejb.test.EjbFactoryTest)  Time elapsed: 0 s
23:26:10 test_createRoleSource(org.eclipse.jst.j2ee.ejb.test.EjbFactoryTest)  Time elapsed: 0 s
23:26:10 test_createCMRField(org.eclipse.jst.j2ee.ejb.test.EjbFactoryTest)  Time elapsed: 0 s
23:26:10 test_createMessageDriven(org.eclipse.jst.j2ee.ejb.test.EjbFactoryTest)  Time elapsed: 0.001 s
23:26:10 Running org.eclipse.jst.j2ee.common.tests.CommonTests
23:26:10 Tests run: 0, Failures: 0, Errors: 0, Skipped: 0, Time elapsed: 0 s - in org.eclipse.jst.j2ee.common.tests.CommonTests
23:26:10 Running org.eclipse.jst.j2ee.common.test.QNameTest
23:26:10 Tests run: 1, Failures: 0, Errors: 0, Skipped: 0, Time elapsed: 0.001 s - in org.eclipse.jst.j2ee.common.test.QNameTest
23:26:10 test_setValues(org.eclipse.jst.j2ee.common.test.QNameTest)  Time elapsed: 0 s
23:26:10 Running org.eclipse.jst.j2ee.common.test.ListenerTest
23:26:10 Tests run: 2, Failures: 0, Errors: 0, Skipped: 0, Time elapsed: 0.001 s - in org.eclipse.jst.j2ee.common.test.ListenerTest
23:26:10 test_setListenerClassName(org.eclipse.jst.j2ee.common.test.ListenerTest)  Time elapsed: 0.001 s
23:26:10 test_getListenerClassName(org.eclipse.jst.j2ee.common.test.ListenerTest)  Time elapsed: 0 s
23:26:10 Running org.eclipse.jst.j2ee.common.test.EjbRefTest
23:26:10 Tests run: 5, Failures: 0, Errors: 0, Skipped: 0, Time elapsed: 0.002 s - in org.eclipse.jst.j2ee.common.test.EjbRefTest
23:26:10 test_isLinked(org.eclipse.jst.j2ee.common.test.EjbRefTest)  Time elapsed: 0 s
23:26:10 test_EjbRef(org.eclipse.jst.j2ee.common.test.EjbRefTest)  Time elapsed: 0 s
23:26:10 test_isEquivalent(org.eclipse.jst.j2ee.common.test.EjbRefTest)  Time elapsed: 0.001 s
23:26:10 test_isLocal(org.eclipse.jst.j2ee.common.test.EjbRefTest)  Time elapsed: 0 s
23:26:10 test_getLinkedEjb(org.eclipse.jst.j2ee.common.test.EjbRefTest)  Time elapsed: 0 s
23:26:10 Running org.eclipse.jst.j2ee.common.test.CommonFactoryTest
23:26:10 Tests run: 22, Failures: 0, Errors: 0, Skipped: 0, Time elapsed: 0.004 s - in org.eclipse.jst.j2ee.common.test.CommonFactoryTest
23:26:10 test_createCompatibilityDescriptionGroup(org.eclipse.jst.j2ee.common.test.CommonFactoryTest)  Time elapsed: 0 s
23:26:10 test_createUseCallerIdentity(org.eclipse.jst.j2ee.common.test.CommonFactoryTest)  Time elapsed: 0 s
23:26:10 test_createDescriptionGroup(org.eclipse.jst.j2ee.common.test.CommonFactoryTest)  Time elapsed: 0 s
23:26:10 test_createIconType(org.eclipse.jst.j2ee.common.test.CommonFactoryTest)  Time elapsed: 0 s
23:26:10 test_createResourceRef(org.eclipse.jst.j2ee.common.test.CommonFactoryTest)  Time elapsed: 0 s
23:26:10 test_createDisplayName(org.eclipse.jst.j2ee.common.test.CommonFactoryTest)  Time elapsed: 0 s
23:26:10 test_createIdentity(org.eclipse.jst.j2ee.common.test.CommonFactoryTest)  Time elapsed: 0 s
23:26:10 test_createSecurityIdentity(org.eclipse.jst.j2ee.common.test.CommonFactoryTest)  Time elapsed: 0 s
23:26:10 test_createResourceEnvRef(org.eclipse.jst.j2ee.common.test.CommonFactoryTest)  Time elapsed: 0 s
23:26:10 test_createDescription(org.eclipse.jst.j2ee.common.test.CommonFactoryTest)  Time elapsed: 0 s
23:26:10 test_createQName(org.eclipse.jst.j2ee.common.test.CommonFactoryTest)  Time elapsed: 0 s
23:26:10 test_CommonFactory(org.eclipse.jst.j2ee.common.test.CommonFactoryTest)  Time elapsed: 0 s
23:26:10 test_createParamValue(org.eclipse.jst.j2ee.common.test.CommonFactoryTest)  Time elapsed: 0 s
23:26:10 test_createEjbRef(org.eclipse.jst.j2ee.common.test.CommonFactoryTest)  Time elapsed: 0 s
23:26:10 test_createListener(org.eclipse.jst.j2ee.common.test.CommonFactoryTest)  Time elapsed: 0 s
23:26:10 test_createMessageDestination(org.eclipse.jst.j2ee.common.test.CommonFactoryTest)  Time elapsed: 0 s
23:26:10 test_createEnvEntry(org.eclipse.jst.j2ee.common.test.CommonFactoryTest)  Time elapsed: 0 s
23:26:10 test_createSecurityRole(org.eclipse.jst.j2ee.common.test.CommonFactoryTest)  Time elapsed: 0 s
23:26:10 test_createMessageDestinationRef(org.eclipse.jst.j2ee.common.test.CommonFactoryTest)  Time elapsed: 0 s
23:26:10 test_createEJBLocalRef(org.eclipse.jst.j2ee.common.test.CommonFactoryTest)  Time elapsed: 0 s
23:26:10 test_createSecurityRoleRef(org.eclipse.jst.j2ee.common.test.CommonFactoryTest)  Time elapsed: 0 s
23:26:10 test_createRunAsSpecifiedIdentity(org.eclipse.jst.j2ee.common.test.CommonFactoryTest)  Time elapsed: 0 s
23:26:10 Running org.eclipse.jst.j2ee.webservice.wsdd.test.WsddFactoryTest
23:26:10 Tests run: 9, Failures: 0, Errors: 0, Skipped: 0, Time elapsed: 0.002 s - in org.eclipse.jst.j2ee.webservice.wsdd.test.WsddFactoryTest
23:26:10 test_createEJBLink(org.eclipse.jst.j2ee.webservice.wsdd.test.WsddFactoryTest)  Time elapsed: 0 s
23:26:10 test_createWSDLPort(org.eclipse.jst.j2ee.webservice.wsdd.test.WsddFactoryTest)  Time elapsed: 0 s
23:26:10 test_createPortComponent(org.eclipse.jst.j2ee.webservice.wsdd.test.WsddFactoryTest)  Time elapsed: 0 s
23:26:10 test_createServiceImplBean(org.eclipse.jst.j2ee.webservice.wsdd.test.WsddFactoryTest)  Time elapsed: 0 s
23:26:10 test_createWebServices(org.eclipse.jst.j2ee.webservice.wsdd.test.WsddFactoryTest)  Time elapsed: 0 s
23:26:10 test_createBeanLink(org.eclipse.jst.j2ee.webservice.wsdd.test.WsddFactoryTest)  Time elapsed: 0 s
23:26:10 test_createWebServiceDescription(org.eclipse.jst.j2ee.webservice.wsdd.test.WsddFactoryTest)  Time elapsed: 0 s
23:26:10 test_createHandler(org.eclipse.jst.j2ee.webservice.wsdd.test.WsddFactoryTest)  Time elapsed: 0.001 s
23:26:10 test_createServletLink(org.eclipse.jst.j2ee.webservice.wsdd.test.WsddFactoryTest)  Time elapsed: 0 s
23:26:10 Running org.eclipse.jst.j2ee.webservice.wscommon.test.WscommonFactoryTest
23:26:10 Tests run: 7, Failures: 0, Errors: 0, Skipped: 0, Time elapsed: 0.003 s - in org.eclipse.jst.j2ee.webservice.wscommon.test.WscommonFactoryTest
23:26:10 test_createSOAPHeader(org.eclipse.jst.j2ee.webservice.wscommon.test.WscommonFactoryTest)  Time elapsed: 0.001 s
23:26:10 test_createDisplayNameType(org.eclipse.jst.j2ee.webservice.wscommon.test.WscommonFactoryTest)  Time elapsed: 0 s
23:26:10 test_getWscommonPackage(org.eclipse.jst.j2ee.webservice.wscommon.test.WscommonFactoryTest)  Time elapsed: 0 s
23:26:10 test_createDescriptionType(org.eclipse.jst.j2ee.webservice.wscommon.test.WscommonFactoryTest)  Time elapsed: 0 s
23:26:10 test_createPortName(org.eclipse.jst.j2ee.webservice.wscommon.test.WscommonFactoryTest)  Time elapsed: 0.001 s
23:26:10 test_createSOAPRole(org.eclipse.jst.j2ee.webservice.wscommon.test.WscommonFactoryTest)  Time elapsed: 0 s
23:26:10 test_createInitParam(org.eclipse.jst.j2ee.webservice.wscommon.test.WscommonFactoryTest)  Time elapsed: 0 s
23:26:10 Running org.eclipse.jst.j2ee.core.tests.api.AllAPITest
23:26:10 Tests run: 243, Failures: 0, Errors: 0, Skipped: 0, Time elapsed: 2.863 s - in org.eclipse.jst.j2ee.core.tests.api.AllAPITest
23:26:13 test_createEjbModule(org.eclipse.jst.j2ee.application.test.ApplicationFactoryTest)  Time elapsed: 0 s
23:26:13 test_createApplication(org.eclipse.jst.j2ee.application.test.ApplicationFactoryTest)  Time elapsed: 0 s
23:26:13 test_createConnectorModule(org.eclipse.jst.j2ee.application.test.ApplicationFactoryTest)  Time elapsed: 0 s
23:26:13 test_createWebModule(org.eclipse.jst.j2ee.application.test.ApplicationFactoryTest)  Time elapsed: 0 s
23:26:13 test_createJavaClientModule(org.eclipse.jst.j2ee.application.test.ApplicationFactoryTest)  Time elapsed: 0 s
23:26:13 test_createModule(org.eclipse.jst.j2ee.application.test.ApplicationFactoryTest)  Time elapsed: 0.001 s
23:26:13 test_getVersionID(org.eclipse.jst.j2ee.application.test.ApplicationTest)  Time elapsed: 0.001 s
23:26:13 test_getJ2EEVersionID(org.eclipse.jst.j2ee.application.test.ApplicationTest)  Time elapsed: 0 s
23:26:13 test_getSecurityRoleNamed(org.eclipse.jst.j2ee.application.test.ApplicationTest)  Time elapsed: 0.001 s
23:26:13 test_getModuleHavingAltDD(org.eclipse.jst.j2ee.application.test.ApplicationTest)  Time elapsed: 0 s
23:26:13 test_containsSecurityRole(org.eclipse.jst.j2ee.application.test.ApplicationTest)  Time elapsed: 0 s
23:26:13 test_getModule_2(org.eclipse.jst.j2ee.application.test.ApplicationTest)  Time elapsed: 0 s
23:26:13 test_getFirstModule(org.eclipse.jst.j2ee.application.test.ApplicationTest)  Time elapsed: 0 s
23:26:13 test_getVersionID(org.eclipse.jst.j2ee.client.test.ApplicationClientTest)  Time elapsed: 0.012 s
23:26:13 test_getJ2EEVersionID(org.eclipse.jst.j2ee.client.test.ApplicationClientTest)  Time elapsed: 0.014 s
23:26:13 test_getCallbackHandlerClassName(org.eclipse.jst.j2ee.client.test.ApplicationClientTest)  Time elapsed: 0 s
23:26:13 test_setCallbackHandlerClassName(org.eclipse.jst.j2ee.client.test.ApplicationClientTest)  Time elapsed: 0 s
23:26:13 test_ClientFactory(org.eclipse.jst.j2ee.client.test.ClientFactoryTest)  Time elapsed: 0 s
23:26:13 test_createApplicationClient(org.eclipse.jst.j2ee.client.test.ClientFactoryTest)  Time elapsed: 0 s
23:26:13 test_createCompatibilityDescriptionGroup(org.eclipse.jst.j2ee.common.test.CommonFactoryTest)  Time elapsed: 0 s
23:26:13 test_createUseCallerIdentity(org.eclipse.jst.j2ee.common.test.CommonFactoryTest)  Time elapsed: 0 s
23:26:13 test_createDescriptionGroup(org.eclipse.jst.j2ee.common.test.CommonFactoryTest)  Time elapsed: 0 s
23:26:13 test_createIconType(org.eclipse.jst.j2ee.common.test.CommonFactoryTest)  Time elapsed: 0 s
23:26:13 test_createResourceRef(org.eclipse.jst.j2ee.common.test.CommonFactoryTest)  Time elapsed: 0 s
23:26:13 test_createDisplayName(org.eclipse.jst.j2ee.common.test.CommonFactoryTest)  Time elapsed: 0 s
23:26:13 test_createIdentity(org.eclipse.jst.j2ee.common.test.CommonFactoryTest)  Time elapsed: 0 s
23:26:13 test_createSecurityIdentity(org.eclipse.jst.j2ee.common.test.CommonFactoryTest)  Time elapsed: 0 s
23:26:13 test_createResourceEnvRef(org.eclipse.jst.j2ee.common.test.CommonFactoryTest)  Time elapsed: 0 s
23:26:13 test_createDescription(org.eclipse.jst.j2ee.common.test.CommonFactoryTest)  Time elapsed: 0 s
23:26:13 test_createQName(org.eclipse.jst.j2ee.common.test.CommonFactoryTest)  Time elapsed: 0 s
23:26:13 test_CommonFactory(org.eclipse.jst.j2ee.common.test.CommonFactoryTest)  Time elapsed: 0 s
23:26:13 test_createParamValue(org.eclipse.jst.j2ee.common.test.CommonFactoryTest)  Time elapsed: 0 s
23:26:13 test_createEjbRef(org.eclipse.jst.j2ee.common.test.CommonFactoryTest)  Time elapsed: 0 s
23:26:13 test_createListener(org.eclipse.jst.j2ee.common.test.CommonFactoryTest)  Time elapsed: 0 s
23:26:13 test_createMessageDestination(org.eclipse.jst.j2ee.common.test.CommonFactoryTest)  Time elapsed: 0 s
23:26:13 test_createEnvEntry(org.eclipse.jst.j2ee.common.test.CommonFactoryTest)  Time elapsed: 0 s
23:26:13 test_createSecurityRole(org.eclipse.jst.j2ee.common.test.CommonFactoryTest)  Time elapsed: 0 s
23:26:13 test_createMessageDestinationRef(org.eclipse.jst.j2ee.common.test.CommonFactoryTest)  Time elapsed: 0 s
23:26:13 test_createEJBLocalRef(org.eclipse.jst.j2ee.common.test.CommonFactoryTest)  Time elapsed: 0 s
23:26:13 test_createSecurityRoleRef(org.eclipse.jst.j2ee.common.test.CommonFactoryTest)  Time elapsed: 0 s
23:26:13 test_createRunAsSpecifiedIdentity(org.eclipse.jst.j2ee.common.test.CommonFactoryTest)  Time elapsed: 0 s
23:26:13 test_isLinked(org.eclipse.jst.j2ee.common.test.EjbRefTest)  Time elapsed: 0 s
23:26:13 test_EjbRef(org.eclipse.jst.j2ee.common.test.EjbRefTest)  Time elapsed: 0 s
23:26:13 test_isEquivalent(org.eclipse.jst.j2ee.common.test.EjbRefTest)  Time elapsed: 0 s
23:26:13 test_isLocal(org.eclipse.jst.j2ee.common.test.EjbRefTest)  Time elapsed: 0 s
23:26:13 test_getLinkedEjb(org.eclipse.jst.j2ee.common.test.EjbRefTest)  Time elapsed: 0 s
23:26:13 test_setListenerClassName(org.eclipse.jst.j2ee.common.test.ListenerTest)  Time elapsed: 0 s
23:26:13 test_getListenerClassName(org.eclipse.jst.j2ee.common.test.ListenerTest)  Time elapsed: 0 s
23:26:13 test_setValues(org.eclipse.jst.j2ee.common.test.QNameTest)  Time elapsed: 0 s
23:26:13 test_getMethodPermissionMethodElements(org.eclipse.jst.j2ee.ejb.test.AssemblyDescriptorTest)  Time elapsed: 0.496 s
23:26:13 test_getMethodTransactionMethodElements(org.eclipse.jst.j2ee.ejb.test.AssemblyDescriptorTest)  Time elapsed: 0.274 s
23:26:13 test_getSecurityRoleNamed(org.eclipse.jst.j2ee.ejb.test.AssemblyDescriptorTest)  Time elapsed: 0.272 s
23:26:13 test_renameSecurityRole(org.eclipse.jst.j2ee.ejb.test.AssemblyDescriptorTest)  Time elapsed: 0.273 s
23:26:13 test_removeData(org.eclipse.jst.j2ee.ejb.test.AssemblyDescriptorTest)  Time elapsed: 0.287 s
23:26:13 test_getSetterName(org.eclipse.jst.j2ee.ejb.test.CMPAttributeTest)  Time elapsed: 0 s
23:26:13 test_getType(org.eclipse.jst.j2ee.ejb.test.CMPAttributeTest)  Time elapsed: 0 s
23:26:13 test_getOriginatingType(org.eclipse.jst.j2ee.ejb.test.CMPAttributeTest)  Time elapsed: 0 s
23:26:13 test_setDerived(org.eclipse.jst.j2ee.ejb.test.CMPAttributeTest)  Time elapsed: 0 s
23:26:13 test_setOriginatingType(org.eclipse.jst.j2ee.ejb.test.CMPAttributeTest)  Time elapsed: 0 s
23:26:13 test_isCMRField(org.eclipse.jst.j2ee.ejb.test.CMPAttributeTest)  Time elapsed: 0 s
23:26:13 test_getGetterName(org.eclipse.jst.j2ee.ejb.test.CMPAttributeTest)  Time elapsed: 0 s
23:26:13 test_isDerived(org.eclipse.jst.j2ee.ejb.test.CMPAttributeTest)  Time elapsed: 0 s
23:26:13 test_isKey(org.eclipse.jst.j2ee.ejb.test.CMPAttributeTest)  Time elapsed: 0 s
23:26:13 test_isPrimKeyField(org.eclipse.jst.j2ee.ejb.test.CMPAttributeTest)  Time elapsed: 0 s
23:26:13 test_getRole(org.eclipse.jst.j2ee.ejb.test.CMRFieldTest)  Time elapsed: 0 s
23:26:13 test_setCollectionTypeName(org.eclipse.jst.j2ee.ejb.test.CMRFieldTest)  Time elapsed: 0 s
23:26:13 test_setCollectionType(org.eclipse.jst.j2ee.ejb.test.CMRFieldTest)  Time elapsed: 0 s
23:26:13 test_getCollectionType(org.eclipse.jst.j2ee.ejb.test.CMRFieldTest)  Time elapsed: 0 s
23:26:13 test_setRole(org.eclipse.jst.j2ee.ejb.test.CMRFieldTest)  Time elapsed: 0 s
23:26:13 test_getCollectionTypeName(org.eclipse.jst.j2ee.ejb.test.CMRFieldTest)  Time elapsed: 0.001 s
23:26:13 test_isUnknownPrimaryKey(org.eclipse.jst.j2ee.ejb.test.ContainerManagedEntityTest)  Time elapsed: 0 s
23:26:13 test_addPersistentAttribute(org.eclipse.jst.j2ee.ejb.test.ContainerManagedEntityTest)  Time elapsed: 0 s
23:26:13 test_addKeyAttributeName(org.eclipse.jst.j2ee.ejb.test.ContainerManagedEntityTest)  Time elapsed: 0 s
23:26:13 test_getKeyAttribute(org.eclipse.jst.j2ee.ejb.test.ContainerManagedEntityTest)  Time elapsed: 0 s
23:26:13 test_isContainerManagedEntity(org.eclipse.jst.j2ee.ejb.test.ContainerManagedEntityTest)  Time elapsed: 0 s
23:26:13 test_getPrimaryKeyAttribute(org.eclipse.jst.j2ee.ejb.test.ContainerManagedEntityTest)  Time elapsed: 0 s
23:26:13 test_isVersion1_X(org.eclipse.jst.j2ee.ejb.test.ContainerManagedEntityTest)  Time elapsed: 0 s
23:26:13 test_isVersion2_X(org.eclipse.jst.j2ee.ejb.test.ContainerManagedEntityTest)  Time elapsed: 0 s
23:26:13 test_removePersistentAttribute_2(org.eclipse.jst.j2ee.ejb.test.ContainerManagedEntityTest)  Time elapsed: 0 s
23:26:13 test_listPersistentFieldNames(org.eclipse.jst.j2ee.ejb.test.ContainerManagedEntityTest)  Time elapsed: 0 s
23:26:13 test_isKeyAttribute(org.eclipse.jst.j2ee.ejb.test.ContainerManagedEntityTest)  Time elapsed: 0 s
23:26:13 test_getCMPVersionID(org.eclipse.jst.j2ee.ejb.test.ContainerManagedEntityTest)  Time elapsed: 0 s
23:26:13 test_setPrimKeyField(org.eclipse.jst.j2ee.ejb.test.ContainerManagedEntityTest)  Time elapsed: 0 s
23:26:13 test_addPersistentAttributeName(org.eclipse.jst.j2ee.ejb.test.ContainerManagedEntityTest)  Time elapsed: 0 s
23:26:13 test_removePersistentAttribute(org.eclipse.jst.j2ee.ejb.test.ContainerManagedEntityTest)  Time elapsed: 0 s
23:26:13 test_createActivationConfig(org.eclipse.jst.j2ee.ejb.test.EjbFactoryTest)  Time elapsed: 0 s
23:26:13 test_createExcludeList(org.eclipse.jst.j2ee.ejb.test.EjbFactoryTest)  Time elapsed: 0 s
23:26:13 test_createEJBRelationshipRole(org.eclipse.jst.j2ee.ejb.test.EjbFactoryTest)  Time elapsed: 0 s
23:26:13 test_createContainerManagedEntity(org.eclipse.jst.j2ee.ejb.test.EjbFactoryTest)  Time elapsed: 0 s
23:26:13 test_createMessageDrivenDestination(org.eclipse.jst.j2ee.ejb.test.EjbFactoryTest)  Time elapsed: 0 s
23:26:13 test_createMethodElement_2(org.eclipse.jst.j2ee.ejb.test.EjbFactoryTest)  Time elapsed: 0 s
23:26:13 test_createCMPAttribute(org.eclipse.jst.j2ee.ejb.test.EjbFactoryTest)  Time elapsed: 0 s
23:26:13 test_createSession(org.eclipse.jst.j2ee.ejb.test.EjbFactoryTest)  Time elapsed: 0 s
23:26:13 test_createMethodElementFrom(org.eclipse.jst.j2ee.ejb.test.EjbFactoryTest)  Time elapsed: 0 s
23:26:13 test_createEJBRelation(org.eclipse.jst.j2ee.ejb.test.EjbFactoryTest)  Time elapsed: 0 s
23:26:13 test_createMethodElementFrom_2(org.eclipse.jst.j2ee.ejb.test.EjbFactoryTest)  Time elapsed: 0.001 s
23:26:13 test_EjbFactory(org.eclipse.jst.j2ee.ejb.test.EjbFactoryTest)  Time elapsed: 0 s
23:26:13 test_createQuery(org.eclipse.jst.j2ee.ejb.test.EjbFactoryTest)  Time elapsed: 0 s
23:26:13 test_createQueryMethod(org.eclipse.jst.j2ee.ejb.test.EjbFactoryTest)  Time elapsed: 0 s
23:26:13 test_createActivationConfigProperty(org.eclipse.jst.j2ee.ejb.test.EjbFactoryTest)  Time elapsed: 0 s
23:26:13 test_createEJBJar(org.eclipse.jst.j2ee.ejb.test.EjbFactoryTest)  Time elapsed: 0 s
23:26:13 test_createMethodPermission(org.eclipse.jst.j2ee.ejb.test.EjbFactoryTest)  Time elapsed: 0 s
23:26:13 test_createEntity(org.eclipse.jst.j2ee.ejb.test.EjbFactoryTest)  Time elapsed: 0 s
23:26:13 test_createRelationships(org.eclipse.jst.j2ee.ejb.test.EjbFactoryTest)  Time elapsed: 0 s
23:26:13 test_createEJBMethodCategory(org.eclipse.jst.j2ee.ejb.test.EjbFactoryTest)  Time elapsed: 0 s
23:26:13 test_createMethodTransaction(org.eclipse.jst.j2ee.ejb.test.EjbFactoryTest)  Time elapsed: 0 s
23:26:13 test_createMethodElement(org.eclipse.jst.j2ee.ejb.test.EjbFactoryTest)  Time elapsed: 0 s
23:26:13 test_createAssemblyDescriptor(org.eclipse.jst.j2ee.ejb.test.EjbFactoryTest)  Time elapsed: 0 s
23:26:13 test_createRoleSource(org.eclipse.jst.j2ee.ejb.test.EjbFactoryTest)  Time elapsed: 0 s
23:26:13 test_createCMRField(org.eclipse.jst.j2ee.ejb.test.EjbFactoryTest)  Time elapsed: 0 s
23:26:13 test_createMessageDriven(org.eclipse.jst.j2ee.ejb.test.EjbFactoryTest)  Time elapsed: 0 s
23:26:13 test_isNavigable(org.eclipse.jst.j2ee.ejb.test.EJBRelationshipRoleTest)  Time elapsed: 0 s
23:26:13 test_getLogicalName(org.eclipse.jst.j2ee.ejb.test.EJBRelationshipRoleTest)  Time elapsed: 0.001 s
23:26:13 test_getName(org.eclipse.jst.j2ee.ejb.test.EJBRelationshipRoleTest)  Time elapsed: 0 s
23:26:13 test_isForward(org.eclipse.jst.j2ee.ejb.test.EJBRelationshipRoleTest)  Time elapsed: 0 s
23:26:13 test_isMany(org.eclipse.jst.j2ee.ejb.test.EJBRelationshipRoleTest)  Time elapsed: 0 s
23:26:13 test_setKey(org.eclipse.jst.j2ee.ejb.test.EJBRelationshipRoleTest)  Time elapsed: 0 s
23:26:13 test_EJBRelationshipRole(org.eclipse.jst.j2ee.ejb.test.EJBRelationshipRoleTest)  Time elapsed: 0 s
23:26:13 test_setFoward(org.eclipse.jst.j2ee.ejb.test.EJBRelationshipRoleTest)  Time elapsed: 0 s
23:26:13 test_setName(org.eclipse.jst.j2ee.ejb.test.EJBRelationshipRoleTest)  Time elapsed: 0 s
23:26:13 test_getSourceEntity(org.eclipse.jst.j2ee.ejb.test.EJBRelationshipRoleTest)  Time elapsed: 0 s
23:26:13 test_setRequired(org.eclipse.jst.j2ee.ejb.test.EJBRelationshipRoleTest)  Time elapsed: 0 s
23:26:13 test_isKey(org.eclipse.jst.j2ee.ejb.test.EJBRelationshipRoleTest)  Time elapsed: 0 s
23:26:13 test_getOpposite(org.eclipse.jst.j2ee.ejb.test.EJBRelationshipRoleTest)  Time elapsed: 0 s
23:26:13 test_containsRelationshipRole(org.eclipse.jst.j2ee.ejb.test.EJBRelationTest)  Time elapsed: 0.001 s
23:26:13 test_getSecondRole(org.eclipse.jst.j2ee.ejb.test.EJBRelationTest)  Time elapsed: 0 s
23:26:13 test_getFirstRole(org.eclipse.jst.j2ee.ejb.test.EJBRelationTest)  Time elapsed: 0 s
23:26:13 test_getOppositeRole(org.eclipse.jst.j2ee.ejb.test.EJBRelationTest)  Time elapsed: 0 s
23:26:13 test_EJBRelation(org.eclipse.jst.j2ee.ejb.test.EJBRelationTest)  Time elapsed: 0 s
23:26:13 test_setFoward(org.eclipse.jst.j2ee.ejb.test.EJBRelationTest)  Time elapsed: 0 s
23:26:13 test_setPrimaryKeyName(org.eclipse.jst.j2ee.ejb.test.EntityTest)  Time elapsed: 0.281 s
23:26:13 test_getPrimaryKeyName(org.eclipse.jst.j2ee.ejb.test.EntityTest)  Time elapsed: 0.339 s
23:26:13 test_initializeFromSignature(org.eclipse.jst.j2ee.ejb.test.MethodElementTest)  Time elapsed: 0 s
23:26:13 test_applyZeroParams(org.eclipse.jst.j2ee.ejb.test.MethodElementTest)  Time elapsed: 0 s
23:26:13 test_equalSignature(org.eclipse.jst.j2ee.ejb.test.MethodElementTest)  Time elapsed: 0.001 s
23:26:13 test_isRemote(org.eclipse.jst.j2ee.ejb.test.MethodElementTest)  Time elapsed: 0 s
23:26:13 test_getTypeJavaClass(org.eclipse.jst.j2ee.ejb.test.MethodElementTest)  Time elapsed: 0.266 s
23:26:13 test_isHome(org.eclipse.jst.j2ee.ejb.test.MethodElementTest)  Time elapsed: 0 s
23:26:13 test_getSignature(org.eclipse.jst.j2ee.ejb.test.MethodElementTest)  Time elapsed: 0 s
23:26:13 test_nameAndParamsEquals(org.eclipse.jst.j2ee.ejb.test.MethodElementTest)  Time elapsed: 0 s
23:26:13 test_isLocalHome(org.eclipse.jst.j2ee.ejb.test.MethodElementTest)  Time elapsed: 0 s
23:26:13 test_isUnspecified(org.eclipse.jst.j2ee.ejb.test.MethodElementTest)  Time elapsed: 0 s
23:26:13 test_isEquivalent(org.eclipse.jst.j2ee.ejb.test.MethodElementTest)  Time elapsed: 0.001 s
23:26:13 test_MethodElement(org.eclipse.jst.j2ee.ejb.test.MethodElementTest)  Time elapsed: 0 s
23:26:13 test_hasMethodParams(org.eclipse.jst.j2ee.ejb.test.MethodElementTest)  Time elapsed: 0 s
23:26:13 test_isLocal(org.eclipse.jst.j2ee.ejb.test.MethodElementTest)  Time elapsed: 0 s
23:26:13 test_isValid(org.eclipse.jst.j2ee.ejb.test.MethodElementTest)  Time elapsed: 0 s
23:26:13 test_getMethodParams(org.eclipse.jst.j2ee.ejb.test.MethodElementTest)  Time elapsed: 0 s
23:26:13 test_isDefault(org.eclipse.jst.j2ee.ejb.test.MethodElementTest)  Time elapsed: 0 s
23:26:13 test_addMethodParams(org.eclipse.jst.j2ee.ejb.test.MethodElementTest)  Time elapsed: 0 s
23:26:13 test_removeMethodParams(org.eclipse.jst.j2ee.ejb.test.MethodElementTest)  Time elapsed: 0 s
23:26:13 testEJBJarPopulation(org.eclipse.jst.j2ee.ejb.test.MethodElementTest)  Time elapsed: 0 s
23:26:13 test14EJBJarPopulation(org.eclipse.jst.j2ee.ejb.test.MethodElementTest)  Time elapsed: 0 s
23:26:13 test_MethodPermission(org.eclipse.jst.j2ee.ejb.test.MethodPermissionTest)  Time elapsed: 0 s
23:26:13 test_isEquivalent(org.eclipse.jst.j2ee.ejb.test.MethodPermissionTest)  Time elapsed: 0 s
23:26:13 test_hasSecurityRole(org.eclipse.jst.j2ee.ejb.test.MethodPermissionTest)  Time elapsed: 0 s
23:26:13 test_getSecurityRole(org.eclipse.jst.j2ee.ejb.test.MethodPermissionTest)  Time elapsed: 0 s
23:26:13 test_hasSecurityRole_2(org.eclipse.jst.j2ee.ejb.test.MethodPermissionTest)  Time elapsed: 0 s
23:26:13 test_getClientTypeJavaClasses(org.eclipse.jst.j2ee.ejb.test.QueryMethodTest)  Time elapsed: 0.278 s
23:26:13 test_isRemoteResultMapping(org.eclipse.jst.j2ee.ejb.test.QueryTest)  Time elapsed: 0 s
23:26:13 test_isLocalResultMapping(org.eclipse.jst.j2ee.ejb.test.QueryTest)  Time elapsed: 0 s
23:26:13 test_Query(org.eclipse.jst.j2ee.ejb.test.QueryTest)  Time elapsed: 0 s
23:26:13 test_hasServiceEndpoint(org.eclipse.jst.j2ee.ejb.test.SessionTest)  Time elapsed: 0 s
23:26:13 test_getServiceEndpointName(org.eclipse.jst.j2ee.ejb.test.SessionTest)  Time elapsed: 0 s
23:26:13 test_setServiceEndpointName(org.eclipse.jst.j2ee.ejb.test.SessionTest)  Time elapsed: 0 s
23:26:13 test_getVersionID(org.eclipse.jst.j2ee.jca.test.ConnectorTest)  Time elapsed: 0.003 s
23:26:13 test_createResourceAdapter(org.eclipse.jst.j2ee.jca.test.JcaFactoryTest)  Time elapsed: 0 s
23:26:13 test_createInboundResourceAdapter(org.eclipse.jst.j2ee.jca.test.JcaFactoryTest)  Time elapsed: 0 s
23:26:13 test_createActivationSpec(org.eclipse.jst.j2ee.jca.test.JcaFactoryTest)  Time elapsed: 0 s
23:26:13 test_getJcaPackage(org.eclipse.jst.j2ee.jca.test.JcaFactoryTest)  Time elapsed: 0 s
23:26:13 test_createAuthenticationMechanism(org.eclipse.jst.j2ee.jca.test.JcaFactoryTest)  Time elapsed: 0 s
23:26:13 test_createMessageAdapter(org.eclipse.jst.j2ee.jca.test.JcaFactoryTest)  Time elapsed: 0 s
23:26:13 test_createRequiredConfigPropertyType(org.eclipse.jst.j2ee.jca.test.JcaFactoryTest)  Time elapsed: 0 s
23:26:13 test_createConfigProperty(org.eclipse.jst.j2ee.jca.test.JcaFactoryTest)  Time elapsed: 0 s
23:26:13 test_createConnectionDefinition(org.eclipse.jst.j2ee.jca.test.JcaFactoryTest)  Time elapsed: 0 s
23:26:13 test_createAdminObject(org.eclipse.jst.j2ee.jca.test.JcaFactoryTest)  Time elapsed: 0 s
23:26:13 test_JcaFactory(org.eclipse.jst.j2ee.jca.test.JcaFactoryTest)  Time elapsed: 0 s
23:26:13 test_createConnector(org.eclipse.jst.j2ee.jca.test.JcaFactoryTest)  Time elapsed: 0 s
23:26:13 test_createMessageListener(org.eclipse.jst.j2ee.jca.test.JcaFactoryTest)  Time elapsed: 0.001 s
23:26:13 test_createSecurityPermission(org.eclipse.jst.j2ee.jca.test.JcaFactoryTest)  Time elapsed: 0 s
23:26:13 test_createOutboundResourceAdapter(org.eclipse.jst.j2ee.jca.test.JcaFactoryTest)  Time elapsed: 0 s
23:26:13 test_createLicense(org.eclipse.jst.j2ee.jca.test.JcaFactoryTest)  Time elapsed: 0 s
23:26:13 test_createResourceAdapter(org.eclipse.jst.j2ee.jca.test.JcaFactoryTest)  Time elapsed: 0 s
23:26:13 test_createInboundResourceAdapter(org.eclipse.jst.j2ee.jca.test.JcaFactoryTest)  Time elapsed: 0 s
23:26:13 test_createActivationSpec(org.eclipse.jst.j2ee.jca.test.JcaFactoryTest)  Time elapsed: 0 s
23:26:13 test_getJcaPackage(org.eclipse.jst.j2ee.jca.test.JcaFactoryTest)  Time elapsed: 0 s
23:26:13 test_createAuthenticationMechanism(org.eclipse.jst.j2ee.jca.test.JcaFactoryTest)  Time elapsed: 0 s
23:26:13 test_createMessageAdapter(org.eclipse.jst.j2ee.jca.test.JcaFactoryTest)  Time elapsed: 0 s
23:26:13 test_createRequiredConfigPropertyType(org.eclipse.jst.j2ee.jca.test.JcaFactoryTest)  Time elapsed: 0 s
23:26:13 test_createConfigProperty(org.eclipse.jst.j2ee.jca.test.JcaFactoryTest)  Time elapsed: 0 s
23:26:13 test_createConnectionDefinition(org.eclipse.jst.j2ee.jca.test.JcaFactoryTest)  Time elapsed: 0 s
23:26:13 test_createAdminObject(org.eclipse.jst.j2ee.jca.test.JcaFactoryTest)  Time elapsed: 0 s
23:26:13 test_JcaFactory(org.eclipse.jst.j2ee.jca.test.JcaFactoryTest)  Time elapsed: 0 s
23:26:13 test_createConnector(org.eclipse.jst.j2ee.jca.test.JcaFactoryTest)  Time elapsed: 0 s
23:26:13 test_createMessageListener(org.eclipse.jst.j2ee.jca.test.JcaFactoryTest)  Time elapsed: 0 s
23:26:13 test_createSecurityPermission(org.eclipse.jst.j2ee.jca.test.JcaFactoryTest)  Time elapsed: 0 s
23:26:13 test_createOutboundResourceAdapter(org.eclipse.jst.j2ee.jca.test.JcaFactoryTest)  Time elapsed: 0 s
23:26:13 test_createLicense(org.eclipse.jst.j2ee.jca.test.JcaFactoryTest)  Time elapsed: 0 s
23:26:13 test_createFormLoginConfig(org.eclipse.jst.j2ee.webapplication.test.WebapplicationFactoryTest)  Time elapsed: 0 s
23:26:13 test_createErrorCodeErrorPage(org.eclipse.jst.j2ee.webapplication.test.WebapplicationFactoryTest)  Time elapsed: 0 s
23:26:13 test_createMimeMapping(org.eclipse.jst.j2ee.webapplication.test.WebapplicationFactoryTest)  Time elapsed: 0 s
23:26:13 test_createExceptionTypeErrorPage(org.eclipse.jst.j2ee.webapplication.test.WebapplicationFactoryTest)  Time elapsed: 0 s
23:26:13 test_createTagLibRef(org.eclipse.jst.j2ee.webapplication.test.WebapplicationFactoryTest)  Time elapsed: 0 s
23:26:13 test_createLocalEncodingMapping(org.eclipse.jst.j2ee.webapplication.test.WebapplicationFactoryTest)  Time elapsed: 0 s
23:26:13 test_createServlet(org.eclipse.jst.j2ee.webapplication.test.WebapplicationFactoryTest)  Time elapsed: 0 s
23:26:13 test_createJSPType(org.eclipse.jst.j2ee.webapplication.test.WebapplicationFactoryTest)  Time elapsed: 0.001 s
23:26:13 test_createSessionConfig(org.eclipse.jst.j2ee.webapplication.test.WebapplicationFactoryTest)  Time elapsed: 0 s
23:26:13 test_createServletMapping(org.eclipse.jst.j2ee.webapplication.test.WebapplicationFactoryTest)  Time elapsed: 0 s
23:26:13 test_createURLPatternType(org.eclipse.jst.j2ee.webapplication.test.WebapplicationFactoryTest)  Time elapsed: 0 s
23:26:13 test_createLocalEncodingMappingList(org.eclipse.jst.j2ee.webapplication.test.WebapplicationFactoryTest)  Time elapsed: 0 s
23:26:13 test_createFilterMapping(org.eclipse.jst.j2ee.webapplication.test.WebapplicationFactoryTest)  Time elapsed: 0 s
23:26:13 test_createAuthConstraint(org.eclipse.jst.j2ee.webapplication.test.WebapplicationFactoryTest)  Time elapsed: 0 s
23:26:13 test_createUserDataConstraint(org.eclipse.jst.j2ee.webapplication.test.WebapplicationFactoryTest)  Time elapsed: 0 s
23:26:13 test_createFilter(org.eclipse.jst.j2ee.webapplication.test.WebapplicationFactoryTest)  Time elapsed: 0 s
23:26:13 test_createRoleNameType(org.eclipse.jst.j2ee.webapplication.test.WebapplicationFactoryTest)  Time elapsed: 0.002 s
23:26:13 test_createWelcomeFileList(org.eclipse.jst.j2ee.webapplication.test.WebapplicationFactoryTest)  Time elapsed: 0 s
23:26:13 test_createWebApp(org.eclipse.jst.j2ee.webapplication.test.WebapplicationFactoryTest)  Time elapsed: 0 s
23:26:13 test_createInitParam(org.eclipse.jst.j2ee.webapplication.test.WebapplicationFactoryTest)  Time elapsed: 0 s
23:26:13 test_createWelcomeFile(org.eclipse.jst.j2ee.webapplication.test.WebapplicationFactoryTest)  Time elapsed: 0 s
23:26:13 test_getWebapplicationPackage(org.eclipse.jst.j2ee.webapplication.test.WebapplicationFactoryTest)  Time elapsed: 0 s
23:26:13 test_createContextParam(org.eclipse.jst.j2ee.webapplication.test.WebapplicationFactoryTest)  Time elapsed: 0 s
23:26:13 test_createSecurityConstraint(org.eclipse.jst.j2ee.webapplication.test.WebapplicationFactoryTest)  Time elapsed: 0 s
23:26:13 test_createHTTPMethodType(org.eclipse.jst.j2ee.webapplication.test.WebapplicationFactoryTest)  Time elapsed: 0 s
23:26:13 test_createWebResourceCollection(org.eclipse.jst.j2ee.webapplication.test.WebapplicationFactoryTest)  Time elapsed: 0 s
23:26:13 test_createErrorPage(org.eclipse.jst.j2ee.webapplication.test.WebapplicationFactoryTest)  Time elapsed: 0 s
23:26:13 test_createServletType(org.eclipse.jst.j2ee.webapplication.test.WebapplicationFactoryTest)  Time elapsed: 0 s
23:26:13 test_createLoginConfig(org.eclipse.jst.j2ee.webapplication.test.WebapplicationFactoryTest)  Time elapsed: 0 s
23:26:13 test_createSOAPHeader(org.eclipse.jst.j2ee.webservice.wscommon.test.WscommonFactoryTest)  Time elapsed: 0.001 s
23:26:13 test_createDisplayNameType(org.eclipse.jst.j2ee.webservice.wscommon.test.WscommonFactoryTest)  Time elapsed: 0 s
23:26:13 test_getWscommonPackage(org.eclipse.jst.j2ee.webservice.wscommon.test.WscommonFactoryTest)  Time elapsed: 0 s
23:26:13 test_createDescriptionType(org.eclipse.jst.j2ee.webservice.wscommon.test.WscommonFactoryTest)  Time elapsed: 0 s
23:26:13 test_createPortName(org.eclipse.jst.j2ee.webservice.wscommon.test.WscommonFactoryTest)  Time elapsed: 0 s
23:26:13 test_createSOAPRole(org.eclipse.jst.j2ee.webservice.wscommon.test.WscommonFactoryTest)  Time elapsed: 0 s
23:26:13 test_createInitParam(org.eclipse.jst.j2ee.webservice.wscommon.test.WscommonFactoryTest)  Time elapsed: 0 s
23:26:13 test_createEJBLink(org.eclipse.jst.j2ee.webservice.wsdd.test.WsddFactoryTest)  Time elapsed: 0 s
23:26:13 test_createWSDLPort(org.eclipse.jst.j2ee.webservice.wsdd.test.WsddFactoryTest)  Time elapsed: 0 s
23:26:13 test_createPortComponent(org.eclipse.jst.j2ee.webservice.wsdd.test.WsddFactoryTest)  Time elapsed: 0 s
23:26:13 test_createServiceImplBean(org.eclipse.jst.j2ee.webservice.wsdd.test.WsddFactoryTest)  Time elapsed: 0 s
23:26:13 test_createWebServices(org.eclipse.jst.j2ee.webservice.wsdd.test.WsddFactoryTest)  Time elapsed: 0 s
23:26:13 test_createBeanLink(org.eclipse.jst.j2ee.webservice.wsdd.test.WsddFactoryTest)  Time elapsed: 0 s
23:26:13 test_createWebServiceDescription(org.eclipse.jst.j2ee.webservice.wsdd.test.WsddFactoryTest)  Time elapsed: 0 s
23:26:13 test_createHandler(org.eclipse.jst.j2ee.webservice.wsdd.test.WsddFactoryTest)  Time elapsed: 0 s
23:26:13 test_createServletLink(org.eclipse.jst.j2ee.webservice.wsdd.test.WsddFactoryTest)  Time elapsed: 0 s
23:26:13 Running org.eclipse.jst.j2ee.core.api.test.AllCoreAPITests
23:26:13 Tests run: 243, Failures: 0, Errors: 0, Skipped: 0, Time elapsed: 2.952 s - in org.eclipse.jst.j2ee.core.api.test.AllCoreAPITests
23:26:16 test_createEjbModule(org.eclipse.jst.j2ee.application.test.ApplicationFactoryTest)  Time elapsed: 0 s
23:26:16 test_createApplication(org.eclipse.jst.j2ee.application.test.ApplicationFactoryTest)  Time elapsed: 0 s
23:26:16 test_createConnectorModule(org.eclipse.jst.j2ee.application.test.ApplicationFactoryTest)  Time elapsed: 0 s
23:26:16 test_createWebModule(org.eclipse.jst.j2ee.application.test.ApplicationFactoryTest)  Time elapsed: 0 s
23:26:16 test_createJavaClientModule(org.eclipse.jst.j2ee.application.test.ApplicationFactoryTest)  Time elapsed: 0 s
23:26:16 test_createModule(org.eclipse.jst.j2ee.application.test.ApplicationFactoryTest)  Time elapsed: 0 s
23:26:16 test_getVersionID(org.eclipse.jst.j2ee.application.test.ApplicationTest)  Time elapsed: 0.001 s
23:26:16 test_getJ2EEVersionID(org.eclipse.jst.j2ee.application.test.ApplicationTest)  Time elapsed: 0.001 s
23:26:16 test_getSecurityRoleNamed(org.eclipse.jst.j2ee.application.test.ApplicationTest)  Time elapsed: 0 s
23:26:16 test_getModuleHavingAltDD(org.eclipse.jst.j2ee.application.test.ApplicationTest)  Time elapsed: 0 s
23:26:16 test_containsSecurityRole(org.eclipse.jst.j2ee.application.test.ApplicationTest)  Time elapsed: 0 s
23:26:16 test_getModule_2(org.eclipse.jst.j2ee.application.test.ApplicationTest)  Time elapsed: 0.001 s
23:26:16 test_getFirstModule(org.eclipse.jst.j2ee.application.test.ApplicationTest)  Time elapsed: 0 s
23:26:16 test_getVersionID(org.eclipse.jst.j2ee.client.test.ApplicationClientTest)  Time elapsed: 0.017 s
23:26:16 test_getJ2EEVersionID(org.eclipse.jst.j2ee.client.test.ApplicationClientTest)  Time elapsed: 0.016 s
23:26:16 test_getCallbackHandlerClassName(org.eclipse.jst.j2ee.client.test.ApplicationClientTest)  Time elapsed: 0.001 s
23:26:16 test_setCallbackHandlerClassName(org.eclipse.jst.j2ee.client.test.ApplicationClientTest)  Time elapsed: 0 s
23:26:16 test_ClientFactory(org.eclipse.jst.j2ee.client.test.ClientFactoryTest)  Time elapsed: 0 s
23:26:16 test_createApplicationClient(org.eclipse.jst.j2ee.client.test.ClientFactoryTest)  Time elapsed: 0 s
23:26:16 test_createCompatibilityDescriptionGroup(org.eclipse.jst.j2ee.common.test.CommonFactoryTest)  Time elapsed: 0 s
23:26:16 test_createUseCallerIdentity(org.eclipse.jst.j2ee.common.test.CommonFactoryTest)  Time elapsed: 0 s
23:26:16 test_createDescriptionGroup(org.eclipse.jst.j2ee.common.test.CommonFactoryTest)  Time elapsed: 0 s
23:26:16 test_createIconType(org.eclipse.jst.j2ee.common.test.CommonFactoryTest)  Time elapsed: 0 s
23:26:16 test_createResourceRef(org.eclipse.jst.j2ee.common.test.CommonFactoryTest)  Time elapsed: 0 s
23:26:16 test_createDisplayName(org.eclipse.jst.j2ee.common.test.CommonFactoryTest)  Time elapsed: 0 s
23:26:16 test_createIdentity(org.eclipse.jst.j2ee.common.test.CommonFactoryTest)  Time elapsed: 0 s
23:26:16 test_createSecurityIdentity(org.eclipse.jst.j2ee.common.test.CommonFactoryTest)  Time elapsed: 0 s
23:26:16 test_createResourceEnvRef(org.eclipse.jst.j2ee.common.test.CommonFactoryTest)  Time elapsed: 0 s
23:26:16 test_createDescription(org.eclipse.jst.j2ee.common.test.CommonFactoryTest)  Time elapsed: 0 s
23:26:16 test_createQName(org.eclipse.jst.j2ee.common.test.CommonFactoryTest)  Time elapsed: 0 s
23:26:16 test_CommonFactory(org.eclipse.jst.j2ee.common.test.CommonFactoryTest)  Time elapsed: 0 s
23:26:16 test_createParamValue(org.eclipse.jst.j2ee.common.test.CommonFactoryTest)  Time elapsed: 0 s
23:26:16 test_createEjbRef(org.eclipse.jst.j2ee.common.test.CommonFactoryTest)  Time elapsed: 0 s
23:26:16 test_createListener(org.eclipse.jst.j2ee.common.test.CommonFactoryTest)  Time elapsed: 0 s
23:26:16 test_createMessageDestination(org.eclipse.jst.j2ee.common.test.CommonFactoryTest)  Time elapsed: 0 s
23:26:16 test_createEnvEntry(org.eclipse.jst.j2ee.common.test.CommonFactoryTest)  Time elapsed: 0 s
23:26:16 test_createSecurityRole(org.eclipse.jst.j2ee.common.test.CommonFactoryTest)  Time elapsed: 0 s
23:26:16 test_createMessageDestinationRef(org.eclipse.jst.j2ee.common.test.CommonFactoryTest)  Time elapsed: 0 s
23:26:16 test_createEJBLocalRef(org.eclipse.jst.j2ee.common.test.CommonFactoryTest)  Time elapsed: 0 s
23:26:16 test_createSecurityRoleRef(org.eclipse.jst.j2ee.common.test.CommonFactoryTest)  Time elapsed: 0 s
23:26:16 test_createRunAsSpecifiedIdentity(org.eclipse.jst.j2ee.common.test.CommonFactoryTest)  Time elapsed: 0 s
23:26:16 test_isLinked(org.eclipse.jst.j2ee.common.test.EjbRefTest)  Time elapsed: 0 s
23:26:16 test_EjbRef(org.eclipse.jst.j2ee.common.test.EjbRefTest)  Time elapsed: 0 s
23:26:16 test_isEquivalent(org.eclipse.jst.j2ee.common.test.EjbRefTest)  Time elapsed: 0.004 s
23:26:16 test_isLocal(org.eclipse.jst.j2ee.common.test.EjbRefTest)  Time elapsed: 0 s
23:26:16 test_getLinkedEjb(org.eclipse.jst.j2ee.common.test.EjbRefTest)  Time elapsed: 0 s
23:26:16 test_setListenerClassName(org.eclipse.jst.j2ee.common.test.ListenerTest)  Time elapsed: 0 s
23:26:16 test_getListenerClassName(org.eclipse.jst.j2ee.common.test.ListenerTest)  Time elapsed: 0 s
23:26:16 test_setValues(org.eclipse.jst.j2ee.common.test.QNameTest)  Time elapsed: 0 s
23:26:16 test_getMethodPermissionMethodElements(org.eclipse.jst.j2ee.ejb.test.AssemblyDescriptorTest)  Time elapsed: 0.273 s
23:26:16 test_getMethodTransactionMethodElements(org.eclipse.jst.j2ee.ejb.test.AssemblyDescriptorTest)  Time elapsed: 0.455 s
23:26:16 test_getSecurityRoleNamed(org.eclipse.jst.j2ee.ejb.test.AssemblyDescriptorTest)  Time elapsed: 0.298 s
23:26:16 test_renameSecurityRole(org.eclipse.jst.j2ee.ejb.test.AssemblyDescriptorTest)  Time elapsed: 0.297 s
23:26:16 test_removeData(org.eclipse.jst.j2ee.ejb.test.AssemblyDescriptorTest)  Time elapsed: 0.298 s
23:26:16 test_getSetterName(org.eclipse.jst.j2ee.ejb.test.CMPAttributeTest)  Time elapsed: 0 s
23:26:16 test_getType(org.eclipse.jst.j2ee.ejb.test.CMPAttributeTest)  Time elapsed: 0 s
23:26:16 test_getOriginatingType(org.eclipse.jst.j2ee.ejb.test.CMPAttributeTest)  Time elapsed: 0 s
23:26:16 test_setDerived(org.eclipse.jst.j2ee.ejb.test.CMPAttributeTest)  Time elapsed: 0 s
23:26:16 test_setOriginatingType(org.eclipse.jst.j2ee.ejb.test.CMPAttributeTest)  Time elapsed: 0 s
23:26:16 test_isCMRField(org.eclipse.jst.j2ee.ejb.test.CMPAttributeTest)  Time elapsed: 0 s
23:26:16 test_getGetterName(org.eclipse.jst.j2ee.ejb.test.CMPAttributeTest)  Time elapsed: 0 s
23:26:16 test_isDerived(org.eclipse.jst.j2ee.ejb.test.CMPAttributeTest)  Time elapsed: 0 s
23:26:16 test_isKey(org.eclipse.jst.j2ee.ejb.test.CMPAttributeTest)  Time elapsed: 0 s
23:26:16 test_isPrimKeyField(org.eclipse.jst.j2ee.ejb.test.CMPAttributeTest)  Time elapsed: 0 s
23:26:16 test_getRole(org.eclipse.jst.j2ee.ejb.test.CMRFieldTest)  Time elapsed: 0 s
23:26:16 test_setCollectionTypeName(org.eclipse.jst.j2ee.ejb.test.CMRFieldTest)  Time elapsed: 0 s
23:26:16 test_setCollectionType(org.eclipse.jst.j2ee.ejb.test.CMRFieldTest)  Time elapsed: 0 s
23:26:16 test_getCollectionType(org.eclipse.jst.j2ee.ejb.test.CMRFieldTest)  Time elapsed: 0 s
23:26:16 test_setRole(org.eclipse.jst.j2ee.ejb.test.CMRFieldTest)  Time elapsed: 0 s
23:26:16 test_getCollectionTypeName(org.eclipse.jst.j2ee.ejb.test.CMRFieldTest)  Time elapsed: 0 s
23:26:16 test_isUnknownPrimaryKey(org.eclipse.jst.j2ee.ejb.test.ContainerManagedEntityTest)  Time elapsed: 0.001 s
23:26:16 test_addPersistentAttribute(org.eclipse.jst.j2ee.ejb.test.ContainerManagedEntityTest)  Time elapsed: 0 s
23:26:16 test_addKeyAttributeName(org.eclipse.jst.j2ee.ejb.test.ContainerManagedEntityTest)  Time elapsed: 0 s
23:26:16 test_getKeyAttribute(org.eclipse.jst.j2ee.ejb.test.ContainerManagedEntityTest)  Time elapsed: 0 s
23:26:16 test_isContainerManagedEntity(org.eclipse.jst.j2ee.ejb.test.ContainerManagedEntityTest)  Time elapsed: 0 s
23:26:16 test_getPrimaryKeyAttribute(org.eclipse.jst.j2ee.ejb.test.ContainerManagedEntityTest)  Time elapsed: 0 s
23:26:16 test_isVersion1_X(org.eclipse.jst.j2ee.ejb.test.ContainerManagedEntityTest)  Time elapsed: 0 s
23:26:16 test_isVersion2_X(org.eclipse.jst.j2ee.ejb.test.ContainerManagedEntityTest)  Time elapsed: 0 s
23:26:16 test_removePersistentAttribute_2(org.eclipse.jst.j2ee.ejb.test.ContainerManagedEntityTest)  Time elapsed: 0 s
23:26:16 test_listPersistentFieldNames(org.eclipse.jst.j2ee.ejb.test.ContainerManagedEntityTest)  Time elapsed: 0 s
23:26:16 test_isKeyAttribute(org.eclipse.jst.j2ee.ejb.test.ContainerManagedEntityTest)  Time elapsed: 0 s
23:26:16 test_getCMPVersionID(org.eclipse.jst.j2ee.ejb.test.ContainerManagedEntityTest)  Time elapsed: 0 s
23:26:16 test_setPrimKeyField(org.eclipse.jst.j2ee.ejb.test.ContainerManagedEntityTest)  Time elapsed: 0 s
23:26:16 test_addPersistentAttributeName(org.eclipse.jst.j2ee.ejb.test.ContainerManagedEntityTest)  Time elapsed: 0 s
23:26:16 test_removePersistentAttribute(org.eclipse.jst.j2ee.ejb.test.ContainerManagedEntityTest)  Time elapsed: 0 s
23:26:16 test_createActivationConfig(org.eclipse.jst.j2ee.ejb.test.EjbFactoryTest)  Time elapsed: 0 s
23:26:16 test_createExcludeList(org.eclipse.jst.j2ee.ejb.test.EjbFactoryTest)  Time elapsed: 0 s
23:26:16 test_createEJBRelationshipRole(org.eclipse.jst.j2ee.ejb.test.EjbFactoryTest)  Time elapsed: 0 s
23:26:16 test_createContainerManagedEntity(org.eclipse.jst.j2ee.ejb.test.EjbFactoryTest)  Time elapsed: 0 s
23:26:16 test_createMessageDrivenDestination(org.eclipse.jst.j2ee.ejb.test.EjbFactoryTest)  Time elapsed: 0 s
23:26:16 test_createMethodElement_2(org.eclipse.jst.j2ee.ejb.test.EjbFactoryTest)  Time elapsed: 0 s
23:26:16 test_createCMPAttribute(org.eclipse.jst.j2ee.ejb.test.EjbFactoryTest)  Time elapsed: 0 s
23:26:16 test_createSession(org.eclipse.jst.j2ee.ejb.test.EjbFactoryTest)  Time elapsed: 0 s
23:26:16 test_createMethodElementFrom(org.eclipse.jst.j2ee.ejb.test.EjbFactoryTest)  Time elapsed: 0 s
23:26:16 test_createEJBRelation(org.eclipse.jst.j2ee.ejb.test.EjbFactoryTest)  Time elapsed: 0 s
23:26:16 test_createMethodElementFrom_2(org.eclipse.jst.j2ee.ejb.test.EjbFactoryTest)  Time elapsed: 0 s
23:26:16 test_EjbFactory(org.eclipse.jst.j2ee.ejb.test.EjbFactoryTest)  Time elapsed: 0 s
23:26:16 test_createQuery(org.eclipse.jst.j2ee.ejb.test.EjbFactoryTest)  Time elapsed: 0 s
23:26:16 test_createQueryMethod(org.eclipse.jst.j2ee.ejb.test.EjbFactoryTest)  Time elapsed: 0 s
23:26:16 test_createActivationConfigProperty(org.eclipse.jst.j2ee.ejb.test.EjbFactoryTest)  Time elapsed: 0 s
23:26:16 test_createEJBJar(org.eclipse.jst.j2ee.ejb.test.EjbFactoryTest)  Time elapsed: 0 s
23:26:16 test_createMethodPermission(org.eclipse.jst.j2ee.ejb.test.EjbFactoryTest)  Time elapsed: 0 s
23:26:16 test_createEntity(org.eclipse.jst.j2ee.ejb.test.EjbFactoryTest)  Time elapsed: 0 s
23:26:16 test_createRelationships(org.eclipse.jst.j2ee.ejb.test.EjbFactoryTest)  Time elapsed: 0.001 s
23:26:16 test_createEJBMethodCategory(org.eclipse.jst.j2ee.ejb.test.EjbFactoryTest)  Time elapsed: 0 s
23:26:16 test_createMethodTransaction(org.eclipse.jst.j2ee.ejb.test.EjbFactoryTest)  Time elapsed: 0 s
23:26:16 test_createMethodElement(org.eclipse.jst.j2ee.ejb.test.EjbFactoryTest)  Time elapsed: 0 s
23:26:16 test_createAssemblyDescriptor(org.eclipse.jst.j2ee.ejb.test.EjbFactoryTest)  Time elapsed: 0 s
23:26:16 test_createRoleSource(org.eclipse.jst.j2ee.ejb.test.EjbFactoryTest)  Time elapsed: 0 s
23:26:16 test_createCMRField(org.eclipse.jst.j2ee.ejb.test.EjbFactoryTest)  Time elapsed: 0 s
23:26:16 test_createMessageDriven(org.eclipse.jst.j2ee.ejb.test.EjbFactoryTest)  Time elapsed: 0 s
23:26:16 test_isNavigable(org.eclipse.jst.j2ee.ejb.test.EJBRelationshipRoleTest)  Time elapsed: 0 s
23:26:16 test_getLogicalName(org.eclipse.jst.j2ee.ejb.test.EJBRelationshipRoleTest)  Time elapsed: 0 s
23:26:16 test_getName(org.eclipse.jst.j2ee.ejb.test.EJBRelationshipRoleTest)  Time elapsed: 0 s
23:26:16 test_isForward(org.eclipse.jst.j2ee.ejb.test.EJBRelationshipRoleTest)  Time elapsed: 0 s
23:26:16 test_isMany(org.eclipse.jst.j2ee.ejb.test.EJBRelationshipRoleTest)  Time elapsed: 0 s
23:26:16 test_setKey(org.eclipse.jst.j2ee.ejb.test.EJBRelationshipRoleTest)  Time elapsed: 0.001 s
23:26:16 test_EJBRelationshipRole(org.eclipse.jst.j2ee.ejb.test.EJBRelationshipRoleTest)  Time elapsed: 0 s
23:26:16 test_setFoward(org.eclipse.jst.j2ee.ejb.test.EJBRelationshipRoleTest)  Time elapsed: 0 s
23:26:16 test_setName(org.eclipse.jst.j2ee.ejb.test.EJBRelationshipRoleTest)  Time elapsed: 0 s
23:26:16 test_getSourceEntity(org.eclipse.jst.j2ee.ejb.test.EJBRelationshipRoleTest)  Time elapsed: 0 s
23:26:16 test_setRequired(org.eclipse.jst.j2ee.ejb.test.EJBRelationshipRoleTest)  Time elapsed: 0 s
23:26:16 test_isKey(org.eclipse.jst.j2ee.ejb.test.EJBRelationshipRoleTest)  Time elapsed: 0 s
23:26:16 test_getOpposite(org.eclipse.jst.j2ee.ejb.test.EJBRelationshipRoleTest)  Time elapsed: 0 s
23:26:16 test_containsRelationshipRole(org.eclipse.jst.j2ee.ejb.test.EJBRelationTest)  Time elapsed: 0 s
23:26:16 test_getSecondRole(org.eclipse.jst.j2ee.ejb.test.EJBRelationTest)  Time elapsed: 0 s
23:26:16 test_getFirstRole(org.eclipse.jst.j2ee.ejb.test.EJBRelationTest)  Time elapsed: 0 s
23:26:16 test_getOppositeRole(org.eclipse.jst.j2ee.ejb.test.EJBRelationTest)  Time elapsed: 0 s
23:26:16 test_EJBRelation(org.eclipse.jst.j2ee.ejb.test.EJBRelationTest)  Time elapsed: 0 s
23:26:16 test_setFoward(org.eclipse.jst.j2ee.ejb.test.EJBRelationTest)  Time elapsed: 0 s
23:26:16 test_setPrimaryKeyName(org.eclipse.jst.j2ee.ejb.test.EntityTest)  Time elapsed: 0.287 s
23:26:16 test_getPrimaryKeyName(org.eclipse.jst.j2ee.ejb.test.EntityTest)  Time elapsed: 0.393 s
23:26:16 test_initializeFromSignature(org.eclipse.jst.j2ee.ejb.test.MethodElementTest)  Time elapsed: 0.001 s
23:26:16 test_applyZeroParams(org.eclipse.jst.j2ee.ejb.test.MethodElementTest)  Time elapsed: 0 s
23:26:16 test_equalSignature(org.eclipse.jst.j2ee.ejb.test.MethodElementTest)  Time elapsed: 0 s
23:26:16 test_isRemote(org.eclipse.jst.j2ee.ejb.test.MethodElementTest)  Time elapsed: 0 s
23:26:16 test_getTypeJavaClass(org.eclipse.jst.j2ee.ejb.test.MethodElementTest)  Time elapsed: 0.306 s
23:26:16 test_isHome(org.eclipse.jst.j2ee.ejb.test.MethodElementTest)  Time elapsed: 0 s
23:26:16 test_getSignature(org.eclipse.jst.j2ee.ejb.test.MethodElementTest)  Time elapsed: 0.001 s
23:26:16 test_nameAndParamsEquals(org.eclipse.jst.j2ee.ejb.test.MethodElementTest)  Time elapsed: 0 s
23:26:16 test_isLocalHome(org.eclipse.jst.j2ee.ejb.test.MethodElementTest)  Time elapsed: 0 s
23:26:16 test_isUnspecified(org.eclipse.jst.j2ee.ejb.test.MethodElementTest)  Time elapsed: 0 s
23:26:16 test_isEquivalent(org.eclipse.jst.j2ee.ejb.test.MethodElementTest)  Time elapsed: 0 s
23:26:16 test_MethodElement(org.eclipse.jst.j2ee.ejb.test.MethodElementTest)  Time elapsed: 0 s
23:26:16 test_hasMethodParams(org.eclipse.jst.j2ee.ejb.test.MethodElementTest)  Time elapsed: 0 s
23:26:16 test_isLocal(org.eclipse.jst.j2ee.ejb.test.MethodElementTest)  Time elapsed: 0 s
23:26:16 test_isValid(org.eclipse.jst.j2ee.ejb.test.MethodElementTest)  Time elapsed: 0 s
23:26:16 test_getMethodParams(org.eclipse.jst.j2ee.ejb.test.MethodElementTest)  Time elapsed: 0.001 s
23:26:16 test_isDefault(org.eclipse.jst.j2ee.ejb.test.MethodElementTest)  Time elapsed: 0 s
23:26:16 test_addMethodParams(org.eclipse.jst.j2ee.ejb.test.MethodElementTest)  Time elapsed: 0 s
23:26:16 test_removeMethodParams(org.eclipse.jst.j2ee.ejb.test.MethodElementTest)  Time elapsed: 0 s
23:26:16 testEJBJarPopulation(org.eclipse.jst.j2ee.ejb.test.MethodElementTest)  Time elapsed: 0 s
23:26:16 test14EJBJarPopulation(org.eclipse.jst.j2ee.ejb.test.MethodElementTest)  Time elapsed: 0 s
23:26:16 test_MethodPermission(org.eclipse.jst.j2ee.ejb.test.MethodPermissionTest)  Time elapsed: 0 s
23:26:16 test_isEquivalent(org.eclipse.jst.j2ee.ejb.test.MethodPermissionTest)  Time elapsed: 0 s
23:26:16 test_hasSecurityRole(org.eclipse.jst.j2ee.ejb.test.MethodPermissionTest)  Time elapsed: 0 s
23:26:16 test_getSecurityRole(org.eclipse.jst.j2ee.ejb.test.MethodPermissionTest)  Time elapsed: 0 s
23:26:16 test_hasSecurityRole_2(org.eclipse.jst.j2ee.ejb.test.MethodPermissionTest)  Time elapsed: 0 s
23:26:16 test_getClientTypeJavaClasses(org.eclipse.jst.j2ee.ejb.test.QueryMethodTest)  Time elapsed: 0.27 s
23:26:16 test_isRemoteResultMapping(org.eclipse.jst.j2ee.ejb.test.QueryTest)  Time elapsed: 0 s
23:26:16 test_isLocalResultMapping(org.eclipse.jst.j2ee.ejb.test.QueryTest)  Time elapsed: 0 s
23:26:16 test_Query(org.eclipse.jst.j2ee.ejb.test.QueryTest)  Time elapsed: 0 s
23:26:16 test_hasServiceEndpoint(org.eclipse.jst.j2ee.ejb.test.SessionTest)  Time elapsed: 0 s
23:26:16 test_getServiceEndpointName(org.eclipse.jst.j2ee.ejb.test.SessionTest)  Time elapsed: 0 s
23:26:16 test_setServiceEndpointName(org.eclipse.jst.j2ee.ejb.test.SessionTest)  Time elapsed: 0 s
23:26:16 test_getVersionID(org.eclipse.jst.j2ee.jca.test.ConnectorTest)  Time elapsed: 0.002 s
23:26:16 test_createResourceAdapter(org.eclipse.jst.j2ee.jca.test.JcaFactoryTest)  Time elapsed: 0 s
23:26:16 test_createInboundResourceAdapter(org.eclipse.jst.j2ee.jca.test.JcaFactoryTest)  Time elapsed: 0 s
23:26:16 test_createActivationSpec(org.eclipse.jst.j2ee.jca.test.JcaFactoryTest)  Time elapsed: 0 s
23:26:16 test_getJcaPackage(org.eclipse.jst.j2ee.jca.test.JcaFactoryTest)  Time elapsed: 0 s
23:26:16 test_createAuthenticationMechanism(org.eclipse.jst.j2ee.jca.test.JcaFactoryTest)  Time elapsed: 0 s
23:26:16 test_createMessageAdapter(org.eclipse.jst.j2ee.jca.test.JcaFactoryTest)  Time elapsed: 0 s
23:26:16 test_createRequiredConfigPropertyType(org.eclipse.jst.j2ee.jca.test.JcaFactoryTest)  Time elapsed: 0 s
23:26:16 test_createConfigProperty(org.eclipse.jst.j2ee.jca.test.JcaFactoryTest)  Time elapsed: 0 s
23:26:16 test_createConnectionDefinition(org.eclipse.jst.j2ee.jca.test.JcaFactoryTest)  Time elapsed: 0 s
23:26:16 test_createAdminObject(org.eclipse.jst.j2ee.jca.test.JcaFactoryTest)  Time elapsed: 0 s
23:26:16 test_JcaFactory(org.eclipse.jst.j2ee.jca.test.JcaFactoryTest)  Time elapsed: 0 s
23:26:16 test_createConnector(org.eclipse.jst.j2ee.jca.test.JcaFactoryTest)  Time elapsed: 0 s
23:26:16 test_createMessageListener(org.eclipse.jst.j2ee.jca.test.JcaFactoryTest)  Time elapsed: 0 s
23:26:16 test_createSecurityPermission(org.eclipse.jst.j2ee.jca.test.JcaFactoryTest)  Time elapsed: 0 s
23:26:16 test_createOutboundResourceAdapter(org.eclipse.jst.j2ee.jca.test.JcaFactoryTest)  Time elapsed: 0 s
23:26:16 test_createLicense(org.eclipse.jst.j2ee.jca.test.JcaFactoryTest)  Time elapsed: 0 s
23:26:16 test_createResourceAdapter(org.eclipse.jst.j2ee.jca.test.JcaFactoryTest)  Time elapsed: 0 s
23:26:16 test_createInboundResourceAdapter(org.eclipse.jst.j2ee.jca.test.JcaFactoryTest)  Time elapsed: 0 s
23:26:16 test_createActivationSpec(org.eclipse.jst.j2ee.jca.test.JcaFactoryTest)  Time elapsed: 0 s
23:26:16 test_getJcaPackage(org.eclipse.jst.j2ee.jca.test.JcaFactoryTest)  Time elapsed: 0 s
23:26:16 test_createAuthenticationMechanism(org.eclipse.jst.j2ee.jca.test.JcaFactoryTest)  Time elapsed: 0.001 s
23:26:16 test_createMessageAdapter(org.eclipse.jst.j2ee.jca.test.JcaFactoryTest)  Time elapsed: 0 s
23:26:16 test_createRequiredConfigPropertyType(org.eclipse.jst.j2ee.jca.test.JcaFactoryTest)  Time elapsed: 0 s
23:26:16 test_createConfigProperty(org.eclipse.jst.j2ee.jca.test.JcaFactoryTest)  Time elapsed: 0 s
23:26:16 test_createConnectionDefinition(org.eclipse.jst.j2ee.jca.test.JcaFactoryTest)  Time elapsed: 0 s
23:26:16 test_createAdminObject(org.eclipse.jst.j2ee.jca.test.JcaFactoryTest)  Time elapsed: 0 s
23:26:16 test_JcaFactory(org.eclipse.jst.j2ee.jca.test.JcaFactoryTest)  Time elapsed: 0 s
23:26:16 test_createConnector(org.eclipse.jst.j2ee.jca.test.JcaFactoryTest)  Time elapsed: 0 s
23:26:16 test_createMessageListener(org.eclipse.jst.j2ee.jca.test.JcaFactoryTest)  Time elapsed: 0 s
23:26:16 test_createSecurityPermission(org.eclipse.jst.j2ee.jca.test.JcaFactoryTest)  Time elapsed: 0 s
23:26:16 test_createOutboundResourceAdapter(org.eclipse.jst.j2ee.jca.test.JcaFactoryTest)  Time elapsed: 0 s
23:26:16 test_createLicense(org.eclipse.jst.j2ee.jca.test.JcaFactoryTest)  Time elapsed: 0 s
23:26:16 test_createFormLoginConfig(org.eclipse.jst.j2ee.webapplication.test.WebapplicationFactoryTest)  Time elapsed: 0 s
23:26:16 test_createErrorCodeErrorPage(org.eclipse.jst.j2ee.webapplication.test.WebapplicationFactoryTest)  Time elapsed: 0 s
23:26:16 test_createMimeMapping(org.eclipse.jst.j2ee.webapplication.test.WebapplicationFactoryTest)  Time elapsed: 0 s
23:26:16 test_createExceptionTypeErrorPage(org.eclipse.jst.j2ee.webapplication.test.WebapplicationFactoryTest)  Time elapsed: 0 s
23:26:16 test_createTagLibRef(org.eclipse.jst.j2ee.webapplication.test.WebapplicationFactoryTest)  Time elapsed: 0 s
23:26:16 test_createLocalEncodingMapping(org.eclipse.jst.j2ee.webapplication.test.WebapplicationFactoryTest)  Time elapsed: 0 s
23:26:16 test_createServlet(org.eclipse.jst.j2ee.webapplication.test.WebapplicationFactoryTest)  Time elapsed: 0 s
23:26:16 test_createJSPType(org.eclipse.jst.j2ee.webapplication.test.WebapplicationFactoryTest)  Time elapsed: 0 s
23:26:16 test_createSessionConfig(org.eclipse.jst.j2ee.webapplication.test.WebapplicationFactoryTest)  Time elapsed: 0 s
23:26:16 test_createServletMapping(org.eclipse.jst.j2ee.webapplication.test.WebapplicationFactoryTest)  Time elapsed: 0 s
23:26:16 test_createURLPatternType(org.eclipse.jst.j2ee.webapplication.test.WebapplicationFactoryTest)  Time elapsed: 0 s
23:26:16 test_createLocalEncodingMappingList(org.eclipse.jst.j2ee.webapplication.test.WebapplicationFactoryTest)  Time elapsed: 0 s
23:26:16 test_createFilterMapping(org.eclipse.jst.j2ee.webapplication.test.WebapplicationFactoryTest)  Time elapsed: 0.001 s
23:26:16 test_createAuthConstraint(org.eclipse.jst.j2ee.webapplication.test.WebapplicationFactoryTest)  Time elapsed: 0 s
23:26:16 test_createUserDataConstraint(org.eclipse.jst.j2ee.webapplication.test.WebapplicationFactoryTest)  Time elapsed: 0 s
23:26:16 test_createFilter(org.eclipse.jst.j2ee.webapplication.test.WebapplicationFactoryTest)  Time elapsed: 0 s
23:26:16 test_createRoleNameType(org.eclipse.jst.j2ee.webapplication.test.WebapplicationFactoryTest)  Time elapsed: 0 s
23:26:16 test_createWelcomeFileList(org.eclipse.jst.j2ee.webapplication.test.WebapplicationFactoryTest)  Time elapsed: 0 s
23:26:16 test_createWebApp(org.eclipse.jst.j2ee.webapplication.test.WebapplicationFactoryTest)  Time elapsed: 0 s
23:26:16 test_createInitParam(org.eclipse.jst.j2ee.webapplication.test.WebapplicationFactoryTest)  Time elapsed: 0 s
23:26:16 test_createWelcomeFile(org.eclipse.jst.j2ee.webapplication.test.WebapplicationFactoryTest)  Time elapsed: 0 s
23:26:16 test_getWebapplicationPackage(org.eclipse.jst.j2ee.webapplication.test.WebapplicationFactoryTest)  Time elapsed: 0 s
23:26:16 test_createContextParam(org.eclipse.jst.j2ee.webapplication.test.WebapplicationFactoryTest)  Time elapsed: 0 s
23:26:16 test_createSecurityConstraint(org.eclipse.jst.j2ee.webapplication.test.WebapplicationFactoryTest)  Time elapsed: 0 s
23:26:16 test_createHTTPMethodType(org.eclipse.jst.j2ee.webapplication.test.WebapplicationFactoryTest)  Time elapsed: 0 s
23:26:16 test_createWebResourceCollection(org.eclipse.jst.j2ee.webapplication.test.WebapplicationFactoryTest)  Time elapsed: 0 s
23:26:16 test_createErrorPage(org.eclipse.jst.j2ee.webapplication.test.WebapplicationFactoryTest)  Time elapsed: 0 s
23:26:16 test_createServletType(org.eclipse.jst.j2ee.webapplication.test.WebapplicationFactoryTest)  Time elapsed: 0 s
23:26:16 test_createLoginConfig(org.eclipse.jst.j2ee.webapplication.test.WebapplicationFactoryTest)  Time elapsed: 0 s
23:26:16 test_createSOAPHeader(org.eclipse.jst.j2ee.webservice.wscommon.test.WscommonFactoryTest)  Time elapsed: 0 s
23:26:16 test_createDisplayNameType(org.eclipse.jst.j2ee.webservice.wscommon.test.WscommonFactoryTest)  Time elapsed: 0 s
23:26:16 test_getWscommonPackage(org.eclipse.jst.j2ee.webservice.wscommon.test.WscommonFactoryTest)  Time elapsed: 0 s
23:26:16 test_createDescriptionType(org.eclipse.jst.j2ee.webservice.wscommon.test.WscommonFactoryTest)  Time elapsed: 0 s
23:26:16 test_createPortName(org.eclipse.jst.j2ee.webservice.wscommon.test.WscommonFactoryTest)  Time elapsed: 0 s
23:26:16 test_createSOAPRole(org.eclipse.jst.j2ee.webservice.wscommon.test.WscommonFactoryTest)  Time elapsed: 0 s
23:26:16 test_createInitParam(org.eclipse.jst.j2ee.webservice.wscommon.test.WscommonFactoryTest)  Time elapsed: 0 s
23:26:16 test_createEJBLink(org.eclipse.jst.j2ee.webservice.wsdd.test.WsddFactoryTest)  Time elapsed: 0 s
23:26:16 test_createWSDLPort(org.eclipse.jst.j2ee.webservice.wsdd.test.WsddFactoryTest)  Time elapsed: 0 s
23:26:16 test_createPortComponent(org.eclipse.jst.j2ee.webservice.wsdd.test.WsddFactoryTest)  Time elapsed: 0 s
23:26:16 test_createServiceImplBean(org.eclipse.jst.j2ee.webservice.wsdd.test.WsddFactoryTest)  Time elapsed: 0 s
23:26:16 test_createWebServices(org.eclipse.jst.j2ee.webservice.wsdd.test.WsddFactoryTest)  Time elapsed: 0 s
23:26:16 test_createBeanLink(org.eclipse.jst.j2ee.webservice.wsdd.test.WsddFactoryTest)  Time elapsed: 0 s
23:26:16 test_createWebServiceDescription(org.eclipse.jst.j2ee.webservice.wsdd.test.WsddFactoryTest)  Time elapsed: 0 s
23:26:16 test_createHandler(org.eclipse.jst.j2ee.webservice.wsdd.test.WsddFactoryTest)  Time elapsed: 0 s
23:26:16 test_createServletLink(org.eclipse.jst.j2ee.webservice.wsdd.test.WsddFactoryTest)  Time elapsed: 0 s
23:26:16 Running org.eclipse.jst.j2ee.client.test.ApplicationClientTest
23:26:16 Tests run: 4, Failures: 0, Errors: 0, Skipped: 0, Time elapsed: 0.023 s - in org.eclipse.jst.j2ee.client.test.ApplicationClientTest
23:26:16 test_getVersionID(org.eclipse.jst.j2ee.client.test.ApplicationClientTest)  Time elapsed: 0.011 s
23:26:16 test_getJ2EEVersionID(org.eclipse.jst.j2ee.client.test.ApplicationClientTest)  Time elapsed: 0.011 s
23:26:16 test_getCallbackHandlerClassName(org.eclipse.jst.j2ee.client.test.ApplicationClientTest)  Time elapsed: 0 s
23:26:16 test_setCallbackHandlerClassName(org.eclipse.jst.j2ee.client.test.ApplicationClientTest)  Time elapsed: 0 s
23:26:16 Running org.eclipse.jst.j2ee.client.test.ClientFactoryTest
23:26:16 Tests run: 2, Failures: 0, Errors: 0, Skipped: 0, Time elapsed: 0.001 s - in org.eclipse.jst.j2ee.client.test.ClientFactoryTest
23:26:16 test_ClientFactory(org.eclipse.jst.j2ee.client.test.ClientFactoryTest)  Time elapsed: 0 s
23:26:16 test_createApplicationClient(org.eclipse.jst.j2ee.client.test.ClientFactoryTest)  Time elapsed: 0 s
23:26:16 Running org.eclipse.jst.j2ee.application.test.ApplicationFactoryTest
23:26:16 Tests run: 6, Failures: 0, Errors: 0, Skipped: 0, Time elapsed: 0.002 s - in org.eclipse.jst.j2ee.application.test.ApplicationFactoryTest
23:26:16 test_createEjbModule(org.eclipse.jst.j2ee.application.test.ApplicationFactoryTest)  Time elapsed: 0 s
23:26:16 test_createApplication(org.eclipse.jst.j2ee.application.test.ApplicationFactoryTest)  Time elapsed: 0 s
23:26:16 test_createConnectorModule(org.eclipse.jst.j2ee.application.test.ApplicationFactoryTest)  Time elapsed: 0 s
23:26:16 test_createWebModule(org.eclipse.jst.j2ee.application.test.ApplicationFactoryTest)  Time elapsed: 0 s
23:26:16 test_createJavaClientModule(org.eclipse.jst.j2ee.application.test.ApplicationFactoryTest)  Time elapsed: 0 s
23:26:16 test_createModule(org.eclipse.jst.j2ee.application.test.ApplicationFactoryTest)  Time elapsed: 0 s
23:26:16 Running org.eclipse.jst.j2ee.application.test.ApplicationTest
23:26:16 Tests run: 7, Failures: 0, Errors: 0, Skipped: 0, Time elapsed: 0.003 s - in org.eclipse.jst.j2ee.application.test.ApplicationTest
23:26:16 test_getVersionID(org.eclipse.jst.j2ee.application.test.ApplicationTest)  Time elapsed: 0.001 s
23:26:16 test_getJ2EEVersionID(org.eclipse.jst.j2ee.application.test.ApplicationTest)  Time elapsed: 0 s
23:26:16 test_getSecurityRoleNamed(org.eclipse.jst.j2ee.application.test.ApplicationTest)  Time elapsed: 0 s
23:26:16 test_getModuleHavingAltDD(org.eclipse.jst.j2ee.application.test.ApplicationTest)  Time elapsed: 0.001 s
23:26:16 test_containsSecurityRole(org.eclipse.jst.j2ee.application.test.ApplicationTest)  Time elapsed: 0 s
23:26:16 test_getModule_2(org.eclipse.jst.j2ee.application.test.ApplicationTest)  Time elapsed: 0 s
23:26:16 test_getFirstModule(org.eclipse.jst.j2ee.application.test.ApplicationTest)  Time elapsed: 0 s
23:26:16 Running org.eclipse.jst.j2ee.jca.test.JcaFactoryTest
23:26:16 Tests run: 16, Failures: 0, Errors: 0, Skipped: 0, Time elapsed: 0.002 s - in org.eclipse.jst.j2ee.jca.test.JcaFactoryTest
23:26:16 test_createResourceAdapter(org.eclipse.jst.j2ee.jca.test.JcaFactoryTest)  Time elapsed: 0 s
23:26:16 test_createInboundResourceAdapter(org.eclipse.jst.j2ee.jca.test.JcaFactoryTest)  Time elapsed: 0 s
23:26:16 test_createActivationSpec(org.eclipse.jst.j2ee.jca.test.JcaFactoryTest)  Time elapsed: 0 s
23:26:16 test_getJcaPackage(org.eclipse.jst.j2ee.jca.test.JcaFactoryTest)  Time elapsed: 0 s
23:26:16 test_createAuthenticationMechanism(org.eclipse.jst.j2ee.jca.test.JcaFactoryTest)  Time elapsed: 0 s
23:26:16 test_createMessageAdapter(org.eclipse.jst.j2ee.jca.test.JcaFactoryTest)  Time elapsed: 0 s
23:26:16 test_createRequiredConfigPropertyType(org.eclipse.jst.j2ee.jca.test.JcaFactoryTest)  Time elapsed: 0 s
23:26:16 test_createConfigProperty(org.eclipse.jst.j2ee.jca.test.JcaFactoryTest)  Time elapsed: 0 s
23:26:16 test_createConnectionDefinition(org.eclipse.jst.j2ee.jca.test.JcaFactoryTest)  Time elapsed: 0 s
23:26:16 test_createAdminObject(org.eclipse.jst.j2ee.jca.test.JcaFactoryTest)  Time elapsed: 0 s
23:26:16 test_JcaFactory(org.eclipse.jst.j2ee.jca.test.JcaFactoryTest)  Time elapsed: 0 s
23:26:16 test_createConnector(org.eclipse.jst.j2ee.jca.test.JcaFactoryTest)  Time elapsed: 0 s
23:26:16 test_createMessageListener(org.eclipse.jst.j2ee.jca.test.JcaFactoryTest)  Time elapsed: 0 s
23:26:16 test_createSecurityPermission(org.eclipse.jst.j2ee.jca.test.JcaFactoryTest)  Time elapsed: 0 s
23:26:16 test_createOutboundResourceAdapter(org.eclipse.jst.j2ee.jca.test.JcaFactoryTest)  Time elapsed: 0 s
23:26:16 test_createLicense(org.eclipse.jst.j2ee.jca.test.JcaFactoryTest)  Time elapsed: 0 s
23:26:16 Running org.eclipse.jst.j2ee.jca.test.ConnectorTest
23:26:16 Tests run: 1, Failures: 0, Errors: 0, Skipped: 0, Time elapsed: 0.001 s - in org.eclipse.jst.j2ee.jca.test.ConnectorTest
23:26:16 test_getVersionID(org.eclipse.jst.j2ee.jca.test.ConnectorTest)  Time elapsed: 0.001 s
23:26:16 Running org.eclipse.jst.j2ee.jsp.test.JspFactoryTest
23:26:16 Tests run: 16, Failures: 0, Errors: 0, Skipped: 0, Time elapsed: 0.002 s - in org.eclipse.jst.j2ee.jsp.test.JspFactoryTest
23:26:16 test_createResourceAdapter(org.eclipse.jst.j2ee.jca.test.JcaFactoryTest)  Time elapsed: 0 s
23:26:16 test_createInboundResourceAdapter(org.eclipse.jst.j2ee.jca.test.JcaFactoryTest)  Time elapsed: 0 s
23:26:16 test_createActivationSpec(org.eclipse.jst.j2ee.jca.test.JcaFactoryTest)  Time elapsed: 0 s
23:26:16 test_getJcaPackage(org.eclipse.jst.j2ee.jca.test.JcaFactoryTest)  Time elapsed: 0 s
23:26:16 test_createAuthenticationMechanism(org.eclipse.jst.j2ee.jca.test.JcaFactoryTest)  Time elapsed: 0 s
23:26:16 test_createMessageAdapter(org.eclipse.jst.j2ee.jca.test.JcaFactoryTest)  Time elapsed: 0 s
23:26:16 test_createRequiredConfigPropertyType(org.eclipse.jst.j2ee.jca.test.JcaFactoryTest)  Time elapsed: 0 s
23:26:16 test_createConfigProperty(org.eclipse.jst.j2ee.jca.test.JcaFactoryTest)  Time elapsed: 0 s
23:26:16 test_createConnectionDefinition(org.eclipse.jst.j2ee.jca.test.JcaFactoryTest)  Time elapsed: 0 s
23:26:16 test_createAdminObject(org.eclipse.jst.j2ee.jca.test.JcaFactoryTest)  Time elapsed: 0 s
23:26:16 test_JcaFactory(org.eclipse.jst.j2ee.jca.test.JcaFactoryTest)  Time elapsed: 0 s
23:26:16 test_createConnector(org.eclipse.jst.j2ee.jca.test.JcaFactoryTest)  Time elapsed: 0 s
23:26:16 test_createMessageListener(org.eclipse.jst.j2ee.jca.test.JcaFactoryTest)  Time elapsed: 0 s
23:26:16 test_createSecurityPermission(org.eclipse.jst.j2ee.jca.test.JcaFactoryTest)  Time elapsed: 0 s
23:26:16 test_createOutboundResourceAdapter(org.eclipse.jst.j2ee.jca.test.JcaFactoryTest)  Time elapsed: 0 s
23:26:16 test_createLicense(org.eclipse.jst.j2ee.jca.test.JcaFactoryTest)  Time elapsed: 0 s
23:26:16 Running org.eclipse.jst.j2ee.webapplication.test.WebapplicationFactoryTest
23:26:16 Tests run: 29, Failures: 0, Errors: 0, Skipped: 0, Time elapsed: 0.002 s - in org.eclipse.jst.j2ee.webapplication.test.WebapplicationFactoryTest
23:26:16 test_createFormLoginConfig(org.eclipse.jst.j2ee.webapplication.test.WebapplicationFactoryTest)  Time elapsed: 0 s
23:26:16 test_createErrorCodeErrorPage(org.eclipse.jst.j2ee.webapplication.test.WebapplicationFactoryTest)  Time elapsed: 0 s
23:26:16 test_createMimeMapping(org.eclipse.jst.j2ee.webapplication.test.WebapplicationFactoryTest)  Time elapsed: 0 s
23:26:16 test_createExceptionTypeErrorPage(org.eclipse.jst.j2ee.webapplication.test.WebapplicationFactoryTest)  Time elapsed: 0 s
23:26:16 test_createTagLibRef(org.eclipse.jst.j2ee.webapplication.test.WebapplicationFactoryTest)  Time elapsed: 0 s
23:26:16 test_createLocalEncodingMapping(org.eclipse.jst.j2ee.webapplication.test.WebapplicationFactoryTest)  Time elapsed: 0 s
23:26:16 test_createServlet(org.eclipse.jst.j2ee.webapplication.test.WebapplicationFactoryTest)  Time elapsed: 0 s
23:26:16 test_createJSPType(org.eclipse.jst.j2ee.webapplication.test.WebapplicationFactoryTest)  Time elapsed: 0 s
23:26:16 test_createSessionConfig(org.eclipse.jst.j2ee.webapplication.test.WebapplicationFactoryTest)  Time elapsed: 0 s
23:26:16 test_createServletMapping(org.eclipse.jst.j2ee.webapplication.test.WebapplicationFactoryTest)  Time elapsed: 0 s
23:26:16 test_createURLPatternType(org.eclipse.jst.j2ee.webapplication.test.WebapplicationFactoryTest)  Time elapsed: 0 s
23:26:16 test_createLocalEncodingMappingList(org.eclipse.jst.j2ee.webapplication.test.WebapplicationFactoryTest)  Time elapsed: 0 s
23:26:16 test_createFilterMapping(org.eclipse.jst.j2ee.webapplication.test.WebapplicationFactoryTest)  Time elapsed: 0 s
23:26:16 test_createAuthConstraint(org.eclipse.jst.j2ee.webapplication.test.WebapplicationFactoryTest)  Time elapsed: 0 s
23:26:16 test_createUserDataConstraint(org.eclipse.jst.j2ee.webapplication.test.WebapplicationFactoryTest)  Time elapsed: 0 s
23:26:16 test_createFilter(org.eclipse.jst.j2ee.webapplication.test.WebapplicationFactoryTest)  Time elapsed: 0 s
23:26:16 test_createRoleNameType(org.eclipse.jst.j2ee.webapplication.test.WebapplicationFactoryTest)  Time elapsed: 0 s
23:26:16 test_createWelcomeFileList(org.eclipse.jst.j2ee.webapplication.test.WebapplicationFactoryTest)  Time elapsed: 0 s
23:26:16 test_createWebApp(org.eclipse.jst.j2ee.webapplication.test.WebapplicationFactoryTest)  Time elapsed: 0 s
23:26:16 test_createInitParam(org.eclipse.jst.j2ee.webapplication.test.WebapplicationFactoryTest)  Time elapsed: 0 s
23:26:16 test_createWelcomeFile(org.eclipse.jst.j2ee.webapplication.test.WebapplicationFactoryTest)  Time elapsed: 0 s
23:26:16 test_getWebapplicationPackage(org.eclipse.jst.j2ee.webapplication.test.WebapplicationFactoryTest)  Time elapsed: 0 s
23:26:16 test_createContextParam(org.eclipse.jst.j2ee.webapplication.test.WebapplicationFactoryTest)  Time elapsed: 0 s
23:26:16 test_createSecurityConstraint(org.eclipse.jst.j2ee.webapplication.test.WebapplicationFactoryTest)  Time elapsed: 0 s
23:26:16 test_createHTTPMethodType(org.eclipse.jst.j2ee.webapplication.test.WebapplicationFactoryTest)  Time elapsed: 0 s
23:26:16 test_createWebResourceCollection(org.eclipse.jst.j2ee.webapplication.test.WebapplicationFactoryTest)  Time elapsed: 0 s
23:26:16 test_createErrorPage(org.eclipse.jst.j2ee.webapplication.test.WebapplicationFactoryTest)  Time elapsed: 0 s
23:26:16 test_createServletType(org.eclipse.jst.j2ee.webapplication.test.WebapplicationFactoryTest)  Time elapsed: 0 s
23:26:16 test_createLoginConfig(org.eclipse.jst.j2ee.webapplication.test.WebapplicationFactoryTest)  Time elapsed: 0 s
23:26:16 
23:26:16 Results:
23:26:16 
23:26:16 Failures: 
23:26:16   ResourceTests.testResourceCreation:76 The resource should be unloaded
23:26:16 Errors: 
23:26:16   CopyTests.testAddCopyDirectory:78 » OpenFailure IWAE0037E Could not open /home...
23:26:16   CopyTests.testAddCopyModule:100 » OpenFailure IWAE0037E Could not open /home/j...
23:26:16   CopyTests.testAddCopyModuleFilesToEAR:139 » OpenFailure IWAE0037E Could not op...
23:26:16   CopyTests.testAddCopyStandaloneModule:167 » OpenFailure IWAE0037E Could not op...
23:26:16   CopyTests.testAddRenameAndDelete:184 » OpenFailure IWAE0037E Could not open /h...
23:26:16   CopyTests.testAddRenameAndDeleteStandalone:218 » OpenFailure IWAE0037E Could n...
23:26:16   DefectVerificationTests.testFilterMappingTranslator:83 » OpenFailure IWAE0037E...
23:26:16   DefectVerificationTests.testFormerDefect297:109 » OpenFailure IWAE0037E Could ...
23:26:16   DefectVerificationTests.testReadCrimsonCase:261 » OpenFailure IWAE0037E Could ...
23:26:16   DefectVerificationTests.testSavingEARWhileDeploying:172 » OpenFailure IWAE0037...
23:26:16   DefectVerificationTests.testServiceQNameTranslator:216 » OpenFailure IWAE0037E...
23:26:16   RarFileTests.testJ2Cauth:193 » OpenFailure IWAE0037E Could not open /home/jenk...
23:26:16   RarFileTests.testOpenAndExtract:153 » OpenFailure IWAE0037E Could not open /ho...
23:26:16   RarFileTests.testOpenAndRead:165 » OpenFailure IWAE0037E Could not open /home/...
23:26:16   RarFileTests.testSaveRarEar:178 » OpenFailure IWAE0037E Could not open /home/j...
23:26:16   RarFileTests.testaddCopyModule:114 » OpenFailure IWAE0037E Could not open /hom...
23:26:16   RarFileTests.testexpandRarModule:132 » OpenFailure IWAE0037E Could not open /h...
23:26:16   RarFileTests.testopenRarEar:172 » OpenFailure IWAE0037E Could not open /home/j...
23:26:16   ResourceTests.testResourceDirty:95 » OpenFailure IWAE0037E Could not open /hom...
23:26:16   SaveTests.testSave:63 » OpenFailure IWAE0037E Could not open /home/jenkins/age...
23:26:16   SaveTests.testSaveDirectory:93 » OpenFailure IWAE0037E Could not open /home/je...
23:26:16   SecurityRoleTests.testPushDownCopy:53 » OpenFailure IWAE0037E Could not open /...
23:26:16   SecurityRoleTests.testRollupAddAndPushDown:73 » OpenFailure IWAE0037E Could no...
23:26:16   SimpleTests.testContainerManagedEntityExtensionRead:110 » OpenFailure IWAE0037...
23:26:16   SimpleTests.testEJB11JarAdd:117 » OpenFailure IWAE0037E Could not open /home/j...
23:26:16   SimpleTests.testEJBSetAbstractSchemaName:125 » OpenFailure IWAE0037E Could not...
23:26:16   SimpleTests.testIndexing:142 » OpenFailure IWAE0037E Could not open /home/jenk...
23:26:16   SimpleTests.testIndexingWithCollections:173 » OpenFailure IWAE0037E Could not ...
23:26:16   SimpleTests.testOpenAndExtract1:213 » OpenFailure IWAE0037E Could not open /ho...
23:26:16   SimpleTests.testOpenAndExtract2:233 » OpenFailure IWAE0037E Could not open /ho...
23:26:16   SimpleTests.testOpenAndExtract3:253 » OpenFailure IWAE0037E Could not open /ho...
23:26:16   SimpleTests.testOpenAndRead:265 » OpenFailure IWAE0037E Could not open /home/j...
23:26:16   SimpleTests.testOpenAndSaveAsJarFile:292 » OpenFailure IWAE0037E Could not ope...
23:26:16   SimpleTests.testOpenDirectoryAndSaveAsJarFile:305 » OpenFailure IWAE0037E Coul...
23:26:16   SimpleTests.testReadEmptyTags:425 » OpenFailure IWAE0037E Could not open /home...
23:26:16   SimpleTests.testSafeClose:319 » OpenFailure IWAE0037E Could not open /home/jen...
23:26:16   SimpleTests.testSaveFailure:352 » OpenFailure IWAE0037E Could not open /home/j...
23:26:16   SimpleTests.testXmlValidation:387 » OpenFailure IWAE0037E Could not open /home...
23:26:16   WARFileTests.testAddCopyClass:56 » OpenFailure IWAE0037E Could not open /home/...
23:26:16   WARFileTests.testAddCopyLib:77 » OpenFailure IWAE0037E Could not open /home/je...
23:26:16   WARFileTests.testListClassesAndLibs:96 » OpenFailure IWAE0037E Could not open ...
23:26:16 
23:26:16 Tests run: 887, Failures: 1, Errors: 41, Skipped: 0
23:26:16 
23:26:16 [INFO] 
23:26:20 [INFO] ------------------------------------------------------------------------
23:26:20 [INFO] Skipping org.eclipse.jst.j2ee.tests
23:26:20 [INFO] This project has been banned from the build due to previous failures.
23:26:20 [INFO] ------------------------------------------------------------------------
23:26:20 [INFO] 
23:26:20 [INFO] ------------------------------------------------------------------------
23:26:20 [INFO] Skipping org.eclipse.jst.jee.tests
23:26:20 [INFO] This project has been banned from the build due to previous failures.
23:26:20 [INFO] ------------------------------------------------------------------------
23:26:20 [INFO] 
23:26:20 [INFO] ------------------------------------------------------------------------
23:26:20 [INFO] Skipping org.eclipse.jst.servlet.tests
23:26:20 [INFO] This project has been banned from the build due to previous failures.
23:26:20 [INFO] ------------------------------------------------------------------------
23:26:20 [INFO] 
23:26:20 [INFO] ----< org.eclipse.webtools.javaee:org.eclipse.jst.validation.test >-----
23:26:20 [INFO] Building org.eclipse.jst.validation.test 1.1.300-SNAPSHOT        [47/51]
23:26:20 [INFO] ------------------------[ eclipse-test-plugin ]-------------------------
23:26:20 [INFO] 
23:26:20 [INFO] --- maven-clean-plugin:2.5:clean (default-clean) @ org.eclipse.jst.validation.test ---
23:26:20 [INFO] 
23:26:20 [INFO] --- tycho-packaging-plugin:2.2.0:build-qualifier (default-build-qualifier) @ org.eclipse.jst.validation.test ---
23:26:20 [INFO] The project's OSGi version is 1.1.300.v202103311810
23:26:20 [INFO] 
23:26:20 [INFO] --- tycho-packaging-plugin:2.2.0:validate-id (default-validate-id) @ org.eclipse.jst.validation.test ---
23:26:20 [INFO] 
23:26:20 [INFO] --- tycho-packaging-plugin:2.2.0:validate-version (default-validate-version) @ org.eclipse.jst.validation.test ---
23:26:20 [INFO] 
23:26:20 [INFO] --- build-helper-maven-plugin:3.0.0:regex-property (regex-property) @ org.eclipse.jst.validation.test ---
23:26:20 [INFO] 
23:26:20 [INFO] --- maven-resources-plugin:2.4.3:resources (default-resources) @ org.eclipse.jst.validation.test ---
23:26:20 [WARNING] Using platform encoding (UTF-8 actually) to copy filtered resources, i.e. build is platform dependent!
23:26:20 [INFO] skip non existing resourceDirectory /home/jenkins/agent/workspace/webtools-javaee-gerrit_master/tests/org.eclipse.jst.validation.test/src/main/resources
23:26:20 [INFO] 
23:26:20 [INFO] --- tycho-compiler-plugin:2.2.0:compile (default-compile) @ org.eclipse.jst.validation.test ---
23:26:20 [INFO] Compiling 53 source files to /home/jenkins/agent/workspace/webtools-javaee-gerrit_master/tests/org.eclipse.jst.validation.test/target/classes
23:26:20 [INFO] 
23:26:20 [INFO] --- maven-resources-plugin:2.4.3:testResources (default-testResources) @ org.eclipse.jst.validation.test ---
23:26:20 [WARNING] Using platform encoding (UTF-8 actually) to copy filtered resources, i.e. build is platform dependent!
23:26:20 [INFO] skip non existing resourceDirectory /home/jenkins/agent/workspace/webtools-javaee-gerrit_master/tests/org.eclipse.jst.validation.test/src/test/resources
23:26:20 [INFO] 
23:26:20 [INFO] --- tycho-source-plugin:2.2.0:plugin-source (plugin-source) @ org.eclipse.jst.validation.test ---
23:26:20 [INFO] Building jar: /home/jenkins/agent/workspace/webtools-javaee-gerrit_master/tests/org.eclipse.jst.validation.test/target/org.eclipse.jst.validation.test-1.1.300-SNAPSHOT-sources.jar
23:26:20 [INFO] 
23:26:20 [INFO] --- target-platform-configuration:2.2.0:target-platform (default-target-platform) @ org.eclipse.jst.validation.test ---
23:26:20 [INFO] 
23:26:20 [INFO] --- tycho-packaging-plugin:2.2.0:package-plugin (default-package-plugin) @ org.eclipse.jst.validation.test ---
23:26:20 [INFO] Building jar: /home/jenkins/agent/workspace/webtools-javaee-gerrit_master/tests/org.eclipse.jst.validation.test/validationtest.jar
23:26:20 [INFO] Building jar: /home/jenkins/agent/workspace/webtools-javaee-gerrit_master/tests/org.eclipse.jst.validation.test/target/org.eclipse.jst.validation.test-1.1.300-SNAPSHOT.jar
23:26:20 [INFO] 
23:26:21 [INFO] --- tycho-p2-plugin:2.2.0:p2-metadata-default (default-p2-metadata-default) @ org.eclipse.jst.validation.test ---
23:26:21 [INFO] 
23:26:21 [INFO] --- tycho-surefire-plugin:2.2.0:test (default-test) @ org.eclipse.jst.validation.test ---
23:26:21 [INFO] Executing Test Runtime with timeout 0, logs (if any) will be placed at: /home/jenkins/agent/workspace/webtools-javaee-gerrit_master/tests/org.eclipse.jst.validation.test/target/work/data/.metadata/.log
23:26:21 [INFO] Command line:
23:26:21 	[/opt/tools/java/openjdk/jdk-11/11.0.2+9/bin/java, -Dosgi.noShutdown=false, -Dosgi.os=linux, -Dosgi.ws=gtk, -Dosgi.arch=x86_64, -Dosgi.clean=true, -jar, /home/jenkins/agent/workspace/webtools-javaee-gerrit_master/.repository/p2/osgi/bundle/org.eclipse.equinox.launcher/1.6.200.v20210416-2027/org.eclipse.equinox.launcher-1.6.200.v20210416-2027.jar, -data, /home/jenkins/agent/workspace/webtools-javaee-gerrit_master/tests/org.eclipse.jst.validation.test/target/work/data, -install, /home/jenkins/agent/workspace/webtools-javaee-gerrit_master/tests/org.eclipse.jst.validation.test/target/work, -configuration, /home/jenkins/agent/workspace/webtools-javaee-gerrit_master/tests/org.eclipse.jst.validation.test/target/work/configuration, -application, org.eclipse.tycho.surefire.osgibooter.headlesstest, -testproperties, /home/jenkins/agent/workspace/webtools-javaee-gerrit_master/tests/org.eclipse.jst.validation.test/target/surefire.properties]
23:26:21 Running org.eclipse.jst.validation.test.junit.ValidatorTest
23:26:25 Tests run: 1, Failures: 0, Errors: 0, Skipped: 1, Time elapsed: 0.014 s - in org.eclipse.jst.validation.test.junit.ValidatorTest
23:26:25 org.eclipse.jst.validation.test.junit.ValidatorTest skipped
23:26:25 Running org.eclipse.jst.validation.test.junit.OperationTest
23:26:25 Tests run: 1, Failures: 0, Errors: 0, Skipped: 1, Time elapsed: 0.001 s - in org.eclipse.jst.validation.test.junit.OperationTest
23:26:25 org.eclipse.jst.validation.test.junit.OperationTest skipped
23:26:25 Running org.eclipse.jst.validation.api.test.ValidationRegistryApiTest
23:26:25 Tests run: 1, Failures: 0, Errors: 0, Skipped: 0, Time elapsed: 0.523 s - in org.eclipse.jst.validation.api.test.ValidationRegistryApiTest
23:26:25 test_getValidator(org.eclipse.jst.validation.api.test.ValidationRegistryApiTest)  Time elapsed: 0.507 s
23:26:25 
23:26:25 Results:
23:26:25 
23:26:25 Tests run: 3, Failures: 0, Errors: 0, Skipped: 2
23:26:25 
23:26:25 [INFO] All tests passed!
23:26:27 [INFO] 
23:26:27 [INFO] --- tycho-pack200a-plugin:2.2.0:normalize (pack200-normalize) @ org.eclipse.jst.validation.test ---
23:26:27 [INFO] Pack200 normalizing jar /home/jenkins/agent/workspace/webtools-javaee-gerrit_master/tests/org.eclipse.jst.validation.test/target/org.eclipse.jst.validation.test-1.1.300-SNAPSHOT.jar
23:26:27 [INFO] 
23:26:27 [INFO] --- eclipse-jarsigner-plugin:1.1.4:sign (sign) @ org.eclipse.jst.validation.test ---
23:26:27 [INFO] Signing of nested jars of '/home/jenkins/agent/workspace/webtools-javaee-gerrit_master/tests/org.eclipse.jst.validation.test/target/org.eclipse.jst.validation.test-1.1.300-SNAPSHOT.jar_unpacked_810227028659618957/testInput/FWK/BVT/opConstr.jar' is disabled.
23:26:27 [INFO] Signing jar: /home/jenkins/agent/workspace/webtools-javaee-gerrit_master/tests/org.eclipse.jst.validation.test/target/org.eclipse.jst.validation.test-1.1.300-SNAPSHOT.jar_unpacked_810227028659618957/testInput/FWK/BVT/opConstr.jar
23:26:27 [INFO] Signing of nested jars of '/home/jenkins/agent/workspace/webtools-javaee-gerrit_master/tests/org.eclipse.jst.validation.test/target/org.eclipse.jst.validation.test-1.1.300-SNAPSHOT.jar_unpacked_810227028659618957/testInput/Properties/aProperties.jar' is disabled.
23:26:29 [INFO] Signing jar: /home/jenkins/agent/workspace/webtools-javaee-gerrit_master/tests/org.eclipse.jst.validation.test/target/org.eclipse.jst.validation.test-1.1.300-SNAPSHOT.jar_unpacked_810227028659618957/testInput/Properties/aProperties.jar
23:26:29 [INFO] Signing of nested jars of '/home/jenkins/agent/workspace/webtools-javaee-gerrit_master/tests/org.eclipse.jst.validation.test/target/org.eclipse.jst.validation.test-1.1.300-SNAPSHOT.jar_unpacked_810227028659618957/validationtest.jar' is disabled.
23:26:30 [INFO] Signing jar: /home/jenkins/agent/workspace/webtools-javaee-gerrit_master/tests/org.eclipse.jst.validation.test/target/org.eclipse.jst.validation.test-1.1.300-SNAPSHOT.jar_unpacked_810227028659618957/validationtest.jar
23:26:30 [INFO] Signing jar: /home/jenkins/agent/workspace/webtools-javaee-gerrit_master/tests/org.eclipse.jst.validation.test/target/org.eclipse.jst.validation.test-1.1.300-SNAPSHOT.jar
23:26:32 [INFO] Signing jar: /home/jenkins/agent/workspace/webtools-javaee-gerrit_master/tests/org.eclipse.jst.validation.test/target/org.eclipse.jst.validation.test-1.1.300-SNAPSHOT-sources.jar
23:26:33 [INFO] 
23:26:35 [INFO] --- tycho-pack200b-plugin:2.2.0:pack (pack200-pack) @ org.eclipse.jst.validation.test ---
23:26:35 [INFO] Pack200 packing jar /home/jenkins/agent/workspace/webtools-javaee-gerrit_master/tests/org.eclipse.jst.validation.test/target/org.eclipse.jst.validation.test-1.1.300-SNAPSHOT.jar
23:26:35 [INFO] 
23:26:35 [INFO] --- tycho-p2-plugin:2.2.0:p2-metadata (p2-metadata) @ org.eclipse.jst.validation.test ---
23:26:35 [INFO] No baseline version MavenProject: org.eclipse.webtools.javaee:org.eclipse.jst.validation.test:1.1.300-SNAPSHOT @ /home/jenkins/agent/workspace/webtools-javaee-gerrit_master/tests/org.eclipse.jst.validation.test/pom.xml
23:26:35 [INFO] 
23:26:35 [INFO] --- maven-install-plugin:2.3.1:install (default-install) @ org.eclipse.jst.validation.test ---
23:26:35 [INFO] Installing /home/jenkins/agent/workspace/webtools-javaee-gerrit_master/tests/org.eclipse.jst.validation.test/target/org.eclipse.jst.validation.test-1.1.300-SNAPSHOT.jar to /home/jenkins/agent/workspace/webtools-javaee-gerrit_master/.repository/org/eclipse/webtools/javaee/org.eclipse.jst.validation.test/1.1.300-SNAPSHOT/org.eclipse.jst.validation.test-1.1.300-SNAPSHOT.jar
23:26:35 [INFO] Installing /home/jenkins/agent/workspace/webtools-javaee-gerrit_master/tests/org.eclipse.jst.validation.test/pom.xml to /home/jenkins/agent/workspace/webtools-javaee-gerrit_master/.repository/org/eclipse/webtools/javaee/org.eclipse.jst.validation.test/1.1.300-SNAPSHOT/org.eclipse.jst.validation.test-1.1.300-SNAPSHOT.pom
23:26:35 [INFO] Installing /home/jenkins/agent/workspace/webtools-javaee-gerrit_master/tests/org.eclipse.jst.validation.test/target/org.eclipse.jst.validation.test-1.1.300-SNAPSHOT-sources.jar to /home/jenkins/agent/workspace/webtools-javaee-gerrit_master/.repository/org/eclipse/webtools/javaee/org.eclipse.jst.validation.test/1.1.300-SNAPSHOT/org.eclipse.jst.validation.test-1.1.300-SNAPSHOT-sources.jar
23:26:35 [INFO] Installing /home/jenkins/agent/workspace/webtools-javaee-gerrit_master/tests/org.eclipse.jst.validation.test/target/org.eclipse.jst.validation.test-1.1.300-SNAPSHOT.jar.pack.gz to /home/jenkins/agent/workspace/webtools-javaee-gerrit_master/.repository/org/eclipse/webtools/javaee/org.eclipse.jst.validation.test/1.1.300-SNAPSHOT/org.eclipse.jst.validation.test-1.1.300-SNAPSHOT-pack200.jar.pack.gz
23:26:35 [INFO] Installing /home/jenkins/agent/workspace/webtools-javaee-gerrit_master/tests/org.eclipse.jst.validation.test/target/p2content.xml to /home/jenkins/agent/workspace/webtools-javaee-gerrit_master/.repository/org/eclipse/webtools/javaee/org.eclipse.jst.validation.test/1.1.300-SNAPSHOT/org.eclipse.jst.validation.test-1.1.300-SNAPSHOT-p2metadata.xml
23:26:35 [INFO] Installing /home/jenkins/agent/workspace/webtools-javaee-gerrit_master/tests/org.eclipse.jst.validation.test/target/p2artifacts.xml to /home/jenkins/agent/workspace/webtools-javaee-gerrit_master/.repository/org/eclipse/webtools/javaee/org.eclipse.jst.validation.test/1.1.300-SNAPSHOT/org.eclipse.jst.validation.test-1.1.300-SNAPSHOT-p2artifacts.xml
23:26:35 [INFO] 
23:26:35 [INFO] --- tycho-p2-plugin:2.2.0:update-local-index (default-update-local-index) @ org.eclipse.jst.validation.test ---
23:26:35 [INFO] 
23:26:35 [INFO] ------------------------------------------------------------------------
23:26:35 [INFO] Skipping org.eclipse.webtools.javaee.site
23:26:35 [INFO] This project has been banned from the build due to previous failures.
23:26:35 [INFO] ------------------------------------------------------------------------
23:26:35 [INFO] ------------------------------------------------------------------------
23:26:35 [INFO] Reactor Summary:
23:26:35 [INFO] 
23:26:35 [INFO] org.eclipse.webtools.javaee 3.6.0-SNAPSHOT ......... SUCCESS [ 25.422 s]
23:26:35 [INFO] javaee.docs 3.6.0-SNAPSHOT ......................... SUCCESS [  0.018 s]
23:26:35 [INFO] org.eclipse.jst.ejb.doc.user 1.1.301-SNAPSHOT ...... SUCCESS [ 16.776 s]
23:26:35 [INFO] org.eclipse.jst.ejb.ui.infopop 1.0.300-SNAPSHOT .... SUCCESS [  3.110 s]
23:26:35 [INFO] org.eclipse.jst.j2ee.doc.user 1.1.400-SNAPSHOT ..... SUCCESS [  4.994 s]
23:26:35 [INFO] org.eclipse.jst.j2ee.infopop 1.0.300-SNAPSHOT ...... SUCCESS [  7.272 s]
23:26:35 [INFO] org.eclipse.jst.servlet.ui.infopop 1.0.500-SNAPSHOT  SUCCESS [  2.912 s]
23:26:35 [INFO] javaee.plugins 3.6.0-SNAPSHOT ...................... SUCCESS [  0.013 s]
23:26:35 [INFO] org.eclipse.jem.proxy 2.1.0-SNAPSHOT ............... SUCCESS [ 12.714 s]
23:26:35 [INFO] org.eclipse.jem 2.0.600-SNAPSHOT ................... SUCCESS [  9.572 s]
23:26:35 [INFO] org.eclipse.jem.workbench 2.1.0-SNAPSHOT ........... SUCCESS [  4.409 s]
23:26:35 [INFO] org.eclipse.jem.beaninfo.vm.common 2.1.0-SNAPSHOT .. SUCCESS [  3.181 s]
23:26:35 [INFO] org.eclipse.jem.beaninfo.vm 2.1.0-SNAPSHOT ......... SUCCESS [  3.361 s]
23:26:35 [INFO] org.eclipse.jem.beaninfo 2.0.300-SNAPSHOT .......... SUCCESS [  5.699 s]
23:26:35 [INFO] org.eclipse.jst.common.annotations.core 1.1.300-SNAPSHOT SUCCESS [  3.330 s]
23:26:35 [INFO] org.eclipse.jst.common.annotations.controller 1.1.300-SNAPSHOT SUCCESS [  4.211 s]
23:26:35 [INFO] org.eclipse.jst.common.annotations.ui 1.1.300-SNAPSHOT SUCCESS [  5.027 s]
23:26:35 [INFO] org.eclipse.jst.common.frameworks 1.1.701-SNAPSHOT . SUCCESS [  4.025 s]
23:26:35 [INFO] org.eclipse.jst.common.ui 1.0.301-SNAPSHOT ......... SUCCESS [  4.176 s]
23:26:35 [INFO] org.eclipse.jst.j2ee.core 1.4.100-SNAPSHOT ......... SUCCESS [ 27.502 s]
23:26:35 [INFO] org.eclipse.jst.j2ee 1.2.500-SNAPSHOT .............. SUCCESS [ 12.332 s]
23:26:35 [INFO] org.eclipse.jst.j2ee.jca 1.1.1000-SNAPSHOT ......... SUCCESS [  4.409 s]
23:26:35 [INFO] org.eclipse.jst.jee 1.0.1000-SNAPSHOT .............. SUCCESS [  3.432 s]
23:26:35 [INFO] org.eclipse.jst.j2ee.ejb 1.1.901-SNAPSHOT .......... SUCCESS [  8.201 s]
23:26:35 [INFO] org.eclipse.jst.j2ee.ejb.annotation.model 1.1.500-SNAPSHOT SUCCESS [  3.893 s]
23:26:35 [INFO] org.eclipse.jst.j2ee.web 1.1.1100-SNAPSHOT ......... SUCCESS [  5.580 s]
23:26:35 [INFO] org.eclipse.jst.j2ee.ui 1.1.931-SNAPSHOT ........... SUCCESS [  7.045 s]
23:26:35 [INFO] org.eclipse.jst.j2ee.jca.ui 1.1.601-SNAPSHOT ....... SUCCESS [  3.312 s]
23:26:35 [INFO] org.eclipse.jst.j2ee.navigator.ui 1.1.800-SNAPSHOT . SUCCESS [  5.671 s]
23:26:35 [INFO] org.eclipse.jst.jee.ui 1.0.901-SNAPSHOT ............ SUCCESS [  7.333 s]
23:26:35 [INFO] org.eclipse.jst.ejb.ui 1.1.911-SNAPSHOT ............ SUCCESS [  6.868 s]
23:26:35 [INFO] org.eclipse.jst.j2ee.ejb.annotations.emitter 1.1.300-SNAPSHOT SUCCESS [  3.096 s]
23:26:35 [INFO] org.eclipse.jst.j2ee.ejb.annotations.ui 1.2.0-SNAPSHOT SUCCESS [  4.431 s]
23:26:35 [INFO] org.eclipse.jst.j2ee.ejb.annotations.xdoclet 1.2.300-SNAPSHOT SUCCESS [  3.608 s]
23:26:35 [INFO] org.eclipse.jst.j2ee.webservice 1.1.700-SNAPSHOT ... SUCCESS [  5.915 s]
23:26:35 [INFO] org.eclipse.jst.j2ee.webservice.ui 1.1.800-SNAPSHOT  SUCCESS [  3.800 s]
23:26:35 [INFO] org.eclipse.jst.j2ee.xdoclet.runtime 1.2.0-SNAPSHOT  SUCCESS [  3.784 s]
23:26:35 [INFO] org.eclipse.jst.jee.ejb 1.0.500-SNAPSHOT ........... SUCCESS [  3.500 s]
23:26:35 [INFO] org.eclipse.jst.jee.web 1.0.800-SNAPSHOT ........... SUCCESS [  3.057 s]
23:26:35 [INFO] org.eclipse.jst.servlet.ui 1.1.1100-SNAPSHOT ....... SUCCESS [  4.984 s]
23:26:35 [INFO] org.eclipse.wtp.jee.capabilities 1.0.100-SNAPSHOT .. SUCCESS [  2.566 s]
23:26:35 [INFO] javaee.tests 3.6.0-SNAPSHOT ........................ SUCCESS [  0.012 s]
23:26:35 [INFO] org.eclipse.jst.validation.sample 1.1.100-SNAPSHOT . SUCCESS [  6.151 s]
23:26:35 [INFO] org.eclipse.jst.ejb.ui.tests 1.0.0-SNAPSHOT ........ SUCCESS [ 11.335 s]
23:26:35 [INFO] org.eclipse.jem.tests 1.3.0-SNAPSHOT ............... SUCCESS [  8.539 s]
23:26:35 [INFO] org.eclipse.jst.j2ee.core.tests 1.1.600-SNAPSHOT ... FAILURE [ 44.594 s]
23:26:35 [INFO] org.eclipse.jst.j2ee.tests 1.1.800-SNAPSHOT ........ SKIPPED
23:26:35 [INFO] org.eclipse.jst.jee.tests 1.0.100-SNAPSHOT ......... SKIPPED
23:26:35 [INFO] org.eclipse.jst.servlet.tests 1.2.0-SNAPSHOT ....... SKIPPED
23:26:35 [INFO] org.eclipse.jst.validation.test 1.1.300-SNAPSHOT ... SUCCESS [ 15.460 s]
23:26:35 [INFO] org.eclipse.webtools.javaee.site 3.6.0-SNAPSHOT .... SKIPPED
23:26:35 [INFO] ------------------------------------------------------------------------
23:26:35 [INFO] BUILD FAILURE
23:26:35 [INFO] ------------------------------------------------------------------------
23:26:35 [INFO] Total time:  08:33 min
23:26:35 [INFO] Finished at: 2021-06-04T03:26:35Z
23:26:35 [INFO] ------------------------------------------------------------------------
23:26:35 [ERROR] Failed to execute goal org.eclipse.tycho:tycho-surefire-plugin:2.2.0:test (default-test) on project org.eclipse.jst.j2ee.core.tests: There are test failures.
23:26:35 [ERROR] 
23:26:35 [ERROR] Please refer to /home/jenkins/agent/workspace/webtools-javaee-gerrit_master/tests/org.eclipse.jst.j2ee.core.tests/target/surefire-reports for the individual test results.
23:26:35 [ERROR] -> [Help 1]
23:26:35 org.apache.maven.lifecycle.LifecycleExecutionException: Failed to execute goal org.eclipse.tycho:tycho-surefire-plugin:2.2.0:test (default-test) on project org.eclipse.jst.j2ee.core.tests: There are test failures.
23:26:35 
23:26:35 Please refer to /home/jenkins/agent/workspace/webtools-javaee-gerrit_master/tests/org.eclipse.jst.j2ee.core.tests/target/surefire-reports for the individual test results.
23:26:35     at org.apache.maven.lifecycle.internal.MojoExecutor.execute (MojoExecutor.java:215)
23:26:35     at org.apache.maven.lifecycle.internal.MojoExecutor.execute (MojoExecutor.java:156)
23:26:35     at org.apache.maven.lifecycle.internal.MojoExecutor.execute (MojoExecutor.java:148)
23:26:35     at org.apache.maven.lifecycle.internal.LifecycleModuleBuilder.buildProject (LifecycleModuleBuilder.java:117)
23:26:35     at org.apache.maven.lifecycle.internal.LifecycleModuleBuilder.buildProject (LifecycleModuleBuilder.java:81)
23:26:35     at org.apache.maven.lifecycle.internal.builder.singlethreaded.SingleThreadedBuilder.build (SingleThreadedBuilder.java:56)
23:26:35     at org.apache.maven.lifecycle.internal.LifecycleStarter.execute (LifecycleStarter.java:128)
23:26:35     at org.apache.maven.DefaultMaven.doExecute (DefaultMaven.java:305)
23:26:35     at org.apache.maven.DefaultMaven.doExecute (DefaultMaven.java:192)
23:26:35     at org.apache.maven.DefaultMaven.execute (DefaultMaven.java:105)
23:26:35     at org.apache.maven.cli.MavenCli.execute (MavenCli.java:957)
23:26:35     at org.apache.maven.cli.MavenCli.doMain (MavenCli.java:289)
23:26:35     at org.apache.maven.cli.MavenCli.main (MavenCli.java:193)
23:26:35     at jdk.internal.reflect.NativeMethodAccessorImpl.invoke0 (Native Method)
23:26:35     at jdk.internal.reflect.NativeMethodAccessorImpl.invoke (NativeMethodAccessorImpl.java:62)
23:26:35     at jdk.internal.reflect.DelegatingMethodAccessorImpl.invoke (DelegatingMethodAccessorImpl.java:43)
23:26:35     at java.lang.reflect.Method.invoke (Method.java:566)
23:26:35     at org.codehaus.plexus.classworlds.launcher.Launcher.launchEnhanced (Launcher.java:282)
23:26:35     at org.codehaus.plexus.classworlds.launcher.Launcher.launch (Launcher.java:225)
23:26:35     at org.codehaus.plexus.classworlds.launcher.Launcher.mainWithExitCode (Launcher.java:406)
23:26:35     at org.codehaus.plexus.classworlds.launcher.Launcher.main (Launcher.java:347)
23:26:35 Caused by: org.apache.maven.plugin.MojoFailureException: There are test failures.
23:26:35 
23:26:35 Please refer to /home/jenkins/agent/workspace/webtools-javaee-gerrit_master/tests/org.eclipse.jst.j2ee.core.tests/target/surefire-reports for the individual test results.
23:26:35     at org.eclipse.tycho.surefire.TestMojo.runTest (TestMojo.java:1070)
23:26:35     at org.eclipse.tycho.surefire.TestMojo.execute (TestMojo.java:714)
23:26:35     at org.apache.maven.plugin.DefaultBuildPluginManager.executeMojo (DefaultBuildPluginManager.java:137)
23:26:35     at org.apache.maven.lifecycle.internal.MojoExecutor.execute (MojoExecutor.java:210)
23:26:35     at org.apache.maven.lifecycle.internal.MojoExecutor.execute (MojoExecutor.java:156)
23:26:35     at org.apache.maven.lifecycle.internal.MojoExecutor.execute (MojoExecutor.java:148)
23:26:35     at org.apache.maven.lifecycle.internal.LifecycleModuleBuilder.buildProject (LifecycleModuleBuilder.java:117)
23:26:35     at org.apache.maven.lifecycle.internal.LifecycleModuleBuilder.buildProject (LifecycleModuleBuilder.java:81)
23:26:35     at org.apache.maven.lifecycle.internal.builder.singlethreaded.SingleThreadedBuilder.build (SingleThreadedBuilder.java:56)
23:26:35     at org.apache.maven.lifecycle.internal.LifecycleStarter.execute (LifecycleStarter.java:128)
23:26:35     at org.apache.maven.DefaultMaven.doExecute (DefaultMaven.java:305)
23:26:35     at org.apache.maven.DefaultMaven.doExecute (DefaultMaven.java:192)
23:26:35     at org.apache.maven.DefaultMaven.execute (DefaultMaven.java:105)
23:26:35     at org.apache.maven.cli.MavenCli.execute (MavenCli.java:957)
23:26:35     at org.apache.maven.cli.MavenCli.doMain (MavenCli.java:289)
23:26:35     at org.apache.maven.cli.MavenCli.main (MavenCli.java:193)
23:26:35     at jdk.internal.reflect.NativeMethodAccessorImpl.invoke0 (Native Method)
23:26:35     at jdk.internal.reflect.NativeMethodAccessorImpl.invoke (NativeMethodAccessorImpl.java:62)
23:26:35     at jdk.internal.reflect.DelegatingMethodAccessorImpl.invoke (DelegatingMethodAccessorImpl.java:43)
23:26:35     at java.lang.reflect.Method.invoke (Method.java:566)
23:26:35     at org.codehaus.plexus.classworlds.launcher.Launcher.launchEnhanced (Launcher.java:282)
23:26:35     at org.codehaus.plexus.classworlds.launcher.Launcher.launch (Launcher.java:225)
23:26:35     at org.codehaus.plexus.classworlds.launcher.Launcher.mainWithExitCode (Launcher.java:406)
23:26:35     at org.codehaus.plexus.classworlds.launcher.Launcher.main (Launcher.java:347)
23:26:35 [ERROR] 
23:26:35 [ERROR] Re-run Maven using the -X switch to enable full debug logging.
23:26:35 [ERROR] 
23:26:35 [ERROR] For more information about the errors and possible solutions, please read the following articles:
23:26:35 [ERROR] [Help 1] http://cwiki.apache.org/confluence/display/MAVEN/MojoFailureException
23:26:35 [ERROR] 
23:26:35 [ERROR] After correcting the problems, you can resume the build with the command
23:26:35 [ERROR]   mvn <args> -rf :org.eclipse.jst.j2ee.core.tests
23:26:35 Build step 'Invoke top-level Maven targets' marked build as failure
23:26:36 Taking screenshot.
23:26:36 [webtools-javaee-gerrit_master] $ echo $XAUTHORITY
23:26:36 /home/jenkins/agent/workspace/webtools-javaee-gerrit_master/.Xauthority-9691219527809656630
23:26:36 [webtools-javaee-gerrit_master] $ ls -l $XAUTHORITY
23:26:36 -rw-r--r--. 1 jenkins 1000750000 0 Jun  4 03:17 /home/jenkins/agent/workspace/webtools-javaee-gerrit_master/.Xauthority-9691219527809656630
23:26:36 [webtools-javaee-gerrit_master] $ import -window root -display :43 screenshot.jpg
23:26:36 Terminating xvnc.
23:26:38 Recording test results
23:26:52 [Checks API] No suitable checks publisher found.
23:26:53 Finished: FAILURE