Console Output

Skipping 641 KB.. Full Log
    	at java.base/java.lang.reflect.Method.invoke(Method.java:566)
08:40:27     	at junit.framework.TestCase.runTest(TestCase.java:177)
08:40:27     	at junit.framework.TestCase.runBare(TestCase.java:142)
08:40:27     	at junit.framework.TestResult$1.protect(TestResult.java:122)
08:40:27     	at junit.framework.TestResult.runProtected(TestResult.java:142)
08:40:27     	at junit.framework.TestResult.run(TestResult.java:125)
08:40:27     	at junit.framework.TestCase.run(TestCase.java:130)
08:40:27     	at junit.framework.TestSuite.runTest(TestSuite.java:241)
08:40:27     	at junit.framework.TestSuite.run(TestSuite.java:236)
08:40:27     	at org.junit.internal.runners.JUnit38ClassRunner.run(JUnit38ClassRunner.java:90)
08:40:27     	at org.apache.maven.surefire.junit4.JUnit4Provider.execute(JUnit4Provider.java:365)
08:40:27     	at org.apache.maven.surefire.junit4.JUnit4Provider.executeWithRerun(JUnit4Provider.java:273)
08:40:27     	at org.apache.maven.surefire.junit4.JUnit4Provider.executeTestSet(JUnit4Provider.java:238)
08:40:27     	at org.apache.maven.surefire.junit4.JUnit4Provider.invoke(JUnit4Provider.java:159)
08:40:27     	at java.base/jdk.internal.reflect.NativeMethodAccessorImpl.invoke0(Native Method)
08:40:27     	at java.base/jdk.internal.reflect.NativeMethodAccessorImpl.invoke(NativeMethodAccessorImpl.java:62)
08:40:27     	at java.base/jdk.internal.reflect.DelegatingMethodAccessorImpl.invoke(DelegatingMethodAccessorImpl.java:43)
08:40:27     	at java.base/java.lang.reflect.Method.invoke(Method.java:566)
08:40:27     	at org.apache.maven.surefire.util.ReflectionUtils.invokeMethodWithArray2(ReflectionUtils.java:206)
08:40:27     	at org.apache.maven.surefire.booter.ProviderFactory$ProviderProxy.invoke(ProviderFactory.java:161)
08:40:27     	at org.apache.maven.surefire.booter.ProviderFactory.invokeProvider(ProviderFactory.java:84)
08:40:27     	at org.eclipse.tycho.surefire.osgibooter.OsgiSurefireBooter.run(OsgiSurefireBooter.java:116)
08:40:27     	at org.eclipse.tycho.surefire.osgibooter.HeadlessTestApplication.start(HeadlessTestApplication.java:23)
08:40:27     	at org.eclipse.equinox.internal.app.EclipseAppHandle.run(EclipseAppHandle.java:203)
08:40:27     	at org.eclipse.core.runtime.internal.adaptor.EclipseAppLauncher.runApplication(EclipseAppLauncher.java:134)
08:40:27     	at org.eclipse.core.runtime.internal.adaptor.EclipseAppLauncher.start(EclipseAppLauncher.java:104)
08:40:27     	at org.eclipse.core.runtime.adaptor.EclipseStarter.run(EclipseStarter.java:401)
08:40:27     	at org.eclipse.core.runtime.adaptor.EclipseStarter.run(EclipseStarter.java:255)
08:40:27     	at java.base/jdk.internal.reflect.NativeMethodAccessorImpl.invoke0(Native Method)
08:40:27     	at java.base/jdk.internal.reflect.NativeMethodAccessorImpl.invoke(NativeMethodAccessorImpl.java:62)
08:40:27     	at java.base/jdk.internal.reflect.DelegatingMethodAccessorImpl.invoke(DelegatingMethodAccessorImpl.java:43)
08:40:27     	at java.base/java.lang.reflect.Method.invoke(Method.java:566)
08:40:27     	at org.eclipse.equinox.launcher.Main.invokeFramework(Main.java:654)
08:40:27     	at org.eclipse.equinox.launcher.Main.basicRun(Main.java:591)
08:40:27     	at org.eclipse.equinox.launcher.Main.run(Main.java:1462)
08:40:27     	at org.eclipse.equinox.launcher.Main.main(Main.java:1435)
08:40:27 
08:40:27 *** ERROR ***: Wed Jun 02 12:40:27 UTC 2021    IWAE0037E Could not open /home/jenkins/agent/workspace/webtools-javaee-gerrit_master/tests/org.eclipse.jst.j2ee.core.tests/commonArchiveResources/WSSecured_InsuranceServices_EJB_WS.ear
08:40:27 
08:40:27 *** ERROR ***: Wed Jun 02 12:40:27 UTC 2021    java.io.FileNotFoundException: IWAE0036E URI Name: /home/jenkins/agent/workspace/webtools-javaee-gerrit_master/tests/org.eclipse.jst.j2ee.core.tests/commonArchiveResources/WSSecured_InsuranceServices_EJB_WS.ear; File name: /home/jenkins/agent/workspace/webtools-javaee-gerrit_master/tests/org.eclipse.jst.j2ee.core.tests/commonArchiveResources/WSSecured_InsuranceServices_EJB_WS.ear
08:40:27     	at org.eclipse.jst.j2ee.commonarchivecore.internal.impl.CommonarchiveFactoryImpl.createLoadStrategy(CommonarchiveFactoryImpl.java:342)
08:40:27     	at org.eclipse.jst.j2ee.commonarchivecore.internal.impl.CommonarchiveFactoryImpl.primOpenArchive(CommonarchiveFactoryImpl.java:876)
08:40:27     	at org.eclipse.jst.j2ee.commonarchivecore.internal.impl.CommonarchiveFactoryImpl.openEARFile(CommonarchiveFactoryImpl.java:639)
08:40:27     	at org.eclipse.jst.j2ee.archive.test.DefectVerificationTests.testServiceQNameTranslator(DefectVerificationTests.java:216)
08:40:27     	at java.base/jdk.internal.reflect.NativeMethodAccessorImpl.invoke0(Native Method)
08:40:27     	at java.base/jdk.internal.reflect.NativeMethodAccessorImpl.invoke(NativeMethodAccessorImpl.java:62)
08:40:27     	at java.base/jdk.internal.reflect.DelegatingMethodAccessorImpl.invoke(DelegatingMethodAccessorImpl.java:43)
08:40:27     	at java.base/java.lang.reflect.Method.invoke(Method.java:566)
08:40:27     	at junit.framework.TestCase.runTest(TestCase.java:177)
08:40:27     	at junit.framework.TestCase.runBare(TestCase.java:142)
08:40:27     	at junit.framework.TestResult$1.protect(TestResult.java:122)
08:40:27     	at junit.framework.TestResult.runProtected(TestResult.java:142)
08:40:27     	at junit.framework.TestResult.run(TestResult.java:125)
08:40:27     	at junit.framework.TestCase.run(TestCase.java:130)
08:40:27     	at junit.framework.TestSuite.runTest(TestSuite.java:241)
08:40:27     	at junit.framework.TestSuite.run(TestSuite.java:236)
08:40:27     	at org.junit.internal.runners.JUnit38ClassRunner.run(JUnit38ClassRunner.java:90)
08:40:27     	at org.apache.maven.surefire.junit4.JUnit4Provider.execute(JUnit4Provider.java:365)
08:40:27     	at org.apache.maven.surefire.junit4.JUnit4Provider.executeWithRerun(JUnit4Provider.java:273)
08:40:27     	at org.apache.maven.surefire.junit4.JUnit4Provider.executeTestSet(JUnit4Provider.java:238)
08:40:27     	at org.apache.maven.surefire.junit4.JUnit4Provider.invoke(JUnit4Provider.java:159)
08:40:27     	at java.base/jdk.internal.reflect.NativeMethodAccessorImpl.invoke0(Native Method)
08:40:27     	at java.base/jdk.internal.reflect.NativeMethodAccessorImpl.invoke(NativeMethodAccessorImpl.java:62)
08:40:27     	at java.base/jdk.internal.reflect.DelegatingMethodAccessorImpl.invoke(DelegatingMethodAccessorImpl.java:43)
08:40:27     	at java.base/java.lang.reflect.Method.invoke(Method.java:566)
08:40:27     	at org.apache.maven.surefire.util.ReflectionUtils.invokeMethodWithArray2(ReflectionUtils.java:206)
08:40:27     	at org.apache.maven.surefire.booter.ProviderFactory$ProviderProxy.invoke(ProviderFactory.java:161)
08:40:27     	at org.apache.maven.surefire.booter.ProviderFactory.invokeProvider(ProviderFactory.java:84)
08:40:27     	at org.eclipse.tycho.surefire.osgibooter.OsgiSurefireBooter.run(OsgiSurefireBooter.java:116)
08:40:27     	at org.eclipse.tycho.surefire.osgibooter.HeadlessTestApplication.start(HeadlessTestApplication.java:23)
08:40:27     	at org.eclipse.equinox.internal.app.EclipseAppHandle.run(EclipseAppHandle.java:203)
08:40:27     	at org.eclipse.core.runtime.internal.adaptor.EclipseAppLauncher.runApplication(EclipseAppLauncher.java:134)
08:40:27     	at org.eclipse.core.runtime.internal.adaptor.EclipseAppLauncher.start(EclipseAppLauncher.java:104)
08:40:27     	at org.eclipse.core.runtime.adaptor.EclipseStarter.run(EclipseStarter.java:401)
08:40:27     	at org.eclipse.core.runtime.adaptor.EclipseStarter.run(EclipseStarter.java:255)
08:40:27     	at java.base/jdk.internal.reflect.NativeMethodAccessorImpl.invoke0(Native Method)
08:40:27     	at java.base/jdk.internal.reflect.NativeMethodAccessorImpl.invoke(NativeMethodAccessorImpl.java:62)
08:40:27     	at java.base/jdk.internal.reflect.DelegatingMethodAccessorImpl.invoke(DelegatingMethodAccessorImpl.java:43)
08:40:27     	at java.base/java.lang.reflect.Method.invoke(Method.java:566)
08:40:27     	at org.eclipse.equinox.launcher.Main.invokeFramework(Main.java:654)
08:40:27     	at org.eclipse.equinox.launcher.Main.basicRun(Main.java:591)
08:40:27     	at org.eclipse.equinox.launcher.Main.run(Main.java:1462)
08:40:27     	at org.eclipse.equinox.launcher.Main.main(Main.java:1435)
08:40:27 
08:40:27 *** ERROR ***: Wed Jun 02 12:40:27 UTC 2021    java.io.FileNotFoundException: IWAE0036E URI Name: /home/jenkins/agent/workspace/webtools-javaee-gerrit_master/tests/org.eclipse.jst.j2ee.core.tests/commonArchiveResources/WSSecured_InsuranceServices_EJB_WS.ear; File name: /home/jenkins/agent/workspace/webtools-javaee-gerrit_master/tests/org.eclipse.jst.j2ee.core.tests/commonArchiveResources/WSSecured_InsuranceServices_EJB_WS.ear
08:40:27     	at org.eclipse.jst.j2ee.commonarchivecore.internal.impl.CommonarchiveFactoryImpl.createLoadStrategy(CommonarchiveFactoryImpl.java:342)
08:40:27     	at org.eclipse.jst.j2ee.commonarchivecore.internal.impl.CommonarchiveFactoryImpl.primOpenArchive(CommonarchiveFactoryImpl.java:876)
08:40:27     	at org.eclipse.jst.j2ee.commonarchivecore.internal.impl.CommonarchiveFactoryImpl.openEARFile(CommonarchiveFactoryImpl.java:639)
08:40:27     	at org.eclipse.jst.j2ee.archive.test.DefectVerificationTests.testServiceQNameTranslator(DefectVerificationTests.java:216)
08:40:27     	at java.base/jdk.internal.reflect.NativeMethodAccessorImpl.invoke0(Native Method)
08:40:27     	at java.base/jdk.internal.reflect.NativeMethodAccessorImpl.invoke(NativeMethodAccessorImpl.java:62)
08:40:27     	at java.base/jdk.internal.reflect.DelegatingMethodAccessorImpl.invoke(DelegatingMethodAccessorImpl.java:43)
08:40:27     	at java.base/java.lang.reflect.Method.invoke(Method.java:566)
08:40:27     	at junit.framework.TestCase.runTest(TestCase.java:177)
08:40:27     	at junit.framework.TestCase.runBare(TestCase.java:142)
08:40:27     	at junit.framework.TestResult$1.protect(TestResult.java:122)
08:40:27     	at junit.framework.TestResult.runProtected(TestResult.java:142)
08:40:27     	at junit.framework.TestResult.run(TestResult.java:125)
08:40:27     	at junit.framework.TestCase.run(TestCase.java:130)
08:40:27     	at junit.framework.TestSuite.runTest(TestSuite.java:241)
08:40:27     	at junit.framework.TestSuite.run(TestSuite.java:236)
08:40:27     	at org.junit.internal.runners.JUnit38ClassRunner.run(JUnit38ClassRunner.java:90)
08:40:27     	at org.apache.maven.surefire.junit4.JUnit4Provider.execute(JUnit4Provider.java:365)
08:40:27     	at org.apache.maven.surefire.junit4.JUnit4Provider.executeWithRerun(JUnit4Provider.java:273)
08:40:27     	at org.apache.maven.surefire.junit4.JUnit4Provider.executeTestSet(JUnit4Provider.java:238)
08:40:27     	at org.apache.maven.surefire.junit4.JUnit4Provider.invoke(JUnit4Provider.java:159)
08:40:27     	at java.base/jdk.internal.reflect.NativeMethodAccessorImpl.invoke0(Native Method)
08:40:27     	at java.base/jdk.internal.reflect.NativeMethodAccessorImpl.invoke(NativeMethodAccessorImpl.java:62)
08:40:27     	at java.base/jdk.internal.reflect.DelegatingMethodAccessorImpl.invoke(DelegatingMethodAccessorImpl.java:43)
08:40:27     	at java.base/java.lang.reflect.Method.invoke(Method.java:566)
08:40:27     	at org.apache.maven.surefire.util.ReflectionUtils.invokeMethodWithArray2(ReflectionUtils.java:206)
08:40:27     	at org.apache.maven.surefire.booter.ProviderFactory$ProviderProxy.invoke(ProviderFactory.java:161)
08:40:27     	at org.apache.maven.surefire.booter.ProviderFactory.invokeProvider(ProviderFactory.java:84)
08:40:27     	at org.eclipse.tycho.surefire.osgibooter.OsgiSurefireBooter.run(OsgiSurefireBooter.java:116)
08:40:27     	at org.eclipse.tycho.surefire.osgibooter.HeadlessTestApplication.start(HeadlessTestApplication.java:23)
08:40:27     	at org.eclipse.equinox.internal.app.EclipseAppHandle.run(EclipseAppHandle.java:203)
08:40:27     	at org.eclipse.core.runtime.internal.adaptor.EclipseAppLauncher.runApplication(EclipseAppLauncher.java:134)
08:40:27     	at org.eclipse.core.runtime.internal.adaptor.EclipseAppLauncher.start(EclipseAppLauncher.java:104)
08:40:27     	at org.eclipse.core.runtime.adaptor.EclipseStarter.run(EclipseStarter.java:401)
08:40:27     	at org.eclipse.core.runtime.adaptor.EclipseStarter.run(EclipseStarter.java:255)
08:40:27     	at java.base/jdk.internal.reflect.NativeMethodAccessorImpl.invoke0(Native Method)
08:40:27     	at java.base/jdk.internal.reflect.NativeMethodAccessorImpl.invoke(NativeMethodAccessorImpl.java:62)
08:40:27     	at java.base/jdk.internal.reflect.DelegatingMethodAccessorImpl.invoke(DelegatingMethodAccessorImpl.java:43)
08:40:27     	at java.base/java.lang.reflect.Method.invoke(Method.java:566)
08:40:27     	at org.eclipse.equinox.launcher.Main.invokeFramework(Main.java:654)
08:40:27     	at org.eclipse.equinox.launcher.Main.basicRun(Main.java:591)
08:40:27     	at org.eclipse.equinox.launcher.Main.run(Main.java:1462)
08:40:27     	at org.eclipse.equinox.launcher.Main.main(Main.java:1435)
08:40:27 
08:40:27 *** ERROR ***: Wed Jun 02 12:40:27 UTC 2021    IWAE0037E Could not open /home/jenkins/agent/workspace/webtools-javaee-gerrit_master/tests/org.eclipse.jst.j2ee.core.tests/commonArchiveResources/WSSecured_InsuranceServices_EJB_WS.ear
08:40:27     IWAE0036E URI Name: /home/jenkins/agent/workspace/webtools-javaee-gerrit_master/tests/org.eclipse.jst.j2ee.core.tests/commonArchiveResources/WSSecured_InsuranceServices_EJB_WS.ear; File name: /home/jenkins/agent/workspace/webtools-javaee-gerrit_master/tests/org.eclipse.jst.j2ee.core.tests/commonArchiveResources/WSSecured_InsuranceServices_EJB_WS.ear
08:40:27 Tests run: 7, Failures: 0, Errors: 5, Skipped: 0, Time elapsed: 0.017 s <<< FAILURE! - in org.eclipse.jst.j2ee.archive.test.DefectVerificationTests
08:40:27 testSavingEARWhileDeploying(org.eclipse.jst.j2ee.archive.test.DefectVerificationTests)  Time elapsed: 0.003 s  <<< ERROR!
08:40:27 org.eclipse.jst.j2ee.commonarchivecore.internal.exception.OpenFailureException: IWAE0037E Could not open /home/jenkins/agent/workspace/webtools-javaee-gerrit_master/tests/org.eclipse.jst.j2ee.core.tests/commonArchiveResources/AuctionApp.ear
08:40:27 	at org.eclipse.jst.j2ee.archive.test.DefectVerificationTests.testSavingEARWhileDeploying(DefectVerificationTests.java:172)
08:40:27 Caused by: java.io.FileNotFoundException: IWAE0036E URI Name: /home/jenkins/agent/workspace/webtools-javaee-gerrit_master/tests/org.eclipse.jst.j2ee.core.tests/commonArchiveResources/AuctionApp.ear; File name: /home/jenkins/agent/workspace/webtools-javaee-gerrit_master/tests/org.eclipse.jst.j2ee.core.tests/commonArchiveResources/AuctionApp.ear
08:40:27 	at org.eclipse.jst.j2ee.archive.test.DefectVerificationTests.testSavingEARWhileDeploying(DefectVerificationTests.java:172)
08:40:27 
08:40:27 testFilterMappingTranslator(org.eclipse.jst.j2ee.archive.test.DefectVerificationTests)  Time elapsed: 0.001 s  <<< ERROR!
08:40:27 org.eclipse.jst.j2ee.commonarchivecore.internal.exception.OpenFailureException: IWAE0037E Could not open /home/jenkins/agent/workspace/webtools-javaee-gerrit_master/tests/org.eclipse.jst.j2ee.core.tests/commonArchiveResources/QIDefectsNew.ear
08:40:27 	at org.eclipse.jst.j2ee.archive.test.DefectVerificationTests.testFilterMappingTranslator(DefectVerificationTests.java:83)
08:40:27 Caused by: java.io.FileNotFoundException: IWAE0036E URI Name: /home/jenkins/agent/workspace/webtools-javaee-gerrit_master/tests/org.eclipse.jst.j2ee.core.tests/commonArchiveResources/QIDefectsNew.ear; File name: /home/jenkins/agent/workspace/webtools-javaee-gerrit_master/tests/org.eclipse.jst.j2ee.core.tests/commonArchiveResources/QIDefectsNew.ear
08:40:27 	at org.eclipse.jst.j2ee.archive.test.DefectVerificationTests.testFilterMappingTranslator(DefectVerificationTests.java:83)
08:40:27 
08:40:27 testReadCrimsonCase(org.eclipse.jst.j2ee.archive.test.DefectVerificationTests)  Time elapsed: 0.001 s  <<< ERROR!
08:40:27 org.eclipse.jst.j2ee.commonarchivecore.internal.exception.OpenFailureException: IWAE0037E Could not open /home/jenkins/agent/workspace/webtools-javaee-gerrit_master/tests/org.eclipse.jst.j2ee.core.tests/commonArchiveResources/ejb_sam_Hello.ear
08:40:27 	at org.eclipse.jst.j2ee.archive.test.DefectVerificationTests.testReadCrimsonCase(DefectVerificationTests.java:261)
08:40:27 Caused by: java.io.FileNotFoundException: IWAE0036E URI Name: /home/jenkins/agent/workspace/webtools-javaee-gerrit_master/tests/org.eclipse.jst.j2ee.core.tests/commonArchiveResources/ejb_sam_Hello.ear; File name: /home/jenkins/agent/workspace/webtools-javaee-gerrit_master/tests/org.eclipse.jst.j2ee.core.tests/commonArchiveResources/ejb_sam_Hello.ear
08:40:27 	at org.eclipse.jst.j2ee.archive.test.DefectVerificationTests.testReadCrimsonCase(DefectVerificationTests.java:261)
08:40:27 
08:40:27 testFormerDefect297(org.eclipse.jst.j2ee.archive.test.DefectVerificationTests)  Time elapsed: 0 s  <<< ERROR!
08:40:27 org.eclipse.jst.j2ee.commonarchivecore.internal.exception.OpenFailureException: IWAE0037E Could not open /home/jenkins/agent/workspace/webtools-javaee-gerrit_master/tests/org.eclipse.jst.j2ee.core.tests/commonArchiveResources/sample.ear
08:40:27 	at org.eclipse.jst.j2ee.archive.test.DefectVerificationTests.testFormerDefect297(DefectVerificationTests.java:109)
08:40:27 Caused by: java.io.FileNotFoundException: IWAE0036E URI Name: /home/jenkins/agent/workspace/webtools-javaee-gerrit_master/tests/org.eclipse.jst.j2ee.core.tests/commonArchiveResources/sample.ear; File name: /home/jenkins/agent/workspace/webtools-javaee-gerrit_master/tests/org.eclipse.jst.j2ee.core.tests/commonArchiveResources/sample.ear
08:40:27 	at org.eclipse.jst.j2ee.archive.test.DefectVerificationTests.testFormerDefect297(DefectVerificationTests.java:109)
08:40:27 
08:40:27 testServiceQNameTranslator(org.eclipse.jst.j2ee.archive.test.DefectVerificationTests)  Time elapsed: 0.001 s  <<< ERROR!
08:40:27 org.eclipse.jst.j2ee.commonarchivecore.internal.exception.OpenFailureException: IWAE0037E Could not open /home/jenkins/agent/workspace/webtools-javaee-gerrit_master/tests/org.eclipse.jst.j2ee.core.tests/commonArchiveResources/WSSecured_InsuranceServices_EJB_WS.ear
08:40:27 	at org.eclipse.jst.j2ee.archive.test.DefectVerificationTests.testServiceQNameTranslator(DefectVerificationTests.java:216)
08:40:27 Caused by: java.io.FileNotFoundException: IWAE0036E URI Name: /home/jenkins/agent/workspace/webtools-javaee-gerrit_master/tests/org.eclipse.jst.j2ee.core.tests/commonArchiveResources/WSSecured_InsuranceServices_EJB_WS.ear; File name: /home/jenkins/agent/workspace/webtools-javaee-gerrit_master/tests/org.eclipse.jst.j2ee.core.tests/commonArchiveResources/WSSecured_InsuranceServices_EJB_WS.ear
08:40:27 	at org.eclipse.jst.j2ee.archive.test.DefectVerificationTests.testServiceQNameTranslator(DefectVerificationTests.java:216)
08:40:27 
08:40:27 testCreatingEARFile(org.eclipse.jst.j2ee.archive.test.DefectVerificationTests)  Time elapsed: 0 s
08:40:27 testFormerDefect1459(org.eclipse.jst.j2ee.archive.test.DefectVerificationTests)  Time elapsed: 0.009 s
08:40:27 Running org.eclipse.jst.j2ee.archive.test.SecurityRoleTests
08:40:27 Tests run: 2, Failures: 0, Errors: 2, Skipped: 0, Time elapsed: 0.002 s <<< FAILURE! - in org.eclipse.jst.j2ee.archive.test.SecurityRoleTests
08:40:27 testRollupAddAndPushDown(org.eclipse.jst.j2ee.archive.test.SecurityRoleTests)  Time elapsed: 0 s  <<< ERROR!
08:40:27 org.eclipse.jst.j2ee.commonarchivecore.internal.exception.OpenFailureException: IWAE0037E Could not open /home/jenkins/agent/workspace/webtools-javaee-gerrit_master/tests/org.eclipse.jst.j2ee.core.tests/commonArchiveResources/sample.ear
08:40:27 	at org.eclipse.jst.j2ee.archive.test.SecurityRoleTests.testRollupAddAndPushDown(SecurityRoleTests.java:73)
08:40:27 Caused by: java.io.FileNotFoundException: IWAE0036E URI Name: /home/jenkins/agent/workspace/webtools-javaee-gerrit_master/tests/org.eclipse.jst.j2ee.core.tests/commonArchiveResources/sample.ear; File name: /home/jenkins/agent/workspace/webtools-javaee-gerrit_master/tests/org.eclipse.jst.j2ee.core.tests/commonArchiveResources/sample.ear
08:40:27 	at org.eclipse.jst.j2ee.archive.test.SecurityRoleTests.testRollupAddAndPushDown(SecurityRoleTests.java:73)
08:40:27 
08:40:27 testPushDownCopy(org.eclipse.jst.j2ee.archive.test.SecurityRoleTests)  Time elapsed: 0.001 s  <<< ERROR!
08:40:27 org.eclipse.jst.j2ee.commonarchivecore.internal.exception.OpenFailureException: IWAE0037E Could not open /home/jenkins/agent/workspace/webtools-javaee-gerrit_master/tests/org.eclipse.jst.j2ee.core.tests/commonArchiveResources/sample.ear
08:40:27 	at org.eclipse.jst.j2ee.archive.test.SecurityRoleTests.testPushDownCopy(SecurityRoleTests.java:53)
08:40:27 Caused by: java.io.FileNotFoundException: IWAE0036E URI Name: /home/jenkins/agent/workspace/webtools-javaee-gerrit_master/tests/org.eclipse.jst.j2ee.core.tests/commonArchiveResources/sample.ear; File name: /home/jenkins/agent/workspace/webtools-javaee-gerrit_master/tests/org.eclipse.jst.j2ee.core.tests/commonArchiveResources/sample.ear
08:40:27 	at org.eclipse.jst.j2ee.archive.test.SecurityRoleTests.testPushDownCopy(SecurityRoleTests.java:53)
08:40:27 
08:40:27 Running org.eclipse.jst.j2ee.archive.test.TestInvalidXmlMultiplicity
08:40:27 Tests run: 3, Failures: 0, Errors: 0, Skipped: 0, Time elapsed: 0.044 s - in org.eclipse.jst.j2ee.archive.test.TestInvalidXmlMultiplicity
08:40:27 test1(org.eclipse.jst.j2ee.archive.test.TestInvalidXmlMultiplicity)  Time elapsed: 0 s
08:40:27 test2(org.eclipse.jst.j2ee.archive.test.TestInvalidXmlMultiplicity)  Time elapsed: 0 s
08:40:27 test3(org.eclipse.jst.j2ee.archive.test.TestInvalidXmlMultiplicity)  Time elapsed: 0.001 s
08:40:27 Running org.eclipse.jst.j2ee.archive.test.CopyTests
08:40:27 Tests run: 6, Failures: 0, Errors: 6, Skipped: 0, Time elapsed: 0.002 s <<< FAILURE! - in org.eclipse.jst.j2ee.archive.test.CopyTests
08:40:27 testAddCopyModuleFilesToEAR(org.eclipse.jst.j2ee.archive.test.CopyTests)  Time elapsed: 0 s  <<< ERROR!
08:40:27 org.eclipse.jst.j2ee.commonarchivecore.internal.exception.OpenFailureException: IWAE0037E Could not open /home/jenkins/agent/workspace/webtools-javaee-gerrit_master/tests/org.eclipse.jst.j2ee.core.tests/commonArchiveResources/bankejbs.jar
08:40:27 	at org.eclipse.jst.j2ee.archive.test.CopyTests.testAddCopyModuleFilesToEAR(CopyTests.java:139)
08:40:27 Caused by: java.io.FileNotFoundException: IWAE0036E URI Name: /home/jenkins/agent/workspace/webtools-javaee-gerrit_master/tests/org.eclipse.jst.j2ee.core.tests/commonArchiveResources/bankejbs.jar; File name: /home/jenkins/agent/workspace/webtools-javaee-gerrit_master/tests/org.eclipse.jst.j2ee.core.tests/commonArchiveResources/bankejbs.jar
08:40:27 	at org.eclipse.jst.j2ee.archive.test.CopyTests.testAddCopyModuleFilesToEAR(CopyTests.java:139)
08:40:27 
08:40:27 testAddRenameAndDeleteStandalone(org.eclipse.jst.j2ee.archive.test.CopyTests)  Time elapsed: 0 s  <<< ERROR!
08:40:27 org.eclipse.jst.j2ee.commonarchivecore.internal.exception.OpenFailureException: IWAE0037E Could not open /home/jenkins/agent/workspace/webtools-javaee-gerrit_master/tests/org.eclipse.jst.j2ee.core.tests/commonArchiveResources/bankejbs.jar
08:40:27 	at org.eclipse.jst.j2ee.archive.test.CopyTests.testAddRenameAndDeleteStandalone(CopyTests.java:218)
08:40:27 Caused by: java.io.FileNotFoundException: IWAE0036E URI Name: /home/jenkins/agent/workspace/webtools-javaee-gerrit_master/tests/org.eclipse.jst.j2ee.core.tests/commonArchiveResources/bankejbs.jar; File name: /home/jenkins/agent/workspace/webtools-javaee-gerrit_master/tests/org.eclipse.jst.j2ee.core.tests/commonArchiveResources/bankejbs.jar
08:40:27 	at org.eclipse.jst.j2ee.archive.test.CopyTests.testAddRenameAndDeleteStandalone(CopyTests.java:218)
08:40:27 
08:40:27 testAddCopyDirectory(org.eclipse.jst.j2ee.archive.test.CopyTests)  Time elapsed: 0 s  <<< ERROR!
08:40:27 org.eclipse.jst.j2ee.commonarchivecore.internal.exception.OpenFailureException: IWAE0037E Could not open /home/jenkins/agent/workspace/webtools-javaee-gerrit_master/tests/org.eclipse.jst.j2ee.core.tests/commonArchiveResources/example2.war
08:40:27 	at org.eclipse.jst.j2ee.archive.test.CopyTests.testAddCopyDirectory(CopyTests.java:78)
08:40:27 Caused by: java.io.FileNotFoundException: IWAE0036E URI Name: /home/jenkins/agent/workspace/webtools-javaee-gerrit_master/tests/org.eclipse.jst.j2ee.core.tests/commonArchiveResources/example2.war; File name: /home/jenkins/agent/workspace/webtools-javaee-gerrit_master/tests/org.eclipse.jst.j2ee.core.tests/commonArchiveResources/example2.war
08:40:27 	at org.eclipse.jst.j2ee.archive.test.CopyTests.testAddCopyDirectory(CopyTests.java:78)
08:40:27 
08:40:27 testAddCopyModule(org.eclipse.jst.j2ee.archive.test.CopyTests)  Time elapsed: 0.001 s  <<< ERROR!
08:40:27 org.eclipse.jst.j2ee.commonarchivecore.internal.exception.OpenFailureException: IWAE0037E Could not open /home/jenkins/agent/workspace/webtools-javaee-gerrit_master/tests/org.eclipse.jst.j2ee.core.tests/commonArchiveResources/sample.ear
08:40:27 	at org.eclipse.jst.j2ee.archive.test.CopyTests.testAddCopyModule(CopyTests.java:100)
08:40:27 Caused by: java.io.FileNotFoundException: IWAE0036E URI Name: /home/jenkins/agent/workspace/webtools-javaee-gerrit_master/tests/org.eclipse.jst.j2ee.core.tests/commonArchiveResources/sample.ear; File name: /home/jenkins/agent/workspace/webtools-javaee-gerrit_master/tests/org.eclipse.jst.j2ee.core.tests/commonArchiveResources/sample.ear
08:40:27 	at org.eclipse.jst.j2ee.archive.test.CopyTests.testAddCopyModule(CopyTests.java:100)
08:40:27 
08:40:27 testAddRenameAndDelete(org.eclipse.jst.j2ee.archive.test.CopyTests)  Time elapsed: 0 s  <<< ERROR!
08:40:27 org.eclipse.jst.j2ee.commonarchivecore.internal.exception.OpenFailureException: IWAE0037E Could not open /home/jenkins/agent/workspace/webtools-javaee-gerrit_master/tests/org.eclipse.jst.j2ee.core.tests/commonArchiveResources/sample.ear
08:40:27 	at org.eclipse.jst.j2ee.archive.test.CopyTests.testAddRenameAndDelete(CopyTests.java:184)
08:40:27 Caused by: java.io.FileNotFoundException: IWAE0036E URI Name: /home/jenkins/agent/workspace/webtools-javaee-gerrit_master/tests/org.eclipse.jst.j2ee.core.tests/commonArchiveResources/sample.ear; File name: /home/jenkins/agent/workspace/webtools-javaee-gerrit_master/tests/org.eclipse.jst.j2ee.core.tests/commonArchiveResources/sample.ear
08:40:27 	at org.eclipse.jst.j2ee.archive.test.CopyTests.testAddRenameAndDelete(CopyTests.java:184)
08:40:27 
08:40:27 testAddCopyStandaloneModule(org.eclipse.jst.j2ee.archive.test.CopyTests)  Time elapsed: 0 s  <<< ERROR!
08:40:27 org.eclipse.jst.j2ee.commonarchivecore.internal.exception.OpenFailureException: IWAE0037E Could not open /home/jenkins/agent/workspace/webtools-javaee-gerrit_master/tests/org.eclipse.jst.j2ee.core.tests/commonArchiveResources/bankejbs.jar
08:40:27 	at org.eclipse.jst.j2ee.archive.test.CopyTests.testAddCopyStandaloneModule(CopyTests.java:167)
08:40:27 Caused by: java.io.FileNotFoundException: IWAE0036E URI Name: /home/jenkins/agent/workspace/webtools-javaee-gerrit_master/tests/org.eclipse.jst.j2ee.core.tests/commonArchiveResources/bankejbs.jar; File name: /home/jenkins/agent/workspace/webtools-javaee-gerrit_master/tests/org.eclipse.jst.j2ee.core.tests/commonArchiveResources/bankejbs.jar
08:40:27 	at org.eclipse.jst.j2ee.archive.test.CopyTests.testAddCopyStandaloneModule(CopyTests.java:167)
08:40:27 
08:40:27 Running org.eclipse.jst.j2ee.archive.test.ResourceTests
08:40:27 Tests run: 2, Failures: 1, Errors: 1, Skipped: 0, Time elapsed: 0.055 s <<< FAILURE! - in org.eclipse.jst.j2ee.archive.test.ResourceTests
08:40:27 testResourceDirty(org.eclipse.jst.j2ee.archive.test.ResourceTests)  Time elapsed: 0 s  <<< ERROR!
08:40:27 org.eclipse.jst.j2ee.commonarchivecore.internal.exception.OpenFailureException: IWAE0037E Could not open /home/jenkins/agent/workspace/webtools-javaee-gerrit_master/tests/org.eclipse.jst.j2ee.core.tests/commonArchiveResources/bankejbs.jar
08:40:27 	at org.eclipse.jst.j2ee.archive.test.ResourceTests.testResourceDirty(ResourceTests.java:95)
08:40:27 Caused by: java.io.FileNotFoundException: IWAE0036E URI Name: /home/jenkins/agent/workspace/webtools-javaee-gerrit_master/tests/org.eclipse.jst.j2ee.core.tests/commonArchiveResources/bankejbs.jar; File name: /home/jenkins/agent/workspace/webtools-javaee-gerrit_master/tests/org.eclipse.jst.j2ee.core.tests/commonArchiveResources/bankejbs.jar
08:40:27 	at org.eclipse.jst.j2ee.archive.test.ResourceTests.testResourceDirty(ResourceTests.java:95)
08:40:27 
08:40:27 testResourceCreation(org.eclipse.jst.j2ee.archive.test.ResourceTests)  Time elapsed: 0.054 s  <<< FAILURE!
08:40:27 junit.framework.AssertionFailedError: The resource should be unloaded
08:40:27 	at org.eclipse.jst.j2ee.archive.test.ResourceTests.testResourceCreation(ResourceTests.java:76)
08:40:27 
08:40:27 Running org.eclipse.jst.j2ee.archive.test.SaveTests
08:40:27 Tests run: 2, Failures: 0, Errors: 2, Skipped: 0, Time elapsed: 0.002 s <<< FAILURE! - in org.eclipse.jst.j2ee.archive.test.SaveTests
08:40:27 testSave(org.eclipse.jst.j2ee.archive.test.SaveTests)  Time elapsed: 0 s  <<< ERROR!
08:40:27 org.eclipse.jst.j2ee.commonarchivecore.internal.exception.OpenFailureException: IWAE0037E Could not open /home/jenkins/agent/workspace/webtools-javaee-gerrit_master/tests/org.eclipse.jst.j2ee.core.tests/commonArchiveResources/example2.war
08:40:27 	at org.eclipse.jst.j2ee.archive.test.SaveTests.testSave(SaveTests.java:63)
08:40:27 Caused by: java.io.FileNotFoundException: IWAE0036E URI Name: /home/jenkins/agent/workspace/webtools-javaee-gerrit_master/tests/org.eclipse.jst.j2ee.core.tests/commonArchiveResources/example2.war; File name: /home/jenkins/agent/workspace/webtools-javaee-gerrit_master/tests/org.eclipse.jst.j2ee.core.tests/commonArchiveResources/example2.war
08:40:27 	at org.eclipse.jst.j2ee.archive.test.SaveTests.testSave(SaveTests.java:63)
08:40:27 
08:40:27 testSaveDirectory(org.eclipse.jst.j2ee.archive.test.SaveTests)  Time elapsed: 0 s  <<< ERROR!
08:40:27 org.eclipse.jst.j2ee.commonarchivecore.internal.exception.OpenFailureException: IWAE0037E Could not open /home/jenkins/agent/workspace/webtools-javaee-gerrit_master/tests/org.eclipse.jst.j2ee.core.tests/commonArchiveResources/sample.ear
08:40:27 	at org.eclipse.jst.j2ee.archive.test.SaveTests.testSaveDirectory(SaveTests.java:93)
08:40:27 Caused by: java.io.FileNotFoundException: IWAE0036E URI Name: /home/jenkins/agent/workspace/webtools-javaee-gerrit_master/tests/org.eclipse.jst.j2ee.core.tests/commonArchiveResources/sample.ear; File name: /home/jenkins/agent/workspace/webtools-javaee-gerrit_master/tests/org.eclipse.jst.j2ee.core.tests/commonArchiveResources/sample.ear
08:40:27 	at org.eclipse.jst.j2ee.archive.test.SaveTests.testSaveDirectory(SaveTests.java:93)
08:40:27 
08:40:27 Running org.eclipse.jst.j2ee.archive.test.ClientContainerResourceLoadTest
08:40:27 org.eclipse.jst.j2ee.commonarchivecore.internal.exception.OpenFailureException: IWAE0037E Could not open /home/jenkins/agent/workspace/webtools-javaee-gerrit_master/tests/org.eclipse.jst.j2ee.core.tests/commonArchiveResources/mtapp2.ear
08:40:27 Stack trace of nested exception:
08:40:27 java.io.FileNotFoundException: IWAE0036E URI Name: /home/jenkins/agent/workspace/webtools-javaee-gerrit_master/tests/org.eclipse.jst.j2ee.core.tests/commonArchiveResources/mtapp2.ear; File name: /home/jenkins/agent/workspace/webtools-javaee-gerrit_master/tests/org.eclipse.jst.j2ee.core.tests/commonArchiveResources/mtapp2.ear
08:40:27 	at org.eclipse.jst.j2ee.commonarchivecore.internal.impl.CommonarchiveFactoryImpl.createLoadStrategy(CommonarchiveFactoryImpl.java:342)
08:40:27 	at org.eclipse.jst.j2ee.commonarchivecore.internal.impl.CommonarchiveFactoryImpl.primOpenArchive(CommonarchiveFactoryImpl.java:876)
08:40:27 	at org.eclipse.jst.j2ee.commonarchivecore.internal.impl.CommonarchiveFactoryImpl.primOpenArchive(CommonarchiveFactoryImpl.java:902)
08:40:27 	at org.eclipse.jst.j2ee.commonarchivecore.internal.impl.CommonarchiveFactoryImpl.openEARFile(CommonarchiveFactoryImpl.java:657)
08:40:27 	at org.eclipse.jst.j2ee.archive.test.ClientContainerResourceLoadTest.testClientContainerLoad(ClientContainerResourceLoadTest.java:57)
08:40:27 	at java.base/jdk.internal.reflect.NativeMethodAccessorImpl.invoke0(Native Method)
08:40:27 	at java.base/jdk.internal.reflect.NativeMethodAccessorImpl.invoke(NativeMethodAccessorImpl.java:62)
08:40:27 	at java.base/jdk.internal.reflect.DelegatingMethodAccessorImpl.invoke(DelegatingMethodAccessorImpl.java:43)
08:40:27 	at java.base/java.lang.reflect.Method.invoke(Method.java:566)
08:40:27 	at junit.framework.TestCase.runTest(TestCase.java:177)
08:40:27 	at junit.framework.TestCase.runBare(TestCase.java:142)
08:40:27 	at junit.framework.TestResult$1.protect(TestResult.java:122)
08:40:27 	at junit.framework.TestResult.runProtected(TestResult.java:142)
08:40:27 	at junit.framework.TestResult.run(TestResult.java:125)
08:40:27 	at junit.framework.TestCase.run(TestCase.java:130)
08:40:27 	at junit.framework.TestSuite.runTest(TestSuite.java:241)
08:40:27 	at junit.framework.TestSuite.run(TestSuite.java:236)
08:40:27 	at org.junit.internal.runners.JUnit38ClassRunner.run(JUnit38ClassRunner.java:90)
08:40:27 	at org.apache.maven.surefire.junit4.JUnit4Provider.execute(JUnit4Provider.java:365)
08:40:27 	at org.apache.maven.surefire.junit4.JUnit4Provider.executeWithRerun(JUnit4Provider.java:273)
08:40:27 	at org.apache.maven.surefire.junit4.JUnit4Provider.executeTestSet(JUnit4Provider.java:238)
08:40:27 	at org.apache.maven.surefire.junit4.JUnit4Provider.invoke(JUnit4Provider.java:159)
08:40:27 	at java.base/jdk.internal.reflect.NativeMethodAccessorImpl.invoke0(Native Method)
08:40:27 	at java.base/jdk.internal.reflect.NativeMethodAccessorImpl.invoke(NativeMethodAccessorImpl.java:62)
08:40:27 	at java.base/jdk.internal.reflect.DelegatingMethodAccessorImpl.invoke(DelegatingMethodAccessorImpl.java:43)
08:40:27 	at java.base/java.lang.reflect.Method.invoke(Method.java:566)
08:40:27 	at org.apache.maven.surefire.util.ReflectionUtils.invokeMethodWithArray2(ReflectionUtils.java:206)
08:40:27 	at org.apache.maven.surefire.booter.ProviderFactory$ProviderProxy.invoke(ProviderFactory.java:161)
08:40:27 	at org.apache.maven.surefire.booter.ProviderFactory.invokeProvider(ProviderFactory.java:84)
08:40:27 	at org.eclipse.tycho.surefire.osgibooter.OsgiSurefireBooter.run(OsgiSurefireBooter.java:116)
08:40:27 	at org.eclipse.tycho.surefire.osgibooter.HeadlessTestApplication.start(HeadlessTestApplication.java:23)
08:40:27 	at org.eclipse.equinox.internal.app.EclipseAppHandle.run(EclipseAppHandle.java:203)
08:40:27 	at org.eclipse.core.runtime.internal.adaptor.EclipseAppLauncher.runApplication(EclipseAppLauncher.java:134)
08:40:27 	at org.eclipse.core.runtime.internal.adaptor.EclipseAppLauncher.start(EclipseAppLauncher.java:104)
08:40:27 	at org.eclipse.core.runtime.adaptor.EclipseStarter.run(EclipseStarter.java:401)
08:40:27 	at org.eclipse.core.runtime.adaptor.EclipseStarter.run(EclipseStarter.java:255)
08:40:27 	at java.base/jdk.internal.reflect.NativeMethodAccessorImpl.invoke0(Native Method)
08:40:27 	at java.base/jdk.internal.reflect.NativeMethodAccessorImpl.invoke(NativeMethodAccessorImpl.java:62)
08:40:27 	at java.base/jdk.internal.reflect.DelegatingMethodAccessorImpl.invoke(DelegatingMethodAccessorImpl.java:43)
08:40:27 	at java.base/java.lang.reflect.Method.invoke(Method.java:566)
08:40:27 	at org.eclipse.equinox.launcher.Main.invokeFramework(Main.java:654)
08:40:27 	at org.eclipse.equinox.launcher.Main.basicRun(Main.java:591)
08:40:27 	at org.eclipse.equinox.launcher.Main.run(Main.java:1462)
08:40:27 	at org.eclipse.equinox.launcher.Main.main(Main.java:1435)
08:40:27 Tests run: 1, Failures: 0, Errors: 0, Skipped: 0, Time elapsed: 0.003 s - in org.eclipse.jst.j2ee.archive.test.ClientContainerResourceLoadTest
08:40:27 testClientContainerLoad(org.eclipse.jst.j2ee.archive.test.ClientContainerResourceLoadTest)  Time elapsed: 0.002 s
08:40:27 Running org.eclipse.jst.j2ee.archive.test.LooseArchiveTests
08:40:27 Tests run: 5, Failures: 0, Errors: 0, Skipped: 0, Time elapsed: 0.375 s - in org.eclipse.jst.j2ee.archive.test.LooseArchiveTests
08:40:27 testLooseConfigCreation(org.eclipse.jst.j2ee.archive.test.LooseArchiveTests)  Time elapsed: 0.056 s
08:40:27 testLooseAppCreation(org.eclipse.jst.j2ee.archive.test.LooseArchiveTests)  Time elapsed: 0.144 s
08:40:27 testLooseConfigOpenAndSave(org.eclipse.jst.j2ee.archive.test.LooseArchiveTests)  Time elapsed: 0.073 s
08:40:27 testLooseConfigOpenAndReOpen(org.eclipse.jst.j2ee.archive.test.LooseArchiveTests)  Time elapsed: 0.018 s
08:40:27 testLooseConfigUnimodeOpenAndSave(org.eclipse.jst.j2ee.archive.test.LooseArchiveTests)  Time elapsed: 0.083 s
08:40:27 Running org.eclipse.jst.j2ee.archive.test.DiscriminatorTest
08:40:27 Tests run: 1, Failures: 0, Errors: 0, Skipped: 0, Time elapsed: 0 s - in org.eclipse.jst.j2ee.archive.test.DiscriminatorTest
08:40:27 testDiscriminator(org.eclipse.jst.j2ee.archive.test.DiscriminatorTest)  Time elapsed: 0 s
08:40:27 Running org.eclipse.jst.j2ee.archive.test.WARFileTests
08:40:27 Tests run: 3, Failures: 0, Errors: 3, Skipped: 0, Time elapsed: 0.001 s <<< FAILURE! - in org.eclipse.jst.j2ee.archive.test.WARFileTests
08:40:27 testAddCopyLib(org.eclipse.jst.j2ee.archive.test.WARFileTests)  Time elapsed: 0.001 s  <<< ERROR!
08:40:27 org.eclipse.jst.j2ee.commonarchivecore.internal.exception.OpenFailureException: IWAE0037E Could not open /home/jenkins/agent/workspace/webtools-javaee-gerrit_master/tests/org.eclipse.jst.j2ee.core.tests/commonArchiveResources/example2.war
08:40:27 	at org.eclipse.jst.j2ee.archive.test.WARFileTests.testAddCopyLib(WARFileTests.java:77)
08:40:27 Caused by: java.io.FileNotFoundException: IWAE0036E URI Name: /home/jenkins/agent/workspace/webtools-javaee-gerrit_master/tests/org.eclipse.jst.j2ee.core.tests/commonArchiveResources/example2.war; File name: /home/jenkins/agent/workspace/webtools-javaee-gerrit_master/tests/org.eclipse.jst.j2ee.core.tests/commonArchiveResources/example2.war
08:40:27 	at org.eclipse.jst.j2ee.archive.test.WARFileTests.testAddCopyLib(WARFileTests.java:77)
08:40:27 
08:40:27 testAddCopyClass(org.eclipse.jst.j2ee.archive.test.WARFileTests)  Time elapsed: 0 s  <<< ERROR!
08:40:27 org.eclipse.jst.j2ee.commonarchivecore.internal.exception.OpenFailureException: IWAE0037E Could not open /home/jenkins/agent/workspace/webtools-javaee-gerrit_master/tests/org.eclipse.jst.j2ee.core.tests/commonArchiveResources/example2.war
08:40:27 	at org.eclipse.jst.j2ee.archive.test.WARFileTests.testAddCopyClass(WARFileTests.java:56)
08:40:27 Caused by: java.io.FileNotFoundException: IWAE0036E URI Name: /home/jenkins/agent/workspace/webtools-javaee-gerrit_master/tests/org.eclipse.jst.j2ee.core.tests/commonArchiveResources/example2.war; File name: /home/jenkins/agent/workspace/webtools-javaee-gerrit_master/tests/org.eclipse.jst.j2ee.core.tests/commonArchiveResources/example2.war
08:40:27 	at org.eclipse.jst.j2ee.archive.test.WARFileTests.testAddCopyClass(WARFileTests.java:56)
08:40:27 
08:40:27 testListClassesAndLibs(org.eclipse.jst.j2ee.archive.test.WARFileTests)  Time elapsed: 0 s  <<< ERROR!
08:40:27 org.eclipse.jst.j2ee.commonarchivecore.internal.exception.OpenFailureException: IWAE0037E Could not open /home/jenkins/agent/workspace/webtools-javaee-gerrit_master/tests/org.eclipse.jst.j2ee.core.tests/commonArchiveResources/example2.war
08:40:27 	at org.eclipse.jst.j2ee.archive.test.WARFileTests.testListClassesAndLibs(WARFileTests.java:96)
08:40:27 Caused by: java.io.FileNotFoundException: IWAE0036E URI Name: /home/jenkins/agent/workspace/webtools-javaee-gerrit_master/tests/org.eclipse.jst.j2ee.core.tests/commonArchiveResources/example2.war; File name: /home/jenkins/agent/workspace/webtools-javaee-gerrit_master/tests/org.eclipse.jst.j2ee.core.tests/commonArchiveResources/example2.war
08:40:27 	at org.eclipse.jst.j2ee.archive.test.WARFileTests.testListClassesAndLibs(WARFileTests.java:96)
08:40:27 
08:40:27 Running org.eclipse.jst.j2ee.archive.test.JavaTests
08:40:27 Tests run: 1, Failures: 0, Errors: 0, Skipped: 0, Time elapsed: 0.001 s - in org.eclipse.jst.j2ee.archive.test.JavaTests
08:40:27 testJavaReflection(org.eclipse.jst.j2ee.archive.test.JavaTests)  Time elapsed: 0 s
08:40:27 Running org.eclipse.jst.j2ee.archive.test.RarFileTests
08:40:27 Tests run: 7, Failures: 0, Errors: 7, Skipped: 0, Time elapsed: 0.002 s <<< FAILURE! - in org.eclipse.jst.j2ee.archive.test.RarFileTests
08:40:27 testOpenAndRead(org.eclipse.jst.j2ee.archive.test.RarFileTests)  Time elapsed: 0.001 s  <<< ERROR!
08:40:27 org.eclipse.jst.j2ee.commonarchivecore.internal.exception.OpenFailureException: IWAE0037E Could not open /home/jenkins/agent/workspace/webtools-javaee-gerrit_master/tests/org.eclipse.jst.j2ee.core.tests/commonArchiveResources/sample.rar
08:40:27 	at org.eclipse.jst.j2ee.archive.test.RarFileTests.testOpenAndRead(RarFileTests.java:165)
08:40:27 Caused by: java.io.FileNotFoundException: IWAE0036E URI Name: /home/jenkins/agent/workspace/webtools-javaee-gerrit_master/tests/org.eclipse.jst.j2ee.core.tests/commonArchiveResources/sample.rar; File name: /home/jenkins/agent/workspace/webtools-javaee-gerrit_master/tests/org.eclipse.jst.j2ee.core.tests/commonArchiveResources/sample.rar
08:40:27 	at org.eclipse.jst.j2ee.archive.test.RarFileTests.testOpenAndRead(RarFileTests.java:165)
08:40:27 
08:40:27 testaddCopyModule(org.eclipse.jst.j2ee.archive.test.RarFileTests)  Time elapsed: 0 s  <<< ERROR!
08:40:27 org.eclipse.jst.j2ee.commonarchivecore.internal.exception.OpenFailureException: IWAE0037E Could not open /home/jenkins/agent/workspace/webtools-javaee-gerrit_master/tests/org.eclipse.jst.j2ee.core.tests/commonArchiveResources/sample.rar
08:40:27 	at org.eclipse.jst.j2ee.archive.test.RarFileTests.testaddCopyModule(RarFileTests.java:114)
08:40:27 Caused by: java.io.FileNotFoundException: IWAE0036E URI Name: /home/jenkins/agent/workspace/webtools-javaee-gerrit_master/tests/org.eclipse.jst.j2ee.core.tests/commonArchiveResources/sample.rar; File name: /home/jenkins/agent/workspace/webtools-javaee-gerrit_master/tests/org.eclipse.jst.j2ee.core.tests/commonArchiveResources/sample.rar
08:40:27 	at org.eclipse.jst.j2ee.archive.test.RarFileTests.testaddCopyModule(RarFileTests.java:114)
08:40:27 
08:40:27 testSaveRarEar(org.eclipse.jst.j2ee.archive.test.RarFileTests)  Time elapsed: 0 s  <<< ERROR!
08:40:27 org.eclipse.jst.j2ee.commonarchivecore.internal.exception.OpenFailureException: IWAE0037E Could not open /home/jenkins/agent/workspace/webtools-javaee-gerrit_master/tests/org.eclipse.jst.j2ee.core.tests/commonArchiveResources/sample.rar
08:40:27 	at org.eclipse.jst.j2ee.archive.test.RarFileTests.testSaveRarEar(RarFileTests.java:178)
08:40:27 Caused by: java.io.FileNotFoundException: IWAE0036E URI Name: /home/jenkins/agent/workspace/webtools-javaee-gerrit_master/tests/org.eclipse.jst.j2ee.core.tests/commonArchiveResources/sample.rar; File name: /home/jenkins/agent/workspace/webtools-javaee-gerrit_master/tests/org.eclipse.jst.j2ee.core.tests/commonArchiveResources/sample.rar
08:40:27 	at org.eclipse.jst.j2ee.archive.test.RarFileTests.testSaveRarEar(RarFileTests.java:178)
08:40:27 
08:40:27 testexpandRarModule(org.eclipse.jst.j2ee.archive.test.RarFileTests)  Time elapsed: 0 s  <<< ERROR!
08:40:27 org.eclipse.jst.j2ee.commonarchivecore.internal.exception.OpenFailureException: IWAE0037E Could not open /home/jenkins/agent/workspace/webtools-javaee-gerrit_master/tests/org.eclipse.jst.j2ee.core.tests/commonArchiveResources/sample.rar
08:40:27 	at org.eclipse.jst.j2ee.archive.test.RarFileTests.testexpandRarModule(RarFileTests.java:132)
08:40:27 Caused by: java.io.FileNotFoundException: IWAE0036E URI Name: /home/jenkins/agent/workspace/webtools-javaee-gerrit_master/tests/org.eclipse.jst.j2ee.core.tests/commonArchiveResources/sample.rar; File name: /home/jenkins/agent/workspace/webtools-javaee-gerrit_master/tests/org.eclipse.jst.j2ee.core.tests/commonArchiveResources/sample.rar
08:40:27 	at org.eclipse.jst.j2ee.archive.test.RarFileTests.testexpandRarModule(RarFileTests.java:132)
08:40:27 
08:40:27 testJ2Cauth(org.eclipse.jst.j2ee.archive.test.RarFileTests)  Time elapsed: 0 s  <<< ERROR!
08:40:27 org.eclipse.jst.j2ee.commonarchivecore.internal.exception.OpenFailureException: IWAE0037E Could not open /home/jenkins/agent/workspace/webtools-javaee-gerrit_master/tests/org.eclipse.jst.j2ee.core.tests/commonArchiveResources/sample.rar
08:40:27 	at org.eclipse.jst.j2ee.archive.test.RarFileTests.testJ2Cauth(RarFileTests.java:193)
08:40:27 Caused by: java.io.FileNotFoundException: IWAE0036E URI Name: /home/jenkins/agent/workspace/webtools-javaee-gerrit_master/tests/org.eclipse.jst.j2ee.core.tests/commonArchiveResources/sample.rar; File name: /home/jenkins/agent/workspace/webtools-javaee-gerrit_master/tests/org.eclipse.jst.j2ee.core.tests/commonArchiveResources/sample.rar
08:40:27 	at org.eclipse.jst.j2ee.archive.test.RarFileTests.testJ2Cauth(RarFileTests.java:193)
08:40:27 
08:40:27 testOpenAndExtract(org.eclipse.jst.j2ee.archive.test.RarFileTests)  Time elapsed: 0 s  <<< ERROR!
08:40:27 org.eclipse.jst.j2ee.commonarchivecore.internal.exception.OpenFailureException: IWAE0037E Could not open /home/jenkins/agent/workspace/webtools-javaee-gerrit_master/tests/org.eclipse.jst.j2ee.core.tests/commonArchiveResources/sample.rar
08:40:27 	at org.eclipse.jst.j2ee.archive.test.RarFileTests.testOpenAndExtract(RarFileTests.java:153)
08:40:27 Caused by: java.io.FileNotFoundException: IWAE0036E URI Name: /home/jenkins/agent/workspace/webtools-javaee-gerrit_master/tests/org.eclipse.jst.j2ee.core.tests/commonArchiveResources/sample.rar; File name: /home/jenkins/agent/workspace/webtools-javaee-gerrit_master/tests/org.eclipse.jst.j2ee.core.tests/commonArchiveResources/sample.rar
08:40:27 	at org.eclipse.jst.j2ee.archive.test.RarFileTests.testOpenAndExtract(RarFileTests.java:153)
08:40:27 
08:40:27 testopenRarEar(org.eclipse.jst.j2ee.archive.test.RarFileTests)  Time elapsed: 0 s  <<< ERROR!
08:40:27 org.eclipse.jst.j2ee.commonarchivecore.internal.exception.OpenFailureException: IWAE0037E Could not open /home/jenkins/agent/workspace/webtools-javaee-gerrit_master/tests/org.eclipse.jst.j2ee.core.tests/commonArchiveResources/testrar.ear
08:40:27 	at org.eclipse.jst.j2ee.archive.test.RarFileTests.testopenRarEar(RarFileTests.java:172)
08:40:27 Caused by: java.io.FileNotFoundException: IWAE0036E URI Name: /home/jenkins/agent/workspace/webtools-javaee-gerrit_master/tests/org.eclipse.jst.j2ee.core.tests/commonArchiveResources/testrar.ear; File name: /home/jenkins/agent/workspace/webtools-javaee-gerrit_master/tests/org.eclipse.jst.j2ee.core.tests/commonArchiveResources/testrar.ear
08:40:27 	at org.eclipse.jst.j2ee.archive.test.RarFileTests.testopenRarEar(RarFileTests.java:172)
08:40:27 
08:40:27 Running org.eclipse.jst.j2ee.archive.test.TestModuleClassLoading
08:40:27 org.eclipse.jst.j2ee.commonarchivecore.internal.exception.OpenFailureException: IWAE0037E Could not open /home/jenkins/agent/workspace/webtools-javaee-gerrit_master/tests/org.eclipse.jst.j2ee.core.tests/commonArchiveResources/PROTO.ear
08:40:27 org.eclipse.jst.j2ee.commonarchivecore.internal.exception.OpenFailureException: IWAE0037E Could not open /home/jenkins/agent/workspace/webtools-javaee-gerrit_master/tests/org.eclipse.jst.j2ee.core.tests/commonArchiveResources/SEIinAnotherJar.ear
08:40:27 org.eclipse.jst.j2ee.commonarchivecore.internal.exception.OpenFailureException: IWAE0037E Could not open /home/jenkins/agent/workspace/webtools-javaee-gerrit_master/tests/org.eclipse.jst.j2ee.core.tests/commonArchiveResources/SEIinWEB-INF_lib_jar.ear
08:40:27 Tests run: 1, Failures: 0, Errors: 0, Skipped: 0, Time elapsed: 0 s - in org.eclipse.jst.j2ee.archive.test.TestModuleClassLoading
08:40:27 testAddModuleClassLoading(org.eclipse.jst.j2ee.archive.test.TestModuleClassLoading)  Time elapsed: 0 s
08:40:27 Running org.eclipse.jst.j2ee.ejb.test.CMRFieldTest
08:40:27 Tests run: 6, Failures: 0, Errors: 0, Skipped: 0, Time elapsed: 0.002 s - in org.eclipse.jst.j2ee.ejb.test.CMRFieldTest
08:40:27 test_getRole(org.eclipse.jst.j2ee.ejb.test.CMRFieldTest)  Time elapsed: 0 s
08:40:27 test_setCollectionTypeName(org.eclipse.jst.j2ee.ejb.test.CMRFieldTest)  Time elapsed: 0 s
08:40:27 test_setCollectionType(org.eclipse.jst.j2ee.ejb.test.CMRFieldTest)  Time elapsed: 0 s
08:40:27 test_getCollectionType(org.eclipse.jst.j2ee.ejb.test.CMRFieldTest)  Time elapsed: 0 s
08:40:27 test_setRole(org.eclipse.jst.j2ee.ejb.test.CMRFieldTest)  Time elapsed: 0 s
08:40:27 test_getCollectionTypeName(org.eclipse.jst.j2ee.ejb.test.CMRFieldTest)  Time elapsed: 0.001 s
08:40:27 Running org.eclipse.jst.j2ee.ejb.test.MethodPermissionTest
08:40:27 Tests run: 5, Failures: 0, Errors: 0, Skipped: 0, Time elapsed: 0.002 s - in org.eclipse.jst.j2ee.ejb.test.MethodPermissionTest
08:40:27 test_MethodPermission(org.eclipse.jst.j2ee.ejb.test.MethodPermissionTest)  Time elapsed: 0 s
08:40:27 test_isEquivalent(org.eclipse.jst.j2ee.ejb.test.MethodPermissionTest)  Time elapsed: 0 s
08:40:27 test_hasSecurityRole(org.eclipse.jst.j2ee.ejb.test.MethodPermissionTest)  Time elapsed: 0 s
08:40:27 test_getSecurityRole(org.eclipse.jst.j2ee.ejb.test.MethodPermissionTest)  Time elapsed: 0 s
08:40:27 test_hasSecurityRole_2(org.eclipse.jst.j2ee.ejb.test.MethodPermissionTest)  Time elapsed: 0 s
08:40:27 Running org.eclipse.jst.j2ee.ejb.test.EJBRelationTest
08:40:27 Tests run: 6, Failures: 0, Errors: 0, Skipped: 0, Time elapsed: 0.001 s - in org.eclipse.jst.j2ee.ejb.test.EJBRelationTest
08:40:27 test_containsRelationshipRole(org.eclipse.jst.j2ee.ejb.test.EJBRelationTest)  Time elapsed: 0 s
08:40:27 test_getSecondRole(org.eclipse.jst.j2ee.ejb.test.EJBRelationTest)  Time elapsed: 0.001 s
08:40:27 test_getFirstRole(org.eclipse.jst.j2ee.ejb.test.EJBRelationTest)  Time elapsed: 0 s
08:40:27 test_getOppositeRole(org.eclipse.jst.j2ee.ejb.test.EJBRelationTest)  Time elapsed: 0 s
08:40:27 test_EJBRelation(org.eclipse.jst.j2ee.ejb.test.EJBRelationTest)  Time elapsed: 0 s
08:40:27 test_setFoward(org.eclipse.jst.j2ee.ejb.test.EJBRelationTest)  Time elapsed: 0 s
08:40:27 Running org.eclipse.jst.j2ee.ejb.test.ContainerManagedEntityTest
08:40:27 Tests run: 15, Failures: 0, Errors: 0, Skipped: 0, Time elapsed: 0.005 s - in org.eclipse.jst.j2ee.ejb.test.ContainerManagedEntityTest
08:40:27 test_isUnknownPrimaryKey(org.eclipse.jst.j2ee.ejb.test.ContainerManagedEntityTest)  Time elapsed: 0.001 s
08:40:27 test_addPersistentAttribute(org.eclipse.jst.j2ee.ejb.test.ContainerManagedEntityTest)  Time elapsed: 0.001 s
08:40:27 test_addKeyAttributeName(org.eclipse.jst.j2ee.ejb.test.ContainerManagedEntityTest)  Time elapsed: 0 s
08:40:27 test_getKeyAttribute(org.eclipse.jst.j2ee.ejb.test.ContainerManagedEntityTest)  Time elapsed: 0 s
08:40:27 test_isContainerManagedEntity(org.eclipse.jst.j2ee.ejb.test.ContainerManagedEntityTest)  Time elapsed: 0 s
08:40:27 test_getPrimaryKeyAttribute(org.eclipse.jst.j2ee.ejb.test.ContainerManagedEntityTest)  Time elapsed: 0 s
08:40:27 test_isVersion1_X(org.eclipse.jst.j2ee.ejb.test.ContainerManagedEntityTest)  Time elapsed: 0 s
08:40:27 test_isVersion2_X(org.eclipse.jst.j2ee.ejb.test.ContainerManagedEntityTest)  Time elapsed: 0 s
08:40:27 test_removePersistentAttribute_2(org.eclipse.jst.j2ee.ejb.test.ContainerManagedEntityTest)  Time elapsed: 0.001 s
08:40:27 test_listPersistentFieldNames(org.eclipse.jst.j2ee.ejb.test.ContainerManagedEntityTest)  Time elapsed: 0 s
08:40:27 test_isKeyAttribute(org.eclipse.jst.j2ee.ejb.test.ContainerManagedEntityTest)  Time elapsed: 0 s
08:40:27 test_getCMPVersionID(org.eclipse.jst.j2ee.ejb.test.ContainerManagedEntityTest)  Time elapsed: 0 s
08:40:27 test_setPrimKeyField(org.eclipse.jst.j2ee.ejb.test.ContainerManagedEntityTest)  Time elapsed: 0 s
08:40:27 test_addPersistentAttributeName(org.eclipse.jst.j2ee.ejb.test.ContainerManagedEntityTest)  Time elapsed: 0 s
08:40:27 test_removePersistentAttribute(org.eclipse.jst.j2ee.ejb.test.ContainerManagedEntityTest)  Time elapsed: 0 s
08:40:27 Running org.eclipse.jst.j2ee.ejb.test.EJBJarTest
08:40:27 Tests run: 15, Failures: 0, Errors: 0, Skipped: 0, Time elapsed: 0.004 s - in org.eclipse.jst.j2ee.ejb.test.EJBJarTest
08:40:27 test_EJBJar(org.eclipse.jst.j2ee.ejb.test.EJBJarTest)  Time elapsed: 0.001 s
08:40:27 test_containsContainerManagedBeans(org.eclipse.jst.j2ee.ejb.test.EJBJarTest)  Time elapsed: 0 s
08:40:27 test_containsSecurityRole(org.eclipse.jst.j2ee.ejb.test.EJBJarTest)  Time elapsed: 0 s
08:40:27 test_getBeanManagedBeans(org.eclipse.jst.j2ee.ejb.test.EJBJarTest)  Time elapsed: 0 s
08:40:27 test_getContainerManagedBeans(org.eclipse.jst.j2ee.ejb.test.EJBJarTest)  Time elapsed: 0.001 s
08:40:27 test_getEJB11ContainerManagedBeans(org.eclipse.jst.j2ee.ejb.test.EJBJarTest)  Time elapsed: 0 s
08:40:27 test_getEJB20ContainerManagedBeans(org.eclipse.jst.j2ee.ejb.test.EJBJarTest)  Time elapsed: 0 s
08:40:27 test_getMessageDrivenBeans(org.eclipse.jst.j2ee.ejb.test.EJBJarTest)  Time elapsed: 0 s
08:40:27 test_getEjbRelations(org.eclipse.jst.j2ee.ejb.test.EJBJarTest)  Time elapsed: 0 s
08:40:27 test_getEnterpiseBeanFromRef(org.eclipse.jst.j2ee.ejb.test.EJBJarTest)  Time elapsed: 0.001 s
08:40:27 test_getEnterpriseBeanNamed(org.eclipse.jst.j2ee.ejb.test.EJBJarTest)  Time elapsed: 0 s
08:40:27 test_getEnterpriseBeansWithReference(org.eclipse.jst.j2ee.ejb.test.EJBJarTest)  Time elapsed: 0 s
08:40:27 test_getEnterpriseBeanWithReference(org.eclipse.jst.j2ee.ejb.test.EJBJarTest)  Time elapsed: 0 s
08:40:27 test_getSessionBeans(org.eclipse.jst.j2ee.ejb.test.EJBJarTest)  Time elapsed: 0 s
08:40:27 test_getEJBRelation(org.eclipse.jst.j2ee.ejb.test.EJBJarTest)  Time elapsed: 0 s
08:40:27 Running org.eclipse.jst.j2ee.ejb.test.QueryMethodTest
08:40:27 Tests run: 1, Failures: 0, Errors: 0, Skipped: 0, Time elapsed: 0.291 s - in org.eclipse.jst.j2ee.ejb.test.QueryMethodTest
08:40:28 test_getClientTypeJavaClasses(org.eclipse.jst.j2ee.ejb.test.QueryMethodTest)  Time elapsed: 0.29 s
08:40:28 Running org.eclipse.jst.j2ee.ejb.test.QueryTest
08:40:28 Tests run: 3, Failures: 0, Errors: 0, Skipped: 0, Time elapsed: 0.002 s - in org.eclipse.jst.j2ee.ejb.test.QueryTest
08:40:28 test_isRemoteResultMapping(org.eclipse.jst.j2ee.ejb.test.QueryTest)  Time elapsed: 0 s
08:40:28 test_isLocalResultMapping(org.eclipse.jst.j2ee.ejb.test.QueryTest)  Time elapsed: 0 s
08:40:28 test_Query(org.eclipse.jst.j2ee.ejb.test.QueryTest)  Time elapsed: 0 s
08:40:28 Running org.eclipse.jst.j2ee.ejb.test.CMPAttributeTest
08:40:28 Tests run: 10, Failures: 0, Errors: 0, Skipped: 0, Time elapsed: 0.002 s - in org.eclipse.jst.j2ee.ejb.test.CMPAttributeTest
08:40:28 test_getSetterName(org.eclipse.jst.j2ee.ejb.test.CMPAttributeTest)  Time elapsed: 0 s
08:40:28 test_getType(org.eclipse.jst.j2ee.ejb.test.CMPAttributeTest)  Time elapsed: 0 s
08:40:28 test_getOriginatingType(org.eclipse.jst.j2ee.ejb.test.CMPAttributeTest)  Time elapsed: 0 s
08:40:28 test_setDerived(org.eclipse.jst.j2ee.ejb.test.CMPAttributeTest)  Time elapsed: 0 s
08:40:28 test_setOriginatingType(org.eclipse.jst.j2ee.ejb.test.CMPAttributeTest)  Time elapsed: 0 s
08:40:28 test_isCMRField(org.eclipse.jst.j2ee.ejb.test.CMPAttributeTest)  Time elapsed: 0 s
08:40:28 test_getGetterName(org.eclipse.jst.j2ee.ejb.test.CMPAttributeTest)  Time elapsed: 0.001 s
08:40:28 test_isDerived(org.eclipse.jst.j2ee.ejb.test.CMPAttributeTest)  Time elapsed: 0 s
08:40:28 test_isKey(org.eclipse.jst.j2ee.ejb.test.CMPAttributeTest)  Time elapsed: 0 s
08:40:28 test_isPrimKeyField(org.eclipse.jst.j2ee.ejb.test.CMPAttributeTest)  Time elapsed: 0 s
08:40:28 Running org.eclipse.jst.j2ee.ejb.test.EntityTest
08:40:28 Tests run: 2, Failures: 0, Errors: 0, Skipped: 0, Time elapsed: 0.422 s - in org.eclipse.jst.j2ee.ejb.test.EntityTest
08:40:28 test_setPrimaryKeyName(org.eclipse.jst.j2ee.ejb.test.EntityTest)  Time elapsed: 0.216 s
08:40:28 test_getPrimaryKeyName(org.eclipse.jst.j2ee.ejb.test.EntityTest)  Time elapsed: 0.204 s
08:40:28 Running org.eclipse.jst.j2ee.ejb.test.MethodElementTest
08:40:28 Tests run: 21, Failures: 0, Errors: 0, Skipped: 0, Time elapsed: 0.193 s - in org.eclipse.jst.j2ee.ejb.test.MethodElementTest
08:40:28 test_initializeFromSignature(org.eclipse.jst.j2ee.ejb.test.MethodElementTest)  Time elapsed: 0.001 s
08:40:28 test_applyZeroParams(org.eclipse.jst.j2ee.ejb.test.MethodElementTest)  Time elapsed: 0 s
08:40:28 test_equalSignature(org.eclipse.jst.j2ee.ejb.test.MethodElementTest)  Time elapsed: 0 s
08:40:28 test_isRemote(org.eclipse.jst.j2ee.ejb.test.MethodElementTest)  Time elapsed: 0 s
08:40:28 test_getTypeJavaClass(org.eclipse.jst.j2ee.ejb.test.MethodElementTest)  Time elapsed: 0.186 s
08:40:28 test_isHome(org.eclipse.jst.j2ee.ejb.test.MethodElementTest)  Time elapsed: 0 s
08:40:28 test_getSignature(org.eclipse.jst.j2ee.ejb.test.MethodElementTest)  Time elapsed: 0 s
08:40:28 test_nameAndParamsEquals(org.eclipse.jst.j2ee.ejb.test.MethodElementTest)  Time elapsed: 0.002 s
08:40:28 test_isLocalHome(org.eclipse.jst.j2ee.ejb.test.MethodElementTest)  Time elapsed: 0 s
08:40:28 test_isUnspecified(org.eclipse.jst.j2ee.ejb.test.MethodElementTest)  Time elapsed: 0 s
08:40:28 test_isEquivalent(org.eclipse.jst.j2ee.ejb.test.MethodElementTest)  Time elapsed: 0 s
08:40:28 test_MethodElement(org.eclipse.jst.j2ee.ejb.test.MethodElementTest)  Time elapsed: 0 s
08:40:28 test_hasMethodParams(org.eclipse.jst.j2ee.ejb.test.MethodElementTest)  Time elapsed: 0 s
08:40:28 test_isLocal(org.eclipse.jst.j2ee.ejb.test.MethodElementTest)  Time elapsed: 0 s
08:40:28 test_isValid(org.eclipse.jst.j2ee.ejb.test.MethodElementTest)  Time elapsed: 0 s
08:40:28 test_getMethodParams(org.eclipse.jst.j2ee.ejb.test.MethodElementTest)  Time elapsed: 0.001 s
08:40:28 test_isDefault(org.eclipse.jst.j2ee.ejb.test.MethodElementTest)  Time elapsed: 0 s
08:40:28 test_addMethodParams(org.eclipse.jst.j2ee.ejb.test.MethodElementTest)  Time elapsed: 0 s
08:40:28 test_removeMethodParams(org.eclipse.jst.j2ee.ejb.test.MethodElementTest)  Time elapsed: 0 s
08:40:28 testEJBJarPopulation(org.eclipse.jst.j2ee.ejb.test.MethodElementTest)  Time elapsed: 0 s
08:40:28 test14EJBJarPopulation(org.eclipse.jst.j2ee.ejb.test.MethodElementTest)  Time elapsed: 0 s
08:40:28 Running org.eclipse.jst.j2ee.ejb.test.EJBRelationshipRoleTest
08:40:28 Tests run: 13, Failures: 0, Errors: 0, Skipped: 0, Time elapsed: 0.004 s - in org.eclipse.jst.j2ee.ejb.test.EJBRelationshipRoleTest
08:40:28 test_isNavigable(org.eclipse.jst.j2ee.ejb.test.EJBRelationshipRoleTest)  Time elapsed: 0.001 s
08:40:28 test_getLogicalName(org.eclipse.jst.j2ee.ejb.test.EJBRelationshipRoleTest)  Time elapsed: 0 s
08:40:28 test_getName(org.eclipse.jst.j2ee.ejb.test.EJBRelationshipRoleTest)  Time elapsed: 0 s
08:40:28 test_isForward(org.eclipse.jst.j2ee.ejb.test.EJBRelationshipRoleTest)  Time elapsed: 0 s
08:40:28 test_isMany(org.eclipse.jst.j2ee.ejb.test.EJBRelationshipRoleTest)  Time elapsed: 0 s
08:40:28 test_setKey(org.eclipse.jst.j2ee.ejb.test.EJBRelationshipRoleTest)  Time elapsed: 0.001 s
08:40:28 test_EJBRelationshipRole(org.eclipse.jst.j2ee.ejb.test.EJBRelationshipRoleTest)  Time elapsed: 0 s
08:40:28 test_setFoward(org.eclipse.jst.j2ee.ejb.test.EJBRelationshipRoleTest)  Time elapsed: 0 s
08:40:28 test_setName(org.eclipse.jst.j2ee.ejb.test.EJBRelationshipRoleTest)  Time elapsed: 0 s
08:40:28 test_getSourceEntity(org.eclipse.jst.j2ee.ejb.test.EJBRelationshipRoleTest)  Time elapsed: 0 s
08:40:28 test_setRequired(org.eclipse.jst.j2ee.ejb.test.EJBRelationshipRoleTest)  Time elapsed: 0 s
08:40:28 test_isKey(org.eclipse.jst.j2ee.ejb.test.EJBRelationshipRoleTest)  Time elapsed: 0 s
08:40:28 test_getOpposite(org.eclipse.jst.j2ee.ejb.test.EJBRelationshipRoleTest)  Time elapsed: 0 s
08:40:28 Running org.eclipse.jst.j2ee.ejb.test.AssemblyDescriptorTest
08:40:28 Tests run: 5, Failures: 0, Errors: 0, Skipped: 0, Time elapsed: 1.238 s - in org.eclipse.jst.j2ee.ejb.test.AssemblyDescriptorTest
08:40:29 test_getMethodPermissionMethodElements(org.eclipse.jst.j2ee.ejb.test.AssemblyDescriptorTest)  Time elapsed: 0.178 s
08:40:29 test_getMethodTransactionMethodElements(org.eclipse.jst.j2ee.ejb.test.AssemblyDescriptorTest)  Time elapsed: 0.379 s
08:40:29 test_getSecurityRoleNamed(org.eclipse.jst.j2ee.ejb.test.AssemblyDescriptorTest)  Time elapsed: 0.258 s
08:40:29 test_renameSecurityRole(org.eclipse.jst.j2ee.ejb.test.AssemblyDescriptorTest)  Time elapsed: 0.189 s
08:40:29 test_removeData(org.eclipse.jst.j2ee.ejb.test.AssemblyDescriptorTest)  Time elapsed: 0.233 s
08:40:29 Running org.eclipse.jst.j2ee.ejb.test.MethodTransactionTest
08:40:29 Tests run: 2, Failures: 0, Errors: 0, Skipped: 0, Time elapsed: 0.22 s - in org.eclipse.jst.j2ee.ejb.test.MethodTransactionTest
08:40:30 test_isEquivalent(org.eclipse.jst.j2ee.ejb.test.MethodTransactionTest)  Time elapsed: 0 s
08:40:30 test_getMethodElements(org.eclipse.jst.j2ee.ejb.test.MethodTransactionTest)  Time elapsed: 0.22 s
08:40:30 Running org.eclipse.jst.j2ee.ejb.test.SessionTest
08:40:30 Tests run: 3, Failures: 0, Errors: 0, Skipped: 0, Time elapsed: 0.001 s - in org.eclipse.jst.j2ee.ejb.test.SessionTest
08:40:30 test_hasServiceEndpoint(org.eclipse.jst.j2ee.ejb.test.SessionTest)  Time elapsed: 0 s
08:40:30 test_getServiceEndpointName(org.eclipse.jst.j2ee.ejb.test.SessionTest)  Time elapsed: 0 s
08:40:30 test_setServiceEndpointName(org.eclipse.jst.j2ee.ejb.test.SessionTest)  Time elapsed: 0 s
08:40:30 Running org.eclipse.jst.j2ee.ejb.test.EjbFactoryTest
08:40:30 Tests run: 26, Failures: 0, Errors: 0, Skipped: 0, Time elapsed: 0.004 s - in org.eclipse.jst.j2ee.ejb.test.EjbFactoryTest
08:40:30 test_createActivationConfig(org.eclipse.jst.j2ee.ejb.test.EjbFactoryTest)  Time elapsed: 0.001 s
08:40:30 test_createExcludeList(org.eclipse.jst.j2ee.ejb.test.EjbFactoryTest)  Time elapsed: 0 s
08:40:30 test_createEJBRelationshipRole(org.eclipse.jst.j2ee.ejb.test.EjbFactoryTest)  Time elapsed: 0 s
08:40:30 test_createContainerManagedEntity(org.eclipse.jst.j2ee.ejb.test.EjbFactoryTest)  Time elapsed: 0 s
08:40:30 test_createMessageDrivenDestination(org.eclipse.jst.j2ee.ejb.test.EjbFactoryTest)  Time elapsed: 0 s
08:40:30 test_createMethodElement_2(org.eclipse.jst.j2ee.ejb.test.EjbFactoryTest)  Time elapsed: 0 s
08:40:30 test_createCMPAttribute(org.eclipse.jst.j2ee.ejb.test.EjbFactoryTest)  Time elapsed: 0 s
08:40:30 test_createSession(org.eclipse.jst.j2ee.ejb.test.EjbFactoryTest)  Time elapsed: 0 s
08:40:30 test_createMethodElementFrom(org.eclipse.jst.j2ee.ejb.test.EjbFactoryTest)  Time elapsed: 0 s
08:40:30 test_createEJBRelation(org.eclipse.jst.j2ee.ejb.test.EjbFactoryTest)  Time elapsed: 0 s
08:40:30 test_createMethodElementFrom_2(org.eclipse.jst.j2ee.ejb.test.EjbFactoryTest)  Time elapsed: 0 s
08:40:30 test_EjbFactory(org.eclipse.jst.j2ee.ejb.test.EjbFactoryTest)  Time elapsed: 0 s
08:40:30 test_createQuery(org.eclipse.jst.j2ee.ejb.test.EjbFactoryTest)  Time elapsed: 0.001 s
08:40:30 test_createQueryMethod(org.eclipse.jst.j2ee.ejb.test.EjbFactoryTest)  Time elapsed: 0 s
08:40:30 test_createActivationConfigProperty(org.eclipse.jst.j2ee.ejb.test.EjbFactoryTest)  Time elapsed: 0 s
08:40:30 test_createEJBJar(org.eclipse.jst.j2ee.ejb.test.EjbFactoryTest)  Time elapsed: 0 s
08:40:30 test_createMethodPermission(org.eclipse.jst.j2ee.ejb.test.EjbFactoryTest)  Time elapsed: 0 s
08:40:30 test_createEntity(org.eclipse.jst.j2ee.ejb.test.EjbFactoryTest)  Time elapsed: 0 s
08:40:30 test_createRelationships(org.eclipse.jst.j2ee.ejb.test.EjbFactoryTest)  Time elapsed: 0 s
08:40:30 test_createEJBMethodCategory(org.eclipse.jst.j2ee.ejb.test.EjbFactoryTest)  Time elapsed: 0 s
08:40:30 test_createMethodTransaction(org.eclipse.jst.j2ee.ejb.test.EjbFactoryTest)  Time elapsed: 0 s
08:40:30 test_createMethodElement(org.eclipse.jst.j2ee.ejb.test.EjbFactoryTest)  Time elapsed: 0 s
08:40:30 test_createAssemblyDescriptor(org.eclipse.jst.j2ee.ejb.test.EjbFactoryTest)  Time elapsed: 0 s
08:40:30 test_createRoleSource(org.eclipse.jst.j2ee.ejb.test.EjbFactoryTest)  Time elapsed: 0 s
08:40:30 test_createCMRField(org.eclipse.jst.j2ee.ejb.test.EjbFactoryTest)  Time elapsed: 0 s
08:40:30 test_createMessageDriven(org.eclipse.jst.j2ee.ejb.test.EjbFactoryTest)  Time elapsed: 0 s
08:40:30 Running org.eclipse.jst.j2ee.common.tests.CommonTests
08:40:30 Tests run: 0, Failures: 0, Errors: 0, Skipped: 0, Time elapsed: 0 s - in org.eclipse.jst.j2ee.common.tests.CommonTests
08:40:30 Running org.eclipse.jst.j2ee.common.test.QNameTest
08:40:30 Tests run: 1, Failures: 0, Errors: 0, Skipped: 0, Time elapsed: 0.001 s - in org.eclipse.jst.j2ee.common.test.QNameTest
08:40:30 test_setValues(org.eclipse.jst.j2ee.common.test.QNameTest)  Time elapsed: 0 s
08:40:30 Running org.eclipse.jst.j2ee.common.test.ListenerTest
08:40:30 Tests run: 2, Failures: 0, Errors: 0, Skipped: 0, Time elapsed: 0.001 s - in org.eclipse.jst.j2ee.common.test.ListenerTest
08:40:30 test_setListenerClassName(org.eclipse.jst.j2ee.common.test.ListenerTest)  Time elapsed: 0 s
08:40:30 test_getListenerClassName(org.eclipse.jst.j2ee.common.test.ListenerTest)  Time elapsed: 0 s
08:40:30 Running org.eclipse.jst.j2ee.common.test.EjbRefTest
08:40:30 Tests run: 5, Failures: 0, Errors: 0, Skipped: 0, Time elapsed: 0.001 s - in org.eclipse.jst.j2ee.common.test.EjbRefTest
08:40:30 test_isLinked(org.eclipse.jst.j2ee.common.test.EjbRefTest)  Time elapsed: 0.001 s
08:40:30 test_EjbRef(org.eclipse.jst.j2ee.common.test.EjbRefTest)  Time elapsed: 0 s
08:40:30 test_isEquivalent(org.eclipse.jst.j2ee.common.test.EjbRefTest)  Time elapsed: 0 s
08:40:30 test_isLocal(org.eclipse.jst.j2ee.common.test.EjbRefTest)  Time elapsed: 0 s
08:40:30 test_getLinkedEjb(org.eclipse.jst.j2ee.common.test.EjbRefTest)  Time elapsed: 0 s
08:40:30 Running org.eclipse.jst.j2ee.common.test.CommonFactoryTest
08:40:30 Tests run: 22, Failures: 0, Errors: 0, Skipped: 0, Time elapsed: 0.003 s - in org.eclipse.jst.j2ee.common.test.CommonFactoryTest
08:40:30 test_createCompatibilityDescriptionGroup(org.eclipse.jst.j2ee.common.test.CommonFactoryTest)  Time elapsed: 0 s
08:40:30 test_createUseCallerIdentity(org.eclipse.jst.j2ee.common.test.CommonFactoryTest)  Time elapsed: 0 s
08:40:30 test_createDescriptionGroup(org.eclipse.jst.j2ee.common.test.CommonFactoryTest)  Time elapsed: 0 s
08:40:30 test_createIconType(org.eclipse.jst.j2ee.common.test.CommonFactoryTest)  Time elapsed: 0 s
08:40:30 test_createResourceRef(org.eclipse.jst.j2ee.common.test.CommonFactoryTest)  Time elapsed: 0 s
08:40:30 test_createDisplayName(org.eclipse.jst.j2ee.common.test.CommonFactoryTest)  Time elapsed: 0 s
08:40:30 test_createIdentity(org.eclipse.jst.j2ee.common.test.CommonFactoryTest)  Time elapsed: 0 s
08:40:30 test_createSecurityIdentity(org.eclipse.jst.j2ee.common.test.CommonFactoryTest)  Time elapsed: 0 s
08:40:30 test_createResourceEnvRef(org.eclipse.jst.j2ee.common.test.CommonFactoryTest)  Time elapsed: 0 s
08:40:30 test_createDescription(org.eclipse.jst.j2ee.common.test.CommonFactoryTest)  Time elapsed: 0 s
08:40:30 test_createQName(org.eclipse.jst.j2ee.common.test.CommonFactoryTest)  Time elapsed: 0 s
08:40:30 test_CommonFactory(org.eclipse.jst.j2ee.common.test.CommonFactoryTest)  Time elapsed: 0 s
08:40:30 test_createParamValue(org.eclipse.jst.j2ee.common.test.CommonFactoryTest)  Time elapsed: 0 s
08:40:30 test_createEjbRef(org.eclipse.jst.j2ee.common.test.CommonFactoryTest)  Time elapsed: 0 s
08:40:30 test_createListener(org.eclipse.jst.j2ee.common.test.CommonFactoryTest)  Time elapsed: 0 s
08:40:30 test_createMessageDestination(org.eclipse.jst.j2ee.common.test.CommonFactoryTest)  Time elapsed: 0 s
08:40:30 test_createEnvEntry(org.eclipse.jst.j2ee.common.test.CommonFactoryTest)  Time elapsed: 0 s
08:40:30 test_createSecurityRole(org.eclipse.jst.j2ee.common.test.CommonFactoryTest)  Time elapsed: 0 s
08:40:30 test_createMessageDestinationRef(org.eclipse.jst.j2ee.common.test.CommonFactoryTest)  Time elapsed: 0 s
08:40:30 test_createEJBLocalRef(org.eclipse.jst.j2ee.common.test.CommonFactoryTest)  Time elapsed: 0 s
08:40:30 test_createSecurityRoleRef(org.eclipse.jst.j2ee.common.test.CommonFactoryTest)  Time elapsed: 0 s
08:40:30 test_createRunAsSpecifiedIdentity(org.eclipse.jst.j2ee.common.test.CommonFactoryTest)  Time elapsed: 0 s
08:40:30 Running org.eclipse.jst.j2ee.webservice.wsdd.test.WsddFactoryTest
08:40:30 Tests run: 9, Failures: 0, Errors: 0, Skipped: 0, Time elapsed: 0.001 s - in org.eclipse.jst.j2ee.webservice.wsdd.test.WsddFactoryTest
08:40:30 test_createEJBLink(org.eclipse.jst.j2ee.webservice.wsdd.test.WsddFactoryTest)  Time elapsed: 0 s
08:40:30 test_createWSDLPort(org.eclipse.jst.j2ee.webservice.wsdd.test.WsddFactoryTest)  Time elapsed: 0 s
08:40:30 test_createPortComponent(org.eclipse.jst.j2ee.webservice.wsdd.test.WsddFactoryTest)  Time elapsed: 0 s
08:40:30 test_createServiceImplBean(org.eclipse.jst.j2ee.webservice.wsdd.test.WsddFactoryTest)  Time elapsed: 0 s
08:40:30 test_createWebServices(org.eclipse.jst.j2ee.webservice.wsdd.test.WsddFactoryTest)  Time elapsed: 0 s
08:40:30 test_createBeanLink(org.eclipse.jst.j2ee.webservice.wsdd.test.WsddFactoryTest)  Time elapsed: 0 s
08:40:30 test_createWebServiceDescription(org.eclipse.jst.j2ee.webservice.wsdd.test.WsddFactoryTest)  Time elapsed: 0 s
08:40:30 test_createHandler(org.eclipse.jst.j2ee.webservice.wsdd.test.WsddFactoryTest)  Time elapsed: 0 s
08:40:30 test_createServletLink(org.eclipse.jst.j2ee.webservice.wsdd.test.WsddFactoryTest)  Time elapsed: 0 s
08:40:30 Running org.eclipse.jst.j2ee.webservice.wscommon.test.WscommonFactoryTest
08:40:30 Tests run: 7, Failures: 0, Errors: 0, Skipped: 0, Time elapsed: 0.002 s - in org.eclipse.jst.j2ee.webservice.wscommon.test.WscommonFactoryTest
08:40:30 test_createSOAPHeader(org.eclipse.jst.j2ee.webservice.wscommon.test.WscommonFactoryTest)  Time elapsed: 0 s
08:40:30 test_createDisplayNameType(org.eclipse.jst.j2ee.webservice.wscommon.test.WscommonFactoryTest)  Time elapsed: 0 s
08:40:30 test_getWscommonPackage(org.eclipse.jst.j2ee.webservice.wscommon.test.WscommonFactoryTest)  Time elapsed: 0 s
08:40:30 test_createDescriptionType(org.eclipse.jst.j2ee.webservice.wscommon.test.WscommonFactoryTest)  Time elapsed: 0 s
08:40:30 test_createPortName(org.eclipse.jst.j2ee.webservice.wscommon.test.WscommonFactoryTest)  Time elapsed: 0 s
08:40:30 test_createSOAPRole(org.eclipse.jst.j2ee.webservice.wscommon.test.WscommonFactoryTest)  Time elapsed: 0 s
08:40:30 test_createInitParam(org.eclipse.jst.j2ee.webservice.wscommon.test.WscommonFactoryTest)  Time elapsed: 0 s
08:40:30 Running org.eclipse.jst.j2ee.core.tests.api.AllAPITest
08:40:30 Tests run: 243, Failures: 0, Errors: 0, Skipped: 0, Time elapsed: 1.824 s - in org.eclipse.jst.j2ee.core.tests.api.AllAPITest
08:40:32 test_createEjbModule(org.eclipse.jst.j2ee.application.test.ApplicationFactoryTest)  Time elapsed: 0 s
08:40:32 test_createApplication(org.eclipse.jst.j2ee.application.test.ApplicationFactoryTest)  Time elapsed: 0 s
08:40:32 test_createConnectorModule(org.eclipse.jst.j2ee.application.test.ApplicationFactoryTest)  Time elapsed: 0 s
08:40:32 test_createWebModule(org.eclipse.jst.j2ee.application.test.ApplicationFactoryTest)  Time elapsed: 0 s
08:40:32 test_createJavaClientModule(org.eclipse.jst.j2ee.application.test.ApplicationFactoryTest)  Time elapsed: 0 s
08:40:32 test_createModule(org.eclipse.jst.j2ee.application.test.ApplicationFactoryTest)  Time elapsed: 0 s
08:40:32 test_getVersionID(org.eclipse.jst.j2ee.application.test.ApplicationTest)  Time elapsed: 0.001 s
08:40:32 test_getJ2EEVersionID(org.eclipse.jst.j2ee.application.test.ApplicationTest)  Time elapsed: 0 s
08:40:32 test_getSecurityRoleNamed(org.eclipse.jst.j2ee.application.test.ApplicationTest)  Time elapsed: 0 s
08:40:32 test_getModuleHavingAltDD(org.eclipse.jst.j2ee.application.test.ApplicationTest)  Time elapsed: 0 s
08:40:32 test_containsSecurityRole(org.eclipse.jst.j2ee.application.test.ApplicationTest)  Time elapsed: 0 s
08:40:32 test_getModule_2(org.eclipse.jst.j2ee.application.test.ApplicationTest)  Time elapsed: 0 s
08:40:32 test_getFirstModule(org.eclipse.jst.j2ee.application.test.ApplicationTest)  Time elapsed: 0 s
08:40:32 test_getVersionID(org.eclipse.jst.j2ee.client.test.ApplicationClientTest)  Time elapsed: 0.006 s
08:40:32 test_getJ2EEVersionID(org.eclipse.jst.j2ee.client.test.ApplicationClientTest)  Time elapsed: 0.006 s
08:40:32 test_getCallbackHandlerClassName(org.eclipse.jst.j2ee.client.test.ApplicationClientTest)  Time elapsed: 0 s
08:40:32 test_setCallbackHandlerClassName(org.eclipse.jst.j2ee.client.test.ApplicationClientTest)  Time elapsed: 0 s
08:40:32 test_ClientFactory(org.eclipse.jst.j2ee.client.test.ClientFactoryTest)  Time elapsed: 0 s
08:40:32 test_createApplicationClient(org.eclipse.jst.j2ee.client.test.ClientFactoryTest)  Time elapsed: 0 s
08:40:32 test_createCompatibilityDescriptionGroup(org.eclipse.jst.j2ee.common.test.CommonFactoryTest)  Time elapsed: 0 s
08:40:32 test_createUseCallerIdentity(org.eclipse.jst.j2ee.common.test.CommonFactoryTest)  Time elapsed: 0 s
08:40:32 test_createDescriptionGroup(org.eclipse.jst.j2ee.common.test.CommonFactoryTest)  Time elapsed: 0 s
08:40:32 test_createIconType(org.eclipse.jst.j2ee.common.test.CommonFactoryTest)  Time elapsed: 0 s
08:40:32 test_createResourceRef(org.eclipse.jst.j2ee.common.test.CommonFactoryTest)  Time elapsed: 0 s
08:40:32 test_createDisplayName(org.eclipse.jst.j2ee.common.test.CommonFactoryTest)  Time elapsed: 0 s
08:40:32 test_createIdentity(org.eclipse.jst.j2ee.common.test.CommonFactoryTest)  Time elapsed: 0 s
08:40:32 test_createSecurityIdentity(org.eclipse.jst.j2ee.common.test.CommonFactoryTest)  Time elapsed: 0 s
08:40:32 test_createResourceEnvRef(org.eclipse.jst.j2ee.common.test.CommonFactoryTest)  Time elapsed: 0 s
08:40:32 test_createDescription(org.eclipse.jst.j2ee.common.test.CommonFactoryTest)  Time elapsed: 0 s
08:40:32 test_createQName(org.eclipse.jst.j2ee.common.test.CommonFactoryTest)  Time elapsed: 0 s
08:40:32 test_CommonFactory(org.eclipse.jst.j2ee.common.test.CommonFactoryTest)  Time elapsed: 0 s
08:40:32 test_createParamValue(org.eclipse.jst.j2ee.common.test.CommonFactoryTest)  Time elapsed: 0 s
08:40:32 test_createEjbRef(org.eclipse.jst.j2ee.common.test.CommonFactoryTest)  Time elapsed: 0 s
08:40:32 test_createListener(org.eclipse.jst.j2ee.common.test.CommonFactoryTest)  Time elapsed: 0 s
08:40:32 test_createMessageDestination(org.eclipse.jst.j2ee.common.test.CommonFactoryTest)  Time elapsed: 0 s
08:40:32 test_createEnvEntry(org.eclipse.jst.j2ee.common.test.CommonFactoryTest)  Time elapsed: 0 s
08:40:32 test_createSecurityRole(org.eclipse.jst.j2ee.common.test.CommonFactoryTest)  Time elapsed: 0 s
08:40:32 test_createMessageDestinationRef(org.eclipse.jst.j2ee.common.test.CommonFactoryTest)  Time elapsed: 0 s
08:40:32 test_createEJBLocalRef(org.eclipse.jst.j2ee.common.test.CommonFactoryTest)  Time elapsed: 0 s
08:40:32 test_createSecurityRoleRef(org.eclipse.jst.j2ee.common.test.CommonFactoryTest)  Time elapsed: 0 s
08:40:32 test_createRunAsSpecifiedIdentity(org.eclipse.jst.j2ee.common.test.CommonFactoryTest)  Time elapsed: 0 s
08:40:32 test_isLinked(org.eclipse.jst.j2ee.common.test.EjbRefTest)  Time elapsed: 0 s
08:40:32 test_EjbRef(org.eclipse.jst.j2ee.common.test.EjbRefTest)  Time elapsed: 0 s
08:40:32 test_isEquivalent(org.eclipse.jst.j2ee.common.test.EjbRefTest)  Time elapsed: 0 s
08:40:32 test_isLocal(org.eclipse.jst.j2ee.common.test.EjbRefTest)  Time elapsed: 0 s
08:40:32 test_getLinkedEjb(org.eclipse.jst.j2ee.common.test.EjbRefTest)  Time elapsed: 0 s
08:40:32 test_setListenerClassName(org.eclipse.jst.j2ee.common.test.ListenerTest)  Time elapsed: 0 s
08:40:32 test_getListenerClassName(org.eclipse.jst.j2ee.common.test.ListenerTest)  Time elapsed: 0 s
08:40:32 test_setValues(org.eclipse.jst.j2ee.common.test.QNameTest)  Time elapsed: 0 s
08:40:32 test_getMethodPermissionMethodElements(org.eclipse.jst.j2ee.ejb.test.AssemblyDescriptorTest)  Time elapsed: 0.228 s
08:40:32 test_getMethodTransactionMethodElements(org.eclipse.jst.j2ee.ejb.test.AssemblyDescriptorTest)  Time elapsed: 0.184 s
08:40:32 test_getSecurityRoleNamed(org.eclipse.jst.j2ee.ejb.test.AssemblyDescriptorTest)  Time elapsed: 0.218 s
08:40:32 test_renameSecurityRole(org.eclipse.jst.j2ee.ejb.test.AssemblyDescriptorTest)  Time elapsed: 0.195 s
08:40:32 test_removeData(org.eclipse.jst.j2ee.ejb.test.AssemblyDescriptorTest)  Time elapsed: 0.195 s
08:40:32 test_getSetterName(org.eclipse.jst.j2ee.ejb.test.CMPAttributeTest)  Time elapsed: 0 s
08:40:32 test_getType(org.eclipse.jst.j2ee.ejb.test.CMPAttributeTest)  Time elapsed: 0 s
08:40:32 test_getOriginatingType(org.eclipse.jst.j2ee.ejb.test.CMPAttributeTest)  Time elapsed: 0 s
08:40:32 test_setDerived(org.eclipse.jst.j2ee.ejb.test.CMPAttributeTest)  Time elapsed: 0 s
08:40:32 test_setOriginatingType(org.eclipse.jst.j2ee.ejb.test.CMPAttributeTest)  Time elapsed: 0 s
08:40:32 test_isCMRField(org.eclipse.jst.j2ee.ejb.test.CMPAttributeTest)  Time elapsed: 0 s
08:40:32 test_getGetterName(org.eclipse.jst.j2ee.ejb.test.CMPAttributeTest)  Time elapsed: 0 s
08:40:32 test_isDerived(org.eclipse.jst.j2ee.ejb.test.CMPAttributeTest)  Time elapsed: 0 s
08:40:32 test_isKey(org.eclipse.jst.j2ee.ejb.test.CMPAttributeTest)  Time elapsed: 0.001 s
08:40:32 test_isPrimKeyField(org.eclipse.jst.j2ee.ejb.test.CMPAttributeTest)  Time elapsed: 0 s
08:40:32 test_getRole(org.eclipse.jst.j2ee.ejb.test.CMRFieldTest)  Time elapsed: 0 s
08:40:32 test_setCollectionTypeName(org.eclipse.jst.j2ee.ejb.test.CMRFieldTest)  Time elapsed: 0 s
08:40:32 test_setCollectionType(org.eclipse.jst.j2ee.ejb.test.CMRFieldTest)  Time elapsed: 0 s
08:40:32 test_getCollectionType(org.eclipse.jst.j2ee.ejb.test.CMRFieldTest)  Time elapsed: 0 s
08:40:32 test_setRole(org.eclipse.jst.j2ee.ejb.test.CMRFieldTest)  Time elapsed: 0 s
08:40:32 test_getCollectionTypeName(org.eclipse.jst.j2ee.ejb.test.CMRFieldTest)  Time elapsed: 0 s
08:40:32 test_isUnknownPrimaryKey(org.eclipse.jst.j2ee.ejb.test.ContainerManagedEntityTest)  Time elapsed: 0 s
08:40:32 test_addPersistentAttribute(org.eclipse.jst.j2ee.ejb.test.ContainerManagedEntityTest)  Time elapsed: 0 s
08:40:32 test_addKeyAttributeName(org.eclipse.jst.j2ee.ejb.test.ContainerManagedEntityTest)  Time elapsed: 0 s
08:40:32 test_getKeyAttribute(org.eclipse.jst.j2ee.ejb.test.ContainerManagedEntityTest)  Time elapsed: 0 s
08:40:32 test_isContainerManagedEntity(org.eclipse.jst.j2ee.ejb.test.ContainerManagedEntityTest)  Time elapsed: 0 s
08:40:32 test_getPrimaryKeyAttribute(org.eclipse.jst.j2ee.ejb.test.ContainerManagedEntityTest)  Time elapsed: 0 s
08:40:32 test_isVersion1_X(org.eclipse.jst.j2ee.ejb.test.ContainerManagedEntityTest)  Time elapsed: 0 s
08:40:32 test_isVersion2_X(org.eclipse.jst.j2ee.ejb.test.ContainerManagedEntityTest)  Time elapsed: 0 s
08:40:32 test_removePersistentAttribute_2(org.eclipse.jst.j2ee.ejb.test.ContainerManagedEntityTest)  Time elapsed: 0 s
08:40:32 test_listPersistentFieldNames(org.eclipse.jst.j2ee.ejb.test.ContainerManagedEntityTest)  Time elapsed: 0 s
08:40:32 test_isKeyAttribute(org.eclipse.jst.j2ee.ejb.test.ContainerManagedEntityTest)  Time elapsed: 0 s
08:40:32 test_getCMPVersionID(org.eclipse.jst.j2ee.ejb.test.ContainerManagedEntityTest)  Time elapsed: 0 s
08:40:32 test_setPrimKeyField(org.eclipse.jst.j2ee.ejb.test.ContainerManagedEntityTest)  Time elapsed: 0 s
08:40:32 test_addPersistentAttributeName(org.eclipse.jst.j2ee.ejb.test.ContainerManagedEntityTest)  Time elapsed: 0 s
08:40:32 test_removePersistentAttribute(org.eclipse.jst.j2ee.ejb.test.ContainerManagedEntityTest)  Time elapsed: 0 s
08:40:32 test_createActivationConfig(org.eclipse.jst.j2ee.ejb.test.EjbFactoryTest)  Time elapsed: 0 s
08:40:32 test_createExcludeList(org.eclipse.jst.j2ee.ejb.test.EjbFactoryTest)  Time elapsed: 0 s
08:40:32 test_createEJBRelationshipRole(org.eclipse.jst.j2ee.ejb.test.EjbFactoryTest)  Time elapsed: 0 s
08:40:32 test_createContainerManagedEntity(org.eclipse.jst.j2ee.ejb.test.EjbFactoryTest)  Time elapsed: 0 s
08:40:32 test_createMessageDrivenDestination(org.eclipse.jst.j2ee.ejb.test.EjbFactoryTest)  Time elapsed: 0 s
08:40:32 test_createMethodElement_2(org.eclipse.jst.j2ee.ejb.test.EjbFactoryTest)  Time elapsed: 0 s
08:40:32 test_createCMPAttribute(org.eclipse.jst.j2ee.ejb.test.EjbFactoryTest)  Time elapsed: 0 s
08:40:32 test_createSession(org.eclipse.jst.j2ee.ejb.test.EjbFactoryTest)  Time elapsed: 0 s
08:40:32 test_createMethodElementFrom(org.eclipse.jst.j2ee.ejb.test.EjbFactoryTest)  Time elapsed: 0.001 s
08:40:32 test_createEJBRelation(org.eclipse.jst.j2ee.ejb.test.EjbFactoryTest)  Time elapsed: 0 s
08:40:32 test_createMethodElementFrom_2(org.eclipse.jst.j2ee.ejb.test.EjbFactoryTest)  Time elapsed: 0 s
08:40:32 test_EjbFactory(org.eclipse.jst.j2ee.ejb.test.EjbFactoryTest)  Time elapsed: 0 s
08:40:32 test_createQuery(org.eclipse.jst.j2ee.ejb.test.EjbFactoryTest)  Time elapsed: 0 s
08:40:32 test_createQueryMethod(org.eclipse.jst.j2ee.ejb.test.EjbFactoryTest)  Time elapsed: 0 s
08:40:32 test_createActivationConfigProperty(org.eclipse.jst.j2ee.ejb.test.EjbFactoryTest)  Time elapsed: 0 s
08:40:32 test_createEJBJar(org.eclipse.jst.j2ee.ejb.test.EjbFactoryTest)  Time elapsed: 0 s
08:40:32 test_createMethodPermission(org.eclipse.jst.j2ee.ejb.test.EjbFactoryTest)  Time elapsed: 0 s
08:40:32 test_createEntity(org.eclipse.jst.j2ee.ejb.test.EjbFactoryTest)  Time elapsed: 0 s
08:40:32 test_createRelationships(org.eclipse.jst.j2ee.ejb.test.EjbFactoryTest)  Time elapsed: 0 s
08:40:32 test_createEJBMethodCategory(org.eclipse.jst.j2ee.ejb.test.EjbFactoryTest)  Time elapsed: 0 s
08:40:32 test_createMethodTransaction(org.eclipse.jst.j2ee.ejb.test.EjbFactoryTest)  Time elapsed: 0 s
08:40:32 test_createMethodElement(org.eclipse.jst.j2ee.ejb.test.EjbFactoryTest)  Time elapsed: 0 s
08:40:32 test_createAssemblyDescriptor(org.eclipse.jst.j2ee.ejb.test.EjbFactoryTest)  Time elapsed: 0 s
08:40:32 test_createRoleSource(org.eclipse.jst.j2ee.ejb.test.EjbFactoryTest)  Time elapsed: 0 s
08:40:32 test_createCMRField(org.eclipse.jst.j2ee.ejb.test.EjbFactoryTest)  Time elapsed: 0 s
08:40:32 test_createMessageDriven(org.eclipse.jst.j2ee.ejb.test.EjbFactoryTest)  Time elapsed: 0 s
08:40:32 test_isNavigable(org.eclipse.jst.j2ee.ejb.test.EJBRelationshipRoleTest)  Time elapsed: 0 s
08:40:32 test_getLogicalName(org.eclipse.jst.j2ee.ejb.test.EJBRelationshipRoleTest)  Time elapsed: 0 s
08:40:32 test_getName(org.eclipse.jst.j2ee.ejb.test.EJBRelationshipRoleTest)  Time elapsed: 0 s
08:40:32 test_isForward(org.eclipse.jst.j2ee.ejb.test.EJBRelationshipRoleTest)  Time elapsed: 0 s
08:40:32 test_isMany(org.eclipse.jst.j2ee.ejb.test.EJBRelationshipRoleTest)  Time elapsed: 0.001 s
08:40:32 test_setKey(org.eclipse.jst.j2ee.ejb.test.EJBRelationshipRoleTest)  Time elapsed: 0 s
08:40:32 test_EJBRelationshipRole(org.eclipse.jst.j2ee.ejb.test.EJBRelationshipRoleTest)  Time elapsed: 0 s
08:40:32 test_setFoward(org.eclipse.jst.j2ee.ejb.test.EJBRelationshipRoleTest)  Time elapsed: 0 s
08:40:32 test_setName(org.eclipse.jst.j2ee.ejb.test.EJBRelationshipRoleTest)  Time elapsed: 0 s
08:40:32 test_getSourceEntity(org.eclipse.jst.j2ee.ejb.test.EJBRelationshipRoleTest)  Time elapsed: 0 s
08:40:32 test_setRequired(org.eclipse.jst.j2ee.ejb.test.EJBRelationshipRoleTest)  Time elapsed: 0 s
08:40:32 test_isKey(org.eclipse.jst.j2ee.ejb.test.EJBRelationshipRoleTest)  Time elapsed: 0 s
08:40:32 test_getOpposite(org.eclipse.jst.j2ee.ejb.test.EJBRelationshipRoleTest)  Time elapsed: 0 s
08:40:32 test_containsRelationshipRole(org.eclipse.jst.j2ee.ejb.test.EJBRelationTest)  Time elapsed: 0 s
08:40:32 test_getSecondRole(org.eclipse.jst.j2ee.ejb.test.EJBRelationTest)  Time elapsed: 0 s
08:40:32 test_getFirstRole(org.eclipse.jst.j2ee.ejb.test.EJBRelationTest)  Time elapsed: 0 s
08:40:32 test_getOppositeRole(org.eclipse.jst.j2ee.ejb.test.EJBRelationTest)  Time elapsed: 0 s
08:40:32 test_EJBRelation(org.eclipse.jst.j2ee.ejb.test.EJBRelationTest)  Time elapsed: 0 s
08:40:32 test_setFoward(org.eclipse.jst.j2ee.ejb.test.EJBRelationTest)  Time elapsed: 0 s
08:40:32 test_setPrimaryKeyName(org.eclipse.jst.j2ee.ejb.test.EntityTest)  Time elapsed: 0.178 s
08:40:32 test_getPrimaryKeyName(org.eclipse.jst.j2ee.ejb.test.EntityTest)  Time elapsed: 0.229 s
08:40:32 test_initializeFromSignature(org.eclipse.jst.j2ee.ejb.test.MethodElementTest)  Time elapsed: 0 s
08:40:32 test_applyZeroParams(org.eclipse.jst.j2ee.ejb.test.MethodElementTest)  Time elapsed: 0 s
08:40:32 test_equalSignature(org.eclipse.jst.j2ee.ejb.test.MethodElementTest)  Time elapsed: 0 s
08:40:32 test_isRemote(org.eclipse.jst.j2ee.ejb.test.MethodElementTest)  Time elapsed: 0 s
08:40:32 test_getTypeJavaClass(org.eclipse.jst.j2ee.ejb.test.MethodElementTest)  Time elapsed: 0.178 s
08:40:32 test_isHome(org.eclipse.jst.j2ee.ejb.test.MethodElementTest)  Time elapsed: 0 s
08:40:32 test_getSignature(org.eclipse.jst.j2ee.ejb.test.MethodElementTest)  Time elapsed: 0.001 s
08:40:32 test_nameAndParamsEquals(org.eclipse.jst.j2ee.ejb.test.MethodElementTest)  Time elapsed: 0 s
08:40:32 test_isLocalHome(org.eclipse.jst.j2ee.ejb.test.MethodElementTest)  Time elapsed: 0 s
08:40:32 test_isUnspecified(org.eclipse.jst.j2ee.ejb.test.MethodElementTest)  Time elapsed: 0 s
08:40:32 test_isEquivalent(org.eclipse.jst.j2ee.ejb.test.MethodElementTest)  Time elapsed: 0 s
08:40:32 test_MethodElement(org.eclipse.jst.j2ee.ejb.test.MethodElementTest)  Time elapsed: 0 s
08:40:32 test_hasMethodParams(org.eclipse.jst.j2ee.ejb.test.MethodElementTest)  Time elapsed: 0 s
08:40:32 test_isLocal(org.eclipse.jst.j2ee.ejb.test.MethodElementTest)  Time elapsed: 0 s
08:40:32 test_isValid(org.eclipse.jst.j2ee.ejb.test.MethodElementTest)  Time elapsed: 0.001 s
08:40:32 test_getMethodParams(org.eclipse.jst.j2ee.ejb.test.MethodElementTest)  Time elapsed: 0 s
08:40:32 test_isDefault(org.eclipse.jst.j2ee.ejb.test.MethodElementTest)  Time elapsed: 0 s
08:40:32 test_addMethodParams(org.eclipse.jst.j2ee.ejb.test.MethodElementTest)  Time elapsed: 0 s
08:40:32 test_removeMethodParams(org.eclipse.jst.j2ee.ejb.test.MethodElementTest)  Time elapsed: 0 s
08:40:32 testEJBJarPopulation(org.eclipse.jst.j2ee.ejb.test.MethodElementTest)  Time elapsed: 0 s
08:40:32 test14EJBJarPopulation(org.eclipse.jst.j2ee.ejb.test.MethodElementTest)  Time elapsed: 0 s
08:40:32 test_MethodPermission(org.eclipse.jst.j2ee.ejb.test.MethodPermissionTest)  Time elapsed: 0 s
08:40:32 test_isEquivalent(org.eclipse.jst.j2ee.ejb.test.MethodPermissionTest)  Time elapsed: 0 s
08:40:32 test_hasSecurityRole(org.eclipse.jst.j2ee.ejb.test.MethodPermissionTest)  Time elapsed: 0 s
08:40:32 test_getSecurityRole(org.eclipse.jst.j2ee.ejb.test.MethodPermissionTest)  Time elapsed: 0 s
08:40:32 test_hasSecurityRole_2(org.eclipse.jst.j2ee.ejb.test.MethodPermissionTest)  Time elapsed: 0 s
08:40:32 test_getClientTypeJavaClasses(org.eclipse.jst.j2ee.ejb.test.QueryMethodTest)  Time elapsed: 0.179 s
08:40:32 test_isRemoteResultMapping(org.eclipse.jst.j2ee.ejb.test.QueryTest)  Time elapsed: 0 s
08:40:32 test_isLocalResultMapping(org.eclipse.jst.j2ee.ejb.test.QueryTest)  Time elapsed: 0 s
08:40:32 test_Query(org.eclipse.jst.j2ee.ejb.test.QueryTest)  Time elapsed: 0 s
08:40:32 test_hasServiceEndpoint(org.eclipse.jst.j2ee.ejb.test.SessionTest)  Time elapsed: 0 s
08:40:32 test_getServiceEndpointName(org.eclipse.jst.j2ee.ejb.test.SessionTest)  Time elapsed: 0 s
08:40:32 test_setServiceEndpointName(org.eclipse.jst.j2ee.ejb.test.SessionTest)  Time elapsed: 0 s
08:40:32 test_getVersionID(org.eclipse.jst.j2ee.jca.test.ConnectorTest)  Time elapsed: 0.001 s
08:40:32 test_createResourceAdapter(org.eclipse.jst.j2ee.jca.test.JcaFactoryTest)  Time elapsed: 0 s
08:40:32 test_createInboundResourceAdapter(org.eclipse.jst.j2ee.jca.test.JcaFactoryTest)  Time elapsed: 0 s
08:40:32 test_createActivationSpec(org.eclipse.jst.j2ee.jca.test.JcaFactoryTest)  Time elapsed: 0 s
08:40:32 test_getJcaPackage(org.eclipse.jst.j2ee.jca.test.JcaFactoryTest)  Time elapsed: 0 s
08:40:32 test_createAuthenticationMechanism(org.eclipse.jst.j2ee.jca.test.JcaFactoryTest)  Time elapsed: 0 s
08:40:32 test_createMessageAdapter(org.eclipse.jst.j2ee.jca.test.JcaFactoryTest)  Time elapsed: 0 s
08:40:32 test_createRequiredConfigPropertyType(org.eclipse.jst.j2ee.jca.test.JcaFactoryTest)  Time elapsed: 0 s
08:40:32 test_createConfigProperty(org.eclipse.jst.j2ee.jca.test.JcaFactoryTest)  Time elapsed: 0 s
08:40:32 test_createConnectionDefinition(org.eclipse.jst.j2ee.jca.test.JcaFactoryTest)  Time elapsed: 0 s
08:40:32 test_createAdminObject(org.eclipse.jst.j2ee.jca.test.JcaFactoryTest)  Time elapsed: 0 s
08:40:32 test_JcaFactory(org.eclipse.jst.j2ee.jca.test.JcaFactoryTest)  Time elapsed: 0 s
08:40:32 test_createConnector(org.eclipse.jst.j2ee.jca.test.JcaFactoryTest)  Time elapsed: 0 s
08:40:32 test_createMessageListener(org.eclipse.jst.j2ee.jca.test.JcaFactoryTest)  Time elapsed: 0 s
08:40:32 test_createSecurityPermission(org.eclipse.jst.j2ee.jca.test.JcaFactoryTest)  Time elapsed: 0 s
08:40:32 test_createOutboundResourceAdapter(org.eclipse.jst.j2ee.jca.test.JcaFactoryTest)  Time elapsed: 0 s
08:40:32 test_createLicense(org.eclipse.jst.j2ee.jca.test.JcaFactoryTest)  Time elapsed: 0 s
08:40:32 test_createResourceAdapter(org.eclipse.jst.j2ee.jca.test.JcaFactoryTest)  Time elapsed: 0 s
08:40:32 test_createInboundResourceAdapter(org.eclipse.jst.j2ee.jca.test.JcaFactoryTest)  Time elapsed: 0 s
08:40:32 test_createActivationSpec(org.eclipse.jst.j2ee.jca.test.JcaFactoryTest)  Time elapsed: 0 s
08:40:32 test_getJcaPackage(org.eclipse.jst.j2ee.jca.test.JcaFactoryTest)  Time elapsed: 0 s
08:40:32 test_createAuthenticationMechanism(org.eclipse.jst.j2ee.jca.test.JcaFactoryTest)  Time elapsed: 0 s
08:40:32 test_createMessageAdapter(org.eclipse.jst.j2ee.jca.test.JcaFactoryTest)  Time elapsed: 0 s
08:40:32 test_createRequiredConfigPropertyType(org.eclipse.jst.j2ee.jca.test.JcaFactoryTest)  Time elapsed: 0 s
08:40:32 test_createConfigProperty(org.eclipse.jst.j2ee.jca.test.JcaFactoryTest)  Time elapsed: 0 s
08:40:32 test_createConnectionDefinition(org.eclipse.jst.j2ee.jca.test.JcaFactoryTest)  Time elapsed: 0 s
08:40:32 test_createAdminObject(org.eclipse.jst.j2ee.jca.test.JcaFactoryTest)  Time elapsed: 0.001 s
08:40:32 test_JcaFactory(org.eclipse.jst.j2ee.jca.test.JcaFactoryTest)  Time elapsed: 0 s
08:40:32 test_createConnector(org.eclipse.jst.j2ee.jca.test.JcaFactoryTest)  Time elapsed: 0 s
08:40:32 test_createMessageListener(org.eclipse.jst.j2ee.jca.test.JcaFactoryTest)  Time elapsed: 0 s
08:40:32 test_createSecurityPermission(org.eclipse.jst.j2ee.jca.test.JcaFactoryTest)  Time elapsed: 0 s
08:40:32 test_createOutboundResourceAdapter(org.eclipse.jst.j2ee.jca.test.JcaFactoryTest)  Time elapsed: 0 s
08:40:32 test_createLicense(org.eclipse.jst.j2ee.jca.test.JcaFactoryTest)  Time elapsed: 0 s
08:40:32 test_createFormLoginConfig(org.eclipse.jst.j2ee.webapplication.test.WebapplicationFactoryTest)  Time elapsed: 0 s
08:40:32 test_createErrorCodeErrorPage(org.eclipse.jst.j2ee.webapplication.test.WebapplicationFactoryTest)  Time elapsed: 0 s
08:40:32 test_createMimeMapping(org.eclipse.jst.j2ee.webapplication.test.WebapplicationFactoryTest)  Time elapsed: 0 s
08:40:32 test_createExceptionTypeErrorPage(org.eclipse.jst.j2ee.webapplication.test.WebapplicationFactoryTest)  Time elapsed: 0 s
08:40:32 test_createTagLibRef(org.eclipse.jst.j2ee.webapplication.test.WebapplicationFactoryTest)  Time elapsed: 0 s
08:40:32 test_createLocalEncodingMapping(org.eclipse.jst.j2ee.webapplication.test.WebapplicationFactoryTest)  Time elapsed: 0 s
08:40:32 test_createServlet(org.eclipse.jst.j2ee.webapplication.test.WebapplicationFactoryTest)  Time elapsed: 0 s
08:40:32 test_createJSPType(org.eclipse.jst.j2ee.webapplication.test.WebapplicationFactoryTest)  Time elapsed: 0 s
08:40:32 test_createSessionConfig(org.eclipse.jst.j2ee.webapplication.test.WebapplicationFactoryTest)  Time elapsed: 0 s
08:40:32 test_createServletMapping(org.eclipse.jst.j2ee.webapplication.test.WebapplicationFactoryTest)  Time elapsed: 0 s
08:40:32 test_createURLPatternType(org.eclipse.jst.j2ee.webapplication.test.WebapplicationFactoryTest)  Time elapsed: 0 s
08:40:32 test_createLocalEncodingMappingList(org.eclipse.jst.j2ee.webapplication.test.WebapplicationFactoryTest)  Time elapsed: 0 s
08:40:32 test_createFilterMapping(org.eclipse.jst.j2ee.webapplication.test.WebapplicationFactoryTest)  Time elapsed: 0 s
08:40:32 test_createAuthConstraint(org.eclipse.jst.j2ee.webapplication.test.WebapplicationFactoryTest)  Time elapsed: 0.001 s
08:40:32 test_createUserDataConstraint(org.eclipse.jst.j2ee.webapplication.test.WebapplicationFactoryTest)  Time elapsed: 0 s
08:40:32 test_createFilter(org.eclipse.jst.j2ee.webapplication.test.WebapplicationFactoryTest)  Time elapsed: 0 s
08:40:32 test_createRoleNameType(org.eclipse.jst.j2ee.webapplication.test.WebapplicationFactoryTest)  Time elapsed: 0 s
08:40:32 test_createWelcomeFileList(org.eclipse.jst.j2ee.webapplication.test.WebapplicationFactoryTest)  Time elapsed: 0 s
08:40:32 test_createWebApp(org.eclipse.jst.j2ee.webapplication.test.WebapplicationFactoryTest)  Time elapsed: 0.001 s
08:40:32 test_createInitParam(org.eclipse.jst.j2ee.webapplication.test.WebapplicationFactoryTest)  Time elapsed: 0 s
08:40:32 test_createWelcomeFile(org.eclipse.jst.j2ee.webapplication.test.WebapplicationFactoryTest)  Time elapsed: 0 s
08:40:32 test_getWebapplicationPackage(org.eclipse.jst.j2ee.webapplication.test.WebapplicationFactoryTest)  Time elapsed: 0 s
08:40:32 test_createContextParam(org.eclipse.jst.j2ee.webapplication.test.WebapplicationFactoryTest)  Time elapsed: 0 s
08:40:32 test_createSecurityConstraint(org.eclipse.jst.j2ee.webapplication.test.WebapplicationFactoryTest)  Time elapsed: 0 s
08:40:32 test_createHTTPMethodType(org.eclipse.jst.j2ee.webapplication.test.WebapplicationFactoryTest)  Time elapsed: 0 s
08:40:32 test_createWebResourceCollection(org.eclipse.jst.j2ee.webapplication.test.WebapplicationFactoryTest)  Time elapsed: 0 s
08:40:32 test_createErrorPage(org.eclipse.jst.j2ee.webapplication.test.WebapplicationFactoryTest)  Time elapsed: 0 s
08:40:32 test_createServletType(org.eclipse.jst.j2ee.webapplication.test.WebapplicationFactoryTest)  Time elapsed: 0 s
08:40:32 test_createLoginConfig(org.eclipse.jst.j2ee.webapplication.test.WebapplicationFactoryTest)  Time elapsed: 0 s
08:40:32 test_createSOAPHeader(org.eclipse.jst.j2ee.webservice.wscommon.test.WscommonFactoryTest)  Time elapsed: 0 s
08:40:32 test_createDisplayNameType(org.eclipse.jst.j2ee.webservice.wscommon.test.WscommonFactoryTest)  Time elapsed: 0 s
08:40:32 test_getWscommonPackage(org.eclipse.jst.j2ee.webservice.wscommon.test.WscommonFactoryTest)  Time elapsed: 0 s
08:40:32 test_createDescriptionType(org.eclipse.jst.j2ee.webservice.wscommon.test.WscommonFactoryTest)  Time elapsed: 0 s
08:40:32 test_createPortName(org.eclipse.jst.j2ee.webservice.wscommon.test.WscommonFactoryTest)  Time elapsed: 0 s
08:40:32 test_createSOAPRole(org.eclipse.jst.j2ee.webservice.wscommon.test.WscommonFactoryTest)  Time elapsed: 0 s
08:40:32 test_createInitParam(org.eclipse.jst.j2ee.webservice.wscommon.test.WscommonFactoryTest)  Time elapsed: 0 s
08:40:32 test_createEJBLink(org.eclipse.jst.j2ee.webservice.wsdd.test.WsddFactoryTest)  Time elapsed: 0 s
08:40:32 test_createWSDLPort(org.eclipse.jst.j2ee.webservice.wsdd.test.WsddFactoryTest)  Time elapsed: 0 s
08:40:32 test_createPortComponent(org.eclipse.jst.j2ee.webservice.wsdd.test.WsddFactoryTest)  Time elapsed: 0 s
08:40:32 test_createServiceImplBean(org.eclipse.jst.j2ee.webservice.wsdd.test.WsddFactoryTest)  Time elapsed: 0 s
08:40:32 test_createWebServices(org.eclipse.jst.j2ee.webservice.wsdd.test.WsddFactoryTest)  Time elapsed: 0 s
08:40:32 test_createBeanLink(org.eclipse.jst.j2ee.webservice.wsdd.test.WsddFactoryTest)  Time elapsed: 0 s
08:40:32 test_createWebServiceDescription(org.eclipse.jst.j2ee.webservice.wsdd.test.WsddFactoryTest)  Time elapsed: 0 s
08:40:32 test_createHandler(org.eclipse.jst.j2ee.webservice.wsdd.test.WsddFactoryTest)  Time elapsed: 0 s
08:40:32 test_createServletLink(org.eclipse.jst.j2ee.webservice.wsdd.test.WsddFactoryTest)  Time elapsed: 0 s
08:40:32 Running org.eclipse.jst.j2ee.core.api.test.AllCoreAPITests
08:40:32 Tests run: 243, Failures: 0, Errors: 0, Skipped: 0, Time elapsed: 2.166 s - in org.eclipse.jst.j2ee.core.api.test.AllCoreAPITests
08:40:34 test_createEjbModule(org.eclipse.jst.j2ee.application.test.ApplicationFactoryTest)  Time elapsed: 0 s
08:40:34 test_createApplication(org.eclipse.jst.j2ee.application.test.ApplicationFactoryTest)  Time elapsed: 0.001 s
08:40:34 test_createConnectorModule(org.eclipse.jst.j2ee.application.test.ApplicationFactoryTest)  Time elapsed: 0 s
08:40:34 test_createWebModule(org.eclipse.jst.j2ee.application.test.ApplicationFactoryTest)  Time elapsed: 0 s
08:40:34 test_createJavaClientModule(org.eclipse.jst.j2ee.application.test.ApplicationFactoryTest)  Time elapsed: 0 s
08:40:34 test_createModule(org.eclipse.jst.j2ee.application.test.ApplicationFactoryTest)  Time elapsed: 0 s
08:40:34 test_getVersionID(org.eclipse.jst.j2ee.application.test.ApplicationTest)  Time elapsed: 0 s
08:40:34 test_getJ2EEVersionID(org.eclipse.jst.j2ee.application.test.ApplicationTest)  Time elapsed: 0.001 s
08:40:34 test_getSecurityRoleNamed(org.eclipse.jst.j2ee.application.test.ApplicationTest)  Time elapsed: 0 s
08:40:34 test_getModuleHavingAltDD(org.eclipse.jst.j2ee.application.test.ApplicationTest)  Time elapsed: 0 s
08:40:34 test_containsSecurityRole(org.eclipse.jst.j2ee.application.test.ApplicationTest)  Time elapsed: 0 s
08:40:34 test_getModule_2(org.eclipse.jst.j2ee.application.test.ApplicationTest)  Time elapsed: 0 s
08:40:34 test_getFirstModule(org.eclipse.jst.j2ee.application.test.ApplicationTest)  Time elapsed: 0 s
08:40:34 test_getVersionID(org.eclipse.jst.j2ee.client.test.ApplicationClientTest)  Time elapsed: 0.005 s
08:40:34 test_getJ2EEVersionID(org.eclipse.jst.j2ee.client.test.ApplicationClientTest)  Time elapsed: 0.004 s
08:40:34 test_getCallbackHandlerClassName(org.eclipse.jst.j2ee.client.test.ApplicationClientTest)  Time elapsed: 0 s
08:40:34 test_setCallbackHandlerClassName(org.eclipse.jst.j2ee.client.test.ApplicationClientTest)  Time elapsed: 0.001 s
08:40:34 test_ClientFactory(org.eclipse.jst.j2ee.client.test.ClientFactoryTest)  Time elapsed: 0 s
08:40:34 test_createApplicationClient(org.eclipse.jst.j2ee.client.test.ClientFactoryTest)  Time elapsed: 0 s
08:40:34 test_createCompatibilityDescriptionGroup(org.eclipse.jst.j2ee.common.test.CommonFactoryTest)  Time elapsed: 0 s
08:40:34 test_createUseCallerIdentity(org.eclipse.jst.j2ee.common.test.CommonFactoryTest)  Time elapsed: 0 s
08:40:34 test_createDescriptionGroup(org.eclipse.jst.j2ee.common.test.CommonFactoryTest)  Time elapsed: 0 s
08:40:34 test_createIconType(org.eclipse.jst.j2ee.common.test.CommonFactoryTest)  Time elapsed: 0 s
08:40:34 test_createResourceRef(org.eclipse.jst.j2ee.common.test.CommonFactoryTest)  Time elapsed: 0 s
08:40:34 test_createDisplayName(org.eclipse.jst.j2ee.common.test.CommonFactoryTest)  Time elapsed: 0 s
08:40:34 test_createIdentity(org.eclipse.jst.j2ee.common.test.CommonFactoryTest)  Time elapsed: 0 s
08:40:34 test_createSecurityIdentity(org.eclipse.jst.j2ee.common.test.CommonFactoryTest)  Time elapsed: 0 s
08:40:34 test_createResourceEnvRef(org.eclipse.jst.j2ee.common.test.CommonFactoryTest)  Time elapsed: 0 s
08:40:34 test_createDescription(org.eclipse.jst.j2ee.common.test.CommonFactoryTest)  Time elapsed: 0 s
08:40:34 test_createQName(org.eclipse.jst.j2ee.common.test.CommonFactoryTest)  Time elapsed: 0 s
08:40:34 test_CommonFactory(org.eclipse.jst.j2ee.common.test.CommonFactoryTest)  Time elapsed: 0 s
08:40:34 test_createParamValue(org.eclipse.jst.j2ee.common.test.CommonFactoryTest)  Time elapsed: 0 s
08:40:34 test_createEjbRef(org.eclipse.jst.j2ee.common.test.CommonFactoryTest)  Time elapsed: 0 s
08:40:34 test_createListener(org.eclipse.jst.j2ee.common.test.CommonFactoryTest)  Time elapsed: 0 s
08:40:34 test_createMessageDestination(org.eclipse.jst.j2ee.common.test.CommonFactoryTest)  Time elapsed: 0 s
08:40:34 test_createEnvEntry(org.eclipse.jst.j2ee.common.test.CommonFactoryTest)  Time elapsed: 0 s
08:40:34 test_createSecurityRole(org.eclipse.jst.j2ee.common.test.CommonFactoryTest)  Time elapsed: 0 s
08:40:34 test_createMessageDestinationRef(org.eclipse.jst.j2ee.common.test.CommonFactoryTest)  Time elapsed: 0 s
08:40:34 test_createEJBLocalRef(org.eclipse.jst.j2ee.common.test.CommonFactoryTest)  Time elapsed: 0 s
08:40:34 test_createSecurityRoleRef(org.eclipse.jst.j2ee.common.test.CommonFactoryTest)  Time elapsed: 0 s
08:40:34 test_createRunAsSpecifiedIdentity(org.eclipse.jst.j2ee.common.test.CommonFactoryTest)  Time elapsed: 0 s
08:40:34 test_isLinked(org.eclipse.jst.j2ee.common.test.EjbRefTest)  Time elapsed: 0 s
08:40:34 test_EjbRef(org.eclipse.jst.j2ee.common.test.EjbRefTest)  Time elapsed: 0 s
08:40:34 test_isEquivalent(org.eclipse.jst.j2ee.common.test.EjbRefTest)  Time elapsed: 0 s
08:40:34 test_isLocal(org.eclipse.jst.j2ee.common.test.EjbRefTest)  Time elapsed: 0.001 s
08:40:34 test_getLinkedEjb(org.eclipse.jst.j2ee.common.test.EjbRefTest)  Time elapsed: 0 s
08:40:34 test_setListenerClassName(org.eclipse.jst.j2ee.common.test.ListenerTest)  Time elapsed: 0 s
08:40:34 test_getListenerClassName(org.eclipse.jst.j2ee.common.test.ListenerTest)  Time elapsed: 0 s
08:40:34 test_setValues(org.eclipse.jst.j2ee.common.test.QNameTest)  Time elapsed: 0 s
08:40:34 test_getMethodPermissionMethodElements(org.eclipse.jst.j2ee.ejb.test.AssemblyDescriptorTest)  Time elapsed: 0.213 s
08:40:34 test_getMethodTransactionMethodElements(org.eclipse.jst.j2ee.ejb.test.AssemblyDescriptorTest)  Time elapsed: 0.36 s
08:40:34 test_getSecurityRoleNamed(org.eclipse.jst.j2ee.ejb.test.AssemblyDescriptorTest)  Time elapsed: 0.195 s
08:40:34 test_renameSecurityRole(org.eclipse.jst.j2ee.ejb.test.AssemblyDescriptorTest)  Time elapsed: 0.223 s
08:40:34 test_removeData(org.eclipse.jst.j2ee.ejb.test.AssemblyDescriptorTest)  Time elapsed: 0.22 s
08:40:34 test_getSetterName(org.eclipse.jst.j2ee.ejb.test.CMPAttributeTest)  Time elapsed: 0 s
08:40:34 test_getType(org.eclipse.jst.j2ee.ejb.test.CMPAttributeTest)  Time elapsed: 0 s
08:40:34 test_getOriginatingType(org.eclipse.jst.j2ee.ejb.test.CMPAttributeTest)  Time elapsed: 0 s
08:40:34 test_setDerived(org.eclipse.jst.j2ee.ejb.test.CMPAttributeTest)  Time elapsed: 0 s
08:40:34 test_setOriginatingType(org.eclipse.jst.j2ee.ejb.test.CMPAttributeTest)  Time elapsed: 0 s
08:40:34 test_isCMRField(org.eclipse.jst.j2ee.ejb.test.CMPAttributeTest)  Time elapsed: 0 s
08:40:34 test_getGetterName(org.eclipse.jst.j2ee.ejb.test.CMPAttributeTest)  Time elapsed: 0 s
08:40:34 test_isDerived(org.eclipse.jst.j2ee.ejb.test.CMPAttributeTest)  Time elapsed: 0 s
08:40:34 test_isKey(org.eclipse.jst.j2ee.ejb.test.CMPAttributeTest)  Time elapsed: 0 s
08:40:34 test_isPrimKeyField(org.eclipse.jst.j2ee.ejb.test.CMPAttributeTest)  Time elapsed: 0 s
08:40:34 test_getRole(org.eclipse.jst.j2ee.ejb.test.CMRFieldTest)  Time elapsed: 0 s
08:40:34 test_setCollectionTypeName(org.eclipse.jst.j2ee.ejb.test.CMRFieldTest)  Time elapsed: 0 s
08:40:34 test_setCollectionType(org.eclipse.jst.j2ee.ejb.test.CMRFieldTest)  Time elapsed: 0 s
08:40:34 test_getCollectionType(org.eclipse.jst.j2ee.ejb.test.CMRFieldTest)  Time elapsed: 0 s
08:40:34 test_setRole(org.eclipse.jst.j2ee.ejb.test.CMRFieldTest)  Time elapsed: 0 s
08:40:34 test_getCollectionTypeName(org.eclipse.jst.j2ee.ejb.test.CMRFieldTest)  Time elapsed: 0 s
08:40:34 test_isUnknownPrimaryKey(org.eclipse.jst.j2ee.ejb.test.ContainerManagedEntityTest)  Time elapsed: 0.001 s
08:40:34 test_addPersistentAttribute(org.eclipse.jst.j2ee.ejb.test.ContainerManagedEntityTest)  Time elapsed: 0 s
08:40:34 test_addKeyAttributeName(org.eclipse.jst.j2ee.ejb.test.ContainerManagedEntityTest)  Time elapsed: 0 s
08:40:34 test_getKeyAttribute(org.eclipse.jst.j2ee.ejb.test.ContainerManagedEntityTest)  Time elapsed: 0 s
08:40:34 test_isContainerManagedEntity(org.eclipse.jst.j2ee.ejb.test.ContainerManagedEntityTest)  Time elapsed: 0 s
08:40:34 test_getPrimaryKeyAttribute(org.eclipse.jst.j2ee.ejb.test.ContainerManagedEntityTest)  Time elapsed: 0 s
08:40:34 test_isVersion1_X(org.eclipse.jst.j2ee.ejb.test.ContainerManagedEntityTest)  Time elapsed: 0 s
08:40:34 test_isVersion2_X(org.eclipse.jst.j2ee.ejb.test.ContainerManagedEntityTest)  Time elapsed: 0 s
08:40:34 test_removePersistentAttribute_2(org.eclipse.jst.j2ee.ejb.test.ContainerManagedEntityTest)  Time elapsed: 0 s
08:40:34 test_listPersistentFieldNames(org.eclipse.jst.j2ee.ejb.test.ContainerManagedEntityTest)  Time elapsed: 0 s
08:40:34 test_isKeyAttribute(org.eclipse.jst.j2ee.ejb.test.ContainerManagedEntityTest)  Time elapsed: 0 s
08:40:34 test_getCMPVersionID(org.eclipse.jst.j2ee.ejb.test.ContainerManagedEntityTest)  Time elapsed: 0 s
08:40:34 test_setPrimKeyField(org.eclipse.jst.j2ee.ejb.test.ContainerManagedEntityTest)  Time elapsed: 0 s
08:40:34 test_addPersistentAttributeName(org.eclipse.jst.j2ee.ejb.test.ContainerManagedEntityTest)  Time elapsed: 0 s
08:40:34 test_removePersistentAttribute(org.eclipse.jst.j2ee.ejb.test.ContainerManagedEntityTest)  Time elapsed: 0 s
08:40:34 test_createActivationConfig(org.eclipse.jst.j2ee.ejb.test.EjbFactoryTest)  Time elapsed: 0 s
08:40:34 test_createExcludeList(org.eclipse.jst.j2ee.ejb.test.EjbFactoryTest)  Time elapsed: 0 s
08:40:34 test_createEJBRelationshipRole(org.eclipse.jst.j2ee.ejb.test.EjbFactoryTest)  Time elapsed: 0 s
08:40:34 test_createContainerManagedEntity(org.eclipse.jst.j2ee.ejb.test.EjbFactoryTest)  Time elapsed: 0 s
08:40:34 test_createMessageDrivenDestination(org.eclipse.jst.j2ee.ejb.test.EjbFactoryTest)  Time elapsed: 0 s
08:40:34 test_createMethodElement_2(org.eclipse.jst.j2ee.ejb.test.EjbFactoryTest)  Time elapsed: 0 s
08:40:34 test_createCMPAttribute(org.eclipse.jst.j2ee.ejb.test.EjbFactoryTest)  Time elapsed: 0 s
08:40:34 test_createSession(org.eclipse.jst.j2ee.ejb.test.EjbFactoryTest)  Time elapsed: 0 s
08:40:34 test_createMethodElementFrom(org.eclipse.jst.j2ee.ejb.test.EjbFactoryTest)  Time elapsed: 0.001 s
08:40:34 test_createEJBRelation(org.eclipse.jst.j2ee.ejb.test.EjbFactoryTest)  Time elapsed: 0 s
08:40:34 test_createMethodElementFrom_2(org.eclipse.jst.j2ee.ejb.test.EjbFactoryTest)  Time elapsed: 0 s
08:40:34 test_EjbFactory(org.eclipse.jst.j2ee.ejb.test.EjbFactoryTest)  Time elapsed: 0 s
08:40:34 test_createQuery(org.eclipse.jst.j2ee.ejb.test.EjbFactoryTest)  Time elapsed: 0 s
08:40:34 test_createQueryMethod(org.eclipse.jst.j2ee.ejb.test.EjbFactoryTest)  Time elapsed: 0 s
08:40:34 test_createActivationConfigProperty(org.eclipse.jst.j2ee.ejb.test.EjbFactoryTest)  Time elapsed: 0 s
08:40:34 test_createEJBJar(org.eclipse.jst.j2ee.ejb.test.EjbFactoryTest)  Time elapsed: 0 s
08:40:34 test_createMethodPermission(org.eclipse.jst.j2ee.ejb.test.EjbFactoryTest)  Time elapsed: 0 s
08:40:34 test_createEntity(org.eclipse.jst.j2ee.ejb.test.EjbFactoryTest)  Time elapsed: 0 s
08:40:34 test_createRelationships(org.eclipse.jst.j2ee.ejb.test.EjbFactoryTest)  Time elapsed: 0 s
08:40:34 test_createEJBMethodCategory(org.eclipse.jst.j2ee.ejb.test.EjbFactoryTest)  Time elapsed: 0 s
08:40:34 test_createMethodTransaction(org.eclipse.jst.j2ee.ejb.test.EjbFactoryTest)  Time elapsed: 0 s
08:40:34 test_createMethodElement(org.eclipse.jst.j2ee.ejb.test.EjbFactoryTest)  Time elapsed: 0 s
08:40:34 test_createAssemblyDescriptor(org.eclipse.jst.j2ee.ejb.test.EjbFactoryTest)  Time elapsed: 0 s
08:40:34 test_createRoleSource(org.eclipse.jst.j2ee.ejb.test.EjbFactoryTest)  Time elapsed: 0 s
08:40:34 test_createCMRField(org.eclipse.jst.j2ee.ejb.test.EjbFactoryTest)  Time elapsed: 0 s
08:40:34 test_createMessageDriven(org.eclipse.jst.j2ee.ejb.test.EjbFactoryTest)  Time elapsed: 0 s
08:40:34 test_isNavigable(org.eclipse.jst.j2ee.ejb.test.EJBRelationshipRoleTest)  Time elapsed: 0 s
08:40:34 test_getLogicalName(org.eclipse.jst.j2ee.ejb.test.EJBRelationshipRoleTest)  Time elapsed: 0 s
08:40:34 test_getName(org.eclipse.jst.j2ee.ejb.test.EJBRelationshipRoleTest)  Time elapsed: 0 s
08:40:34 test_isForward(org.eclipse.jst.j2ee.ejb.test.EJBRelationshipRoleTest)  Time elapsed: 0 s
08:40:34 test_isMany(org.eclipse.jst.j2ee.ejb.test.EJBRelationshipRoleTest)  Time elapsed: 0 s
08:40:34 test_setKey(org.eclipse.jst.j2ee.ejb.test.EJBRelationshipRoleTest)  Time elapsed: 0 s
08:40:34 test_EJBRelationshipRole(org.eclipse.jst.j2ee.ejb.test.EJBRelationshipRoleTest)  Time elapsed: 0.001 s
08:40:34 test_setFoward(org.eclipse.jst.j2ee.ejb.test.EJBRelationshipRoleTest)  Time elapsed: 0 s
08:40:34 test_setName(org.eclipse.jst.j2ee.ejb.test.EJBRelationshipRoleTest)  Time elapsed: 0 s
08:40:34 test_getSourceEntity(org.eclipse.jst.j2ee.ejb.test.EJBRelationshipRoleTest)  Time elapsed: 0 s
08:40:34 test_setRequired(org.eclipse.jst.j2ee.ejb.test.EJBRelationshipRoleTest)  Time elapsed: 0 s
08:40:34 test_isKey(org.eclipse.jst.j2ee.ejb.test.EJBRelationshipRoleTest)  Time elapsed: 0 s
08:40:34 test_getOpposite(org.eclipse.jst.j2ee.ejb.test.EJBRelationshipRoleTest)  Time elapsed: 0 s
08:40:34 test_containsRelationshipRole(org.eclipse.jst.j2ee.ejb.test.EJBRelationTest)  Time elapsed: 0 s
08:40:34 test_getSecondRole(org.eclipse.jst.j2ee.ejb.test.EJBRelationTest)  Time elapsed: 0 s
08:40:34 test_getFirstRole(org.eclipse.jst.j2ee.ejb.test.EJBRelationTest)  Time elapsed: 0 s
08:40:34 test_getOppositeRole(org.eclipse.jst.j2ee.ejb.test.EJBRelationTest)  Time elapsed: 0 s
08:40:34 test_EJBRelation(org.eclipse.jst.j2ee.ejb.test.EJBRelationTest)  Time elapsed: 0 s
08:40:34 test_setFoward(org.eclipse.jst.j2ee.ejb.test.EJBRelationTest)  Time elapsed: 0 s
08:40:34 test_setPrimaryKeyName(org.eclipse.jst.j2ee.ejb.test.EntityTest)  Time elapsed: 0.302 s
08:40:34 test_getPrimaryKeyName(org.eclipse.jst.j2ee.ejb.test.EntityTest)  Time elapsed: 0.219 s
08:40:34 test_initializeFromSignature(org.eclipse.jst.j2ee.ejb.test.MethodElementTest)  Time elapsed: 0 s
08:40:34 test_applyZeroParams(org.eclipse.jst.j2ee.ejb.test.MethodElementTest)  Time elapsed: 0 s
08:40:34 test_equalSignature(org.eclipse.jst.j2ee.ejb.test.MethodElementTest)  Time elapsed: 0 s
08:40:34 test_isRemote(org.eclipse.jst.j2ee.ejb.test.MethodElementTest)  Time elapsed: 0 s
08:40:34 test_getTypeJavaClass(org.eclipse.jst.j2ee.ejb.test.MethodElementTest)  Time elapsed: 0.212 s
08:40:34 test_isHome(org.eclipse.jst.j2ee.ejb.test.MethodElementTest)  Time elapsed: 0 s
08:40:34 test_getSignature(org.eclipse.jst.j2ee.ejb.test.MethodElementTest)  Time elapsed: 0 s
08:40:34 test_nameAndParamsEquals(org.eclipse.jst.j2ee.ejb.test.MethodElementTest)  Time elapsed: 0 s
08:40:34 test_isLocalHome(org.eclipse.jst.j2ee.ejb.test.MethodElementTest)  Time elapsed: 0.001 s
08:40:34 test_isUnspecified(org.eclipse.jst.j2ee.ejb.test.MethodElementTest)  Time elapsed: 0 s
08:40:34 test_isEquivalent(org.eclipse.jst.j2ee.ejb.test.MethodElementTest)  Time elapsed: 0 s
08:40:34 test_MethodElement(org.eclipse.jst.j2ee.ejb.test.MethodElementTest)  Time elapsed: 0 s
08:40:34 test_hasMethodParams(org.eclipse.jst.j2ee.ejb.test.MethodElementTest)  Time elapsed: 0 s
08:40:34 test_isLocal(org.eclipse.jst.j2ee.ejb.test.MethodElementTest)  Time elapsed: 0 s
08:40:34 test_isValid(org.eclipse.jst.j2ee.ejb.test.MethodElementTest)  Time elapsed: 0 s
08:40:34 test_getMethodParams(org.eclipse.jst.j2ee.ejb.test.MethodElementTest)  Time elapsed: 0 s
08:40:34 test_isDefault(org.eclipse.jst.j2ee.ejb.test.MethodElementTest)  Time elapsed: 0 s
08:40:34 test_addMethodParams(org.eclipse.jst.j2ee.ejb.test.MethodElementTest)  Time elapsed: 0 s
08:40:34 test_removeMethodParams(org.eclipse.jst.j2ee.ejb.test.MethodElementTest)  Time elapsed: 0 s
08:40:34 testEJBJarPopulation(org.eclipse.jst.j2ee.ejb.test.MethodElementTest)  Time elapsed: 0 s
08:40:34 test14EJBJarPopulation(org.eclipse.jst.j2ee.ejb.test.MethodElementTest)  Time elapsed: 0 s
08:40:34 test_MethodPermission(org.eclipse.jst.j2ee.ejb.test.MethodPermissionTest)  Time elapsed: 0 s
08:40:34 test_isEquivalent(org.eclipse.jst.j2ee.ejb.test.MethodPermissionTest)  Time elapsed: 0 s
08:40:34 test_hasSecurityRole(org.eclipse.jst.j2ee.ejb.test.MethodPermissionTest)  Time elapsed: 0 s
08:40:34 test_getSecurityRole(org.eclipse.jst.j2ee.ejb.test.MethodPermissionTest)  Time elapsed: 0 s
08:40:34 test_hasSecurityRole_2(org.eclipse.jst.j2ee.ejb.test.MethodPermissionTest)  Time elapsed: 0 s
08:40:34 test_getClientTypeJavaClasses(org.eclipse.jst.j2ee.ejb.test.QueryMethodTest)  Time elapsed: 0.191 s
08:40:34 test_isRemoteResultMapping(org.eclipse.jst.j2ee.ejb.test.QueryTest)  Time elapsed: 0 s
08:40:34 test_isLocalResultMapping(org.eclipse.jst.j2ee.ejb.test.QueryTest)  Time elapsed: 0 s
08:40:34 test_Query(org.eclipse.jst.j2ee.ejb.test.QueryTest)  Time elapsed: 0 s
08:40:34 test_hasServiceEndpoint(org.eclipse.jst.j2ee.ejb.test.SessionTest)  Time elapsed: 0 s
08:40:34 test_getServiceEndpointName(org.eclipse.jst.j2ee.ejb.test.SessionTest)  Time elapsed: 0 s
08:40:34 test_setServiceEndpointName(org.eclipse.jst.j2ee.ejb.test.SessionTest)  Time elapsed: 0 s
08:40:34 test_getVersionID(org.eclipse.jst.j2ee.jca.test.ConnectorTest)  Time elapsed: 0.001 s
08:40:34 test_createResourceAdapter(org.eclipse.jst.j2ee.jca.test.JcaFactoryTest)  Time elapsed: 0 s
08:40:34 test_createInboundResourceAdapter(org.eclipse.jst.j2ee.jca.test.JcaFactoryTest)  Time elapsed: 0.001 s
08:40:34 test_createActivationSpec(org.eclipse.jst.j2ee.jca.test.JcaFactoryTest)  Time elapsed: 0 s
08:40:34 test_getJcaPackage(org.eclipse.jst.j2ee.jca.test.JcaFactoryTest)  Time elapsed: 0 s
08:40:34 test_createAuthenticationMechanism(org.eclipse.jst.j2ee.jca.test.JcaFactoryTest)  Time elapsed: 0 s
08:40:34 test_createMessageAdapter(org.eclipse.jst.j2ee.jca.test.JcaFactoryTest)  Time elapsed: 0 s
08:40:34 test_createRequiredConfigPropertyType(org.eclipse.jst.j2ee.jca.test.JcaFactoryTest)  Time elapsed: 0 s
08:40:34 test_createConfigProperty(org.eclipse.jst.j2ee.jca.test.JcaFactoryTest)  Time elapsed: 0 s
08:40:34 test_createConnectionDefinition(org.eclipse.jst.j2ee.jca.test.JcaFactoryTest)  Time elapsed: 0 s
08:40:34 test_createAdminObject(org.eclipse.jst.j2ee.jca.test.JcaFactoryTest)  Time elapsed: 0 s
08:40:34 test_JcaFactory(org.eclipse.jst.j2ee.jca.test.JcaFactoryTest)  Time elapsed: 0 s
08:40:34 test_createConnector(org.eclipse.jst.j2ee.jca.test.JcaFactoryTest)  Time elapsed: 0 s
08:40:34 test_createMessageListener(org.eclipse.jst.j2ee.jca.test.JcaFactoryTest)  Time elapsed: 0 s
08:40:34 test_createSecurityPermission(org.eclipse.jst.j2ee.jca.test.JcaFactoryTest)  Time elapsed: 0 s
08:40:34 test_createOutboundResourceAdapter(org.eclipse.jst.j2ee.jca.test.JcaFactoryTest)  Time elapsed: 0 s
08:40:34 test_createLicense(org.eclipse.jst.j2ee.jca.test.JcaFactoryTest)  Time elapsed: 0 s
08:40:34 test_createResourceAdapter(org.eclipse.jst.j2ee.jca.test.JcaFactoryTest)  Time elapsed: 0 s
08:40:34 test_createInboundResourceAdapter(org.eclipse.jst.j2ee.jca.test.JcaFactoryTest)  Time elapsed: 0 s
08:40:34 test_createActivationSpec(org.eclipse.jst.j2ee.jca.test.JcaFactoryTest)  Time elapsed: 0 s
08:40:34 test_getJcaPackage(org.eclipse.jst.j2ee.jca.test.JcaFactoryTest)  Time elapsed: 0 s
08:40:34 test_createAuthenticationMechanism(org.eclipse.jst.j2ee.jca.test.JcaFactoryTest)  Time elapsed: 0 s
08:40:34 test_createMessageAdapter(org.eclipse.jst.j2ee.jca.test.JcaFactoryTest)  Time elapsed: 0 s
08:40:34 test_createRequiredConfigPropertyType(org.eclipse.jst.j2ee.jca.test.JcaFactoryTest)  Time elapsed: 0 s
08:40:34 test_createConfigProperty(org.eclipse.jst.j2ee.jca.test.JcaFactoryTest)  Time elapsed: 0 s
08:40:34 test_createConnectionDefinition(org.eclipse.jst.j2ee.jca.test.JcaFactoryTest)  Time elapsed: 0 s
08:40:34 test_createAdminObject(org.eclipse.jst.j2ee.jca.test.JcaFactoryTest)  Time elapsed: 0 s
08:40:34 test_JcaFactory(org.eclipse.jst.j2ee.jca.test.JcaFactoryTest)  Time elapsed: 0 s
08:40:34 test_createConnector(org.eclipse.jst.j2ee.jca.test.JcaFactoryTest)  Time elapsed: 0 s
08:40:34 test_createMessageListener(org.eclipse.jst.j2ee.jca.test.JcaFactoryTest)  Time elapsed: 0 s
08:40:34 test_createSecurityPermission(org.eclipse.jst.j2ee.jca.test.JcaFactoryTest)  Time elapsed: 0 s
08:40:34 test_createOutboundResourceAdapter(org.eclipse.jst.j2ee.jca.test.JcaFactoryTest)  Time elapsed: 0 s
08:40:34 test_createLicense(org.eclipse.jst.j2ee.jca.test.JcaFactoryTest)  Time elapsed: 0 s
08:40:34 test_createFormLoginConfig(org.eclipse.jst.j2ee.webapplication.test.WebapplicationFactoryTest)  Time elapsed: 0 s
08:40:34 test_createErrorCodeErrorPage(org.eclipse.jst.j2ee.webapplication.test.WebapplicationFactoryTest)  Time elapsed: 0 s
08:40:34 test_createMimeMapping(org.eclipse.jst.j2ee.webapplication.test.WebapplicationFactoryTest)  Time elapsed: 0 s
08:40:34 test_createExceptionTypeErrorPage(org.eclipse.jst.j2ee.webapplication.test.WebapplicationFactoryTest)  Time elapsed: 0 s
08:40:34 test_createTagLibRef(org.eclipse.jst.j2ee.webapplication.test.WebapplicationFactoryTest)  Time elapsed: 0 s
08:40:34 test_createLocalEncodingMapping(org.eclipse.jst.j2ee.webapplication.test.WebapplicationFactoryTest)  Time elapsed: 0 s
08:40:34 test_createServlet(org.eclipse.jst.j2ee.webapplication.test.WebapplicationFactoryTest)  Time elapsed: 0 s
08:40:34 test_createJSPType(org.eclipse.jst.j2ee.webapplication.test.WebapplicationFactoryTest)  Time elapsed: 0 s
08:40:34 test_createSessionConfig(org.eclipse.jst.j2ee.webapplication.test.WebapplicationFactoryTest)  Time elapsed: 0 s
08:40:34 test_createServletMapping(org.eclipse.jst.j2ee.webapplication.test.WebapplicationFactoryTest)  Time elapsed: 0 s
08:40:34 test_createURLPatternType(org.eclipse.jst.j2ee.webapplication.test.WebapplicationFactoryTest)  Time elapsed: 0 s
08:40:34 test_createLocalEncodingMappingList(org.eclipse.jst.j2ee.webapplication.test.WebapplicationFactoryTest)  Time elapsed: 0 s
08:40:34 test_createFilterMapping(org.eclipse.jst.j2ee.webapplication.test.WebapplicationFactoryTest)  Time elapsed: 0 s
08:40:34 test_createAuthConstraint(org.eclipse.jst.j2ee.webapplication.test.WebapplicationFactoryTest)  Time elapsed: 0 s
08:40:34 test_createUserDataConstraint(org.eclipse.jst.j2ee.webapplication.test.WebapplicationFactoryTest)  Time elapsed: 0 s
08:40:34 test_createFilter(org.eclipse.jst.j2ee.webapplication.test.WebapplicationFactoryTest)  Time elapsed: 0 s
08:40:34 test_createRoleNameType(org.eclipse.jst.j2ee.webapplication.test.WebapplicationFactoryTest)  Time elapsed: 0 s
08:40:34 test_createWelcomeFileList(org.eclipse.jst.j2ee.webapplication.test.WebapplicationFactoryTest)  Time elapsed: 0 s
08:40:34 test_createWebApp(org.eclipse.jst.j2ee.webapplication.test.WebapplicationFactoryTest)  Time elapsed: 0 s
08:40:34 test_createInitParam(org.eclipse.jst.j2ee.webapplication.test.WebapplicationFactoryTest)  Time elapsed: 0 s
08:40:34 test_createWelcomeFile(org.eclipse.jst.j2ee.webapplication.test.WebapplicationFactoryTest)  Time elapsed: 0 s
08:40:34 test_getWebapplicationPackage(org.eclipse.jst.j2ee.webapplication.test.WebapplicationFactoryTest)  Time elapsed: 0 s
08:40:34 test_createContextParam(org.eclipse.jst.j2ee.webapplication.test.WebapplicationFactoryTest)  Time elapsed: 0 s
08:40:34 test_createSecurityConstraint(org.eclipse.jst.j2ee.webapplication.test.WebapplicationFactoryTest)  Time elapsed: 0 s
08:40:34 test_createHTTPMethodType(org.eclipse.jst.j2ee.webapplication.test.WebapplicationFactoryTest)  Time elapsed: 0 s
08:40:34 test_createWebResourceCollection(org.eclipse.jst.j2ee.webapplication.test.WebapplicationFactoryTest)  Time elapsed: 0 s
08:40:34 test_createErrorPage(org.eclipse.jst.j2ee.webapplication.test.WebapplicationFactoryTest)  Time elapsed: 0 s
08:40:34 test_createServletType(org.eclipse.jst.j2ee.webapplication.test.WebapplicationFactoryTest)  Time elapsed: 0 s
08:40:34 test_createLoginConfig(org.eclipse.jst.j2ee.webapplication.test.WebapplicationFactoryTest)  Time elapsed: 0 s
08:40:34 test_createSOAPHeader(org.eclipse.jst.j2ee.webservice.wscommon.test.WscommonFactoryTest)  Time elapsed: 0 s
08:40:34 test_createDisplayNameType(org.eclipse.jst.j2ee.webservice.wscommon.test.WscommonFactoryTest)  Time elapsed: 0 s
08:40:34 test_getWscommonPackage(org.eclipse.jst.j2ee.webservice.wscommon.test.WscommonFactoryTest)  Time elapsed: 0 s
08:40:34 test_createDescriptionType(org.eclipse.jst.j2ee.webservice.wscommon.test.WscommonFactoryTest)  Time elapsed: 0 s
08:40:34 test_createPortName(org.eclipse.jst.j2ee.webservice.wscommon.test.WscommonFactoryTest)  Time elapsed: 0 s
08:40:34 test_createSOAPRole(org.eclipse.jst.j2ee.webservice.wscommon.test.WscommonFactoryTest)  Time elapsed: 0 s
08:40:34 test_createInitParam(org.eclipse.jst.j2ee.webservice.wscommon.test.WscommonFactoryTest)  Time elapsed: 0 s
08:40:34 test_createEJBLink(org.eclipse.jst.j2ee.webservice.wsdd.test.WsddFactoryTest)  Time elapsed: 0 s
08:40:34 test_createWSDLPort(org.eclipse.jst.j2ee.webservice.wsdd.test.WsddFactoryTest)  Time elapsed: 0 s
08:40:34 test_createPortComponent(org.eclipse.jst.j2ee.webservice.wsdd.test.WsddFactoryTest)  Time elapsed: 0 s
08:40:34 test_createServiceImplBean(org.eclipse.jst.j2ee.webservice.wsdd.test.WsddFactoryTest)  Time elapsed: 0 s
08:40:34 test_createWebServices(org.eclipse.jst.j2ee.webservice.wsdd.test.WsddFactoryTest)  Time elapsed: 0 s
08:40:34 test_createBeanLink(org.eclipse.jst.j2ee.webservice.wsdd.test.WsddFactoryTest)  Time elapsed: 0 s
08:40:34 test_createWebServiceDescription(org.eclipse.jst.j2ee.webservice.wsdd.test.WsddFactoryTest)  Time elapsed: 0 s
08:40:34 test_createHandler(org.eclipse.jst.j2ee.webservice.wsdd.test.WsddFactoryTest)  Time elapsed: 0 s
08:40:34 test_createServletLink(org.eclipse.jst.j2ee.webservice.wsdd.test.WsddFactoryTest)  Time elapsed: 0 s
08:40:34 Running org.eclipse.jst.j2ee.client.test.ApplicationClientTest
08:40:34 Tests run: 4, Failures: 0, Errors: 0, Skipped: 0, Time elapsed: 0.011 s - in org.eclipse.jst.j2ee.client.test.ApplicationClientTest
08:40:34 test_getVersionID(org.eclipse.jst.j2ee.client.test.ApplicationClientTest)  Time elapsed: 0.005 s
08:40:34 test_getJ2EEVersionID(org.eclipse.jst.j2ee.client.test.ApplicationClientTest)  Time elapsed: 0.006 s
08:40:34 test_getCallbackHandlerClassName(org.eclipse.jst.j2ee.client.test.ApplicationClientTest)  Time elapsed: 0 s
08:40:34 test_setCallbackHandlerClassName(org.eclipse.jst.j2ee.client.test.ApplicationClientTest)  Time elapsed: 0 s
08:40:34 Running org.eclipse.jst.j2ee.client.test.ClientFactoryTest
08:40:34 Tests run: 2, Failures: 0, Errors: 0, Skipped: 0, Time elapsed: 0 s - in org.eclipse.jst.j2ee.client.test.ClientFactoryTest
08:40:34 test_ClientFactory(org.eclipse.jst.j2ee.client.test.ClientFactoryTest)  Time elapsed: 0 s
08:40:34 test_createApplicationClient(org.eclipse.jst.j2ee.client.test.ClientFactoryTest)  Time elapsed: 0 s
08:40:34 Running org.eclipse.jst.j2ee.application.test.ApplicationFactoryTest
08:40:34 Tests run: 6, Failures: 0, Errors: 0, Skipped: 0, Time elapsed: 0.001 s - in org.eclipse.jst.j2ee.application.test.ApplicationFactoryTest
08:40:34 test_createEjbModule(org.eclipse.jst.j2ee.application.test.ApplicationFactoryTest)  Time elapsed: 0 s
08:40:34 test_createApplication(org.eclipse.jst.j2ee.application.test.ApplicationFactoryTest)  Time elapsed: 0 s
08:40:34 test_createConnectorModule(org.eclipse.jst.j2ee.application.test.ApplicationFactoryTest)  Time elapsed: 0 s
08:40:34 test_createWebModule(org.eclipse.jst.j2ee.application.test.ApplicationFactoryTest)  Time elapsed: 0 s
08:40:34 test_createJavaClientModule(org.eclipse.jst.j2ee.application.test.ApplicationFactoryTest)  Time elapsed: 0 s
08:40:34 test_createModule(org.eclipse.jst.j2ee.application.test.ApplicationFactoryTest)  Time elapsed: 0 s
08:40:34 Running org.eclipse.jst.j2ee.application.test.ApplicationTest
08:40:34 Tests run: 7, Failures: 0, Errors: 0, Skipped: 0, Time elapsed: 0.002 s - in org.eclipse.jst.j2ee.application.test.ApplicationTest
08:40:34 test_getVersionID(org.eclipse.jst.j2ee.application.test.ApplicationTest)  Time elapsed: 0 s
08:40:34 test_getJ2EEVersionID(org.eclipse.jst.j2ee.application.test.ApplicationTest)  Time elapsed: 0.001 s
08:40:34 test_getSecurityRoleNamed(org.eclipse.jst.j2ee.application.test.ApplicationTest)  Time elapsed: 0 s
08:40:34 test_getModuleHavingAltDD(org.eclipse.jst.j2ee.application.test.ApplicationTest)  Time elapsed: 0 s
08:40:34 test_containsSecurityRole(org.eclipse.jst.j2ee.application.test.ApplicationTest)  Time elapsed: 0 s
08:40:34 test_getModule_2(org.eclipse.jst.j2ee.application.test.ApplicationTest)  Time elapsed: 0 s
08:40:34 test_getFirstModule(org.eclipse.jst.j2ee.application.test.ApplicationTest)  Time elapsed: 0 s
08:40:34 Running org.eclipse.jst.j2ee.jca.test.JcaFactoryTest
08:40:34 Tests run: 16, Failures: 0, Errors: 0, Skipped: 0, Time elapsed: 0.002 s - in org.eclipse.jst.j2ee.jca.test.JcaFactoryTest
08:40:34 test_createResourceAdapter(org.eclipse.jst.j2ee.jca.test.JcaFactoryTest)  Time elapsed: 0 s
08:40:34 test_createInboundResourceAdapter(org.eclipse.jst.j2ee.jca.test.JcaFactoryTest)  Time elapsed: 0 s
08:40:34 test_createActivationSpec(org.eclipse.jst.j2ee.jca.test.JcaFactoryTest)  Time elapsed: 0 s
08:40:34 test_getJcaPackage(org.eclipse.jst.j2ee.jca.test.JcaFactoryTest)  Time elapsed: 0 s
08:40:34 test_createAuthenticationMechanism(org.eclipse.jst.j2ee.jca.test.JcaFactoryTest)  Time elapsed: 0 s
08:40:34 test_createMessageAdapter(org.eclipse.jst.j2ee.jca.test.JcaFactoryTest)  Time elapsed: 0 s
08:40:34 test_createRequiredConfigPropertyType(org.eclipse.jst.j2ee.jca.test.JcaFactoryTest)  Time elapsed: 0 s
08:40:34 test_createConfigProperty(org.eclipse.jst.j2ee.jca.test.JcaFactoryTest)  Time elapsed: 0 s
08:40:34 test_createConnectionDefinition(org.eclipse.jst.j2ee.jca.test.JcaFactoryTest)  Time elapsed: 0 s
08:40:34 test_createAdminObject(org.eclipse.jst.j2ee.jca.test.JcaFactoryTest)  Time elapsed: 0 s
08:40:34 test_JcaFactory(org.eclipse.jst.j2ee.jca.test.JcaFactoryTest)  Time elapsed: 0 s
08:40:34 test_createConnector(org.eclipse.jst.j2ee.jca.test.JcaFactoryTest)  Time elapsed: 0 s
08:40:34 test_createMessageListener(org.eclipse.jst.j2ee.jca.test.JcaFactoryTest)  Time elapsed: 0 s
08:40:34 test_createSecurityPermission(org.eclipse.jst.j2ee.jca.test.JcaFactoryTest)  Time elapsed: 0 s
08:40:34 test_createOutboundResourceAdapter(org.eclipse.jst.j2ee.jca.test.JcaFactoryTest)  Time elapsed: 0 s
08:40:34 test_createLicense(org.eclipse.jst.j2ee.jca.test.JcaFactoryTest)  Time elapsed: 0 s
08:40:34 Running org.eclipse.jst.j2ee.jca.test.ConnectorTest
08:40:34 Tests run: 1, Failures: 0, Errors: 0, Skipped: 0, Time elapsed: 0.001 s - in org.eclipse.jst.j2ee.jca.test.ConnectorTest
08:40:34 test_getVersionID(org.eclipse.jst.j2ee.jca.test.ConnectorTest)  Time elapsed: 0.001 s
08:40:34 Running org.eclipse.jst.j2ee.jsp.test.JspFactoryTest
08:40:34 Tests run: 16, Failures: 0, Errors: 0, Skipped: 0, Time elapsed: 0.001 s - in org.eclipse.jst.j2ee.jsp.test.JspFactoryTest
08:40:34 test_createResourceAdapter(org.eclipse.jst.j2ee.jca.test.JcaFactoryTest)  Time elapsed: 0 s
08:40:34 test_createInboundResourceAdapter(org.eclipse.jst.j2ee.jca.test.JcaFactoryTest)  Time elapsed: 0 s
08:40:34 test_createActivationSpec(org.eclipse.jst.j2ee.jca.test.JcaFactoryTest)  Time elapsed: 0 s
08:40:34 test_getJcaPackage(org.eclipse.jst.j2ee.jca.test.JcaFactoryTest)  Time elapsed: 0 s
08:40:34 test_createAuthenticationMechanism(org.eclipse.jst.j2ee.jca.test.JcaFactoryTest)  Time elapsed: 0 s
08:40:34 test_createMessageAdapter(org.eclipse.jst.j2ee.jca.test.JcaFactoryTest)  Time elapsed: 0 s
08:40:34 test_createRequiredConfigPropertyType(org.eclipse.jst.j2ee.jca.test.JcaFactoryTest)  Time elapsed: 0 s
08:40:34 test_createConfigProperty(org.eclipse.jst.j2ee.jca.test.JcaFactoryTest)  Time elapsed: 0 s
08:40:34 test_createConnectionDefinition(org.eclipse.jst.j2ee.jca.test.JcaFactoryTest)  Time elapsed: 0 s
08:40:34 test_createAdminObject(org.eclipse.jst.j2ee.jca.test.JcaFactoryTest)  Time elapsed: 0 s
08:40:34 test_JcaFactory(org.eclipse.jst.j2ee.jca.test.JcaFactoryTest)  Time elapsed: 0 s
08:40:34 test_createConnector(org.eclipse.jst.j2ee.jca.test.JcaFactoryTest)  Time elapsed: 0 s
08:40:34 test_createMessageListener(org.eclipse.jst.j2ee.jca.test.JcaFactoryTest)  Time elapsed: 0 s
08:40:34 test_createSecurityPermission(org.eclipse.jst.j2ee.jca.test.JcaFactoryTest)  Time elapsed: 0 s
08:40:34 test_createOutboundResourceAdapter(org.eclipse.jst.j2ee.jca.test.JcaFactoryTest)  Time elapsed: 0 s
08:40:34 test_createLicense(org.eclipse.jst.j2ee.jca.test.JcaFactoryTest)  Time elapsed: 0 s
08:40:34 Running org.eclipse.jst.j2ee.webapplication.test.WebapplicationFactoryTest
08:40:34 Tests run: 29, Failures: 0, Errors: 0, Skipped: 0, Time elapsed: 0.002 s - in org.eclipse.jst.j2ee.webapplication.test.WebapplicationFactoryTest
08:40:34 test_createFormLoginConfig(org.eclipse.jst.j2ee.webapplication.test.WebapplicationFactoryTest)  Time elapsed: 0 s
08:40:34 test_createErrorCodeErrorPage(org.eclipse.jst.j2ee.webapplication.test.WebapplicationFactoryTest)  Time elapsed: 0 s
08:40:34 test_createMimeMapping(org.eclipse.jst.j2ee.webapplication.test.WebapplicationFactoryTest)  Time elapsed: 0 s
08:40:34 test_createExceptionTypeErrorPage(org.eclipse.jst.j2ee.webapplication.test.WebapplicationFactoryTest)  Time elapsed: 0 s
08:40:34 test_createTagLibRef(org.eclipse.jst.j2ee.webapplication.test.WebapplicationFactoryTest)  Time elapsed: 0 s
08:40:34 test_createLocalEncodingMapping(org.eclipse.jst.j2ee.webapplication.test.WebapplicationFactoryTest)  Time elapsed: 0 s
08:40:34 test_createServlet(org.eclipse.jst.j2ee.webapplication.test.WebapplicationFactoryTest)  Time elapsed: 0 s
08:40:34 test_createJSPType(org.eclipse.jst.j2ee.webapplication.test.WebapplicationFactoryTest)  Time elapsed: 0 s
08:40:34 test_createSessionConfig(org.eclipse.jst.j2ee.webapplication.test.WebapplicationFactoryTest)  Time elapsed: 0 s
08:40:34 test_createServletMapping(org.eclipse.jst.j2ee.webapplication.test.WebapplicationFactoryTest)  Time elapsed: 0 s
08:40:34 test_createURLPatternType(org.eclipse.jst.j2ee.webapplication.test.WebapplicationFactoryTest)  Time elapsed: 0 s
08:40:34 test_createLocalEncodingMappingList(org.eclipse.jst.j2ee.webapplication.test.WebapplicationFactoryTest)  Time elapsed: 0 s
08:40:34 test_createFilterMapping(org.eclipse.jst.j2ee.webapplication.test.WebapplicationFactoryTest)  Time elapsed: 0 s
08:40:34 test_createAuthConstraint(org.eclipse.jst.j2ee.webapplication.test.WebapplicationFactoryTest)  Time elapsed: 0 s
08:40:34 test_createUserDataConstraint(org.eclipse.jst.j2ee.webapplication.test.WebapplicationFactoryTest)  Time elapsed: 0 s
08:40:34 test_createFilter(org.eclipse.jst.j2ee.webapplication.test.WebapplicationFactoryTest)  Time elapsed: 0 s
08:40:34 test_createRoleNameType(org.eclipse.jst.j2ee.webapplication.test.WebapplicationFactoryTest)  Time elapsed: 0 s
08:40:34 test_createWelcomeFileList(org.eclipse.jst.j2ee.webapplication.test.WebapplicationFactoryTest)  Time elapsed: 0 s
08:40:34 test_createWebApp(org.eclipse.jst.j2ee.webapplication.test.WebapplicationFactoryTest)  Time elapsed: 0 s
08:40:34 test_createInitParam(org.eclipse.jst.j2ee.webapplication.test.WebapplicationFactoryTest)  Time elapsed: 0 s
08:40:34 test_createWelcomeFile(org.eclipse.jst.j2ee.webapplication.test.WebapplicationFactoryTest)  Time elapsed: 0 s
08:40:34 test_getWebapplicationPackage(org.eclipse.jst.j2ee.webapplication.test.WebapplicationFactoryTest)  Time elapsed: 0 s
08:40:34 test_createContextParam(org.eclipse.jst.j2ee.webapplication.test.WebapplicationFactoryTest)  Time elapsed: 0 s
08:40:34 test_createSecurityConstraint(org.eclipse.jst.j2ee.webapplication.test.WebapplicationFactoryTest)  Time elapsed: 0 s
08:40:34 test_createHTTPMethodType(org.eclipse.jst.j2ee.webapplication.test.WebapplicationFactoryTest)  Time elapsed: 0 s
08:40:34 test_createWebResourceCollection(org.eclipse.jst.j2ee.webapplication.test.WebapplicationFactoryTest)  Time elapsed: 0 s
08:40:34 test_createErrorPage(org.eclipse.jst.j2ee.webapplication.test.WebapplicationFactoryTest)  Time elapsed: 0 s
08:40:34 test_createServletType(org.eclipse.jst.j2ee.webapplication.test.WebapplicationFactoryTest)  Time elapsed: 0 s
08:40:34 test_createLoginConfig(org.eclipse.jst.j2ee.webapplication.test.WebapplicationFactoryTest)  Time elapsed: 0 s
08:40:34 
08:40:34 Results:
08:40:34 
08:40:34 Failures: 
08:40:34   ResourceTests.testResourceCreation:76 The resource should be unloaded
08:40:34 Errors: 
08:40:34   CopyTests.testAddCopyDirectory:78 » OpenFailure IWAE0037E Could not open /home...
08:40:34   CopyTests.testAddCopyModule:100 » OpenFailure IWAE0037E Could not open /home/j...
08:40:34   CopyTests.testAddCopyModuleFilesToEAR:139 » OpenFailure IWAE0037E Could not op...
08:40:34   CopyTests.testAddCopyStandaloneModule:167 » OpenFailure IWAE0037E Could not op...
08:40:34   CopyTests.testAddRenameAndDelete:184 » OpenFailure IWAE0037E Could not open /h...
08:40:34   CopyTests.testAddRenameAndDeleteStandalone:218 » OpenFailure IWAE0037E Could n...
08:40:34   DefectVerificationTests.testFilterMappingTranslator:83 » OpenFailure IWAE0037E...
08:40:34   DefectVerificationTests.testFormerDefect297:109 » OpenFailure IWAE0037E Could ...
08:40:34   DefectVerificationTests.testReadCrimsonCase:261 » OpenFailure IWAE0037E Could ...
08:40:34   DefectVerificationTests.testSavingEARWhileDeploying:172 » OpenFailure IWAE0037...
08:40:34   DefectVerificationTests.testServiceQNameTranslator:216 » OpenFailure IWAE0037E...
08:40:34   RarFileTests.testJ2Cauth:193 » OpenFailure IWAE0037E Could not open /home/jenk...
08:40:34   RarFileTests.testOpenAndExtract:153 » OpenFailure IWAE0037E Could not open /ho...
08:40:34   RarFileTests.testOpenAndRead:165 » OpenFailure IWAE0037E Could not open /home/...
08:40:34   RarFileTests.testSaveRarEar:178 » OpenFailure IWAE0037E Could not open /home/j...
08:40:34   RarFileTests.testaddCopyModule:114 » OpenFailure IWAE0037E Could not open /hom...
08:40:34   RarFileTests.testexpandRarModule:132 » OpenFailure IWAE0037E Could not open /h...
08:40:34   RarFileTests.testopenRarEar:172 » OpenFailure IWAE0037E Could not open /home/j...
08:40:34   ResourceTests.testResourceDirty:95 » OpenFailure IWAE0037E Could not open /hom...
08:40:34   SaveTests.testSave:63 » OpenFailure IWAE0037E Could not open /home/jenkins/age...
08:40:34   SaveTests.testSaveDirectory:93 » OpenFailure IWAE0037E Could not open /home/je...
08:40:34   SecurityRoleTests.testPushDownCopy:53 » OpenFailure IWAE0037E Could not open /...
08:40:34   SecurityRoleTests.testRollupAddAndPushDown:73 » OpenFailure IWAE0037E Could no...
08:40:34   SimpleTests.testContainerManagedEntityExtensionRead:110 » OpenFailure IWAE0037...
08:40:34   SimpleTests.testEJB11JarAdd:117 » OpenFailure IWAE0037E Could not open /home/j...
08:40:34   SimpleTests.testEJBSetAbstractSchemaName:125 » OpenFailure IWAE0037E Could not...
08:40:34   SimpleTests.testIndexing:142 » OpenFailure IWAE0037E Could not open /home/jenk...
08:40:34   SimpleTests.testIndexingWithCollections:173 » OpenFailure IWAE0037E Could not ...
08:40:34   SimpleTests.testOpenAndExtract1:213 » OpenFailure IWAE0037E Could not open /ho...
08:40:34   SimpleTests.testOpenAndExtract2:233 » OpenFailure IWAE0037E Could not open /ho...
08:40:34   SimpleTests.testOpenAndExtract3:253 » OpenFailure IWAE0037E Could not open /ho...
08:40:34   SimpleTests.testOpenAndRead:265 » OpenFailure IWAE0037E Could not open /home/j...
08:40:34   SimpleTests.testOpenAndSaveAsJarFile:292 » OpenFailure IWAE0037E Could not ope...
08:40:34   SimpleTests.testOpenDirectoryAndSaveAsJarFile:305 » OpenFailure IWAE0037E Coul...
08:40:34   SimpleTests.testReadEmptyTags:425 » OpenFailure IWAE0037E Could not open /home...
08:40:34   SimpleTests.testSafeClose:319 » OpenFailure IWAE0037E Could not open /home/jen...
08:40:34   SimpleTests.testSaveFailure:352 » OpenFailure IWAE0037E Could not open /home/j...
08:40:34   SimpleTests.testXmlValidation:387 » OpenFailure IWAE0037E Could not open /home...
08:40:34   WARFileTests.testAddCopyClass:56 » OpenFailure IWAE0037E Could not open /home/...
08:40:34   WARFileTests.testAddCopyLib:77 » OpenFailure IWAE0037E Could not open /home/je...
08:40:34   WARFileTests.testListClassesAndLibs:96 » OpenFailure IWAE0037E Could not open ...
08:40:34 
08:40:34 Tests run: 887, Failures: 1, Errors: 41, Skipped: 0
08:40:34 
08:40:34 [INFO] 
08:40:51 [INFO] ------------------------------------------------------------------------
08:40:51 [INFO] Skipping org.eclipse.jst.j2ee.tests
08:40:51 [INFO] This project has been banned from the build due to previous failures.
08:40:51 [INFO] ------------------------------------------------------------------------
08:40:51 [INFO] 
08:40:51 [INFO] ------------------------------------------------------------------------
08:40:51 [INFO] Skipping org.eclipse.jst.jee.tests
08:40:51 [INFO] This project has been banned from the build due to previous failures.
08:40:51 [INFO] ------------------------------------------------------------------------
08:40:51 [INFO] 
08:40:51 [INFO] ------------------------------------------------------------------------
08:40:51 [INFO] Skipping org.eclipse.jst.servlet.tests
08:40:51 [INFO] This project has been banned from the build due to previous failures.
08:40:51 [INFO] ------------------------------------------------------------------------
08:40:51 [INFO] 
08:40:51 [INFO] ----< org.eclipse.webtools.javaee:org.eclipse.jst.validation.test >-----
08:40:51 [INFO] Building org.eclipse.jst.validation.test 1.1.300-SNAPSHOT        [47/51]
08:40:51 [INFO] ------------------------[ eclipse-test-plugin ]-------------------------
08:40:51 [INFO] 
08:40:51 [INFO] --- maven-clean-plugin:2.5:clean (default-clean) @ org.eclipse.jst.validation.test ---
08:40:51 [INFO] 
08:40:51 [INFO] --- tycho-packaging-plugin:2.2.0:build-qualifier (default-build-qualifier) @ org.eclipse.jst.validation.test ---
08:40:51 [INFO] The project's OSGi version is 1.1.300.v202103311810
08:40:51 [INFO] 
08:40:51 [INFO] --- tycho-packaging-plugin:2.2.0:validate-id (default-validate-id) @ org.eclipse.jst.validation.test ---
08:40:51 [INFO] 
08:40:51 [INFO] --- tycho-packaging-plugin:2.2.0:validate-version (default-validate-version) @ org.eclipse.jst.validation.test ---
08:40:51 [INFO] 
08:40:51 [INFO] --- build-helper-maven-plugin:3.0.0:regex-property (regex-property) @ org.eclipse.jst.validation.test ---
08:40:51 [INFO] 
08:40:51 [INFO] --- maven-resources-plugin:2.4.3:resources (default-resources) @ org.eclipse.jst.validation.test ---
08:40:51 [WARNING] Using platform encoding (UTF-8 actually) to copy filtered resources, i.e. build is platform dependent!
08:40:51 [INFO] skip non existing resourceDirectory /home/jenkins/agent/workspace/webtools-javaee-gerrit_master/tests/org.eclipse.jst.validation.test/src/main/resources
08:40:51 [INFO] 
08:40:51 [INFO] --- tycho-compiler-plugin:2.2.0:compile (default-compile) @ org.eclipse.jst.validation.test ---
08:40:51 [INFO] Compiling 53 source files to /home/jenkins/agent/workspace/webtools-javaee-gerrit_master/tests/org.eclipse.jst.validation.test/target/classes
08:40:51 [INFO] 
08:40:51 [INFO] --- maven-resources-plugin:2.4.3:testResources (default-testResources) @ org.eclipse.jst.validation.test ---
08:40:51 [WARNING] Using platform encoding (UTF-8 actually) to copy filtered resources, i.e. build is platform dependent!
08:40:51 [INFO] skip non existing resourceDirectory /home/jenkins/agent/workspace/webtools-javaee-gerrit_master/tests/org.eclipse.jst.validation.test/src/test/resources
08:40:51 [INFO] 
08:40:51 [INFO] --- tycho-source-plugin:2.2.0:plugin-source (plugin-source) @ org.eclipse.jst.validation.test ---
08:40:51 [INFO] Building jar: /home/jenkins/agent/workspace/webtools-javaee-gerrit_master/tests/org.eclipse.jst.validation.test/target/org.eclipse.jst.validation.test-1.1.300-SNAPSHOT-sources.jar
08:40:51 [INFO] 
08:40:51 [INFO] --- target-platform-configuration:2.2.0:target-platform (default-target-platform) @ org.eclipse.jst.validation.test ---
08:40:51 [INFO] 
08:40:51 [INFO] --- tycho-packaging-plugin:2.2.0:package-plugin (default-package-plugin) @ org.eclipse.jst.validation.test ---
08:40:51 [INFO] Building jar: /home/jenkins/agent/workspace/webtools-javaee-gerrit_master/tests/org.eclipse.jst.validation.test/validationtest.jar
08:40:51 [INFO] Building jar: /home/jenkins/agent/workspace/webtools-javaee-gerrit_master/tests/org.eclipse.jst.validation.test/target/org.eclipse.jst.validation.test-1.1.300-SNAPSHOT.jar
08:40:52 [INFO] 
08:40:52 [INFO] --- tycho-p2-plugin:2.2.0:p2-metadata-default (default-p2-metadata-default) @ org.eclipse.jst.validation.test ---
08:40:52 [INFO] 
08:40:52 [INFO] --- tycho-surefire-plugin:2.2.0:test (default-test) @ org.eclipse.jst.validation.test ---
08:40:52 [INFO] Executing Test Runtime with timeout 0, logs (if any) will be placed at: /home/jenkins/agent/workspace/webtools-javaee-gerrit_master/tests/org.eclipse.jst.validation.test/target/work/data/.metadata/.log
08:40:52 [INFO] Command line:
08:40:52 	[/opt/tools/java/openjdk/jdk-11/11.0.2+9/bin/java, -Dosgi.noShutdown=false, -Dosgi.os=linux, -Dosgi.ws=gtk, -Dosgi.arch=x86_64, -Dosgi.clean=true, -jar, /home/jenkins/agent/workspace/webtools-javaee-gerrit_master/.repository/p2/osgi/bundle/org.eclipse.equinox.launcher/1.6.200.v20210416-2027/org.eclipse.equinox.launcher-1.6.200.v20210416-2027.jar, -data, /home/jenkins/agent/workspace/webtools-javaee-gerrit_master/tests/org.eclipse.jst.validation.test/target/work/data, -install, /home/jenkins/agent/workspace/webtools-javaee-gerrit_master/tests/org.eclipse.jst.validation.test/target/work, -configuration, /home/jenkins/agent/workspace/webtools-javaee-gerrit_master/tests/org.eclipse.jst.validation.test/target/work/configuration, -application, org.eclipse.tycho.surefire.osgibooter.headlesstest, -testproperties, /home/jenkins/agent/workspace/webtools-javaee-gerrit_master/tests/org.eclipse.jst.validation.test/target/surefire.properties]
08:40:52 Running org.eclipse.jst.validation.test.junit.ValidatorTest
08:40:55 Tests run: 1, Failures: 0, Errors: 0, Skipped: 1, Time elapsed: 0.01 s - in org.eclipse.jst.validation.test.junit.ValidatorTest
08:40:55 org.eclipse.jst.validation.test.junit.ValidatorTest skipped
08:40:55 Running org.eclipse.jst.validation.test.junit.OperationTest
08:40:55 Tests run: 1, Failures: 0, Errors: 0, Skipped: 1, Time elapsed: 0 s - in org.eclipse.jst.validation.test.junit.OperationTest
08:40:55 org.eclipse.jst.validation.test.junit.OperationTest skipped
08:40:55 Running org.eclipse.jst.validation.api.test.ValidationRegistryApiTest
08:40:55 Tests run: 1, Failures: 0, Errors: 0, Skipped: 0, Time elapsed: 0.398 s - in org.eclipse.jst.validation.api.test.ValidationRegistryApiTest
08:40:56 test_getValidator(org.eclipse.jst.validation.api.test.ValidationRegistryApiTest)  Time elapsed: 0.373 s
08:40:56 
08:40:56 Results:
08:40:56 
08:40:56 Tests run: 3, Failures: 0, Errors: 0, Skipped: 2
08:40:56 
08:40:56 [INFO] All tests passed!
08:41:02 [INFO] 
08:41:02 [INFO] --- tycho-pack200a-plugin:2.2.0:normalize (pack200-normalize) @ org.eclipse.jst.validation.test ---
08:41:02 [INFO] Pack200 normalizing jar /home/jenkins/agent/workspace/webtools-javaee-gerrit_master/tests/org.eclipse.jst.validation.test/target/org.eclipse.jst.validation.test-1.1.300-SNAPSHOT.jar
08:41:02 [INFO] 
08:41:02 [INFO] --- eclipse-jarsigner-plugin:1.1.4:sign (sign) @ org.eclipse.jst.validation.test ---
08:41:02 [INFO] Signing of nested jars of '/home/jenkins/agent/workspace/webtools-javaee-gerrit_master/tests/org.eclipse.jst.validation.test/target/org.eclipse.jst.validation.test-1.1.300-SNAPSHOT.jar_unpacked_7304216152161350571/testInput/FWK/BVT/opConstr.jar' is disabled.
08:41:02 [INFO] Signing jar: /home/jenkins/agent/workspace/webtools-javaee-gerrit_master/tests/org.eclipse.jst.validation.test/target/org.eclipse.jst.validation.test-1.1.300-SNAPSHOT.jar_unpacked_7304216152161350571/testInput/FWK/BVT/opConstr.jar
08:41:02 [INFO] Signing of nested jars of '/home/jenkins/agent/workspace/webtools-javaee-gerrit_master/tests/org.eclipse.jst.validation.test/target/org.eclipse.jst.validation.test-1.1.300-SNAPSHOT.jar_unpacked_7304216152161350571/testInput/Properties/aProperties.jar' is disabled.
08:41:03 [INFO] Signing jar: /home/jenkins/agent/workspace/webtools-javaee-gerrit_master/tests/org.eclipse.jst.validation.test/target/org.eclipse.jst.validation.test-1.1.300-SNAPSHOT.jar_unpacked_7304216152161350571/testInput/Properties/aProperties.jar
08:41:03 [INFO] Signing of nested jars of '/home/jenkins/agent/workspace/webtools-javaee-gerrit_master/tests/org.eclipse.jst.validation.test/target/org.eclipse.jst.validation.test-1.1.300-SNAPSHOT.jar_unpacked_7304216152161350571/validationtest.jar' is disabled.
08:41:05 [INFO] Signing jar: /home/jenkins/agent/workspace/webtools-javaee-gerrit_master/tests/org.eclipse.jst.validation.test/target/org.eclipse.jst.validation.test-1.1.300-SNAPSHOT.jar_unpacked_7304216152161350571/validationtest.jar
08:41:05 [INFO] Signing jar: /home/jenkins/agent/workspace/webtools-javaee-gerrit_master/tests/org.eclipse.jst.validation.test/target/org.eclipse.jst.validation.test-1.1.300-SNAPSHOT.jar
08:41:06 [INFO] Signing jar: /home/jenkins/agent/workspace/webtools-javaee-gerrit_master/tests/org.eclipse.jst.validation.test/target/org.eclipse.jst.validation.test-1.1.300-SNAPSHOT-sources.jar
08:41:08 [INFO] 
08:41:10 [INFO] --- tycho-pack200b-plugin:2.2.0:pack (pack200-pack) @ org.eclipse.jst.validation.test ---
08:41:10 [INFO] Pack200 packing jar /home/jenkins/agent/workspace/webtools-javaee-gerrit_master/tests/org.eclipse.jst.validation.test/target/org.eclipse.jst.validation.test-1.1.300-SNAPSHOT.jar
08:41:10 [INFO] 
08:41:10 [INFO] --- tycho-p2-plugin:2.2.0:p2-metadata (p2-metadata) @ org.eclipse.jst.validation.test ---
08:41:10 [INFO] No baseline version MavenProject: org.eclipse.webtools.javaee:org.eclipse.jst.validation.test:1.1.300-SNAPSHOT @ /home/jenkins/agent/workspace/webtools-javaee-gerrit_master/tests/org.eclipse.jst.validation.test/pom.xml
08:41:10 [INFO] 
08:41:10 [INFO] --- maven-install-plugin:2.3.1:install (default-install) @ org.eclipse.jst.validation.test ---
08:41:10 [INFO] Installing /home/jenkins/agent/workspace/webtools-javaee-gerrit_master/tests/org.eclipse.jst.validation.test/target/org.eclipse.jst.validation.test-1.1.300-SNAPSHOT.jar to /home/jenkins/agent/workspace/webtools-javaee-gerrit_master/.repository/org/eclipse/webtools/javaee/org.eclipse.jst.validation.test/1.1.300-SNAPSHOT/org.eclipse.jst.validation.test-1.1.300-SNAPSHOT.jar
08:41:10 [INFO] Installing /home/jenkins/agent/workspace/webtools-javaee-gerrit_master/tests/org.eclipse.jst.validation.test/pom.xml to /home/jenkins/agent/workspace/webtools-javaee-gerrit_master/.repository/org/eclipse/webtools/javaee/org.eclipse.jst.validation.test/1.1.300-SNAPSHOT/org.eclipse.jst.validation.test-1.1.300-SNAPSHOT.pom
08:41:10 [INFO] Installing /home/jenkins/agent/workspace/webtools-javaee-gerrit_master/tests/org.eclipse.jst.validation.test/target/org.eclipse.jst.validation.test-1.1.300-SNAPSHOT-sources.jar to /home/jenkins/agent/workspace/webtools-javaee-gerrit_master/.repository/org/eclipse/webtools/javaee/org.eclipse.jst.validation.test/1.1.300-SNAPSHOT/org.eclipse.jst.validation.test-1.1.300-SNAPSHOT-sources.jar
08:41:10 [INFO] Installing /home/jenkins/agent/workspace/webtools-javaee-gerrit_master/tests/org.eclipse.jst.validation.test/target/org.eclipse.jst.validation.test-1.1.300-SNAPSHOT.jar.pack.gz to /home/jenkins/agent/workspace/webtools-javaee-gerrit_master/.repository/org/eclipse/webtools/javaee/org.eclipse.jst.validation.test/1.1.300-SNAPSHOT/org.eclipse.jst.validation.test-1.1.300-SNAPSHOT-pack200.jar.pack.gz
08:41:10 [INFO] Installing /home/jenkins/agent/workspace/webtools-javaee-gerrit_master/tests/org.eclipse.jst.validation.test/target/p2content.xml to /home/jenkins/agent/workspace/webtools-javaee-gerrit_master/.repository/org/eclipse/webtools/javaee/org.eclipse.jst.validation.test/1.1.300-SNAPSHOT/org.eclipse.jst.validation.test-1.1.300-SNAPSHOT-p2metadata.xml
08:41:10 [INFO] Installing /home/jenkins/agent/workspace/webtools-javaee-gerrit_master/tests/org.eclipse.jst.validation.test/target/p2artifacts.xml to /home/jenkins/agent/workspace/webtools-javaee-gerrit_master/.repository/org/eclipse/webtools/javaee/org.eclipse.jst.validation.test/1.1.300-SNAPSHOT/org.eclipse.jst.validation.test-1.1.300-SNAPSHOT-p2artifacts.xml
08:41:11 [INFO] 
08:41:11 [INFO] --- tycho-p2-plugin:2.2.0:update-local-index (default-update-local-index) @ org.eclipse.jst.validation.test ---
08:41:11 [INFO] 
08:41:11 [INFO] ------------------------------------------------------------------------
08:41:11 [INFO] Skipping org.eclipse.webtools.javaee.site
08:41:11 [INFO] This project has been banned from the build due to previous failures.
08:41:11 [INFO] ------------------------------------------------------------------------
08:41:11 [INFO] ------------------------------------------------------------------------
08:41:11 [INFO] Reactor Summary:
08:41:11 [INFO] 
08:41:11 [INFO] org.eclipse.webtools.javaee 3.6.0-SNAPSHOT ......... SUCCESS [01:27 min]
08:41:11 [INFO] javaee.docs 3.6.0-SNAPSHOT ......................... SUCCESS [  0.430 s]
08:41:11 [INFO] org.eclipse.jst.ejb.doc.user 1.1.301-SNAPSHOT ...... SUCCESS [ 44.222 s]
08:41:11 [INFO] org.eclipse.jst.ejb.ui.infopop 1.0.300-SNAPSHOT .... SUCCESS [  5.007 s]
08:41:11 [INFO] org.eclipse.jst.j2ee.doc.user 1.1.400-SNAPSHOT ..... SUCCESS [  9.047 s]
08:41:11 [INFO] org.eclipse.jst.j2ee.infopop 1.0.300-SNAPSHOT ...... SUCCESS [ 16.536 s]
08:41:11 [INFO] org.eclipse.jst.servlet.ui.infopop 1.0.500-SNAPSHOT  SUCCESS [  5.726 s]
08:41:11 [INFO] javaee.plugins 3.6.0-SNAPSHOT ...................... SUCCESS [  0.053 s]
08:41:11 [INFO] org.eclipse.jem.proxy 2.1.0-SNAPSHOT ............... SUCCESS [ 18.191 s]
08:41:11 [INFO] org.eclipse.jem 2.0.600-SNAPSHOT ................... SUCCESS [ 16.387 s]
08:41:11 [INFO] org.eclipse.jem.workbench 2.1.0-SNAPSHOT ........... SUCCESS [ 38.339 s]
08:41:11 [INFO] org.eclipse.jem.beaninfo.vm.common 2.1.0-SNAPSHOT .. SUCCESS [ 17.888 s]
08:41:11 [INFO] org.eclipse.jem.beaninfo.vm 2.1.0-SNAPSHOT ......... SUCCESS [  7.374 s]
08:41:11 [INFO] org.eclipse.jem.beaninfo 2.0.300-SNAPSHOT .......... SUCCESS [ 17.740 s]
08:41:11 [INFO] org.eclipse.jst.common.annotations.core 1.1.300-SNAPSHOT SUCCESS [  9.864 s]
08:41:11 [INFO] org.eclipse.jst.common.annotations.controller 1.1.300-SNAPSHOT SUCCESS [  5.389 s]
08:41:11 [INFO] org.eclipse.jst.common.annotations.ui 1.1.300-SNAPSHOT SUCCESS [  9.192 s]
08:41:11 [INFO] org.eclipse.jst.common.frameworks 1.1.701-SNAPSHOT . SUCCESS [  5.476 s]
08:41:11 [INFO] org.eclipse.jst.common.ui 1.0.301-SNAPSHOT ......... SUCCESS [ 14.206 s]
08:41:11 [INFO] org.eclipse.jst.j2ee.core 1.4.3-SNAPSHOT ........... SUCCESS [ 46.847 s]
08:41:11 [INFO] org.eclipse.jst.j2ee 1.2.500-SNAPSHOT .............. SUCCESS [ 27.392 s]
08:41:11 [INFO] org.eclipse.jst.j2ee.jca 1.1.1000-SNAPSHOT ......... SUCCESS [ 16.117 s]
08:41:11 [INFO] org.eclipse.jst.jee 1.0.1000-SNAPSHOT .............. SUCCESS [ 29.028 s]
08:41:11 [INFO] org.eclipse.jst.j2ee.ejb 1.1.901-SNAPSHOT .......... SUCCESS [ 33.426 s]
08:41:11 [INFO] org.eclipse.jst.j2ee.ejb.annotation.model 1.1.500-SNAPSHOT SUCCESS [01:13 min]
08:41:11 [INFO] org.eclipse.jst.j2ee.web 1.1.1100-SNAPSHOT ......... SUCCESS [01:29 min]
08:41:11 [INFO] org.eclipse.jst.j2ee.ui 1.1.931-SNAPSHOT ........... SUCCESS [01:48 min]
08:41:11 [INFO] org.eclipse.jst.j2ee.jca.ui 1.1.601-SNAPSHOT ....... SUCCESS [ 13.945 s]
08:41:11 [INFO] org.eclipse.jst.j2ee.navigator.ui 1.1.800-SNAPSHOT . SUCCESS [  6.084 s]
08:41:11 [INFO] org.eclipse.jst.jee.ui 1.0.901-SNAPSHOT ............ SUCCESS [  6.107 s]
08:41:11 [INFO] org.eclipse.jst.ejb.ui 1.1.911-SNAPSHOT ............ SUCCESS [  7.249 s]
08:41:11 [INFO] org.eclipse.jst.j2ee.ejb.annotations.emitter 1.1.300-SNAPSHOT SUCCESS [  7.766 s]
08:41:11 [INFO] org.eclipse.jst.j2ee.ejb.annotations.ui 1.2.0-SNAPSHOT SUCCESS [ 11.089 s]
08:41:11 [INFO] org.eclipse.jst.j2ee.ejb.annotations.xdoclet 1.2.300-SNAPSHOT SUCCESS [  5.613 s]
08:41:11 [INFO] org.eclipse.jst.j2ee.webservice 1.1.700-SNAPSHOT ... SUCCESS [ 17.628 s]
08:41:11 [INFO] org.eclipse.jst.j2ee.webservice.ui 1.1.800-SNAPSHOT  SUCCESS [  5.521 s]
08:41:11 [INFO] org.eclipse.jst.j2ee.xdoclet.runtime 1.2.0-SNAPSHOT  SUCCESS [  7.129 s]
08:41:11 [INFO] org.eclipse.jst.jee.ejb 1.0.500-SNAPSHOT ........... SUCCESS [  5.351 s]
08:41:11 [INFO] org.eclipse.jst.jee.web 1.0.702-SNAPSHOT ........... SUCCESS [ 11.487 s]
08:41:11 [INFO] org.eclipse.jst.servlet.ui 1.1.1000-SNAPSHOT ....... SUCCESS [ 11.440 s]
08:41:11 [INFO] org.eclipse.wtp.jee.capabilities 1.0.100-SNAPSHOT .. SUCCESS [ 17.194 s]
08:41:11 [INFO] javaee.tests 3.6.0-SNAPSHOT ........................ SUCCESS [  0.016 s]
08:41:11 [INFO] org.eclipse.jst.validation.sample 1.1.100-SNAPSHOT . SUCCESS [  6.316 s]
08:41:11 [INFO] org.eclipse.jst.ejb.ui.tests 1.0.0-SNAPSHOT ........ SUCCESS [ 30.593 s]
08:41:11 [INFO] org.eclipse.jem.tests 1.3.0-SNAPSHOT ............... SUCCESS [01:04 min]
08:41:11 [INFO] org.eclipse.jst.j2ee.core.tests 1.1.600-SNAPSHOT ... FAILURE [01:00 min]
08:41:11 [INFO] org.eclipse.jst.j2ee.tests 1.1.800-SNAPSHOT ........ SKIPPED
08:41:11 [INFO] org.eclipse.jst.jee.tests 1.0.100-SNAPSHOT ......... SKIPPED
08:41:11 [INFO] org.eclipse.jst.servlet.tests 1.2.0-SNAPSHOT ....... SKIPPED
08:41:11 [INFO] org.eclipse.jst.validation.test 1.1.300-SNAPSHOT ... SUCCESS [ 19.750 s]
08:41:11 [INFO] org.eclipse.webtools.javaee.site 3.6.0-SNAPSHOT .... SKIPPED
08:41:11 [INFO] ------------------------------------------------------------------------
08:41:11 [INFO] BUILD FAILURE
08:41:11 [INFO] ------------------------------------------------------------------------
08:41:11 [INFO] Total time:  25:57 min
08:41:11 [INFO] Finished at: 2021-06-02T12:41:11Z
08:41:11 [INFO] ------------------------------------------------------------------------
08:41:11 [ERROR] Failed to execute goal org.eclipse.tycho:tycho-surefire-plugin:2.2.0:test (default-test) on project org.eclipse.jst.j2ee.core.tests: There are test failures.
08:41:11 [ERROR] 
08:41:11 [ERROR] Please refer to /home/jenkins/agent/workspace/webtools-javaee-gerrit_master/tests/org.eclipse.jst.j2ee.core.tests/target/surefire-reports for the individual test results.
08:41:11 [ERROR] -> [Help 1]
08:41:11 org.apache.maven.lifecycle.LifecycleExecutionException: Failed to execute goal org.eclipse.tycho:tycho-surefire-plugin:2.2.0:test (default-test) on project org.eclipse.jst.j2ee.core.tests: There are test failures.
08:41:11 
08:41:11 Please refer to /home/jenkins/agent/workspace/webtools-javaee-gerrit_master/tests/org.eclipse.jst.j2ee.core.tests/target/surefire-reports for the individual test results.
08:41:11     at org.apache.maven.lifecycle.internal.MojoExecutor.execute (MojoExecutor.java:215)
08:41:11     at org.apache.maven.lifecycle.internal.MojoExecutor.execute (MojoExecutor.java:156)
08:41:11     at org.apache.maven.lifecycle.internal.MojoExecutor.execute (MojoExecutor.java:148)
08:41:11     at org.apache.maven.lifecycle.internal.LifecycleModuleBuilder.buildProject (LifecycleModuleBuilder.java:117)
08:41:11     at org.apache.maven.lifecycle.internal.LifecycleModuleBuilder.buildProject (LifecycleModuleBuilder.java:81)
08:41:11     at org.apache.maven.lifecycle.internal.builder.singlethreaded.SingleThreadedBuilder.build (SingleThreadedBuilder.java:56)
08:41:11     at org.apache.maven.lifecycle.internal.LifecycleStarter.execute (LifecycleStarter.java:128)
08:41:11     at org.apache.maven.DefaultMaven.doExecute (DefaultMaven.java:305)
08:41:11     at org.apache.maven.DefaultMaven.doExecute (DefaultMaven.java:192)
08:41:11     at org.apache.maven.DefaultMaven.execute (DefaultMaven.java:105)
08:41:11     at org.apache.maven.cli.MavenCli.execute (MavenCli.java:957)
08:41:11     at org.apache.maven.cli.MavenCli.doMain (MavenCli.java:289)
08:41:11     at org.apache.maven.cli.MavenCli.main (MavenCli.java:193)
08:41:11     at jdk.internal.reflect.NativeMethodAccessorImpl.invoke0 (Native Method)
08:41:11     at jdk.internal.reflect.NativeMethodAccessorImpl.invoke (NativeMethodAccessorImpl.java:62)
08:41:11     at jdk.internal.reflect.DelegatingMethodAccessorImpl.invoke (DelegatingMethodAccessorImpl.java:43)
08:41:11     at java.lang.reflect.Method.invoke (Method.java:566)
08:41:11     at org.codehaus.plexus.classworlds.launcher.Launcher.launchEnhanced (Launcher.java:282)
08:41:11     at org.codehaus.plexus.classworlds.launcher.Launcher.launch (Launcher.java:225)
08:41:11     at org.codehaus.plexus.classworlds.launcher.Launcher.mainWithExitCode (Launcher.java:406)
08:41:11     at org.codehaus.plexus.classworlds.launcher.Launcher.main (Launcher.java:347)
08:41:11 Caused by: org.apache.maven.plugin.MojoFailureException: There are test failures.
08:41:11 
08:41:11 Please refer to /home/jenkins/agent/workspace/webtools-javaee-gerrit_master/tests/org.eclipse.jst.j2ee.core.tests/target/surefire-reports for the individual test results.
08:41:11     at org.eclipse.tycho.surefire.TestMojo.runTest (TestMojo.java:1070)
08:41:11     at org.eclipse.tycho.surefire.TestMojo.execute (TestMojo.java:714)
08:41:11     at org.apache.maven.plugin.DefaultBuildPluginManager.executeMojo (DefaultBuildPluginManager.java:137)
08:41:11     at org.apache.maven.lifecycle.internal.MojoExecutor.execute (MojoExecutor.java:210)
08:41:11     at org.apache.maven.lifecycle.internal.MojoExecutor.execute (MojoExecutor.java:156)
08:41:11     at org.apache.maven.lifecycle.internal.MojoExecutor.execute (MojoExecutor.java:148)
08:41:11     at org.apache.maven.lifecycle.internal.LifecycleModuleBuilder.buildProject (LifecycleModuleBuilder.java:117)
08:41:11     at org.apache.maven.lifecycle.internal.LifecycleModuleBuilder.buildProject (LifecycleModuleBuilder.java:81)
08:41:11     at org.apache.maven.lifecycle.internal.builder.singlethreaded.SingleThreadedBuilder.build (SingleThreadedBuilder.java:56)
08:41:11     at org.apache.maven.lifecycle.internal.LifecycleStarter.execute (LifecycleStarter.java:128)
08:41:11     at org.apache.maven.DefaultMaven.doExecute (DefaultMaven.java:305)
08:41:11     at org.apache.maven.DefaultMaven.doExecute (DefaultMaven.java:192)
08:41:11     at org.apache.maven.DefaultMaven.execute (DefaultMaven.java:105)
08:41:11     at org.apache.maven.cli.MavenCli.execute (MavenCli.java:957)
08:41:11     at org.apache.maven.cli.MavenCli.doMain (MavenCli.java:289)
08:41:11     at org.apache.maven.cli.MavenCli.main (MavenCli.java:193)
08:41:11     at jdk.internal.reflect.NativeMethodAccessorImpl.invoke0 (Native Method)
08:41:11     at jdk.internal.reflect.NativeMethodAccessorImpl.invoke (NativeMethodAccessorImpl.java:62)
08:41:11     at jdk.internal.reflect.DelegatingMethodAccessorImpl.invoke (DelegatingMethodAccessorImpl.java:43)
08:41:11     at java.lang.reflect.Method.invoke (Method.java:566)
08:41:11     at org.codehaus.plexus.classworlds.launcher.Launcher.launchEnhanced (Launcher.java:282)
08:41:11     at org.codehaus.plexus.classworlds.launcher.Launcher.launch (Launcher.java:225)
08:41:11     at org.codehaus.plexus.classworlds.launcher.Launcher.mainWithExitCode (Launcher.java:406)
08:41:11     at org.codehaus.plexus.classworlds.launcher.Launcher.main (Launcher.java:347)
08:41:11 [ERROR] 
08:41:11 [ERROR] Re-run Maven using the -X switch to enable full debug logging.
08:41:11 [ERROR] 
08:41:11 [ERROR] For more information about the errors and possible solutions, please read the following articles:
08:41:11 [ERROR] [Help 1] http://cwiki.apache.org/confluence/display/MAVEN/MojoFailureException
08:41:11 [ERROR] 
08:41:11 [ERROR] After correcting the problems, you can resume the build with the command
08:41:11 [ERROR]   mvn <args> -rf :org.eclipse.jst.j2ee.core.tests
08:41:11 Build step 'Invoke top-level Maven targets' marked build as failure
08:41:19 Taking screenshot.
08:41:19 [webtools-javaee-gerrit_master] $ echo $XAUTHORITY
08:41:19 /home/jenkins/agent/workspace/webtools-javaee-gerrit_master/.Xauthority-11534194888708051245
08:41:19 [webtools-javaee-gerrit_master] $ ls -l $XAUTHORITY
08:41:19 -rw-r--r--. 1 jenkins 1000750000 0 Jun  2 12:15 /home/jenkins/agent/workspace/webtools-javaee-gerrit_master/.Xauthority-11534194888708051245
08:41:19 [webtools-javaee-gerrit_master] $ import -window root -display :96 screenshot.jpg
08:41:19 Terminating xvnc.
08:41:19 Recording test results
08:42:04 [Checks API] No suitable checks publisher found.
08:42:05 Finished: FAILURE