Console Output

Skipping 640 KB.. Full Log
    	at junit.framework.TestCase.runBare(TestCase.java:142)
15:26:18     	at junit.framework.TestResult$1.protect(TestResult.java:122)
15:26:18     	at junit.framework.TestResult.runProtected(TestResult.java:142)
15:26:18     	at junit.framework.TestResult.run(TestResult.java:125)
15:26:18     	at junit.framework.TestCase.run(TestCase.java:130)
15:26:18     	at junit.framework.TestSuite.runTest(TestSuite.java:241)
15:26:18     	at junit.framework.TestSuite.run(TestSuite.java:236)
15:26:18     	at org.junit.internal.runners.JUnit38ClassRunner.run(JUnit38ClassRunner.java:90)
15:26:18     	at org.apache.maven.surefire.junit4.JUnit4Provider.execute(JUnit4Provider.java:365)
15:26:18     	at org.apache.maven.surefire.junit4.JUnit4Provider.executeWithRerun(JUnit4Provider.java:273)
15:26:18     	at org.apache.maven.surefire.junit4.JUnit4Provider.executeTestSet(JUnit4Provider.java:238)
15:26:18     	at org.apache.maven.surefire.junit4.JUnit4Provider.invoke(JUnit4Provider.java:159)
15:26:18     	at java.base/jdk.internal.reflect.NativeMethodAccessorImpl.invoke0(Native Method)
15:26:18     	at java.base/jdk.internal.reflect.NativeMethodAccessorImpl.invoke(NativeMethodAccessorImpl.java:62)
15:26:18     	at java.base/jdk.internal.reflect.DelegatingMethodAccessorImpl.invoke(DelegatingMethodAccessorImpl.java:43)
15:26:18     	at java.base/java.lang.reflect.Method.invoke(Method.java:566)
15:26:18     	at org.apache.maven.surefire.util.ReflectionUtils.invokeMethodWithArray2(ReflectionUtils.java:206)
15:26:18     	at org.apache.maven.surefire.booter.ProviderFactory$ProviderProxy.invoke(ProviderFactory.java:161)
15:26:18     	at org.apache.maven.surefire.booter.ProviderFactory.invokeProvider(ProviderFactory.java:84)
15:26:18     	at org.eclipse.tycho.surefire.osgibooter.OsgiSurefireBooter.run(OsgiSurefireBooter.java:116)
15:26:18     	at org.eclipse.tycho.surefire.osgibooter.HeadlessTestApplication.start(HeadlessTestApplication.java:23)
15:26:18     	at org.eclipse.equinox.internal.app.EclipseAppHandle.run(EclipseAppHandle.java:203)
15:26:18     	at org.eclipse.core.runtime.internal.adaptor.EclipseAppLauncher.runApplication(EclipseAppLauncher.java:134)
15:26:18     	at org.eclipse.core.runtime.internal.adaptor.EclipseAppLauncher.start(EclipseAppLauncher.java:104)
15:26:18     	at org.eclipse.core.runtime.adaptor.EclipseStarter.run(EclipseStarter.java:401)
15:26:18     	at org.eclipse.core.runtime.adaptor.EclipseStarter.run(EclipseStarter.java:255)
15:26:18     	at java.base/jdk.internal.reflect.NativeMethodAccessorImpl.invoke0(Native Method)
15:26:18     	at java.base/jdk.internal.reflect.NativeMethodAccessorImpl.invoke(NativeMethodAccessorImpl.java:62)
15:26:18     	at java.base/jdk.internal.reflect.DelegatingMethodAccessorImpl.invoke(DelegatingMethodAccessorImpl.java:43)
15:26:18     	at java.base/java.lang.reflect.Method.invoke(Method.java:566)
15:26:18     	at org.eclipse.equinox.launcher.Main.invokeFramework(Main.java:654)
15:26:18     	at org.eclipse.equinox.launcher.Main.basicRun(Main.java:591)
15:26:18     	at org.eclipse.equinox.launcher.Main.run(Main.java:1462)
15:26:18     	at org.eclipse.equinox.launcher.Main.main(Main.java:1435)
15:26:18 
15:26:18 *** ERROR ***: Tue May 25 19:26:18 UTC 2021    IWAE0037E Could not open /home/jenkins/agent/workspace/webtools-javaee-gerrit_master/tests/org.eclipse.jst.j2ee.core.tests/commonArchiveResources/WSSecured_InsuranceServices_EJB_WS.ear
15:26:18 
15:26:18 *** ERROR ***: Tue May 25 19:26:18 UTC 2021    java.io.FileNotFoundException: IWAE0036E URI Name: /home/jenkins/agent/workspace/webtools-javaee-gerrit_master/tests/org.eclipse.jst.j2ee.core.tests/commonArchiveResources/WSSecured_InsuranceServices_EJB_WS.ear; File name: /home/jenkins/agent/workspace/webtools-javaee-gerrit_master/tests/org.eclipse.jst.j2ee.core.tests/commonArchiveResources/WSSecured_InsuranceServices_EJB_WS.ear
15:26:18     	at org.eclipse.jst.j2ee.commonarchivecore.internal.impl.CommonarchiveFactoryImpl.createLoadStrategy(CommonarchiveFactoryImpl.java:342)
15:26:18     	at org.eclipse.jst.j2ee.commonarchivecore.internal.impl.CommonarchiveFactoryImpl.primOpenArchive(CommonarchiveFactoryImpl.java:876)
15:26:18     	at org.eclipse.jst.j2ee.commonarchivecore.internal.impl.CommonarchiveFactoryImpl.openEARFile(CommonarchiveFactoryImpl.java:639)
15:26:18     	at org.eclipse.jst.j2ee.archive.test.DefectVerificationTests.testServiceQNameTranslator(DefectVerificationTests.java:216)
15:26:18     	at java.base/jdk.internal.reflect.NativeMethodAccessorImpl.invoke0(Native Method)
15:26:18     	at java.base/jdk.internal.reflect.NativeMethodAccessorImpl.invoke(NativeMethodAccessorImpl.java:62)
15:26:18     	at java.base/jdk.internal.reflect.DelegatingMethodAccessorImpl.invoke(DelegatingMethodAccessorImpl.java:43)
15:26:18     	at java.base/java.lang.reflect.Method.invoke(Method.java:566)
15:26:18     	at junit.framework.TestCase.runTest(TestCase.java:177)
15:26:18     	at junit.framework.TestCase.runBare(TestCase.java:142)
15:26:18     	at junit.framework.TestResult$1.protect(TestResult.java:122)
15:26:18     	at junit.framework.TestResult.runProtected(TestResult.java:142)
15:26:18     	at junit.framework.TestResult.run(TestResult.java:125)
15:26:18     	at junit.framework.TestCase.run(TestCase.java:130)
15:26:18     	at junit.framework.TestSuite.runTest(TestSuite.java:241)
15:26:18     	at junit.framework.TestSuite.run(TestSuite.java:236)
15:26:18     	at org.junit.internal.runners.JUnit38ClassRunner.run(JUnit38ClassRunner.java:90)
15:26:18     	at org.apache.maven.surefire.junit4.JUnit4Provider.execute(JUnit4Provider.java:365)
15:26:18     	at org.apache.maven.surefire.junit4.JUnit4Provider.executeWithRerun(JUnit4Provider.java:273)
15:26:18     	at org.apache.maven.surefire.junit4.JUnit4Provider.executeTestSet(JUnit4Provider.java:238)
15:26:18     	at org.apache.maven.surefire.junit4.JUnit4Provider.invoke(JUnit4Provider.java:159)
15:26:18     	at java.base/jdk.internal.reflect.NativeMethodAccessorImpl.invoke0(Native Method)
15:26:18     	at java.base/jdk.internal.reflect.NativeMethodAccessorImpl.invoke(NativeMethodAccessorImpl.java:62)
15:26:18     	at java.base/jdk.internal.reflect.DelegatingMethodAccessorImpl.invoke(DelegatingMethodAccessorImpl.java:43)
15:26:18     	at java.base/java.lang.reflect.Method.invoke(Method.java:566)
15:26:18     	at org.apache.maven.surefire.util.ReflectionUtils.invokeMethodWithArray2(ReflectionUtils.java:206)
15:26:18     	at org.apache.maven.surefire.booter.ProviderFactory$ProviderProxy.invoke(ProviderFactory.java:161)
15:26:18     	at org.apache.maven.surefire.booter.ProviderFactory.invokeProvider(ProviderFactory.java:84)
15:26:18     	at org.eclipse.tycho.surefire.osgibooter.OsgiSurefireBooter.run(OsgiSurefireBooter.java:116)
15:26:18     	at org.eclipse.tycho.surefire.osgibooter.HeadlessTestApplication.start(HeadlessTestApplication.java:23)
15:26:18     	at org.eclipse.equinox.internal.app.EclipseAppHandle.run(EclipseAppHandle.java:203)
15:26:18     	at org.eclipse.core.runtime.internal.adaptor.EclipseAppLauncher.runApplication(EclipseAppLauncher.java:134)
15:26:18     	at org.eclipse.core.runtime.internal.adaptor.EclipseAppLauncher.start(EclipseAppLauncher.java:104)
15:26:18     	at org.eclipse.core.runtime.adaptor.EclipseStarter.run(EclipseStarter.java:401)
15:26:18     	at org.eclipse.core.runtime.adaptor.EclipseStarter.run(EclipseStarter.java:255)
15:26:18     	at java.base/jdk.internal.reflect.NativeMethodAccessorImpl.invoke0(Native Method)
15:26:18     	at java.base/jdk.internal.reflect.NativeMethodAccessorImpl.invoke(NativeMethodAccessorImpl.java:62)
15:26:18     	at java.base/jdk.internal.reflect.DelegatingMethodAccessorImpl.invoke(DelegatingMethodAccessorImpl.java:43)
15:26:18     	at java.base/java.lang.reflect.Method.invoke(Method.java:566)
15:26:18     	at org.eclipse.equinox.launcher.Main.invokeFramework(Main.java:654)
15:26:18     	at org.eclipse.equinox.launcher.Main.basicRun(Main.java:591)
15:26:18     	at org.eclipse.equinox.launcher.Main.run(Main.java:1462)
15:26:18     	at org.eclipse.equinox.launcher.Main.main(Main.java:1435)
15:26:18 
15:26:18 *** ERROR ***: Tue May 25 19:26:18 UTC 2021    java.io.FileNotFoundException: IWAE0036E URI Name: /home/jenkins/agent/workspace/webtools-javaee-gerrit_master/tests/org.eclipse.jst.j2ee.core.tests/commonArchiveResources/WSSecured_InsuranceServices_EJB_WS.ear; File name: /home/jenkins/agent/workspace/webtools-javaee-gerrit_master/tests/org.eclipse.jst.j2ee.core.tests/commonArchiveResources/WSSecured_InsuranceServices_EJB_WS.ear
15:26:18     	at org.eclipse.jst.j2ee.commonarchivecore.internal.impl.CommonarchiveFactoryImpl.createLoadStrategy(CommonarchiveFactoryImpl.java:342)
15:26:18     	at org.eclipse.jst.j2ee.commonarchivecore.internal.impl.CommonarchiveFactoryImpl.primOpenArchive(CommonarchiveFactoryImpl.java:876)
15:26:18     	at org.eclipse.jst.j2ee.commonarchivecore.internal.impl.CommonarchiveFactoryImpl.openEARFile(CommonarchiveFactoryImpl.java:639)
15:26:18     	at org.eclipse.jst.j2ee.archive.test.DefectVerificationTests.testServiceQNameTranslator(DefectVerificationTests.java:216)
15:26:18     	at java.base/jdk.internal.reflect.NativeMethodAccessorImpl.invoke0(Native Method)
15:26:18     	at java.base/jdk.internal.reflect.NativeMethodAccessorImpl.invoke(NativeMethodAccessorImpl.java:62)
15:26:18     	at java.base/jdk.internal.reflect.DelegatingMethodAccessorImpl.invoke(DelegatingMethodAccessorImpl.java:43)
15:26:18     	at java.base/java.lang.reflect.Method.invoke(Method.java:566)
15:26:18     	at junit.framework.TestCase.runTest(TestCase.java:177)
15:26:18     	at junit.framework.TestCase.runBare(TestCase.java:142)
15:26:18     	at junit.framework.TestResult$1.protect(TestResult.java:122)
15:26:18     	at junit.framework.TestResult.runProtected(TestResult.java:142)
15:26:18     	at junit.framework.TestResult.run(TestResult.java:125)
15:26:18     	at junit.framework.TestCase.run(TestCase.java:130)
15:26:18     	at junit.framework.TestSuite.runTest(TestSuite.java:241)
15:26:18     	at junit.framework.TestSuite.run(TestSuite.java:236)
15:26:18     	at org.junit.internal.runners.JUnit38ClassRunner.run(JUnit38ClassRunner.java:90)
15:26:18     	at org.apache.maven.surefire.junit4.JUnit4Provider.execute(JUnit4Provider.java:365)
15:26:18     	at org.apache.maven.surefire.junit4.JUnit4Provider.executeWithRerun(JUnit4Provider.java:273)
15:26:18     	at org.apache.maven.surefire.junit4.JUnit4Provider.executeTestSet(JUnit4Provider.java:238)
15:26:18     	at org.apache.maven.surefire.junit4.JUnit4Provider.invoke(JUnit4Provider.java:159)
15:26:18     	at java.base/jdk.internal.reflect.NativeMethodAccessorImpl.invoke0(Native Method)
15:26:18     	at java.base/jdk.internal.reflect.NativeMethodAccessorImpl.invoke(NativeMethodAccessorImpl.java:62)
15:26:18     	at java.base/jdk.internal.reflect.DelegatingMethodAccessorImpl.invoke(DelegatingMethodAccessorImpl.java:43)
15:26:18     	at java.base/java.lang.reflect.Method.invoke(Method.java:566)
15:26:18     	at org.apache.maven.surefire.util.ReflectionUtils.invokeMethodWithArray2(ReflectionUtils.java:206)
15:26:18     	at org.apache.maven.surefire.booter.ProviderFactory$ProviderProxy.invoke(ProviderFactory.java:161)
15:26:18     	at org.apache.maven.surefire.booter.ProviderFactory.invokeProvider(ProviderFactory.java:84)
15:26:18     	at org.eclipse.tycho.surefire.osgibooter.OsgiSurefireBooter.run(OsgiSurefireBooter.java:116)
15:26:18     	at org.eclipse.tycho.surefire.osgibooter.HeadlessTestApplication.start(HeadlessTestApplication.java:23)
15:26:18     	at org.eclipse.equinox.internal.app.EclipseAppHandle.run(EclipseAppHandle.java:203)
15:26:18     	at org.eclipse.core.runtime.internal.adaptor.EclipseAppLauncher.runApplication(EclipseAppLauncher.java:134)
15:26:18     	at org.eclipse.core.runtime.internal.adaptor.EclipseAppLauncher.start(EclipseAppLauncher.java:104)
15:26:18     	at org.eclipse.core.runtime.adaptor.EclipseStarter.run(EclipseStarter.java:401)
15:26:18     	at org.eclipse.core.runtime.adaptor.EclipseStarter.run(EclipseStarter.java:255)
15:26:18     	at java.base/jdk.internal.reflect.NativeMethodAccessorImpl.invoke0(Native Method)
15:26:18     	at java.base/jdk.internal.reflect.NativeMethodAccessorImpl.invoke(NativeMethodAccessorImpl.java:62)
15:26:18     	at java.base/jdk.internal.reflect.DelegatingMethodAccessorImpl.invoke(DelegatingMethodAccessorImpl.java:43)
15:26:18     	at java.base/java.lang.reflect.Method.invoke(Method.java:566)
15:26:18     	at org.eclipse.equinox.launcher.Main.invokeFramework(Main.java:654)
15:26:18     	at org.eclipse.equinox.launcher.Main.basicRun(Main.java:591)
15:26:18     	at org.eclipse.equinox.launcher.Main.run(Main.java:1462)
15:26:18     	at org.eclipse.equinox.launcher.Main.main(Main.java:1435)
15:26:18 
15:26:18 *** ERROR ***: Tue May 25 19:26:18 UTC 2021    IWAE0037E Could not open /home/jenkins/agent/workspace/webtools-javaee-gerrit_master/tests/org.eclipse.jst.j2ee.core.tests/commonArchiveResources/WSSecured_InsuranceServices_EJB_WS.ear
15:26:18     IWAE0036E URI Name: /home/jenkins/agent/workspace/webtools-javaee-gerrit_master/tests/org.eclipse.jst.j2ee.core.tests/commonArchiveResources/WSSecured_InsuranceServices_EJB_WS.ear; File name: /home/jenkins/agent/workspace/webtools-javaee-gerrit_master/tests/org.eclipse.jst.j2ee.core.tests/commonArchiveResources/WSSecured_InsuranceServices_EJB_WS.ear
15:26:18 Tests run: 7, Failures: 0, Errors: 5, Skipped: 0, Time elapsed: 0.036 s <<< FAILURE! - in org.eclipse.jst.j2ee.archive.test.DefectVerificationTests
15:26:18 testSavingEARWhileDeploying(org.eclipse.jst.j2ee.archive.test.DefectVerificationTests)  Time elapsed: 0.016 s  <<< ERROR!
15:26:18 org.eclipse.jst.j2ee.commonarchivecore.internal.exception.OpenFailureException: IWAE0037E Could not open /home/jenkins/agent/workspace/webtools-javaee-gerrit_master/tests/org.eclipse.jst.j2ee.core.tests/commonArchiveResources/AuctionApp.ear
15:26:18 	at org.eclipse.jst.j2ee.archive.test.DefectVerificationTests.testSavingEARWhileDeploying(DefectVerificationTests.java:172)
15:26:18 Caused by: java.io.FileNotFoundException: IWAE0036E URI Name: /home/jenkins/agent/workspace/webtools-javaee-gerrit_master/tests/org.eclipse.jst.j2ee.core.tests/commonArchiveResources/AuctionApp.ear; File name: /home/jenkins/agent/workspace/webtools-javaee-gerrit_master/tests/org.eclipse.jst.j2ee.core.tests/commonArchiveResources/AuctionApp.ear
15:26:18 	at org.eclipse.jst.j2ee.archive.test.DefectVerificationTests.testSavingEARWhileDeploying(DefectVerificationTests.java:172)
15:26:18 
15:26:18 testFilterMappingTranslator(org.eclipse.jst.j2ee.archive.test.DefectVerificationTests)  Time elapsed: 0 s  <<< ERROR!
15:26:18 org.eclipse.jst.j2ee.commonarchivecore.internal.exception.OpenFailureException: IWAE0037E Could not open /home/jenkins/agent/workspace/webtools-javaee-gerrit_master/tests/org.eclipse.jst.j2ee.core.tests/commonArchiveResources/QIDefectsNew.ear
15:26:18 	at org.eclipse.jst.j2ee.archive.test.DefectVerificationTests.testFilterMappingTranslator(DefectVerificationTests.java:83)
15:26:18 Caused by: java.io.FileNotFoundException: IWAE0036E URI Name: /home/jenkins/agent/workspace/webtools-javaee-gerrit_master/tests/org.eclipse.jst.j2ee.core.tests/commonArchiveResources/QIDefectsNew.ear; File name: /home/jenkins/agent/workspace/webtools-javaee-gerrit_master/tests/org.eclipse.jst.j2ee.core.tests/commonArchiveResources/QIDefectsNew.ear
15:26:18 	at org.eclipse.jst.j2ee.archive.test.DefectVerificationTests.testFilterMappingTranslator(DefectVerificationTests.java:83)
15:26:18 
15:26:18 testReadCrimsonCase(org.eclipse.jst.j2ee.archive.test.DefectVerificationTests)  Time elapsed: 0.002 s  <<< ERROR!
15:26:18 org.eclipse.jst.j2ee.commonarchivecore.internal.exception.OpenFailureException: IWAE0037E Could not open /home/jenkins/agent/workspace/webtools-javaee-gerrit_master/tests/org.eclipse.jst.j2ee.core.tests/commonArchiveResources/ejb_sam_Hello.ear
15:26:18 	at org.eclipse.jst.j2ee.archive.test.DefectVerificationTests.testReadCrimsonCase(DefectVerificationTests.java:261)
15:26:18 Caused by: java.io.FileNotFoundException: IWAE0036E URI Name: /home/jenkins/agent/workspace/webtools-javaee-gerrit_master/tests/org.eclipse.jst.j2ee.core.tests/commonArchiveResources/ejb_sam_Hello.ear; File name: /home/jenkins/agent/workspace/webtools-javaee-gerrit_master/tests/org.eclipse.jst.j2ee.core.tests/commonArchiveResources/ejb_sam_Hello.ear
15:26:18 	at org.eclipse.jst.j2ee.archive.test.DefectVerificationTests.testReadCrimsonCase(DefectVerificationTests.java:261)
15:26:18 
15:26:18 testFormerDefect297(org.eclipse.jst.j2ee.archive.test.DefectVerificationTests)  Time elapsed: 0.001 s  <<< ERROR!
15:26:18 org.eclipse.jst.j2ee.commonarchivecore.internal.exception.OpenFailureException: IWAE0037E Could not open /home/jenkins/agent/workspace/webtools-javaee-gerrit_master/tests/org.eclipse.jst.j2ee.core.tests/commonArchiveResources/sample.ear
15:26:18 	at org.eclipse.jst.j2ee.archive.test.DefectVerificationTests.testFormerDefect297(DefectVerificationTests.java:109)
15:26:18 Caused by: java.io.FileNotFoundException: IWAE0036E URI Name: /home/jenkins/agent/workspace/webtools-javaee-gerrit_master/tests/org.eclipse.jst.j2ee.core.tests/commonArchiveResources/sample.ear; File name: /home/jenkins/agent/workspace/webtools-javaee-gerrit_master/tests/org.eclipse.jst.j2ee.core.tests/commonArchiveResources/sample.ear
15:26:18 	at org.eclipse.jst.j2ee.archive.test.DefectVerificationTests.testFormerDefect297(DefectVerificationTests.java:109)
15:26:18 
15:26:18 testServiceQNameTranslator(org.eclipse.jst.j2ee.archive.test.DefectVerificationTests)  Time elapsed: 0.002 s  <<< ERROR!
15:26:18 org.eclipse.jst.j2ee.commonarchivecore.internal.exception.OpenFailureException: IWAE0037E Could not open /home/jenkins/agent/workspace/webtools-javaee-gerrit_master/tests/org.eclipse.jst.j2ee.core.tests/commonArchiveResources/WSSecured_InsuranceServices_EJB_WS.ear
15:26:18 	at org.eclipse.jst.j2ee.archive.test.DefectVerificationTests.testServiceQNameTranslator(DefectVerificationTests.java:216)
15:26:18 Caused by: java.io.FileNotFoundException: IWAE0036E URI Name: /home/jenkins/agent/workspace/webtools-javaee-gerrit_master/tests/org.eclipse.jst.j2ee.core.tests/commonArchiveResources/WSSecured_InsuranceServices_EJB_WS.ear; File name: /home/jenkins/agent/workspace/webtools-javaee-gerrit_master/tests/org.eclipse.jst.j2ee.core.tests/commonArchiveResources/WSSecured_InsuranceServices_EJB_WS.ear
15:26:18 	at org.eclipse.jst.j2ee.archive.test.DefectVerificationTests.testServiceQNameTranslator(DefectVerificationTests.java:216)
15:26:18 
15:26:18 testCreatingEARFile(org.eclipse.jst.j2ee.archive.test.DefectVerificationTests)  Time elapsed: 0.001 s
15:26:18 testFormerDefect1459(org.eclipse.jst.j2ee.archive.test.DefectVerificationTests)  Time elapsed: 0.011 s
15:26:18 Running org.eclipse.jst.j2ee.archive.test.SecurityRoleTests
15:26:18 Tests run: 2, Failures: 0, Errors: 2, Skipped: 0, Time elapsed: 0.003 s <<< FAILURE! - in org.eclipse.jst.j2ee.archive.test.SecurityRoleTests
15:26:18 testRollupAddAndPushDown(org.eclipse.jst.j2ee.archive.test.SecurityRoleTests)  Time elapsed: 0 s  <<< ERROR!
15:26:18 org.eclipse.jst.j2ee.commonarchivecore.internal.exception.OpenFailureException: IWAE0037E Could not open /home/jenkins/agent/workspace/webtools-javaee-gerrit_master/tests/org.eclipse.jst.j2ee.core.tests/commonArchiveResources/sample.ear
15:26:18 	at org.eclipse.jst.j2ee.archive.test.SecurityRoleTests.testRollupAddAndPushDown(SecurityRoleTests.java:73)
15:26:18 Caused by: java.io.FileNotFoundException: IWAE0036E URI Name: /home/jenkins/agent/workspace/webtools-javaee-gerrit_master/tests/org.eclipse.jst.j2ee.core.tests/commonArchiveResources/sample.ear; File name: /home/jenkins/agent/workspace/webtools-javaee-gerrit_master/tests/org.eclipse.jst.j2ee.core.tests/commonArchiveResources/sample.ear
15:26:18 	at org.eclipse.jst.j2ee.archive.test.SecurityRoleTests.testRollupAddAndPushDown(SecurityRoleTests.java:73)
15:26:18 
15:26:18 testPushDownCopy(org.eclipse.jst.j2ee.archive.test.SecurityRoleTests)  Time elapsed: 0 s  <<< ERROR!
15:26:18 org.eclipse.jst.j2ee.commonarchivecore.internal.exception.OpenFailureException: IWAE0037E Could not open /home/jenkins/agent/workspace/webtools-javaee-gerrit_master/tests/org.eclipse.jst.j2ee.core.tests/commonArchiveResources/sample.ear
15:26:18 	at org.eclipse.jst.j2ee.archive.test.SecurityRoleTests.testPushDownCopy(SecurityRoleTests.java:53)
15:26:18 Caused by: java.io.FileNotFoundException: IWAE0036E URI Name: /home/jenkins/agent/workspace/webtools-javaee-gerrit_master/tests/org.eclipse.jst.j2ee.core.tests/commonArchiveResources/sample.ear; File name: /home/jenkins/agent/workspace/webtools-javaee-gerrit_master/tests/org.eclipse.jst.j2ee.core.tests/commonArchiveResources/sample.ear
15:26:18 	at org.eclipse.jst.j2ee.archive.test.SecurityRoleTests.testPushDownCopy(SecurityRoleTests.java:53)
15:26:18 
15:26:18 Running org.eclipse.jst.j2ee.archive.test.TestInvalidXmlMultiplicity
15:26:18 Tests run: 3, Failures: 0, Errors: 0, Skipped: 0, Time elapsed: 0.002 s - in org.eclipse.jst.j2ee.archive.test.TestInvalidXmlMultiplicity
15:26:18 test1(org.eclipse.jst.j2ee.archive.test.TestInvalidXmlMultiplicity)  Time elapsed: 0 s
15:26:18 test2(org.eclipse.jst.j2ee.archive.test.TestInvalidXmlMultiplicity)  Time elapsed: 0.001 s
15:26:18 test3(org.eclipse.jst.j2ee.archive.test.TestInvalidXmlMultiplicity)  Time elapsed: 0 s
15:26:18 Running org.eclipse.jst.j2ee.archive.test.CopyTests
15:26:18 Tests run: 6, Failures: 0, Errors: 6, Skipped: 0, Time elapsed: 0.003 s <<< FAILURE! - in org.eclipse.jst.j2ee.archive.test.CopyTests
15:26:18 testAddCopyModuleFilesToEAR(org.eclipse.jst.j2ee.archive.test.CopyTests)  Time elapsed: 0.001 s  <<< ERROR!
15:26:18 org.eclipse.jst.j2ee.commonarchivecore.internal.exception.OpenFailureException: IWAE0037E Could not open /home/jenkins/agent/workspace/webtools-javaee-gerrit_master/tests/org.eclipse.jst.j2ee.core.tests/commonArchiveResources/bankejbs.jar
15:26:18 	at org.eclipse.jst.j2ee.archive.test.CopyTests.testAddCopyModuleFilesToEAR(CopyTests.java:139)
15:26:18 Caused by: java.io.FileNotFoundException: IWAE0036E URI Name: /home/jenkins/agent/workspace/webtools-javaee-gerrit_master/tests/org.eclipse.jst.j2ee.core.tests/commonArchiveResources/bankejbs.jar; File name: /home/jenkins/agent/workspace/webtools-javaee-gerrit_master/tests/org.eclipse.jst.j2ee.core.tests/commonArchiveResources/bankejbs.jar
15:26:18 	at org.eclipse.jst.j2ee.archive.test.CopyTests.testAddCopyModuleFilesToEAR(CopyTests.java:139)
15:26:18 
15:26:18 testAddRenameAndDeleteStandalone(org.eclipse.jst.j2ee.archive.test.CopyTests)  Time elapsed: 0 s  <<< ERROR!
15:26:18 org.eclipse.jst.j2ee.commonarchivecore.internal.exception.OpenFailureException: IWAE0037E Could not open /home/jenkins/agent/workspace/webtools-javaee-gerrit_master/tests/org.eclipse.jst.j2ee.core.tests/commonArchiveResources/bankejbs.jar
15:26:18 	at org.eclipse.jst.j2ee.archive.test.CopyTests.testAddRenameAndDeleteStandalone(CopyTests.java:218)
15:26:18 Caused by: java.io.FileNotFoundException: IWAE0036E URI Name: /home/jenkins/agent/workspace/webtools-javaee-gerrit_master/tests/org.eclipse.jst.j2ee.core.tests/commonArchiveResources/bankejbs.jar; File name: /home/jenkins/agent/workspace/webtools-javaee-gerrit_master/tests/org.eclipse.jst.j2ee.core.tests/commonArchiveResources/bankejbs.jar
15:26:18 	at org.eclipse.jst.j2ee.archive.test.CopyTests.testAddRenameAndDeleteStandalone(CopyTests.java:218)
15:26:18 
15:26:18 testAddCopyDirectory(org.eclipse.jst.j2ee.archive.test.CopyTests)  Time elapsed: 0 s  <<< ERROR!
15:26:18 org.eclipse.jst.j2ee.commonarchivecore.internal.exception.OpenFailureException: IWAE0037E Could not open /home/jenkins/agent/workspace/webtools-javaee-gerrit_master/tests/org.eclipse.jst.j2ee.core.tests/commonArchiveResources/example2.war
15:26:18 	at org.eclipse.jst.j2ee.archive.test.CopyTests.testAddCopyDirectory(CopyTests.java:78)
15:26:18 Caused by: java.io.FileNotFoundException: IWAE0036E URI Name: /home/jenkins/agent/workspace/webtools-javaee-gerrit_master/tests/org.eclipse.jst.j2ee.core.tests/commonArchiveResources/example2.war; File name: /home/jenkins/agent/workspace/webtools-javaee-gerrit_master/tests/org.eclipse.jst.j2ee.core.tests/commonArchiveResources/example2.war
15:26:18 	at org.eclipse.jst.j2ee.archive.test.CopyTests.testAddCopyDirectory(CopyTests.java:78)
15:26:18 
15:26:18 testAddCopyModule(org.eclipse.jst.j2ee.archive.test.CopyTests)  Time elapsed: 0 s  <<< ERROR!
15:26:18 org.eclipse.jst.j2ee.commonarchivecore.internal.exception.OpenFailureException: IWAE0037E Could not open /home/jenkins/agent/workspace/webtools-javaee-gerrit_master/tests/org.eclipse.jst.j2ee.core.tests/commonArchiveResources/sample.ear
15:26:18 	at org.eclipse.jst.j2ee.archive.test.CopyTests.testAddCopyModule(CopyTests.java:100)
15:26:18 Caused by: java.io.FileNotFoundException: IWAE0036E URI Name: /home/jenkins/agent/workspace/webtools-javaee-gerrit_master/tests/org.eclipse.jst.j2ee.core.tests/commonArchiveResources/sample.ear; File name: /home/jenkins/agent/workspace/webtools-javaee-gerrit_master/tests/org.eclipse.jst.j2ee.core.tests/commonArchiveResources/sample.ear
15:26:18 	at org.eclipse.jst.j2ee.archive.test.CopyTests.testAddCopyModule(CopyTests.java:100)
15:26:18 
15:26:18 testAddRenameAndDelete(org.eclipse.jst.j2ee.archive.test.CopyTests)  Time elapsed: 0 s  <<< ERROR!
15:26:18 org.eclipse.jst.j2ee.commonarchivecore.internal.exception.OpenFailureException: IWAE0037E Could not open /home/jenkins/agent/workspace/webtools-javaee-gerrit_master/tests/org.eclipse.jst.j2ee.core.tests/commonArchiveResources/sample.ear
15:26:18 	at org.eclipse.jst.j2ee.archive.test.CopyTests.testAddRenameAndDelete(CopyTests.java:184)
15:26:18 Caused by: java.io.FileNotFoundException: IWAE0036E URI Name: /home/jenkins/agent/workspace/webtools-javaee-gerrit_master/tests/org.eclipse.jst.j2ee.core.tests/commonArchiveResources/sample.ear; File name: /home/jenkins/agent/workspace/webtools-javaee-gerrit_master/tests/org.eclipse.jst.j2ee.core.tests/commonArchiveResources/sample.ear
15:26:18 	at org.eclipse.jst.j2ee.archive.test.CopyTests.testAddRenameAndDelete(CopyTests.java:184)
15:26:18 
15:26:18 testAddCopyStandaloneModule(org.eclipse.jst.j2ee.archive.test.CopyTests)  Time elapsed: 0 s  <<< ERROR!
15:26:18 org.eclipse.jst.j2ee.commonarchivecore.internal.exception.OpenFailureException: IWAE0037E Could not open /home/jenkins/agent/workspace/webtools-javaee-gerrit_master/tests/org.eclipse.jst.j2ee.core.tests/commonArchiveResources/bankejbs.jar
15:26:18 	at org.eclipse.jst.j2ee.archive.test.CopyTests.testAddCopyStandaloneModule(CopyTests.java:167)
15:26:18 Caused by: java.io.FileNotFoundException: IWAE0036E URI Name: /home/jenkins/agent/workspace/webtools-javaee-gerrit_master/tests/org.eclipse.jst.j2ee.core.tests/commonArchiveResources/bankejbs.jar; File name: /home/jenkins/agent/workspace/webtools-javaee-gerrit_master/tests/org.eclipse.jst.j2ee.core.tests/commonArchiveResources/bankejbs.jar
15:26:18 	at org.eclipse.jst.j2ee.archive.test.CopyTests.testAddCopyStandaloneModule(CopyTests.java:167)
15:26:18 
15:26:18 Running org.eclipse.jst.j2ee.archive.test.ResourceTests
15:26:18 Tests run: 2, Failures: 1, Errors: 1, Skipped: 0, Time elapsed: 0.081 s <<< FAILURE! - in org.eclipse.jst.j2ee.archive.test.ResourceTests
15:26:18 testResourceDirty(org.eclipse.jst.j2ee.archive.test.ResourceTests)  Time elapsed: 0 s  <<< ERROR!
15:26:18 org.eclipse.jst.j2ee.commonarchivecore.internal.exception.OpenFailureException: IWAE0037E Could not open /home/jenkins/agent/workspace/webtools-javaee-gerrit_master/tests/org.eclipse.jst.j2ee.core.tests/commonArchiveResources/bankejbs.jar
15:26:18 	at org.eclipse.jst.j2ee.archive.test.ResourceTests.testResourceDirty(ResourceTests.java:95)
15:26:18 Caused by: java.io.FileNotFoundException: IWAE0036E URI Name: /home/jenkins/agent/workspace/webtools-javaee-gerrit_master/tests/org.eclipse.jst.j2ee.core.tests/commonArchiveResources/bankejbs.jar; File name: /home/jenkins/agent/workspace/webtools-javaee-gerrit_master/tests/org.eclipse.jst.j2ee.core.tests/commonArchiveResources/bankejbs.jar
15:26:18 	at org.eclipse.jst.j2ee.archive.test.ResourceTests.testResourceDirty(ResourceTests.java:95)
15:26:18 
15:26:18 testResourceCreation(org.eclipse.jst.j2ee.archive.test.ResourceTests)  Time elapsed: 0.079 s  <<< FAILURE!
15:26:18 junit.framework.AssertionFailedError: The resource should be unloaded
15:26:18 	at org.eclipse.jst.j2ee.archive.test.ResourceTests.testResourceCreation(ResourceTests.java:76)
15:26:18 
15:26:18 Running org.eclipse.jst.j2ee.archive.test.SaveTests
15:26:18 Tests run: 2, Failures: 0, Errors: 2, Skipped: 0, Time elapsed: 0.002 s <<< FAILURE! - in org.eclipse.jst.j2ee.archive.test.SaveTests
15:26:18 testSave(org.eclipse.jst.j2ee.archive.test.SaveTests)  Time elapsed: 0 s  <<< ERROR!
15:26:18 org.eclipse.jst.j2ee.commonarchivecore.internal.exception.OpenFailureException: IWAE0037E Could not open /home/jenkins/agent/workspace/webtools-javaee-gerrit_master/tests/org.eclipse.jst.j2ee.core.tests/commonArchiveResources/example2.war
15:26:18 	at org.eclipse.jst.j2ee.archive.test.SaveTests.testSave(SaveTests.java:63)
15:26:18 Caused by: java.io.FileNotFoundException: IWAE0036E URI Name: /home/jenkins/agent/workspace/webtools-javaee-gerrit_master/tests/org.eclipse.jst.j2ee.core.tests/commonArchiveResources/example2.war; File name: /home/jenkins/agent/workspace/webtools-javaee-gerrit_master/tests/org.eclipse.jst.j2ee.core.tests/commonArchiveResources/example2.war
15:26:18 	at org.eclipse.jst.j2ee.archive.test.SaveTests.testSave(SaveTests.java:63)
15:26:18 
15:26:18 testSaveDirectory(org.eclipse.jst.j2ee.archive.test.SaveTests)  Time elapsed: 0 s  <<< ERROR!
15:26:18 org.eclipse.jst.j2ee.commonarchivecore.internal.exception.OpenFailureException: IWAE0037E Could not open /home/jenkins/agent/workspace/webtools-javaee-gerrit_master/tests/org.eclipse.jst.j2ee.core.tests/commonArchiveResources/sample.ear
15:26:18 	at org.eclipse.jst.j2ee.archive.test.SaveTests.testSaveDirectory(SaveTests.java:93)
15:26:18 Caused by: java.io.FileNotFoundException: IWAE0036E URI Name: /home/jenkins/agent/workspace/webtools-javaee-gerrit_master/tests/org.eclipse.jst.j2ee.core.tests/commonArchiveResources/sample.ear; File name: /home/jenkins/agent/workspace/webtools-javaee-gerrit_master/tests/org.eclipse.jst.j2ee.core.tests/commonArchiveResources/sample.ear
15:26:18 	at org.eclipse.jst.j2ee.archive.test.SaveTests.testSaveDirectory(SaveTests.java:93)
15:26:18 
15:26:18 Running org.eclipse.jst.j2ee.archive.test.ClientContainerResourceLoadTest
15:26:18 org.eclipse.jst.j2ee.commonarchivecore.internal.exception.OpenFailureException: IWAE0037E Could not open /home/jenkins/agent/workspace/webtools-javaee-gerrit_master/tests/org.eclipse.jst.j2ee.core.tests/commonArchiveResources/mtapp2.ear
15:26:18 Stack trace of nested exception:
15:26:18 java.io.FileNotFoundException: IWAE0036E URI Name: /home/jenkins/agent/workspace/webtools-javaee-gerrit_master/tests/org.eclipse.jst.j2ee.core.tests/commonArchiveResources/mtapp2.ear; File name: /home/jenkins/agent/workspace/webtools-javaee-gerrit_master/tests/org.eclipse.jst.j2ee.core.tests/commonArchiveResources/mtapp2.ear
15:26:18 	at org.eclipse.jst.j2ee.commonarchivecore.internal.impl.CommonarchiveFactoryImpl.createLoadStrategy(CommonarchiveFactoryImpl.java:342)
15:26:18 	at org.eclipse.jst.j2ee.commonarchivecore.internal.impl.CommonarchiveFactoryImpl.primOpenArchive(CommonarchiveFactoryImpl.java:876)
15:26:18 	at org.eclipse.jst.j2ee.commonarchivecore.internal.impl.CommonarchiveFactoryImpl.primOpenArchive(CommonarchiveFactoryImpl.java:902)
15:26:18 	at org.eclipse.jst.j2ee.commonarchivecore.internal.impl.CommonarchiveFactoryImpl.openEARFile(CommonarchiveFactoryImpl.java:657)
15:26:18 	at org.eclipse.jst.j2ee.archive.test.ClientContainerResourceLoadTest.testClientContainerLoad(ClientContainerResourceLoadTest.java:57)
15:26:18 	at java.base/jdk.internal.reflect.NativeMethodAccessorImpl.invoke0(Native Method)
15:26:18 	at java.base/jdk.internal.reflect.NativeMethodAccessorImpl.invoke(NativeMethodAccessorImpl.java:62)
15:26:18 	at java.base/jdk.internal.reflect.DelegatingMethodAccessorImpl.invoke(DelegatingMethodAccessorImpl.java:43)
15:26:18 	at java.base/java.lang.reflect.Method.invoke(Method.java:566)
15:26:18 	at junit.framework.TestCase.runTest(TestCase.java:177)
15:26:18 	at junit.framework.TestCase.runBare(TestCase.java:142)
15:26:18 	at junit.framework.TestResult$1.protect(TestResult.java:122)
15:26:18 	at junit.framework.TestResult.runProtected(TestResult.java:142)
15:26:18 	at junit.framework.TestResult.run(TestResult.java:125)
15:26:18 	at junit.framework.TestCase.run(TestCase.java:130)
15:26:18 	at junit.framework.TestSuite.runTest(TestSuite.java:241)
15:26:18 	at junit.framework.TestSuite.run(TestSuite.java:236)
15:26:18 	at org.junit.internal.runners.JUnit38ClassRunner.run(JUnit38ClassRunner.java:90)
15:26:18 	at org.apache.maven.surefire.junit4.JUnit4Provider.execute(JUnit4Provider.java:365)
15:26:18 	at org.apache.maven.surefire.junit4.JUnit4Provider.executeWithRerun(JUnit4Provider.java:273)
15:26:18 	at org.apache.maven.surefire.junit4.JUnit4Provider.executeTestSet(JUnit4Provider.java:238)
15:26:18 	at org.apache.maven.surefire.junit4.JUnit4Provider.invoke(JUnit4Provider.java:159)
15:26:18 	at java.base/jdk.internal.reflect.NativeMethodAccessorImpl.invoke0(Native Method)
15:26:18 	at java.base/jdk.internal.reflect.NativeMethodAccessorImpl.invoke(NativeMethodAccessorImpl.java:62)
15:26:18 	at java.base/jdk.internal.reflect.DelegatingMethodAccessorImpl.invoke(DelegatingMethodAccessorImpl.java:43)
15:26:18 	at java.base/java.lang.reflect.Method.invoke(Method.java:566)
15:26:18 	at org.apache.maven.surefire.util.ReflectionUtils.invokeMethodWithArray2(ReflectionUtils.java:206)
15:26:18 	at org.apache.maven.surefire.booter.ProviderFactory$ProviderProxy.invoke(ProviderFactory.java:161)
15:26:18 	at org.apache.maven.surefire.booter.ProviderFactory.invokeProvider(ProviderFactory.java:84)
15:26:18 	at org.eclipse.tycho.surefire.osgibooter.OsgiSurefireBooter.run(OsgiSurefireBooter.java:116)
15:26:18 	at org.eclipse.tycho.surefire.osgibooter.HeadlessTestApplication.start(HeadlessTestApplication.java:23)
15:26:18 	at org.eclipse.equinox.internal.app.EclipseAppHandle.run(EclipseAppHandle.java:203)
15:26:18 	at org.eclipse.core.runtime.internal.adaptor.EclipseAppLauncher.runApplication(EclipseAppLauncher.java:134)
15:26:18 	at org.eclipse.core.runtime.internal.adaptor.EclipseAppLauncher.start(EclipseAppLauncher.java:104)
15:26:18 	at org.eclipse.core.runtime.adaptor.EclipseStarter.run(EclipseStarter.java:401)
15:26:18 	at org.eclipse.core.runtime.adaptor.EclipseStarter.run(EclipseStarter.java:255)
15:26:18 	at java.base/jdk.internal.reflect.NativeMethodAccessorImpl.invoke0(Native Method)
15:26:18 	at java.base/jdk.internal.reflect.NativeMethodAccessorImpl.invoke(NativeMethodAccessorImpl.java:62)
15:26:18 	at java.base/jdk.internal.reflect.DelegatingMethodAccessorImpl.invoke(DelegatingMethodAccessorImpl.java:43)
15:26:18 	at java.base/java.lang.reflect.Method.invoke(Method.java:566)
15:26:18 	at org.eclipse.equinox.launcher.Main.invokeFramework(Main.java:654)
15:26:18 	at org.eclipse.equinox.launcher.Main.basicRun(Main.java:591)
15:26:18 	at org.eclipse.equinox.launcher.Main.run(Main.java:1462)
15:26:18 	at org.eclipse.equinox.launcher.Main.main(Main.java:1435)
15:26:18 Tests run: 1, Failures: 0, Errors: 0, Skipped: 0, Time elapsed: 0.005 s - in org.eclipse.jst.j2ee.archive.test.ClientContainerResourceLoadTest
15:26:18 testClientContainerLoad(org.eclipse.jst.j2ee.archive.test.ClientContainerResourceLoadTest)  Time elapsed: 0.004 s
15:26:18 Running org.eclipse.jst.j2ee.archive.test.LooseArchiveTests
15:26:18 Tests run: 5, Failures: 0, Errors: 0, Skipped: 0, Time elapsed: 0.429 s - in org.eclipse.jst.j2ee.archive.test.LooseArchiveTests
15:26:19 testLooseConfigCreation(org.eclipse.jst.j2ee.archive.test.LooseArchiveTests)  Time elapsed: 0.143 s
15:26:19 testLooseAppCreation(org.eclipse.jst.j2ee.archive.test.LooseArchiveTests)  Time elapsed: 0.078 s
15:26:19 testLooseConfigOpenAndSave(org.eclipse.jst.j2ee.archive.test.LooseArchiveTests)  Time elapsed: 0.105 s
15:26:19 testLooseConfigOpenAndReOpen(org.eclipse.jst.j2ee.archive.test.LooseArchiveTests)  Time elapsed: 0.019 s
15:26:19 testLooseConfigUnimodeOpenAndSave(org.eclipse.jst.j2ee.archive.test.LooseArchiveTests)  Time elapsed: 0.082 s
15:26:19 Running org.eclipse.jst.j2ee.archive.test.DiscriminatorTest
15:26:19 Tests run: 1, Failures: 0, Errors: 0, Skipped: 0, Time elapsed: 0.001 s - in org.eclipse.jst.j2ee.archive.test.DiscriminatorTest
15:26:19 testDiscriminator(org.eclipse.jst.j2ee.archive.test.DiscriminatorTest)  Time elapsed: 0 s
15:26:19 Running org.eclipse.jst.j2ee.archive.test.WARFileTests
15:26:19 Tests run: 3, Failures: 0, Errors: 3, Skipped: 0, Time elapsed: 0.002 s <<< FAILURE! - in org.eclipse.jst.j2ee.archive.test.WARFileTests
15:26:19 testAddCopyLib(org.eclipse.jst.j2ee.archive.test.WARFileTests)  Time elapsed: 0.001 s  <<< ERROR!
15:26:19 org.eclipse.jst.j2ee.commonarchivecore.internal.exception.OpenFailureException: IWAE0037E Could not open /home/jenkins/agent/workspace/webtools-javaee-gerrit_master/tests/org.eclipse.jst.j2ee.core.tests/commonArchiveResources/example2.war
15:26:19 	at org.eclipse.jst.j2ee.archive.test.WARFileTests.testAddCopyLib(WARFileTests.java:77)
15:26:19 Caused by: java.io.FileNotFoundException: IWAE0036E URI Name: /home/jenkins/agent/workspace/webtools-javaee-gerrit_master/tests/org.eclipse.jst.j2ee.core.tests/commonArchiveResources/example2.war; File name: /home/jenkins/agent/workspace/webtools-javaee-gerrit_master/tests/org.eclipse.jst.j2ee.core.tests/commonArchiveResources/example2.war
15:26:19 	at org.eclipse.jst.j2ee.archive.test.WARFileTests.testAddCopyLib(WARFileTests.java:77)
15:26:19 
15:26:19 testAddCopyClass(org.eclipse.jst.j2ee.archive.test.WARFileTests)  Time elapsed: 0 s  <<< ERROR!
15:26:19 org.eclipse.jst.j2ee.commonarchivecore.internal.exception.OpenFailureException: IWAE0037E Could not open /home/jenkins/agent/workspace/webtools-javaee-gerrit_master/tests/org.eclipse.jst.j2ee.core.tests/commonArchiveResources/example2.war
15:26:19 	at org.eclipse.jst.j2ee.archive.test.WARFileTests.testAddCopyClass(WARFileTests.java:56)
15:26:19 Caused by: java.io.FileNotFoundException: IWAE0036E URI Name: /home/jenkins/agent/workspace/webtools-javaee-gerrit_master/tests/org.eclipse.jst.j2ee.core.tests/commonArchiveResources/example2.war; File name: /home/jenkins/agent/workspace/webtools-javaee-gerrit_master/tests/org.eclipse.jst.j2ee.core.tests/commonArchiveResources/example2.war
15:26:19 	at org.eclipse.jst.j2ee.archive.test.WARFileTests.testAddCopyClass(WARFileTests.java:56)
15:26:19 
15:26:19 testListClassesAndLibs(org.eclipse.jst.j2ee.archive.test.WARFileTests)  Time elapsed: 0 s  <<< ERROR!
15:26:19 org.eclipse.jst.j2ee.commonarchivecore.internal.exception.OpenFailureException: IWAE0037E Could not open /home/jenkins/agent/workspace/webtools-javaee-gerrit_master/tests/org.eclipse.jst.j2ee.core.tests/commonArchiveResources/example2.war
15:26:19 	at org.eclipse.jst.j2ee.archive.test.WARFileTests.testListClassesAndLibs(WARFileTests.java:96)
15:26:19 Caused by: java.io.FileNotFoundException: IWAE0036E URI Name: /home/jenkins/agent/workspace/webtools-javaee-gerrit_master/tests/org.eclipse.jst.j2ee.core.tests/commonArchiveResources/example2.war; File name: /home/jenkins/agent/workspace/webtools-javaee-gerrit_master/tests/org.eclipse.jst.j2ee.core.tests/commonArchiveResources/example2.war
15:26:19 	at org.eclipse.jst.j2ee.archive.test.WARFileTests.testListClassesAndLibs(WARFileTests.java:96)
15:26:19 
15:26:19 Running org.eclipse.jst.j2ee.archive.test.JavaTests
15:26:19 Tests run: 1, Failures: 0, Errors: 0, Skipped: 0, Time elapsed: 0.001 s - in org.eclipse.jst.j2ee.archive.test.JavaTests
15:26:19 testJavaReflection(org.eclipse.jst.j2ee.archive.test.JavaTests)  Time elapsed: 0 s
15:26:19 Running org.eclipse.jst.j2ee.archive.test.RarFileTests
15:26:19 Tests run: 7, Failures: 0, Errors: 7, Skipped: 0, Time elapsed: 0.003 s <<< FAILURE! - in org.eclipse.jst.j2ee.archive.test.RarFileTests
15:26:19 testOpenAndRead(org.eclipse.jst.j2ee.archive.test.RarFileTests)  Time elapsed: 0.001 s  <<< ERROR!
15:26:19 org.eclipse.jst.j2ee.commonarchivecore.internal.exception.OpenFailureException: IWAE0037E Could not open /home/jenkins/agent/workspace/webtools-javaee-gerrit_master/tests/org.eclipse.jst.j2ee.core.tests/commonArchiveResources/sample.rar
15:26:19 	at org.eclipse.jst.j2ee.archive.test.RarFileTests.testOpenAndRead(RarFileTests.java:165)
15:26:19 Caused by: java.io.FileNotFoundException: IWAE0036E URI Name: /home/jenkins/agent/workspace/webtools-javaee-gerrit_master/tests/org.eclipse.jst.j2ee.core.tests/commonArchiveResources/sample.rar; File name: /home/jenkins/agent/workspace/webtools-javaee-gerrit_master/tests/org.eclipse.jst.j2ee.core.tests/commonArchiveResources/sample.rar
15:26:19 	at org.eclipse.jst.j2ee.archive.test.RarFileTests.testOpenAndRead(RarFileTests.java:165)
15:26:19 
15:26:19 testaddCopyModule(org.eclipse.jst.j2ee.archive.test.RarFileTests)  Time elapsed: 0 s  <<< ERROR!
15:26:19 org.eclipse.jst.j2ee.commonarchivecore.internal.exception.OpenFailureException: IWAE0037E Could not open /home/jenkins/agent/workspace/webtools-javaee-gerrit_master/tests/org.eclipse.jst.j2ee.core.tests/commonArchiveResources/sample.rar
15:26:19 	at org.eclipse.jst.j2ee.archive.test.RarFileTests.testaddCopyModule(RarFileTests.java:114)
15:26:19 Caused by: java.io.FileNotFoundException: IWAE0036E URI Name: /home/jenkins/agent/workspace/webtools-javaee-gerrit_master/tests/org.eclipse.jst.j2ee.core.tests/commonArchiveResources/sample.rar; File name: /home/jenkins/agent/workspace/webtools-javaee-gerrit_master/tests/org.eclipse.jst.j2ee.core.tests/commonArchiveResources/sample.rar
15:26:19 	at org.eclipse.jst.j2ee.archive.test.RarFileTests.testaddCopyModule(RarFileTests.java:114)
15:26:19 
15:26:19 testSaveRarEar(org.eclipse.jst.j2ee.archive.test.RarFileTests)  Time elapsed: 0 s  <<< ERROR!
15:26:19 org.eclipse.jst.j2ee.commonarchivecore.internal.exception.OpenFailureException: IWAE0037E Could not open /home/jenkins/agent/workspace/webtools-javaee-gerrit_master/tests/org.eclipse.jst.j2ee.core.tests/commonArchiveResources/sample.rar
15:26:19 	at org.eclipse.jst.j2ee.archive.test.RarFileTests.testSaveRarEar(RarFileTests.java:178)
15:26:19 Caused by: java.io.FileNotFoundException: IWAE0036E URI Name: /home/jenkins/agent/workspace/webtools-javaee-gerrit_master/tests/org.eclipse.jst.j2ee.core.tests/commonArchiveResources/sample.rar; File name: /home/jenkins/agent/workspace/webtools-javaee-gerrit_master/tests/org.eclipse.jst.j2ee.core.tests/commonArchiveResources/sample.rar
15:26:19 	at org.eclipse.jst.j2ee.archive.test.RarFileTests.testSaveRarEar(RarFileTests.java:178)
15:26:19 
15:26:19 testexpandRarModule(org.eclipse.jst.j2ee.archive.test.RarFileTests)  Time elapsed: 0 s  <<< ERROR!
15:26:19 org.eclipse.jst.j2ee.commonarchivecore.internal.exception.OpenFailureException: IWAE0037E Could not open /home/jenkins/agent/workspace/webtools-javaee-gerrit_master/tests/org.eclipse.jst.j2ee.core.tests/commonArchiveResources/sample.rar
15:26:19 	at org.eclipse.jst.j2ee.archive.test.RarFileTests.testexpandRarModule(RarFileTests.java:132)
15:26:19 Caused by: java.io.FileNotFoundException: IWAE0036E URI Name: /home/jenkins/agent/workspace/webtools-javaee-gerrit_master/tests/org.eclipse.jst.j2ee.core.tests/commonArchiveResources/sample.rar; File name: /home/jenkins/agent/workspace/webtools-javaee-gerrit_master/tests/org.eclipse.jst.j2ee.core.tests/commonArchiveResources/sample.rar
15:26:19 	at org.eclipse.jst.j2ee.archive.test.RarFileTests.testexpandRarModule(RarFileTests.java:132)
15:26:19 
15:26:19 testJ2Cauth(org.eclipse.jst.j2ee.archive.test.RarFileTests)  Time elapsed: 0 s  <<< ERROR!
15:26:19 org.eclipse.jst.j2ee.commonarchivecore.internal.exception.OpenFailureException: IWAE0037E Could not open /home/jenkins/agent/workspace/webtools-javaee-gerrit_master/tests/org.eclipse.jst.j2ee.core.tests/commonArchiveResources/sample.rar
15:26:19 	at org.eclipse.jst.j2ee.archive.test.RarFileTests.testJ2Cauth(RarFileTests.java:193)
15:26:19 Caused by: java.io.FileNotFoundException: IWAE0036E URI Name: /home/jenkins/agent/workspace/webtools-javaee-gerrit_master/tests/org.eclipse.jst.j2ee.core.tests/commonArchiveResources/sample.rar; File name: /home/jenkins/agent/workspace/webtools-javaee-gerrit_master/tests/org.eclipse.jst.j2ee.core.tests/commonArchiveResources/sample.rar
15:26:19 	at org.eclipse.jst.j2ee.archive.test.RarFileTests.testJ2Cauth(RarFileTests.java:193)
15:26:19 
15:26:19 testOpenAndExtract(org.eclipse.jst.j2ee.archive.test.RarFileTests)  Time elapsed: 0.001 s  <<< ERROR!
15:26:19 org.eclipse.jst.j2ee.commonarchivecore.internal.exception.OpenFailureException: IWAE0037E Could not open /home/jenkins/agent/workspace/webtools-javaee-gerrit_master/tests/org.eclipse.jst.j2ee.core.tests/commonArchiveResources/sample.rar
15:26:19 	at org.eclipse.jst.j2ee.archive.test.RarFileTests.testOpenAndExtract(RarFileTests.java:153)
15:26:19 Caused by: java.io.FileNotFoundException: IWAE0036E URI Name: /home/jenkins/agent/workspace/webtools-javaee-gerrit_master/tests/org.eclipse.jst.j2ee.core.tests/commonArchiveResources/sample.rar; File name: /home/jenkins/agent/workspace/webtools-javaee-gerrit_master/tests/org.eclipse.jst.j2ee.core.tests/commonArchiveResources/sample.rar
15:26:19 	at org.eclipse.jst.j2ee.archive.test.RarFileTests.testOpenAndExtract(RarFileTests.java:153)
15:26:19 
15:26:19 testopenRarEar(org.eclipse.jst.j2ee.archive.test.RarFileTests)  Time elapsed: 0 s  <<< ERROR!
15:26:19 org.eclipse.jst.j2ee.commonarchivecore.internal.exception.OpenFailureException: IWAE0037E Could not open /home/jenkins/agent/workspace/webtools-javaee-gerrit_master/tests/org.eclipse.jst.j2ee.core.tests/commonArchiveResources/testrar.ear
15:26:19 	at org.eclipse.jst.j2ee.archive.test.RarFileTests.testopenRarEar(RarFileTests.java:172)
15:26:19 Caused by: java.io.FileNotFoundException: IWAE0036E URI Name: /home/jenkins/agent/workspace/webtools-javaee-gerrit_master/tests/org.eclipse.jst.j2ee.core.tests/commonArchiveResources/testrar.ear; File name: /home/jenkins/agent/workspace/webtools-javaee-gerrit_master/tests/org.eclipse.jst.j2ee.core.tests/commonArchiveResources/testrar.ear
15:26:19 	at org.eclipse.jst.j2ee.archive.test.RarFileTests.testopenRarEar(RarFileTests.java:172)
15:26:19 
15:26:19 Running org.eclipse.jst.j2ee.archive.test.TestModuleClassLoading
15:26:19 org.eclipse.jst.j2ee.commonarchivecore.internal.exception.OpenFailureException: IWAE0037E Could not open /home/jenkins/agent/workspace/webtools-javaee-gerrit_master/tests/org.eclipse.jst.j2ee.core.tests/commonArchiveResources/PROTO.ear
15:26:19 org.eclipse.jst.j2ee.commonarchivecore.internal.exception.OpenFailureException: IWAE0037E Could not open /home/jenkins/agent/workspace/webtools-javaee-gerrit_master/tests/org.eclipse.jst.j2ee.core.tests/commonArchiveResources/SEIinAnotherJar.ear
15:26:19 org.eclipse.jst.j2ee.commonarchivecore.internal.exception.OpenFailureException: IWAE0037E Could not open /home/jenkins/agent/workspace/webtools-javaee-gerrit_master/tests/org.eclipse.jst.j2ee.core.tests/commonArchiveResources/SEIinWEB-INF_lib_jar.ear
15:26:19 Tests run: 1, Failures: 0, Errors: 0, Skipped: 0, Time elapsed: 0.002 s - in org.eclipse.jst.j2ee.archive.test.TestModuleClassLoading
15:26:19 testAddModuleClassLoading(org.eclipse.jst.j2ee.archive.test.TestModuleClassLoading)  Time elapsed: 0.001 s
15:26:19 Running org.eclipse.jst.j2ee.ejb.test.CMRFieldTest
15:26:19 Tests run: 6, Failures: 0, Errors: 0, Skipped: 0, Time elapsed: 0.002 s - in org.eclipse.jst.j2ee.ejb.test.CMRFieldTest
15:26:19 test_getRole(org.eclipse.jst.j2ee.ejb.test.CMRFieldTest)  Time elapsed: 0 s
15:26:19 test_setCollectionTypeName(org.eclipse.jst.j2ee.ejb.test.CMRFieldTest)  Time elapsed: 0.001 s
15:26:19 test_setCollectionType(org.eclipse.jst.j2ee.ejb.test.CMRFieldTest)  Time elapsed: 0 s
15:26:19 test_getCollectionType(org.eclipse.jst.j2ee.ejb.test.CMRFieldTest)  Time elapsed: 0 s
15:26:19 test_setRole(org.eclipse.jst.j2ee.ejb.test.CMRFieldTest)  Time elapsed: 0 s
15:26:19 test_getCollectionTypeName(org.eclipse.jst.j2ee.ejb.test.CMRFieldTest)  Time elapsed: 0 s
15:26:19 Running org.eclipse.jst.j2ee.ejb.test.MethodPermissionTest
15:26:19 Tests run: 5, Failures: 0, Errors: 0, Skipped: 0, Time elapsed: 0.002 s - in org.eclipse.jst.j2ee.ejb.test.MethodPermissionTest
15:26:19 test_MethodPermission(org.eclipse.jst.j2ee.ejb.test.MethodPermissionTest)  Time elapsed: 0 s
15:26:19 test_isEquivalent(org.eclipse.jst.j2ee.ejb.test.MethodPermissionTest)  Time elapsed: 0 s
15:26:19 test_hasSecurityRole(org.eclipse.jst.j2ee.ejb.test.MethodPermissionTest)  Time elapsed: 0 s
15:26:19 test_getSecurityRole(org.eclipse.jst.j2ee.ejb.test.MethodPermissionTest)  Time elapsed: 0.001 s
15:26:19 test_hasSecurityRole_2(org.eclipse.jst.j2ee.ejb.test.MethodPermissionTest)  Time elapsed: 0 s
15:26:19 Running org.eclipse.jst.j2ee.ejb.test.EJBRelationTest
15:26:19 Tests run: 6, Failures: 0, Errors: 0, Skipped: 0, Time elapsed: 0.002 s - in org.eclipse.jst.j2ee.ejb.test.EJBRelationTest
15:26:19 test_containsRelationshipRole(org.eclipse.jst.j2ee.ejb.test.EJBRelationTest)  Time elapsed: 0 s
15:26:19 test_getSecondRole(org.eclipse.jst.j2ee.ejb.test.EJBRelationTest)  Time elapsed: 0 s
15:26:19 test_getFirstRole(org.eclipse.jst.j2ee.ejb.test.EJBRelationTest)  Time elapsed: 0 s
15:26:19 test_getOppositeRole(org.eclipse.jst.j2ee.ejb.test.EJBRelationTest)  Time elapsed: 0 s
15:26:19 test_EJBRelation(org.eclipse.jst.j2ee.ejb.test.EJBRelationTest)  Time elapsed: 0 s
15:26:19 test_setFoward(org.eclipse.jst.j2ee.ejb.test.EJBRelationTest)  Time elapsed: 0 s
15:26:19 Running org.eclipse.jst.j2ee.ejb.test.ContainerManagedEntityTest
15:26:19 Tests run: 15, Failures: 0, Errors: 0, Skipped: 0, Time elapsed: 0.035 s - in org.eclipse.jst.j2ee.ejb.test.ContainerManagedEntityTest
15:26:19 test_isUnknownPrimaryKey(org.eclipse.jst.j2ee.ejb.test.ContainerManagedEntityTest)  Time elapsed: 0.001 s
15:26:19 test_addPersistentAttribute(org.eclipse.jst.j2ee.ejb.test.ContainerManagedEntityTest)  Time elapsed: 0.001 s
15:26:19 test_addKeyAttributeName(org.eclipse.jst.j2ee.ejb.test.ContainerManagedEntityTest)  Time elapsed: 0 s
15:26:19 test_getKeyAttribute(org.eclipse.jst.j2ee.ejb.test.ContainerManagedEntityTest)  Time elapsed: 0 s
15:26:19 test_isContainerManagedEntity(org.eclipse.jst.j2ee.ejb.test.ContainerManagedEntityTest)  Time elapsed: 0 s
15:26:19 test_getPrimaryKeyAttribute(org.eclipse.jst.j2ee.ejb.test.ContainerManagedEntityTest)  Time elapsed: 0 s
15:26:19 test_isVersion1_X(org.eclipse.jst.j2ee.ejb.test.ContainerManagedEntityTest)  Time elapsed: 0 s
15:26:19 test_isVersion2_X(org.eclipse.jst.j2ee.ejb.test.ContainerManagedEntityTest)  Time elapsed: 0 s
15:26:19 test_removePersistentAttribute_2(org.eclipse.jst.j2ee.ejb.test.ContainerManagedEntityTest)  Time elapsed: 0 s
15:26:19 test_listPersistentFieldNames(org.eclipse.jst.j2ee.ejb.test.ContainerManagedEntityTest)  Time elapsed: 0 s
15:26:19 test_isKeyAttribute(org.eclipse.jst.j2ee.ejb.test.ContainerManagedEntityTest)  Time elapsed: 0.001 s
15:26:19 test_getCMPVersionID(org.eclipse.jst.j2ee.ejb.test.ContainerManagedEntityTest)  Time elapsed: 0 s
15:26:19 test_setPrimKeyField(org.eclipse.jst.j2ee.ejb.test.ContainerManagedEntityTest)  Time elapsed: 0 s
15:26:19 test_addPersistentAttributeName(org.eclipse.jst.j2ee.ejb.test.ContainerManagedEntityTest)  Time elapsed: 0 s
15:26:19 test_removePersistentAttribute(org.eclipse.jst.j2ee.ejb.test.ContainerManagedEntityTest)  Time elapsed: 0 s
15:26:19 Running org.eclipse.jst.j2ee.ejb.test.EJBJarTest
15:26:19 Tests run: 15, Failures: 0, Errors: 0, Skipped: 0, Time elapsed: 0.007 s - in org.eclipse.jst.j2ee.ejb.test.EJBJarTest
15:26:19 test_EJBJar(org.eclipse.jst.j2ee.ejb.test.EJBJarTest)  Time elapsed: 0.001 s
15:26:19 test_containsContainerManagedBeans(org.eclipse.jst.j2ee.ejb.test.EJBJarTest)  Time elapsed: 0 s
15:26:19 test_containsSecurityRole(org.eclipse.jst.j2ee.ejb.test.EJBJarTest)  Time elapsed: 0.001 s
15:26:19 test_getBeanManagedBeans(org.eclipse.jst.j2ee.ejb.test.EJBJarTest)  Time elapsed: 0 s
15:26:19 test_getContainerManagedBeans(org.eclipse.jst.j2ee.ejb.test.EJBJarTest)  Time elapsed: 0 s
15:26:19 test_getEJB11ContainerManagedBeans(org.eclipse.jst.j2ee.ejb.test.EJBJarTest)  Time elapsed: 0 s
15:26:19 test_getEJB20ContainerManagedBeans(org.eclipse.jst.j2ee.ejb.test.EJBJarTest)  Time elapsed: 0 s
15:26:19 test_getMessageDrivenBeans(org.eclipse.jst.j2ee.ejb.test.EJBJarTest)  Time elapsed: 0 s
15:26:19 test_getEjbRelations(org.eclipse.jst.j2ee.ejb.test.EJBJarTest)  Time elapsed: 0 s
15:26:19 test_getEnterpiseBeanFromRef(org.eclipse.jst.j2ee.ejb.test.EJBJarTest)  Time elapsed: 0 s
15:26:19 test_getEnterpriseBeanNamed(org.eclipse.jst.j2ee.ejb.test.EJBJarTest)  Time elapsed: 0 s
15:26:19 test_getEnterpriseBeansWithReference(org.eclipse.jst.j2ee.ejb.test.EJBJarTest)  Time elapsed: 0 s
15:26:19 test_getEnterpriseBeanWithReference(org.eclipse.jst.j2ee.ejb.test.EJBJarTest)  Time elapsed: 0 s
15:26:19 test_getSessionBeans(org.eclipse.jst.j2ee.ejb.test.EJBJarTest)  Time elapsed: 0.001 s
15:26:19 test_getEJBRelation(org.eclipse.jst.j2ee.ejb.test.EJBJarTest)  Time elapsed: 0 s
15:26:19 Running org.eclipse.jst.j2ee.ejb.test.QueryMethodTest
15:26:19 Tests run: 1, Failures: 0, Errors: 0, Skipped: 0, Time elapsed: 0.371 s - in org.eclipse.jst.j2ee.ejb.test.QueryMethodTest
15:26:19 test_getClientTypeJavaClasses(org.eclipse.jst.j2ee.ejb.test.QueryMethodTest)  Time elapsed: 0.371 s
15:26:19 Running org.eclipse.jst.j2ee.ejb.test.QueryTest
15:26:19 Tests run: 3, Failures: 0, Errors: 0, Skipped: 0, Time elapsed: 0.003 s - in org.eclipse.jst.j2ee.ejb.test.QueryTest
15:26:19 test_isRemoteResultMapping(org.eclipse.jst.j2ee.ejb.test.QueryTest)  Time elapsed: 0 s
15:26:19 test_isLocalResultMapping(org.eclipse.jst.j2ee.ejb.test.QueryTest)  Time elapsed: 0 s
15:26:19 test_Query(org.eclipse.jst.j2ee.ejb.test.QueryTest)  Time elapsed: 0 s
15:26:19 Running org.eclipse.jst.j2ee.ejb.test.CMPAttributeTest
15:26:19 Tests run: 10, Failures: 0, Errors: 0, Skipped: 0, Time elapsed: 0.003 s - in org.eclipse.jst.j2ee.ejb.test.CMPAttributeTest
15:26:19 test_getSetterName(org.eclipse.jst.j2ee.ejb.test.CMPAttributeTest)  Time elapsed: 0 s
15:26:19 test_getType(org.eclipse.jst.j2ee.ejb.test.CMPAttributeTest)  Time elapsed: 0 s
15:26:19 test_getOriginatingType(org.eclipse.jst.j2ee.ejb.test.CMPAttributeTest)  Time elapsed: 0.001 s
15:26:19 test_setDerived(org.eclipse.jst.j2ee.ejb.test.CMPAttributeTest)  Time elapsed: 0 s
15:26:19 test_setOriginatingType(org.eclipse.jst.j2ee.ejb.test.CMPAttributeTest)  Time elapsed: 0 s
15:26:19 test_isCMRField(org.eclipse.jst.j2ee.ejb.test.CMPAttributeTest)  Time elapsed: 0 s
15:26:19 test_getGetterName(org.eclipse.jst.j2ee.ejb.test.CMPAttributeTest)  Time elapsed: 0 s
15:26:19 test_isDerived(org.eclipse.jst.j2ee.ejb.test.CMPAttributeTest)  Time elapsed: 0 s
15:26:19 test_isKey(org.eclipse.jst.j2ee.ejb.test.CMPAttributeTest)  Time elapsed: 0 s
15:26:19 test_isPrimKeyField(org.eclipse.jst.j2ee.ejb.test.CMPAttributeTest)  Time elapsed: 0.001 s
15:26:19 Running org.eclipse.jst.j2ee.ejb.test.EntityTest
15:26:19 Tests run: 2, Failures: 0, Errors: 0, Skipped: 0, Time elapsed: 0.597 s - in org.eclipse.jst.j2ee.ejb.test.EntityTest
15:26:20 test_setPrimaryKeyName(org.eclipse.jst.j2ee.ejb.test.EntityTest)  Time elapsed: 0.314 s
15:26:20 test_getPrimaryKeyName(org.eclipse.jst.j2ee.ejb.test.EntityTest)  Time elapsed: 0.283 s
15:26:20 Running org.eclipse.jst.j2ee.ejb.test.MethodElementTest
15:26:20 Tests run: 21, Failures: 0, Errors: 0, Skipped: 0, Time elapsed: 0.298 s - in org.eclipse.jst.j2ee.ejb.test.MethodElementTest
15:26:20 test_initializeFromSignature(org.eclipse.jst.j2ee.ejb.test.MethodElementTest)  Time elapsed: 0 s
15:26:20 test_applyZeroParams(org.eclipse.jst.j2ee.ejb.test.MethodElementTest)  Time elapsed: 0 s
15:26:20 test_equalSignature(org.eclipse.jst.j2ee.ejb.test.MethodElementTest)  Time elapsed: 0 s
15:26:20 test_isRemote(org.eclipse.jst.j2ee.ejb.test.MethodElementTest)  Time elapsed: 0.001 s
15:26:20 test_getTypeJavaClass(org.eclipse.jst.j2ee.ejb.test.MethodElementTest)  Time elapsed: 0.289 s
15:26:20 test_isHome(org.eclipse.jst.j2ee.ejb.test.MethodElementTest)  Time elapsed: 0 s
15:26:20 test_getSignature(org.eclipse.jst.j2ee.ejb.test.MethodElementTest)  Time elapsed: 0 s
15:26:20 test_nameAndParamsEquals(org.eclipse.jst.j2ee.ejb.test.MethodElementTest)  Time elapsed: 0.002 s
15:26:20 test_isLocalHome(org.eclipse.jst.j2ee.ejb.test.MethodElementTest)  Time elapsed: 0 s
15:26:20 test_isUnspecified(org.eclipse.jst.j2ee.ejb.test.MethodElementTest)  Time elapsed: 0 s
15:26:20 test_isEquivalent(org.eclipse.jst.j2ee.ejb.test.MethodElementTest)  Time elapsed: 0 s
15:26:20 test_MethodElement(org.eclipse.jst.j2ee.ejb.test.MethodElementTest)  Time elapsed: 0 s
15:26:20 test_hasMethodParams(org.eclipse.jst.j2ee.ejb.test.MethodElementTest)  Time elapsed: 0 s
15:26:20 test_isLocal(org.eclipse.jst.j2ee.ejb.test.MethodElementTest)  Time elapsed: 0 s
15:26:20 test_isValid(org.eclipse.jst.j2ee.ejb.test.MethodElementTest)  Time elapsed: 0.001 s
15:26:20 test_getMethodParams(org.eclipse.jst.j2ee.ejb.test.MethodElementTest)  Time elapsed: 0 s
15:26:20 test_isDefault(org.eclipse.jst.j2ee.ejb.test.MethodElementTest)  Time elapsed: 0 s
15:26:20 test_addMethodParams(org.eclipse.jst.j2ee.ejb.test.MethodElementTest)  Time elapsed: 0 s
15:26:20 test_removeMethodParams(org.eclipse.jst.j2ee.ejb.test.MethodElementTest)  Time elapsed: 0 s
15:26:20 testEJBJarPopulation(org.eclipse.jst.j2ee.ejb.test.MethodElementTest)  Time elapsed: 0 s
15:26:20 test14EJBJarPopulation(org.eclipse.jst.j2ee.ejb.test.MethodElementTest)  Time elapsed: 0.001 s
15:26:20 Running org.eclipse.jst.j2ee.ejb.test.EJBRelationshipRoleTest
15:26:20 Tests run: 13, Failures: 0, Errors: 0, Skipped: 0, Time elapsed: 0.005 s - in org.eclipse.jst.j2ee.ejb.test.EJBRelationshipRoleTest
15:26:20 test_isNavigable(org.eclipse.jst.j2ee.ejb.test.EJBRelationshipRoleTest)  Time elapsed: 0 s
15:26:20 test_getLogicalName(org.eclipse.jst.j2ee.ejb.test.EJBRelationshipRoleTest)  Time elapsed: 0 s
15:26:20 test_getName(org.eclipse.jst.j2ee.ejb.test.EJBRelationshipRoleTest)  Time elapsed: 0 s
15:26:20 test_isForward(org.eclipse.jst.j2ee.ejb.test.EJBRelationshipRoleTest)  Time elapsed: 0 s
15:26:20 test_isMany(org.eclipse.jst.j2ee.ejb.test.EJBRelationshipRoleTest)  Time elapsed: 0.001 s
15:26:20 test_setKey(org.eclipse.jst.j2ee.ejb.test.EJBRelationshipRoleTest)  Time elapsed: 0.001 s
15:26:20 test_EJBRelationshipRole(org.eclipse.jst.j2ee.ejb.test.EJBRelationshipRoleTest)  Time elapsed: 0.001 s
15:26:20 test_setFoward(org.eclipse.jst.j2ee.ejb.test.EJBRelationshipRoleTest)  Time elapsed: 0 s
15:26:20 test_setName(org.eclipse.jst.j2ee.ejb.test.EJBRelationshipRoleTest)  Time elapsed: 0 s
15:26:20 test_getSourceEntity(org.eclipse.jst.j2ee.ejb.test.EJBRelationshipRoleTest)  Time elapsed: 0 s
15:26:20 test_setRequired(org.eclipse.jst.j2ee.ejb.test.EJBRelationshipRoleTest)  Time elapsed: 0 s
15:26:20 test_isKey(org.eclipse.jst.j2ee.ejb.test.EJBRelationshipRoleTest)  Time elapsed: 0 s
15:26:20 test_getOpposite(org.eclipse.jst.j2ee.ejb.test.EJBRelationshipRoleTest)  Time elapsed: 0 s
15:26:20 Running org.eclipse.jst.j2ee.ejb.test.AssemblyDescriptorTest
15:26:20 Tests run: 5, Failures: 0, Errors: 0, Skipped: 0, Time elapsed: 1.392 s - in org.eclipse.jst.j2ee.ejb.test.AssemblyDescriptorTest
15:26:21 test_getMethodPermissionMethodElements(org.eclipse.jst.j2ee.ejb.test.AssemblyDescriptorTest)  Time elapsed: 0.263 s
15:26:21 test_getMethodTransactionMethodElements(org.eclipse.jst.j2ee.ejb.test.AssemblyDescriptorTest)  Time elapsed: 0.263 s
15:26:21 test_getSecurityRoleNamed(org.eclipse.jst.j2ee.ejb.test.AssemblyDescriptorTest)  Time elapsed: 0.322 s
15:26:21 test_renameSecurityRole(org.eclipse.jst.j2ee.ejb.test.AssemblyDescriptorTest)  Time elapsed: 0.259 s
15:26:21 test_removeData(org.eclipse.jst.j2ee.ejb.test.AssemblyDescriptorTest)  Time elapsed: 0.284 s
15:26:21 Running org.eclipse.jst.j2ee.ejb.test.MethodTransactionTest
15:26:21 Tests run: 2, Failures: 0, Errors: 0, Skipped: 0, Time elapsed: 0.38 s - in org.eclipse.jst.j2ee.ejb.test.MethodTransactionTest
15:26:22 test_isEquivalent(org.eclipse.jst.j2ee.ejb.test.MethodTransactionTest)  Time elapsed: 0.001 s
15:26:22 test_getMethodElements(org.eclipse.jst.j2ee.ejb.test.MethodTransactionTest)  Time elapsed: 0.379 s
15:26:22 Running org.eclipse.jst.j2ee.ejb.test.SessionTest
15:26:22 Tests run: 3, Failures: 0, Errors: 0, Skipped: 0, Time elapsed: 0.001 s - in org.eclipse.jst.j2ee.ejb.test.SessionTest
15:26:22 test_hasServiceEndpoint(org.eclipse.jst.j2ee.ejb.test.SessionTest)  Time elapsed: 0.001 s
15:26:22 test_getServiceEndpointName(org.eclipse.jst.j2ee.ejb.test.SessionTest)  Time elapsed: 0 s
15:26:22 test_setServiceEndpointName(org.eclipse.jst.j2ee.ejb.test.SessionTest)  Time elapsed: 0 s
15:26:22 Running org.eclipse.jst.j2ee.ejb.test.EjbFactoryTest
15:26:22 Tests run: 26, Failures: 0, Errors: 0, Skipped: 0, Time elapsed: 0.006 s - in org.eclipse.jst.j2ee.ejb.test.EjbFactoryTest
15:26:22 test_createActivationConfig(org.eclipse.jst.j2ee.ejb.test.EjbFactoryTest)  Time elapsed: 0 s
15:26:22 test_createExcludeList(org.eclipse.jst.j2ee.ejb.test.EjbFactoryTest)  Time elapsed: 0 s
15:26:22 test_createEJBRelationshipRole(org.eclipse.jst.j2ee.ejb.test.EjbFactoryTest)  Time elapsed: 0 s
15:26:22 test_createContainerManagedEntity(org.eclipse.jst.j2ee.ejb.test.EjbFactoryTest)  Time elapsed: 0 s
15:26:22 test_createMessageDrivenDestination(org.eclipse.jst.j2ee.ejb.test.EjbFactoryTest)  Time elapsed: 0 s
15:26:22 test_createMethodElement_2(org.eclipse.jst.j2ee.ejb.test.EjbFactoryTest)  Time elapsed: 0 s
15:26:22 test_createCMPAttribute(org.eclipse.jst.j2ee.ejb.test.EjbFactoryTest)  Time elapsed: 0 s
15:26:22 test_createSession(org.eclipse.jst.j2ee.ejb.test.EjbFactoryTest)  Time elapsed: 0 s
15:26:22 test_createMethodElementFrom(org.eclipse.jst.j2ee.ejb.test.EjbFactoryTest)  Time elapsed: 0.001 s
15:26:22 test_createEJBRelation(org.eclipse.jst.j2ee.ejb.test.EjbFactoryTest)  Time elapsed: 0 s
15:26:22 test_createMethodElementFrom_2(org.eclipse.jst.j2ee.ejb.test.EjbFactoryTest)  Time elapsed: 0 s
15:26:22 test_EjbFactory(org.eclipse.jst.j2ee.ejb.test.EjbFactoryTest)  Time elapsed: 0 s
15:26:22 test_createQuery(org.eclipse.jst.j2ee.ejb.test.EjbFactoryTest)  Time elapsed: 0 s
15:26:22 test_createQueryMethod(org.eclipse.jst.j2ee.ejb.test.EjbFactoryTest)  Time elapsed: 0 s
15:26:22 test_createActivationConfigProperty(org.eclipse.jst.j2ee.ejb.test.EjbFactoryTest)  Time elapsed: 0 s
15:26:22 test_createEJBJar(org.eclipse.jst.j2ee.ejb.test.EjbFactoryTest)  Time elapsed: 0 s
15:26:22 test_createMethodPermission(org.eclipse.jst.j2ee.ejb.test.EjbFactoryTest)  Time elapsed: 0 s
15:26:22 test_createEntity(org.eclipse.jst.j2ee.ejb.test.EjbFactoryTest)  Time elapsed: 0 s
15:26:22 test_createRelationships(org.eclipse.jst.j2ee.ejb.test.EjbFactoryTest)  Time elapsed: 0 s
15:26:22 test_createEJBMethodCategory(org.eclipse.jst.j2ee.ejb.test.EjbFactoryTest)  Time elapsed: 0 s
15:26:22 test_createMethodTransaction(org.eclipse.jst.j2ee.ejb.test.EjbFactoryTest)  Time elapsed: 0 s
15:26:22 test_createMethodElement(org.eclipse.jst.j2ee.ejb.test.EjbFactoryTest)  Time elapsed: 0 s
15:26:22 test_createAssemblyDescriptor(org.eclipse.jst.j2ee.ejb.test.EjbFactoryTest)  Time elapsed: 0 s
15:26:22 test_createRoleSource(org.eclipse.jst.j2ee.ejb.test.EjbFactoryTest)  Time elapsed: 0 s
15:26:22 test_createCMRField(org.eclipse.jst.j2ee.ejb.test.EjbFactoryTest)  Time elapsed: 0 s
15:26:22 test_createMessageDriven(org.eclipse.jst.j2ee.ejb.test.EjbFactoryTest)  Time elapsed: 0 s
15:26:22 Running org.eclipse.jst.j2ee.common.tests.CommonTests
15:26:22 Tests run: 0, Failures: 0, Errors: 0, Skipped: 0, Time elapsed: 0 s - in org.eclipse.jst.j2ee.common.tests.CommonTests
15:26:22 Running org.eclipse.jst.j2ee.common.test.QNameTest
15:26:22 Tests run: 1, Failures: 0, Errors: 0, Skipped: 0, Time elapsed: 0.001 s - in org.eclipse.jst.j2ee.common.test.QNameTest
15:26:22 test_setValues(org.eclipse.jst.j2ee.common.test.QNameTest)  Time elapsed: 0 s
15:26:22 Running org.eclipse.jst.j2ee.common.test.ListenerTest
15:26:22 Tests run: 2, Failures: 0, Errors: 0, Skipped: 0, Time elapsed: 0.001 s - in org.eclipse.jst.j2ee.common.test.ListenerTest
15:26:22 test_setListenerClassName(org.eclipse.jst.j2ee.common.test.ListenerTest)  Time elapsed: 0 s
15:26:22 test_getListenerClassName(org.eclipse.jst.j2ee.common.test.ListenerTest)  Time elapsed: 0 s
15:26:22 Running org.eclipse.jst.j2ee.common.test.EjbRefTest
15:26:22 Tests run: 5, Failures: 0, Errors: 0, Skipped: 0, Time elapsed: 0.002 s - in org.eclipse.jst.j2ee.common.test.EjbRefTest
15:26:22 test_isLinked(org.eclipse.jst.j2ee.common.test.EjbRefTest)  Time elapsed: 0 s
15:26:22 test_EjbRef(org.eclipse.jst.j2ee.common.test.EjbRefTest)  Time elapsed: 0 s
15:26:22 test_isEquivalent(org.eclipse.jst.j2ee.common.test.EjbRefTest)  Time elapsed: 0.001 s
15:26:22 test_isLocal(org.eclipse.jst.j2ee.common.test.EjbRefTest)  Time elapsed: 0 s
15:26:22 test_getLinkedEjb(org.eclipse.jst.j2ee.common.test.EjbRefTest)  Time elapsed: 0 s
15:26:22 Running org.eclipse.jst.j2ee.common.test.CommonFactoryTest
15:26:22 Tests run: 22, Failures: 0, Errors: 0, Skipped: 0, Time elapsed: 0.003 s - in org.eclipse.jst.j2ee.common.test.CommonFactoryTest
15:26:22 test_createCompatibilityDescriptionGroup(org.eclipse.jst.j2ee.common.test.CommonFactoryTest)  Time elapsed: 0 s
15:26:22 test_createUseCallerIdentity(org.eclipse.jst.j2ee.common.test.CommonFactoryTest)  Time elapsed: 0 s
15:26:22 test_createDescriptionGroup(org.eclipse.jst.j2ee.common.test.CommonFactoryTest)  Time elapsed: 0 s
15:26:22 test_createIconType(org.eclipse.jst.j2ee.common.test.CommonFactoryTest)  Time elapsed: 0 s
15:26:22 test_createResourceRef(org.eclipse.jst.j2ee.common.test.CommonFactoryTest)  Time elapsed: 0 s
15:26:22 test_createDisplayName(org.eclipse.jst.j2ee.common.test.CommonFactoryTest)  Time elapsed: 0 s
15:26:22 test_createIdentity(org.eclipse.jst.j2ee.common.test.CommonFactoryTest)  Time elapsed: 0 s
15:26:22 test_createSecurityIdentity(org.eclipse.jst.j2ee.common.test.CommonFactoryTest)  Time elapsed: 0 s
15:26:22 test_createResourceEnvRef(org.eclipse.jst.j2ee.common.test.CommonFactoryTest)  Time elapsed: 0.001 s
15:26:22 test_createDescription(org.eclipse.jst.j2ee.common.test.CommonFactoryTest)  Time elapsed: 0 s
15:26:22 test_createQName(org.eclipse.jst.j2ee.common.test.CommonFactoryTest)  Time elapsed: 0 s
15:26:22 test_CommonFactory(org.eclipse.jst.j2ee.common.test.CommonFactoryTest)  Time elapsed: 0 s
15:26:22 test_createParamValue(org.eclipse.jst.j2ee.common.test.CommonFactoryTest)  Time elapsed: 0 s
15:26:22 test_createEjbRef(org.eclipse.jst.j2ee.common.test.CommonFactoryTest)  Time elapsed: 0 s
15:26:22 test_createListener(org.eclipse.jst.j2ee.common.test.CommonFactoryTest)  Time elapsed: 0 s
15:26:22 test_createMessageDestination(org.eclipse.jst.j2ee.common.test.CommonFactoryTest)  Time elapsed: 0 s
15:26:22 test_createEnvEntry(org.eclipse.jst.j2ee.common.test.CommonFactoryTest)  Time elapsed: 0 s
15:26:22 test_createSecurityRole(org.eclipse.jst.j2ee.common.test.CommonFactoryTest)  Time elapsed: 0 s
15:26:22 test_createMessageDestinationRef(org.eclipse.jst.j2ee.common.test.CommonFactoryTest)  Time elapsed: 0 s
15:26:22 test_createEJBLocalRef(org.eclipse.jst.j2ee.common.test.CommonFactoryTest)  Time elapsed: 0 s
15:26:22 test_createSecurityRoleRef(org.eclipse.jst.j2ee.common.test.CommonFactoryTest)  Time elapsed: 0 s
15:26:22 test_createRunAsSpecifiedIdentity(org.eclipse.jst.j2ee.common.test.CommonFactoryTest)  Time elapsed: 0 s
15:26:22 Running org.eclipse.jst.j2ee.webservice.wsdd.test.WsddFactoryTest
15:26:22 Tests run: 9, Failures: 0, Errors: 0, Skipped: 0, Time elapsed: 0.002 s - in org.eclipse.jst.j2ee.webservice.wsdd.test.WsddFactoryTest
15:26:22 test_createEJBLink(org.eclipse.jst.j2ee.webservice.wsdd.test.WsddFactoryTest)  Time elapsed: 0 s
15:26:22 test_createWSDLPort(org.eclipse.jst.j2ee.webservice.wsdd.test.WsddFactoryTest)  Time elapsed: 0 s
15:26:22 test_createPortComponent(org.eclipse.jst.j2ee.webservice.wsdd.test.WsddFactoryTest)  Time elapsed: 0 s
15:26:22 test_createServiceImplBean(org.eclipse.jst.j2ee.webservice.wsdd.test.WsddFactoryTest)  Time elapsed: 0 s
15:26:22 test_createWebServices(org.eclipse.jst.j2ee.webservice.wsdd.test.WsddFactoryTest)  Time elapsed: 0 s
15:26:22 test_createBeanLink(org.eclipse.jst.j2ee.webservice.wsdd.test.WsddFactoryTest)  Time elapsed: 0 s
15:26:22 test_createWebServiceDescription(org.eclipse.jst.j2ee.webservice.wsdd.test.WsddFactoryTest)  Time elapsed: 0 s
15:26:22 test_createHandler(org.eclipse.jst.j2ee.webservice.wsdd.test.WsddFactoryTest)  Time elapsed: 0 s
15:26:22 test_createServletLink(org.eclipse.jst.j2ee.webservice.wsdd.test.WsddFactoryTest)  Time elapsed: 0 s
15:26:22 Running org.eclipse.jst.j2ee.webservice.wscommon.test.WscommonFactoryTest
15:26:22 Tests run: 7, Failures: 0, Errors: 0, Skipped: 0, Time elapsed: 0.003 s - in org.eclipse.jst.j2ee.webservice.wscommon.test.WscommonFactoryTest
15:26:22 test_createSOAPHeader(org.eclipse.jst.j2ee.webservice.wscommon.test.WscommonFactoryTest)  Time elapsed: 0 s
15:26:22 test_createDisplayNameType(org.eclipse.jst.j2ee.webservice.wscommon.test.WscommonFactoryTest)  Time elapsed: 0 s
15:26:22 test_getWscommonPackage(org.eclipse.jst.j2ee.webservice.wscommon.test.WscommonFactoryTest)  Time elapsed: 0 s
15:26:22 test_createDescriptionType(org.eclipse.jst.j2ee.webservice.wscommon.test.WscommonFactoryTest)  Time elapsed: 0 s
15:26:22 test_createPortName(org.eclipse.jst.j2ee.webservice.wscommon.test.WscommonFactoryTest)  Time elapsed: 0.001 s
15:26:22 test_createSOAPRole(org.eclipse.jst.j2ee.webservice.wscommon.test.WscommonFactoryTest)  Time elapsed: 0 s
15:26:22 test_createInitParam(org.eclipse.jst.j2ee.webservice.wscommon.test.WscommonFactoryTest)  Time elapsed: 0 s
15:26:22 Running org.eclipse.jst.j2ee.core.tests.api.AllAPITest
15:26:22 Tests run: 243, Failures: 0, Errors: 0, Skipped: 0, Time elapsed: 2.589 s - in org.eclipse.jst.j2ee.core.tests.api.AllAPITest
15:26:24 test_createEjbModule(org.eclipse.jst.j2ee.application.test.ApplicationFactoryTest)  Time elapsed: 0 s
15:26:24 test_createApplication(org.eclipse.jst.j2ee.application.test.ApplicationFactoryTest)  Time elapsed: 0 s
15:26:24 test_createConnectorModule(org.eclipse.jst.j2ee.application.test.ApplicationFactoryTest)  Time elapsed: 0 s
15:26:24 test_createWebModule(org.eclipse.jst.j2ee.application.test.ApplicationFactoryTest)  Time elapsed: 0 s
15:26:24 test_createJavaClientModule(org.eclipse.jst.j2ee.application.test.ApplicationFactoryTest)  Time elapsed: 0 s
15:26:24 test_createModule(org.eclipse.jst.j2ee.application.test.ApplicationFactoryTest)  Time elapsed: 0 s
15:26:24 test_getVersionID(org.eclipse.jst.j2ee.application.test.ApplicationTest)  Time elapsed: 0.033 s
15:26:24 test_getJ2EEVersionID(org.eclipse.jst.j2ee.application.test.ApplicationTest)  Time elapsed: 0.001 s
15:26:24 test_getSecurityRoleNamed(org.eclipse.jst.j2ee.application.test.ApplicationTest)  Time elapsed: 0 s
15:26:24 test_getModuleHavingAltDD(org.eclipse.jst.j2ee.application.test.ApplicationTest)  Time elapsed: 0 s
15:26:24 test_containsSecurityRole(org.eclipse.jst.j2ee.application.test.ApplicationTest)  Time elapsed: 0.001 s
15:26:24 test_getModule_2(org.eclipse.jst.j2ee.application.test.ApplicationTest)  Time elapsed: 0 s
15:26:24 test_getFirstModule(org.eclipse.jst.j2ee.application.test.ApplicationTest)  Time elapsed: 0 s
15:26:24 test_getVersionID(org.eclipse.jst.j2ee.client.test.ApplicationClientTest)  Time elapsed: 0.011 s
15:26:24 test_getJ2EEVersionID(org.eclipse.jst.j2ee.client.test.ApplicationClientTest)  Time elapsed: 0.011 s
15:26:24 test_getCallbackHandlerClassName(org.eclipse.jst.j2ee.client.test.ApplicationClientTest)  Time elapsed: 0 s
15:26:24 test_setCallbackHandlerClassName(org.eclipse.jst.j2ee.client.test.ApplicationClientTest)  Time elapsed: 0 s
15:26:24 test_ClientFactory(org.eclipse.jst.j2ee.client.test.ClientFactoryTest)  Time elapsed: 0 s
15:26:24 test_createApplicationClient(org.eclipse.jst.j2ee.client.test.ClientFactoryTest)  Time elapsed: 0 s
15:26:24 test_createCompatibilityDescriptionGroup(org.eclipse.jst.j2ee.common.test.CommonFactoryTest)  Time elapsed: 0 s
15:26:24 test_createUseCallerIdentity(org.eclipse.jst.j2ee.common.test.CommonFactoryTest)  Time elapsed: 0 s
15:26:24 test_createDescriptionGroup(org.eclipse.jst.j2ee.common.test.CommonFactoryTest)  Time elapsed: 0 s
15:26:24 test_createIconType(org.eclipse.jst.j2ee.common.test.CommonFactoryTest)  Time elapsed: 0 s
15:26:24 test_createResourceRef(org.eclipse.jst.j2ee.common.test.CommonFactoryTest)  Time elapsed: 0 s
15:26:24 test_createDisplayName(org.eclipse.jst.j2ee.common.test.CommonFactoryTest)  Time elapsed: 0 s
15:26:24 test_createIdentity(org.eclipse.jst.j2ee.common.test.CommonFactoryTest)  Time elapsed: 0 s
15:26:24 test_createSecurityIdentity(org.eclipse.jst.j2ee.common.test.CommonFactoryTest)  Time elapsed: 0 s
15:26:24 test_createResourceEnvRef(org.eclipse.jst.j2ee.common.test.CommonFactoryTest)  Time elapsed: 0 s
15:26:24 test_createDescription(org.eclipse.jst.j2ee.common.test.CommonFactoryTest)  Time elapsed: 0 s
15:26:24 test_createQName(org.eclipse.jst.j2ee.common.test.CommonFactoryTest)  Time elapsed: 0 s
15:26:24 test_CommonFactory(org.eclipse.jst.j2ee.common.test.CommonFactoryTest)  Time elapsed: 0 s
15:26:24 test_createParamValue(org.eclipse.jst.j2ee.common.test.CommonFactoryTest)  Time elapsed: 0 s
15:26:24 test_createEjbRef(org.eclipse.jst.j2ee.common.test.CommonFactoryTest)  Time elapsed: 0 s
15:26:24 test_createListener(org.eclipse.jst.j2ee.common.test.CommonFactoryTest)  Time elapsed: 0 s
15:26:24 test_createMessageDestination(org.eclipse.jst.j2ee.common.test.CommonFactoryTest)  Time elapsed: 0 s
15:26:24 test_createEnvEntry(org.eclipse.jst.j2ee.common.test.CommonFactoryTest)  Time elapsed: 0 s
15:26:24 test_createSecurityRole(org.eclipse.jst.j2ee.common.test.CommonFactoryTest)  Time elapsed: 0 s
15:26:24 test_createMessageDestinationRef(org.eclipse.jst.j2ee.common.test.CommonFactoryTest)  Time elapsed: 0 s
15:26:24 test_createEJBLocalRef(org.eclipse.jst.j2ee.common.test.CommonFactoryTest)  Time elapsed: 0 s
15:26:24 test_createSecurityRoleRef(org.eclipse.jst.j2ee.common.test.CommonFactoryTest)  Time elapsed: 0 s
15:26:24 test_createRunAsSpecifiedIdentity(org.eclipse.jst.j2ee.common.test.CommonFactoryTest)  Time elapsed: 0 s
15:26:24 test_isLinked(org.eclipse.jst.j2ee.common.test.EjbRefTest)  Time elapsed: 0 s
15:26:24 test_EjbRef(org.eclipse.jst.j2ee.common.test.EjbRefTest)  Time elapsed: 0 s
15:26:24 test_isEquivalent(org.eclipse.jst.j2ee.common.test.EjbRefTest)  Time elapsed: 0 s
15:26:24 test_isLocal(org.eclipse.jst.j2ee.common.test.EjbRefTest)  Time elapsed: 0 s
15:26:24 test_getLinkedEjb(org.eclipse.jst.j2ee.common.test.EjbRefTest)  Time elapsed: 0 s
15:26:24 test_setListenerClassName(org.eclipse.jst.j2ee.common.test.ListenerTest)  Time elapsed: 0 s
15:26:24 test_getListenerClassName(org.eclipse.jst.j2ee.common.test.ListenerTest)  Time elapsed: 0 s
15:26:24 test_setValues(org.eclipse.jst.j2ee.common.test.QNameTest)  Time elapsed: 0 s
15:26:24 test_getMethodPermissionMethodElements(org.eclipse.jst.j2ee.ejb.test.AssemblyDescriptorTest)  Time elapsed: 0.287 s
15:26:24 test_getMethodTransactionMethodElements(org.eclipse.jst.j2ee.ejb.test.AssemblyDescriptorTest)  Time elapsed: 0.298 s
15:26:24 test_getSecurityRoleNamed(org.eclipse.jst.j2ee.ejb.test.AssemblyDescriptorTest)  Time elapsed: 0.271 s
15:26:24 test_renameSecurityRole(org.eclipse.jst.j2ee.ejb.test.AssemblyDescriptorTest)  Time elapsed: 0.274 s
15:26:24 test_removeData(org.eclipse.jst.j2ee.ejb.test.AssemblyDescriptorTest)  Time elapsed: 0.3 s
15:26:24 test_getSetterName(org.eclipse.jst.j2ee.ejb.test.CMPAttributeTest)  Time elapsed: 0 s
15:26:24 test_getType(org.eclipse.jst.j2ee.ejb.test.CMPAttributeTest)  Time elapsed: 0 s
15:26:24 test_getOriginatingType(org.eclipse.jst.j2ee.ejb.test.CMPAttributeTest)  Time elapsed: 0 s
15:26:24 test_setDerived(org.eclipse.jst.j2ee.ejb.test.CMPAttributeTest)  Time elapsed: 0 s
15:26:24 test_setOriginatingType(org.eclipse.jst.j2ee.ejb.test.CMPAttributeTest)  Time elapsed: 0 s
15:26:24 test_isCMRField(org.eclipse.jst.j2ee.ejb.test.CMPAttributeTest)  Time elapsed: 0 s
15:26:24 test_getGetterName(org.eclipse.jst.j2ee.ejb.test.CMPAttributeTest)  Time elapsed: 0 s
15:26:24 test_isDerived(org.eclipse.jst.j2ee.ejb.test.CMPAttributeTest)  Time elapsed: 0 s
15:26:24 test_isKey(org.eclipse.jst.j2ee.ejb.test.CMPAttributeTest)  Time elapsed: 0 s
15:26:24 test_isPrimKeyField(org.eclipse.jst.j2ee.ejb.test.CMPAttributeTest)  Time elapsed: 0 s
15:26:24 test_getRole(org.eclipse.jst.j2ee.ejb.test.CMRFieldTest)  Time elapsed: 0 s
15:26:24 test_setCollectionTypeName(org.eclipse.jst.j2ee.ejb.test.CMRFieldTest)  Time elapsed: 0 s
15:26:24 test_setCollectionType(org.eclipse.jst.j2ee.ejb.test.CMRFieldTest)  Time elapsed: 0 s
15:26:24 test_getCollectionType(org.eclipse.jst.j2ee.ejb.test.CMRFieldTest)  Time elapsed: 0 s
15:26:24 test_setRole(org.eclipse.jst.j2ee.ejb.test.CMRFieldTest)  Time elapsed: 0 s
15:26:24 test_getCollectionTypeName(org.eclipse.jst.j2ee.ejb.test.CMRFieldTest)  Time elapsed: 0 s
15:26:24 test_isUnknownPrimaryKey(org.eclipse.jst.j2ee.ejb.test.ContainerManagedEntityTest)  Time elapsed: 0 s
15:26:24 test_addPersistentAttribute(org.eclipse.jst.j2ee.ejb.test.ContainerManagedEntityTest)  Time elapsed: 0 s
15:26:24 test_addKeyAttributeName(org.eclipse.jst.j2ee.ejb.test.ContainerManagedEntityTest)  Time elapsed: 0 s
15:26:24 test_getKeyAttribute(org.eclipse.jst.j2ee.ejb.test.ContainerManagedEntityTest)  Time elapsed: 0 s
15:26:24 test_isContainerManagedEntity(org.eclipse.jst.j2ee.ejb.test.ContainerManagedEntityTest)  Time elapsed: 0 s
15:26:24 test_getPrimaryKeyAttribute(org.eclipse.jst.j2ee.ejb.test.ContainerManagedEntityTest)  Time elapsed: 0 s
15:26:24 test_isVersion1_X(org.eclipse.jst.j2ee.ejb.test.ContainerManagedEntityTest)  Time elapsed: 0.001 s
15:26:24 test_isVersion2_X(org.eclipse.jst.j2ee.ejb.test.ContainerManagedEntityTest)  Time elapsed: 0 s
15:26:24 test_removePersistentAttribute_2(org.eclipse.jst.j2ee.ejb.test.ContainerManagedEntityTest)  Time elapsed: 0 s
15:26:24 test_listPersistentFieldNames(org.eclipse.jst.j2ee.ejb.test.ContainerManagedEntityTest)  Time elapsed: 0 s
15:26:24 test_isKeyAttribute(org.eclipse.jst.j2ee.ejb.test.ContainerManagedEntityTest)  Time elapsed: 0 s
15:26:24 test_getCMPVersionID(org.eclipse.jst.j2ee.ejb.test.ContainerManagedEntityTest)  Time elapsed: 0 s
15:26:24 test_setPrimKeyField(org.eclipse.jst.j2ee.ejb.test.ContainerManagedEntityTest)  Time elapsed: 0 s
15:26:24 test_addPersistentAttributeName(org.eclipse.jst.j2ee.ejb.test.ContainerManagedEntityTest)  Time elapsed: 0 s
15:26:24 test_removePersistentAttribute(org.eclipse.jst.j2ee.ejb.test.ContainerManagedEntityTest)  Time elapsed: 0 s
15:26:24 test_createActivationConfig(org.eclipse.jst.j2ee.ejb.test.EjbFactoryTest)  Time elapsed: 0 s
15:26:24 test_createExcludeList(org.eclipse.jst.j2ee.ejb.test.EjbFactoryTest)  Time elapsed: 0 s
15:26:24 test_createEJBRelationshipRole(org.eclipse.jst.j2ee.ejb.test.EjbFactoryTest)  Time elapsed: 0 s
15:26:24 test_createContainerManagedEntity(org.eclipse.jst.j2ee.ejb.test.EjbFactoryTest)  Time elapsed: 0 s
15:26:24 test_createMessageDrivenDestination(org.eclipse.jst.j2ee.ejb.test.EjbFactoryTest)  Time elapsed: 0 s
15:26:24 test_createMethodElement_2(org.eclipse.jst.j2ee.ejb.test.EjbFactoryTest)  Time elapsed: 0 s
15:26:24 test_createCMPAttribute(org.eclipse.jst.j2ee.ejb.test.EjbFactoryTest)  Time elapsed: 0 s
15:26:24 test_createSession(org.eclipse.jst.j2ee.ejb.test.EjbFactoryTest)  Time elapsed: 0 s
15:26:24 test_createMethodElementFrom(org.eclipse.jst.j2ee.ejb.test.EjbFactoryTest)  Time elapsed: 0 s
15:26:24 test_createEJBRelation(org.eclipse.jst.j2ee.ejb.test.EjbFactoryTest)  Time elapsed: 0 s
15:26:24 test_createMethodElementFrom_2(org.eclipse.jst.j2ee.ejb.test.EjbFactoryTest)  Time elapsed: 0 s
15:26:24 test_EjbFactory(org.eclipse.jst.j2ee.ejb.test.EjbFactoryTest)  Time elapsed: 0 s
15:26:24 test_createQuery(org.eclipse.jst.j2ee.ejb.test.EjbFactoryTest)  Time elapsed: 0 s
15:26:24 test_createQueryMethod(org.eclipse.jst.j2ee.ejb.test.EjbFactoryTest)  Time elapsed: 0 s
15:26:24 test_createActivationConfigProperty(org.eclipse.jst.j2ee.ejb.test.EjbFactoryTest)  Time elapsed: 0 s
15:26:24 test_createEJBJar(org.eclipse.jst.j2ee.ejb.test.EjbFactoryTest)  Time elapsed: 0 s
15:26:24 test_createMethodPermission(org.eclipse.jst.j2ee.ejb.test.EjbFactoryTest)  Time elapsed: 0 s
15:26:24 test_createEntity(org.eclipse.jst.j2ee.ejb.test.EjbFactoryTest)  Time elapsed: 0.001 s
15:26:24 test_createRelationships(org.eclipse.jst.j2ee.ejb.test.EjbFactoryTest)  Time elapsed: 0 s
15:26:24 test_createEJBMethodCategory(org.eclipse.jst.j2ee.ejb.test.EjbFactoryTest)  Time elapsed: 0 s
15:26:24 test_createMethodTransaction(org.eclipse.jst.j2ee.ejb.test.EjbFactoryTest)  Time elapsed: 0 s
15:26:24 test_createMethodElement(org.eclipse.jst.j2ee.ejb.test.EjbFactoryTest)  Time elapsed: 0 s
15:26:24 test_createAssemblyDescriptor(org.eclipse.jst.j2ee.ejb.test.EjbFactoryTest)  Time elapsed: 0 s
15:26:24 test_createRoleSource(org.eclipse.jst.j2ee.ejb.test.EjbFactoryTest)  Time elapsed: 0 s
15:26:24 test_createCMRField(org.eclipse.jst.j2ee.ejb.test.EjbFactoryTest)  Time elapsed: 0 s
15:26:24 test_createMessageDriven(org.eclipse.jst.j2ee.ejb.test.EjbFactoryTest)  Time elapsed: 0 s
15:26:24 test_isNavigable(org.eclipse.jst.j2ee.ejb.test.EJBRelationshipRoleTest)  Time elapsed: 0 s
15:26:24 test_getLogicalName(org.eclipse.jst.j2ee.ejb.test.EJBRelationshipRoleTest)  Time elapsed: 0 s
15:26:24 test_getName(org.eclipse.jst.j2ee.ejb.test.EJBRelationshipRoleTest)  Time elapsed: 0 s
15:26:24 test_isForward(org.eclipse.jst.j2ee.ejb.test.EJBRelationshipRoleTest)  Time elapsed: 0 s
15:26:24 test_isMany(org.eclipse.jst.j2ee.ejb.test.EJBRelationshipRoleTest)  Time elapsed: 0 s
15:26:24 test_setKey(org.eclipse.jst.j2ee.ejb.test.EJBRelationshipRoleTest)  Time elapsed: 0.001 s
15:26:24 test_EJBRelationshipRole(org.eclipse.jst.j2ee.ejb.test.EJBRelationshipRoleTest)  Time elapsed: 0 s
15:26:24 test_setFoward(org.eclipse.jst.j2ee.ejb.test.EJBRelationshipRoleTest)  Time elapsed: 0 s
15:26:24 test_setName(org.eclipse.jst.j2ee.ejb.test.EJBRelationshipRoleTest)  Time elapsed: 0 s
15:26:24 test_getSourceEntity(org.eclipse.jst.j2ee.ejb.test.EJBRelationshipRoleTest)  Time elapsed: 0 s
15:26:24 test_setRequired(org.eclipse.jst.j2ee.ejb.test.EJBRelationshipRoleTest)  Time elapsed: 0 s
15:26:24 test_isKey(org.eclipse.jst.j2ee.ejb.test.EJBRelationshipRoleTest)  Time elapsed: 0 s
15:26:24 test_getOpposite(org.eclipse.jst.j2ee.ejb.test.EJBRelationshipRoleTest)  Time elapsed: 0 s
15:26:24 test_containsRelationshipRole(org.eclipse.jst.j2ee.ejb.test.EJBRelationTest)  Time elapsed: 0 s
15:26:24 test_getSecondRole(org.eclipse.jst.j2ee.ejb.test.EJBRelationTest)  Time elapsed: 0 s
15:26:24 test_getFirstRole(org.eclipse.jst.j2ee.ejb.test.EJBRelationTest)  Time elapsed: 0 s
15:26:24 test_getOppositeRole(org.eclipse.jst.j2ee.ejb.test.EJBRelationTest)  Time elapsed: 0 s
15:26:24 test_EJBRelation(org.eclipse.jst.j2ee.ejb.test.EJBRelationTest)  Time elapsed: 0 s
15:26:24 test_setFoward(org.eclipse.jst.j2ee.ejb.test.EJBRelationTest)  Time elapsed: 0 s
15:26:24 test_setPrimaryKeyName(org.eclipse.jst.j2ee.ejb.test.EntityTest)  Time elapsed: 0.276 s
15:26:24 test_getPrimaryKeyName(org.eclipse.jst.j2ee.ejb.test.EntityTest)  Time elapsed: 0.284 s
15:26:24 test_initializeFromSignature(org.eclipse.jst.j2ee.ejb.test.MethodElementTest)  Time elapsed: 0 s
15:26:24 test_applyZeroParams(org.eclipse.jst.j2ee.ejb.test.MethodElementTest)  Time elapsed: 0 s
15:26:24 test_equalSignature(org.eclipse.jst.j2ee.ejb.test.MethodElementTest)  Time elapsed: 0.001 s
15:26:24 test_isRemote(org.eclipse.jst.j2ee.ejb.test.MethodElementTest)  Time elapsed: 0 s
15:26:24 test_getTypeJavaClass(org.eclipse.jst.j2ee.ejb.test.MethodElementTest)  Time elapsed: 0.253 s
15:26:24 test_isHome(org.eclipse.jst.j2ee.ejb.test.MethodElementTest)  Time elapsed: 0 s
15:26:24 test_getSignature(org.eclipse.jst.j2ee.ejb.test.MethodElementTest)  Time elapsed: 0 s
15:26:24 test_nameAndParamsEquals(org.eclipse.jst.j2ee.ejb.test.MethodElementTest)  Time elapsed: 0 s
15:26:24 test_isLocalHome(org.eclipse.jst.j2ee.ejb.test.MethodElementTest)  Time elapsed: 0 s
15:26:24 test_isUnspecified(org.eclipse.jst.j2ee.ejb.test.MethodElementTest)  Time elapsed: 0.001 s
15:26:24 test_isEquivalent(org.eclipse.jst.j2ee.ejb.test.MethodElementTest)  Time elapsed: 0 s
15:26:24 test_MethodElement(org.eclipse.jst.j2ee.ejb.test.MethodElementTest)  Time elapsed: 0 s
15:26:24 test_hasMethodParams(org.eclipse.jst.j2ee.ejb.test.MethodElementTest)  Time elapsed: 0 s
15:26:24 test_isLocal(org.eclipse.jst.j2ee.ejb.test.MethodElementTest)  Time elapsed: 0 s
15:26:24 test_isValid(org.eclipse.jst.j2ee.ejb.test.MethodElementTest)  Time elapsed: 0 s
15:26:24 test_getMethodParams(org.eclipse.jst.j2ee.ejb.test.MethodElementTest)  Time elapsed: 0 s
15:26:24 test_isDefault(org.eclipse.jst.j2ee.ejb.test.MethodElementTest)  Time elapsed: 0 s
15:26:24 test_addMethodParams(org.eclipse.jst.j2ee.ejb.test.MethodElementTest)  Time elapsed: 0.001 s
15:26:24 test_removeMethodParams(org.eclipse.jst.j2ee.ejb.test.MethodElementTest)  Time elapsed: 0 s
15:26:24 testEJBJarPopulation(org.eclipse.jst.j2ee.ejb.test.MethodElementTest)  Time elapsed: 0 s
15:26:24 test14EJBJarPopulation(org.eclipse.jst.j2ee.ejb.test.MethodElementTest)  Time elapsed: 0 s
15:26:24 test_MethodPermission(org.eclipse.jst.j2ee.ejb.test.MethodPermissionTest)  Time elapsed: 0 s
15:26:24 test_isEquivalent(org.eclipse.jst.j2ee.ejb.test.MethodPermissionTest)  Time elapsed: 0 s
15:26:24 test_hasSecurityRole(org.eclipse.jst.j2ee.ejb.test.MethodPermissionTest)  Time elapsed: 0 s
15:26:24 test_getSecurityRole(org.eclipse.jst.j2ee.ejb.test.MethodPermissionTest)  Time elapsed: 0 s
15:26:24 test_hasSecurityRole_2(org.eclipse.jst.j2ee.ejb.test.MethodPermissionTest)  Time elapsed: 0 s
15:26:24 test_getClientTypeJavaClasses(org.eclipse.jst.j2ee.ejb.test.QueryMethodTest)  Time elapsed: 0.249 s
15:26:24 test_isRemoteResultMapping(org.eclipse.jst.j2ee.ejb.test.QueryTest)  Time elapsed: 0 s
15:26:24 test_isLocalResultMapping(org.eclipse.jst.j2ee.ejb.test.QueryTest)  Time elapsed: 0 s
15:26:24 test_Query(org.eclipse.jst.j2ee.ejb.test.QueryTest)  Time elapsed: 0 s
15:26:24 test_hasServiceEndpoint(org.eclipse.jst.j2ee.ejb.test.SessionTest)  Time elapsed: 0 s
15:26:24 test_getServiceEndpointName(org.eclipse.jst.j2ee.ejb.test.SessionTest)  Time elapsed: 0.001 s
15:26:24 test_setServiceEndpointName(org.eclipse.jst.j2ee.ejb.test.SessionTest)  Time elapsed: 0 s
15:26:24 test_getVersionID(org.eclipse.jst.j2ee.jca.test.ConnectorTest)  Time elapsed: 0.001 s
15:26:24 test_createResourceAdapter(org.eclipse.jst.j2ee.jca.test.JcaFactoryTest)  Time elapsed: 0 s
15:26:24 test_createInboundResourceAdapter(org.eclipse.jst.j2ee.jca.test.JcaFactoryTest)  Time elapsed: 0 s
15:26:24 test_createActivationSpec(org.eclipse.jst.j2ee.jca.test.JcaFactoryTest)  Time elapsed: 0 s
15:26:24 test_getJcaPackage(org.eclipse.jst.j2ee.jca.test.JcaFactoryTest)  Time elapsed: 0 s
15:26:24 test_createAuthenticationMechanism(org.eclipse.jst.j2ee.jca.test.JcaFactoryTest)  Time elapsed: 0 s
15:26:24 test_createMessageAdapter(org.eclipse.jst.j2ee.jca.test.JcaFactoryTest)  Time elapsed: 0.001 s
15:26:24 test_createRequiredConfigPropertyType(org.eclipse.jst.j2ee.jca.test.JcaFactoryTest)  Time elapsed: 0 s
15:26:24 test_createConfigProperty(org.eclipse.jst.j2ee.jca.test.JcaFactoryTest)  Time elapsed: 0 s
15:26:24 test_createConnectionDefinition(org.eclipse.jst.j2ee.jca.test.JcaFactoryTest)  Time elapsed: 0 s
15:26:24 test_createAdminObject(org.eclipse.jst.j2ee.jca.test.JcaFactoryTest)  Time elapsed: 0 s
15:26:24 test_JcaFactory(org.eclipse.jst.j2ee.jca.test.JcaFactoryTest)  Time elapsed: 0 s
15:26:24 test_createConnector(org.eclipse.jst.j2ee.jca.test.JcaFactoryTest)  Time elapsed: 0 s
15:26:24 test_createMessageListener(org.eclipse.jst.j2ee.jca.test.JcaFactoryTest)  Time elapsed: 0 s
15:26:24 test_createSecurityPermission(org.eclipse.jst.j2ee.jca.test.JcaFactoryTest)  Time elapsed: 0 s
15:26:24 test_createOutboundResourceAdapter(org.eclipse.jst.j2ee.jca.test.JcaFactoryTest)  Time elapsed: 0 s
15:26:24 test_createLicense(org.eclipse.jst.j2ee.jca.test.JcaFactoryTest)  Time elapsed: 0 s
15:26:24 test_createResourceAdapter(org.eclipse.jst.j2ee.jca.test.JcaFactoryTest)  Time elapsed: 0 s
15:26:24 test_createInboundResourceAdapter(org.eclipse.jst.j2ee.jca.test.JcaFactoryTest)  Time elapsed: 0 s
15:26:24 test_createActivationSpec(org.eclipse.jst.j2ee.jca.test.JcaFactoryTest)  Time elapsed: 0 s
15:26:24 test_getJcaPackage(org.eclipse.jst.j2ee.jca.test.JcaFactoryTest)  Time elapsed: 0 s
15:26:24 test_createAuthenticationMechanism(org.eclipse.jst.j2ee.jca.test.JcaFactoryTest)  Time elapsed: 0.001 s
15:26:24 test_createMessageAdapter(org.eclipse.jst.j2ee.jca.test.JcaFactoryTest)  Time elapsed: 0 s
15:26:24 test_createRequiredConfigPropertyType(org.eclipse.jst.j2ee.jca.test.JcaFactoryTest)  Time elapsed: 0 s
15:26:24 test_createConfigProperty(org.eclipse.jst.j2ee.jca.test.JcaFactoryTest)  Time elapsed: 0 s
15:26:24 test_createConnectionDefinition(org.eclipse.jst.j2ee.jca.test.JcaFactoryTest)  Time elapsed: 0 s
15:26:24 test_createAdminObject(org.eclipse.jst.j2ee.jca.test.JcaFactoryTest)  Time elapsed: 0 s
15:26:24 test_JcaFactory(org.eclipse.jst.j2ee.jca.test.JcaFactoryTest)  Time elapsed: 0 s
15:26:24 test_createConnector(org.eclipse.jst.j2ee.jca.test.JcaFactoryTest)  Time elapsed: 0 s
15:26:24 test_createMessageListener(org.eclipse.jst.j2ee.jca.test.JcaFactoryTest)  Time elapsed: 0 s
15:26:24 test_createSecurityPermission(org.eclipse.jst.j2ee.jca.test.JcaFactoryTest)  Time elapsed: 0 s
15:26:24 test_createOutboundResourceAdapter(org.eclipse.jst.j2ee.jca.test.JcaFactoryTest)  Time elapsed: 0 s
15:26:24 test_createLicense(org.eclipse.jst.j2ee.jca.test.JcaFactoryTest)  Time elapsed: 0 s
15:26:24 test_createFormLoginConfig(org.eclipse.jst.j2ee.webapplication.test.WebapplicationFactoryTest)  Time elapsed: 0 s
15:26:24 test_createErrorCodeErrorPage(org.eclipse.jst.j2ee.webapplication.test.WebapplicationFactoryTest)  Time elapsed: 0 s
15:26:24 test_createMimeMapping(org.eclipse.jst.j2ee.webapplication.test.WebapplicationFactoryTest)  Time elapsed: 0 s
15:26:24 test_createExceptionTypeErrorPage(org.eclipse.jst.j2ee.webapplication.test.WebapplicationFactoryTest)  Time elapsed: 0.001 s
15:26:24 test_createTagLibRef(org.eclipse.jst.j2ee.webapplication.test.WebapplicationFactoryTest)  Time elapsed: 0 s
15:26:24 test_createLocalEncodingMapping(org.eclipse.jst.j2ee.webapplication.test.WebapplicationFactoryTest)  Time elapsed: 0 s
15:26:24 test_createServlet(org.eclipse.jst.j2ee.webapplication.test.WebapplicationFactoryTest)  Time elapsed: 0 s
15:26:24 test_createJSPType(org.eclipse.jst.j2ee.webapplication.test.WebapplicationFactoryTest)  Time elapsed: 0 s
15:26:24 test_createSessionConfig(org.eclipse.jst.j2ee.webapplication.test.WebapplicationFactoryTest)  Time elapsed: 0 s
15:26:24 test_createServletMapping(org.eclipse.jst.j2ee.webapplication.test.WebapplicationFactoryTest)  Time elapsed: 0 s
15:26:24 test_createURLPatternType(org.eclipse.jst.j2ee.webapplication.test.WebapplicationFactoryTest)  Time elapsed: 0 s
15:26:24 test_createLocalEncodingMappingList(org.eclipse.jst.j2ee.webapplication.test.WebapplicationFactoryTest)  Time elapsed: 0 s
15:26:24 test_createFilterMapping(org.eclipse.jst.j2ee.webapplication.test.WebapplicationFactoryTest)  Time elapsed: 0 s
15:26:24 test_createAuthConstraint(org.eclipse.jst.j2ee.webapplication.test.WebapplicationFactoryTest)  Time elapsed: 0 s
15:26:24 test_createUserDataConstraint(org.eclipse.jst.j2ee.webapplication.test.WebapplicationFactoryTest)  Time elapsed: 0 s
15:26:24 test_createFilter(org.eclipse.jst.j2ee.webapplication.test.WebapplicationFactoryTest)  Time elapsed: 0.001 s
15:26:24 test_createRoleNameType(org.eclipse.jst.j2ee.webapplication.test.WebapplicationFactoryTest)  Time elapsed: 0 s
15:26:24 test_createWelcomeFileList(org.eclipse.jst.j2ee.webapplication.test.WebapplicationFactoryTest)  Time elapsed: 0 s
15:26:24 test_createWebApp(org.eclipse.jst.j2ee.webapplication.test.WebapplicationFactoryTest)  Time elapsed: 0 s
15:26:24 test_createInitParam(org.eclipse.jst.j2ee.webapplication.test.WebapplicationFactoryTest)  Time elapsed: 0 s
15:26:24 test_createWelcomeFile(org.eclipse.jst.j2ee.webapplication.test.WebapplicationFactoryTest)  Time elapsed: 0 s
15:26:24 test_getWebapplicationPackage(org.eclipse.jst.j2ee.webapplication.test.WebapplicationFactoryTest)  Time elapsed: 0 s
15:26:24 test_createContextParam(org.eclipse.jst.j2ee.webapplication.test.WebapplicationFactoryTest)  Time elapsed: 0 s
15:26:24 test_createSecurityConstraint(org.eclipse.jst.j2ee.webapplication.test.WebapplicationFactoryTest)  Time elapsed: 0 s
15:26:24 test_createHTTPMethodType(org.eclipse.jst.j2ee.webapplication.test.WebapplicationFactoryTest)  Time elapsed: 0 s
15:26:24 test_createWebResourceCollection(org.eclipse.jst.j2ee.webapplication.test.WebapplicationFactoryTest)  Time elapsed: 0 s
15:26:24 test_createErrorPage(org.eclipse.jst.j2ee.webapplication.test.WebapplicationFactoryTest)  Time elapsed: 0 s
15:26:24 test_createServletType(org.eclipse.jst.j2ee.webapplication.test.WebapplicationFactoryTest)  Time elapsed: 0 s
15:26:24 test_createLoginConfig(org.eclipse.jst.j2ee.webapplication.test.WebapplicationFactoryTest)  Time elapsed: 0 s
15:26:24 test_createSOAPHeader(org.eclipse.jst.j2ee.webservice.wscommon.test.WscommonFactoryTest)  Time elapsed: 0 s
15:26:24 test_createDisplayNameType(org.eclipse.jst.j2ee.webservice.wscommon.test.WscommonFactoryTest)  Time elapsed: 0 s
15:26:24 test_getWscommonPackage(org.eclipse.jst.j2ee.webservice.wscommon.test.WscommonFactoryTest)  Time elapsed: 0 s
15:26:24 test_createDescriptionType(org.eclipse.jst.j2ee.webservice.wscommon.test.WscommonFactoryTest)  Time elapsed: 0 s
15:26:24 test_createPortName(org.eclipse.jst.j2ee.webservice.wscommon.test.WscommonFactoryTest)  Time elapsed: 0 s
15:26:24 test_createSOAPRole(org.eclipse.jst.j2ee.webservice.wscommon.test.WscommonFactoryTest)  Time elapsed: 0 s
15:26:24 test_createInitParam(org.eclipse.jst.j2ee.webservice.wscommon.test.WscommonFactoryTest)  Time elapsed: 0 s
15:26:24 test_createEJBLink(org.eclipse.jst.j2ee.webservice.wsdd.test.WsddFactoryTest)  Time elapsed: 0 s
15:26:24 test_createWSDLPort(org.eclipse.jst.j2ee.webservice.wsdd.test.WsddFactoryTest)  Time elapsed: 0 s
15:26:24 test_createPortComponent(org.eclipse.jst.j2ee.webservice.wsdd.test.WsddFactoryTest)  Time elapsed: 0 s
15:26:24 test_createServiceImplBean(org.eclipse.jst.j2ee.webservice.wsdd.test.WsddFactoryTest)  Time elapsed: 0 s
15:26:24 test_createWebServices(org.eclipse.jst.j2ee.webservice.wsdd.test.WsddFactoryTest)  Time elapsed: 0 s
15:26:24 test_createBeanLink(org.eclipse.jst.j2ee.webservice.wsdd.test.WsddFactoryTest)  Time elapsed: 0 s
15:26:24 test_createWebServiceDescription(org.eclipse.jst.j2ee.webservice.wsdd.test.WsddFactoryTest)  Time elapsed: 0 s
15:26:24 test_createHandler(org.eclipse.jst.j2ee.webservice.wsdd.test.WsddFactoryTest)  Time elapsed: 0 s
15:26:24 test_createServletLink(org.eclipse.jst.j2ee.webservice.wsdd.test.WsddFactoryTest)  Time elapsed: 0 s
15:26:24 Running org.eclipse.jst.j2ee.core.api.test.AllCoreAPITests
15:26:24 Tests run: 243, Failures: 0, Errors: 0, Skipped: 0, Time elapsed: 3.006 s - in org.eclipse.jst.j2ee.core.api.test.AllCoreAPITests
15:26:27 test_createEjbModule(org.eclipse.jst.j2ee.application.test.ApplicationFactoryTest)  Time elapsed: 0 s
15:26:27 test_createApplication(org.eclipse.jst.j2ee.application.test.ApplicationFactoryTest)  Time elapsed: 0 s
15:26:27 test_createConnectorModule(org.eclipse.jst.j2ee.application.test.ApplicationFactoryTest)  Time elapsed: 0 s
15:26:27 test_createWebModule(org.eclipse.jst.j2ee.application.test.ApplicationFactoryTest)  Time elapsed: 0 s
15:26:27 test_createJavaClientModule(org.eclipse.jst.j2ee.application.test.ApplicationFactoryTest)  Time elapsed: 0 s
15:26:27 test_createModule(org.eclipse.jst.j2ee.application.test.ApplicationFactoryTest)  Time elapsed: 0 s
15:26:27 test_getVersionID(org.eclipse.jst.j2ee.application.test.ApplicationTest)  Time elapsed: 0.001 s
15:26:27 test_getJ2EEVersionID(org.eclipse.jst.j2ee.application.test.ApplicationTest)  Time elapsed: 0 s
15:26:27 test_getSecurityRoleNamed(org.eclipse.jst.j2ee.application.test.ApplicationTest)  Time elapsed: 0 s
15:26:27 test_getModuleHavingAltDD(org.eclipse.jst.j2ee.application.test.ApplicationTest)  Time elapsed: 0 s
15:26:27 test_containsSecurityRole(org.eclipse.jst.j2ee.application.test.ApplicationTest)  Time elapsed: 0 s
15:26:27 test_getModule_2(org.eclipse.jst.j2ee.application.test.ApplicationTest)  Time elapsed: 0 s
15:26:27 test_getFirstModule(org.eclipse.jst.j2ee.application.test.ApplicationTest)  Time elapsed: 0 s
15:26:27 test_getVersionID(org.eclipse.jst.j2ee.client.test.ApplicationClientTest)  Time elapsed: 0.01 s
15:26:27 test_getJ2EEVersionID(org.eclipse.jst.j2ee.client.test.ApplicationClientTest)  Time elapsed: 0.01 s
15:26:27 test_getCallbackHandlerClassName(org.eclipse.jst.j2ee.client.test.ApplicationClientTest)  Time elapsed: 0 s
15:26:27 test_setCallbackHandlerClassName(org.eclipse.jst.j2ee.client.test.ApplicationClientTest)  Time elapsed: 0 s
15:26:27 test_ClientFactory(org.eclipse.jst.j2ee.client.test.ClientFactoryTest)  Time elapsed: 0 s
15:26:27 test_createApplicationClient(org.eclipse.jst.j2ee.client.test.ClientFactoryTest)  Time elapsed: 0 s
15:26:27 test_createCompatibilityDescriptionGroup(org.eclipse.jst.j2ee.common.test.CommonFactoryTest)  Time elapsed: 0 s
15:26:27 test_createUseCallerIdentity(org.eclipse.jst.j2ee.common.test.CommonFactoryTest)  Time elapsed: 0 s
15:26:27 test_createDescriptionGroup(org.eclipse.jst.j2ee.common.test.CommonFactoryTest)  Time elapsed: 0 s
15:26:27 test_createIconType(org.eclipse.jst.j2ee.common.test.CommonFactoryTest)  Time elapsed: 0 s
15:26:27 test_createResourceRef(org.eclipse.jst.j2ee.common.test.CommonFactoryTest)  Time elapsed: 0 s
15:26:27 test_createDisplayName(org.eclipse.jst.j2ee.common.test.CommonFactoryTest)  Time elapsed: 0 s
15:26:27 test_createIdentity(org.eclipse.jst.j2ee.common.test.CommonFactoryTest)  Time elapsed: 0 s
15:26:27 test_createSecurityIdentity(org.eclipse.jst.j2ee.common.test.CommonFactoryTest)  Time elapsed: 0 s
15:26:27 test_createResourceEnvRef(org.eclipse.jst.j2ee.common.test.CommonFactoryTest)  Time elapsed: 0 s
15:26:27 test_createDescription(org.eclipse.jst.j2ee.common.test.CommonFactoryTest)  Time elapsed: 0 s
15:26:27 test_createQName(org.eclipse.jst.j2ee.common.test.CommonFactoryTest)  Time elapsed: 0 s
15:26:27 test_CommonFactory(org.eclipse.jst.j2ee.common.test.CommonFactoryTest)  Time elapsed: 0 s
15:26:27 test_createParamValue(org.eclipse.jst.j2ee.common.test.CommonFactoryTest)  Time elapsed: 0 s
15:26:27 test_createEjbRef(org.eclipse.jst.j2ee.common.test.CommonFactoryTest)  Time elapsed: 0 s
15:26:27 test_createListener(org.eclipse.jst.j2ee.common.test.CommonFactoryTest)  Time elapsed: 0 s
15:26:27 test_createMessageDestination(org.eclipse.jst.j2ee.common.test.CommonFactoryTest)  Time elapsed: 0 s
15:26:27 test_createEnvEntry(org.eclipse.jst.j2ee.common.test.CommonFactoryTest)  Time elapsed: 0 s
15:26:27 test_createSecurityRole(org.eclipse.jst.j2ee.common.test.CommonFactoryTest)  Time elapsed: 0 s
15:26:27 test_createMessageDestinationRef(org.eclipse.jst.j2ee.common.test.CommonFactoryTest)  Time elapsed: 0 s
15:26:27 test_createEJBLocalRef(org.eclipse.jst.j2ee.common.test.CommonFactoryTest)  Time elapsed: 0 s
15:26:27 test_createSecurityRoleRef(org.eclipse.jst.j2ee.common.test.CommonFactoryTest)  Time elapsed: 0 s
15:26:27 test_createRunAsSpecifiedIdentity(org.eclipse.jst.j2ee.common.test.CommonFactoryTest)  Time elapsed: 0 s
15:26:27 test_isLinked(org.eclipse.jst.j2ee.common.test.EjbRefTest)  Time elapsed: 0 s
15:26:27 test_EjbRef(org.eclipse.jst.j2ee.common.test.EjbRefTest)  Time elapsed: 0 s
15:26:27 test_isEquivalent(org.eclipse.jst.j2ee.common.test.EjbRefTest)  Time elapsed: 0 s
15:26:27 test_isLocal(org.eclipse.jst.j2ee.common.test.EjbRefTest)  Time elapsed: 0 s
15:26:27 test_getLinkedEjb(org.eclipse.jst.j2ee.common.test.EjbRefTest)  Time elapsed: 0 s
15:26:27 test_setListenerClassName(org.eclipse.jst.j2ee.common.test.ListenerTest)  Time elapsed: 0.001 s
15:26:27 test_getListenerClassName(org.eclipse.jst.j2ee.common.test.ListenerTest)  Time elapsed: 0 s
15:26:27 test_setValues(org.eclipse.jst.j2ee.common.test.QNameTest)  Time elapsed: 0 s
15:26:27 test_getMethodPermissionMethodElements(org.eclipse.jst.j2ee.ejb.test.AssemblyDescriptorTest)  Time elapsed: 0.333 s
15:26:27 test_getMethodTransactionMethodElements(org.eclipse.jst.j2ee.ejb.test.AssemblyDescriptorTest)  Time elapsed: 0.262 s
15:26:27 test_getSecurityRoleNamed(org.eclipse.jst.j2ee.ejb.test.AssemblyDescriptorTest)  Time elapsed: 0.289 s
15:26:27 test_renameSecurityRole(org.eclipse.jst.j2ee.ejb.test.AssemblyDescriptorTest)  Time elapsed: 0.261 s
15:26:27 test_removeData(org.eclipse.jst.j2ee.ejb.test.AssemblyDescriptorTest)  Time elapsed: 0.283 s
15:26:27 test_getSetterName(org.eclipse.jst.j2ee.ejb.test.CMPAttributeTest)  Time elapsed: 0 s
15:26:27 test_getType(org.eclipse.jst.j2ee.ejb.test.CMPAttributeTest)  Time elapsed: 0 s
15:26:27 test_getOriginatingType(org.eclipse.jst.j2ee.ejb.test.CMPAttributeTest)  Time elapsed: 0.001 s
15:26:27 test_setDerived(org.eclipse.jst.j2ee.ejb.test.CMPAttributeTest)  Time elapsed: 0 s
15:26:27 test_setOriginatingType(org.eclipse.jst.j2ee.ejb.test.CMPAttributeTest)  Time elapsed: 0 s
15:26:27 test_isCMRField(org.eclipse.jst.j2ee.ejb.test.CMPAttributeTest)  Time elapsed: 0 s
15:26:27 test_getGetterName(org.eclipse.jst.j2ee.ejb.test.CMPAttributeTest)  Time elapsed: 0 s
15:26:27 test_isDerived(org.eclipse.jst.j2ee.ejb.test.CMPAttributeTest)  Time elapsed: 0 s
15:26:27 test_isKey(org.eclipse.jst.j2ee.ejb.test.CMPAttributeTest)  Time elapsed: 0 s
15:26:27 test_isPrimKeyField(org.eclipse.jst.j2ee.ejb.test.CMPAttributeTest)  Time elapsed: 0 s
15:26:27 test_getRole(org.eclipse.jst.j2ee.ejb.test.CMRFieldTest)  Time elapsed: 0 s
15:26:27 test_setCollectionTypeName(org.eclipse.jst.j2ee.ejb.test.CMRFieldTest)  Time elapsed: 0 s
15:26:27 test_setCollectionType(org.eclipse.jst.j2ee.ejb.test.CMRFieldTest)  Time elapsed: 0 s
15:26:27 test_getCollectionType(org.eclipse.jst.j2ee.ejb.test.CMRFieldTest)  Time elapsed: 0 s
15:26:27 test_setRole(org.eclipse.jst.j2ee.ejb.test.CMRFieldTest)  Time elapsed: 0 s
15:26:27 test_getCollectionTypeName(org.eclipse.jst.j2ee.ejb.test.CMRFieldTest)  Time elapsed: 0 s
15:26:27 test_isUnknownPrimaryKey(org.eclipse.jst.j2ee.ejb.test.ContainerManagedEntityTest)  Time elapsed: 0.001 s
15:26:27 test_addPersistentAttribute(org.eclipse.jst.j2ee.ejb.test.ContainerManagedEntityTest)  Time elapsed: 0 s
15:26:27 test_addKeyAttributeName(org.eclipse.jst.j2ee.ejb.test.ContainerManagedEntityTest)  Time elapsed: 0 s
15:26:27 test_getKeyAttribute(org.eclipse.jst.j2ee.ejb.test.ContainerManagedEntityTest)  Time elapsed: 0 s
15:26:27 test_isContainerManagedEntity(org.eclipse.jst.j2ee.ejb.test.ContainerManagedEntityTest)  Time elapsed: 0 s
15:26:27 test_getPrimaryKeyAttribute(org.eclipse.jst.j2ee.ejb.test.ContainerManagedEntityTest)  Time elapsed: 0 s
15:26:27 test_isVersion1_X(org.eclipse.jst.j2ee.ejb.test.ContainerManagedEntityTest)  Time elapsed: 0 s
15:26:27 test_isVersion2_X(org.eclipse.jst.j2ee.ejb.test.ContainerManagedEntityTest)  Time elapsed: 0 s
15:26:27 test_removePersistentAttribute_2(org.eclipse.jst.j2ee.ejb.test.ContainerManagedEntityTest)  Time elapsed: 0 s
15:26:27 test_listPersistentFieldNames(org.eclipse.jst.j2ee.ejb.test.ContainerManagedEntityTest)  Time elapsed: 0 s
15:26:27 test_isKeyAttribute(org.eclipse.jst.j2ee.ejb.test.ContainerManagedEntityTest)  Time elapsed: 0 s
15:26:27 test_getCMPVersionID(org.eclipse.jst.j2ee.ejb.test.ContainerManagedEntityTest)  Time elapsed: 0 s
15:26:27 test_setPrimKeyField(org.eclipse.jst.j2ee.ejb.test.ContainerManagedEntityTest)  Time elapsed: 0 s
15:26:27 test_addPersistentAttributeName(org.eclipse.jst.j2ee.ejb.test.ContainerManagedEntityTest)  Time elapsed: 0 s
15:26:27 test_removePersistentAttribute(org.eclipse.jst.j2ee.ejb.test.ContainerManagedEntityTest)  Time elapsed: 0 s
15:26:27 test_createActivationConfig(org.eclipse.jst.j2ee.ejb.test.EjbFactoryTest)  Time elapsed: 0 s
15:26:27 test_createExcludeList(org.eclipse.jst.j2ee.ejb.test.EjbFactoryTest)  Time elapsed: 0 s
15:26:27 test_createEJBRelationshipRole(org.eclipse.jst.j2ee.ejb.test.EjbFactoryTest)  Time elapsed: 0 s
15:26:27 test_createContainerManagedEntity(org.eclipse.jst.j2ee.ejb.test.EjbFactoryTest)  Time elapsed: 0 s
15:26:27 test_createMessageDrivenDestination(org.eclipse.jst.j2ee.ejb.test.EjbFactoryTest)  Time elapsed: 0 s
15:26:27 test_createMethodElement_2(org.eclipse.jst.j2ee.ejb.test.EjbFactoryTest)  Time elapsed: 0 s
15:26:27 test_createCMPAttribute(org.eclipse.jst.j2ee.ejb.test.EjbFactoryTest)  Time elapsed: 0 s
15:26:27 test_createSession(org.eclipse.jst.j2ee.ejb.test.EjbFactoryTest)  Time elapsed: 0 s
15:26:27 test_createMethodElementFrom(org.eclipse.jst.j2ee.ejb.test.EjbFactoryTest)  Time elapsed: 0 s
15:26:27 test_createEJBRelation(org.eclipse.jst.j2ee.ejb.test.EjbFactoryTest)  Time elapsed: 0 s
15:26:27 test_createMethodElementFrom_2(org.eclipse.jst.j2ee.ejb.test.EjbFactoryTest)  Time elapsed: 0 s
15:26:27 test_EjbFactory(org.eclipse.jst.j2ee.ejb.test.EjbFactoryTest)  Time elapsed: 0 s
15:26:27 test_createQuery(org.eclipse.jst.j2ee.ejb.test.EjbFactoryTest)  Time elapsed: 0 s
15:26:27 test_createQueryMethod(org.eclipse.jst.j2ee.ejb.test.EjbFactoryTest)  Time elapsed: 0 s
15:26:27 test_createActivationConfigProperty(org.eclipse.jst.j2ee.ejb.test.EjbFactoryTest)  Time elapsed: 0 s
15:26:27 test_createEJBJar(org.eclipse.jst.j2ee.ejb.test.EjbFactoryTest)  Time elapsed: 0 s
15:26:27 test_createMethodPermission(org.eclipse.jst.j2ee.ejb.test.EjbFactoryTest)  Time elapsed: 0 s
15:26:27 test_createEntity(org.eclipse.jst.j2ee.ejb.test.EjbFactoryTest)  Time elapsed: 0 s
15:26:27 test_createRelationships(org.eclipse.jst.j2ee.ejb.test.EjbFactoryTest)  Time elapsed: 0 s
15:26:27 test_createEJBMethodCategory(org.eclipse.jst.j2ee.ejb.test.EjbFactoryTest)  Time elapsed: 0 s
15:26:27 test_createMethodTransaction(org.eclipse.jst.j2ee.ejb.test.EjbFactoryTest)  Time elapsed: 0 s
15:26:27 test_createMethodElement(org.eclipse.jst.j2ee.ejb.test.EjbFactoryTest)  Time elapsed: 0 s
15:26:27 test_createAssemblyDescriptor(org.eclipse.jst.j2ee.ejb.test.EjbFactoryTest)  Time elapsed: 0 s
15:26:27 test_createRoleSource(org.eclipse.jst.j2ee.ejb.test.EjbFactoryTest)  Time elapsed: 0 s
15:26:27 test_createCMRField(org.eclipse.jst.j2ee.ejb.test.EjbFactoryTest)  Time elapsed: 0 s
15:26:27 test_createMessageDriven(org.eclipse.jst.j2ee.ejb.test.EjbFactoryTest)  Time elapsed: 0 s
15:26:27 test_isNavigable(org.eclipse.jst.j2ee.ejb.test.EJBRelationshipRoleTest)  Time elapsed: 0 s
15:26:27 test_getLogicalName(org.eclipse.jst.j2ee.ejb.test.EJBRelationshipRoleTest)  Time elapsed: 0 s
15:26:27 test_getName(org.eclipse.jst.j2ee.ejb.test.EJBRelationshipRoleTest)  Time elapsed: 0 s
15:26:27 test_isForward(org.eclipse.jst.j2ee.ejb.test.EJBRelationshipRoleTest)  Time elapsed: 0 s
15:26:27 test_isMany(org.eclipse.jst.j2ee.ejb.test.EJBRelationshipRoleTest)  Time elapsed: 0 s
15:26:27 test_setKey(org.eclipse.jst.j2ee.ejb.test.EJBRelationshipRoleTest)  Time elapsed: 0.001 s
15:26:27 test_EJBRelationshipRole(org.eclipse.jst.j2ee.ejb.test.EJBRelationshipRoleTest)  Time elapsed: 0 s
15:26:27 test_setFoward(org.eclipse.jst.j2ee.ejb.test.EJBRelationshipRoleTest)  Time elapsed: 0 s
15:26:27 test_setName(org.eclipse.jst.j2ee.ejb.test.EJBRelationshipRoleTest)  Time elapsed: 0 s
15:26:27 test_getSourceEntity(org.eclipse.jst.j2ee.ejb.test.EJBRelationshipRoleTest)  Time elapsed: 0 s
15:26:27 test_setRequired(org.eclipse.jst.j2ee.ejb.test.EJBRelationshipRoleTest)  Time elapsed: 0 s
15:26:27 test_isKey(org.eclipse.jst.j2ee.ejb.test.EJBRelationshipRoleTest)  Time elapsed: 0 s
15:26:27 test_getOpposite(org.eclipse.jst.j2ee.ejb.test.EJBRelationshipRoleTest)  Time elapsed: 0 s
15:26:27 test_containsRelationshipRole(org.eclipse.jst.j2ee.ejb.test.EJBRelationTest)  Time elapsed: 0 s
15:26:27 test_getSecondRole(org.eclipse.jst.j2ee.ejb.test.EJBRelationTest)  Time elapsed: 0 s
15:26:27 test_getFirstRole(org.eclipse.jst.j2ee.ejb.test.EJBRelationTest)  Time elapsed: 0 s
15:26:27 test_getOppositeRole(org.eclipse.jst.j2ee.ejb.test.EJBRelationTest)  Time elapsed: 0 s
15:26:27 test_EJBRelation(org.eclipse.jst.j2ee.ejb.test.EJBRelationTest)  Time elapsed: 0 s
15:26:27 test_setFoward(org.eclipse.jst.j2ee.ejb.test.EJBRelationTest)  Time elapsed: 0 s
15:26:27 test_setPrimaryKeyName(org.eclipse.jst.j2ee.ejb.test.EntityTest)  Time elapsed: 0.271 s
15:26:27 test_getPrimaryKeyName(org.eclipse.jst.j2ee.ejb.test.EntityTest)  Time elapsed: 0.655 s
15:26:27 test_initializeFromSignature(org.eclipse.jst.j2ee.ejb.test.MethodElementTest)  Time elapsed: 0 s
15:26:27 test_applyZeroParams(org.eclipse.jst.j2ee.ejb.test.MethodElementTest)  Time elapsed: 0 s
15:26:27 test_equalSignature(org.eclipse.jst.j2ee.ejb.test.MethodElementTest)  Time elapsed: 0 s
15:26:27 test_isRemote(org.eclipse.jst.j2ee.ejb.test.MethodElementTest)  Time elapsed: 0.001 s
15:26:27 test_getTypeJavaClass(org.eclipse.jst.j2ee.ejb.test.MethodElementTest)  Time elapsed: 0.327 s
15:26:27 test_isHome(org.eclipse.jst.j2ee.ejb.test.MethodElementTest)  Time elapsed: 0 s
15:26:27 test_getSignature(org.eclipse.jst.j2ee.ejb.test.MethodElementTest)  Time elapsed: 0 s
15:26:27 test_nameAndParamsEquals(org.eclipse.jst.j2ee.ejb.test.MethodElementTest)  Time elapsed: 0 s
15:26:27 test_isLocalHome(org.eclipse.jst.j2ee.ejb.test.MethodElementTest)  Time elapsed: 0.001 s
15:26:27 test_isUnspecified(org.eclipse.jst.j2ee.ejb.test.MethodElementTest)  Time elapsed: 0 s
15:26:27 test_isEquivalent(org.eclipse.jst.j2ee.ejb.test.MethodElementTest)  Time elapsed: 0 s
15:26:27 test_MethodElement(org.eclipse.jst.j2ee.ejb.test.MethodElementTest)  Time elapsed: 0 s
15:26:27 test_hasMethodParams(org.eclipse.jst.j2ee.ejb.test.MethodElementTest)  Time elapsed: 0 s
15:26:27 test_isLocal(org.eclipse.jst.j2ee.ejb.test.MethodElementTest)  Time elapsed: 0 s
15:26:27 test_isValid(org.eclipse.jst.j2ee.ejb.test.MethodElementTest)  Time elapsed: 0 s
15:26:27 test_getMethodParams(org.eclipse.jst.j2ee.ejb.test.MethodElementTest)  Time elapsed: 0 s
15:26:27 test_isDefault(org.eclipse.jst.j2ee.ejb.test.MethodElementTest)  Time elapsed: 0 s
15:26:27 test_addMethodParams(org.eclipse.jst.j2ee.ejb.test.MethodElementTest)  Time elapsed: 0.001 s
15:26:27 test_removeMethodParams(org.eclipse.jst.j2ee.ejb.test.MethodElementTest)  Time elapsed: 0 s
15:26:27 testEJBJarPopulation(org.eclipse.jst.j2ee.ejb.test.MethodElementTest)  Time elapsed: 0 s
15:26:27 test14EJBJarPopulation(org.eclipse.jst.j2ee.ejb.test.MethodElementTest)  Time elapsed: 0 s
15:26:27 test_MethodPermission(org.eclipse.jst.j2ee.ejb.test.MethodPermissionTest)  Time elapsed: 0 s
15:26:27 test_isEquivalent(org.eclipse.jst.j2ee.ejb.test.MethodPermissionTest)  Time elapsed: 0 s
15:26:27 test_hasSecurityRole(org.eclipse.jst.j2ee.ejb.test.MethodPermissionTest)  Time elapsed: 0 s
15:26:27 test_getSecurityRole(org.eclipse.jst.j2ee.ejb.test.MethodPermissionTest)  Time elapsed: 0 s
15:26:27 test_hasSecurityRole_2(org.eclipse.jst.j2ee.ejb.test.MethodPermissionTest)  Time elapsed: 0 s
15:26:27 test_getClientTypeJavaClasses(org.eclipse.jst.j2ee.ejb.test.QueryMethodTest)  Time elapsed: 0.273 s
15:26:27 test_isRemoteResultMapping(org.eclipse.jst.j2ee.ejb.test.QueryTest)  Time elapsed: 0.001 s
15:26:27 test_isLocalResultMapping(org.eclipse.jst.j2ee.ejb.test.QueryTest)  Time elapsed: 0 s
15:26:27 test_Query(org.eclipse.jst.j2ee.ejb.test.QueryTest)  Time elapsed: 0 s
15:26:27 test_hasServiceEndpoint(org.eclipse.jst.j2ee.ejb.test.SessionTest)  Time elapsed: 0 s
15:26:27 test_getServiceEndpointName(org.eclipse.jst.j2ee.ejb.test.SessionTest)  Time elapsed: 0 s
15:26:27 test_setServiceEndpointName(org.eclipse.jst.j2ee.ejb.test.SessionTest)  Time elapsed: 0 s
15:26:27 test_getVersionID(org.eclipse.jst.j2ee.jca.test.ConnectorTest)  Time elapsed: 0.001 s
15:26:27 test_createResourceAdapter(org.eclipse.jst.j2ee.jca.test.JcaFactoryTest)  Time elapsed: 0 s
15:26:27 test_createInboundResourceAdapter(org.eclipse.jst.j2ee.jca.test.JcaFactoryTest)  Time elapsed: 0 s
15:26:27 test_createActivationSpec(org.eclipse.jst.j2ee.jca.test.JcaFactoryTest)  Time elapsed: 0 s
15:26:27 test_getJcaPackage(org.eclipse.jst.j2ee.jca.test.JcaFactoryTest)  Time elapsed: 0 s
15:26:27 test_createAuthenticationMechanism(org.eclipse.jst.j2ee.jca.test.JcaFactoryTest)  Time elapsed: 0 s
15:26:27 test_createMessageAdapter(org.eclipse.jst.j2ee.jca.test.JcaFactoryTest)  Time elapsed: 0 s
15:26:27 test_createRequiredConfigPropertyType(org.eclipse.jst.j2ee.jca.test.JcaFactoryTest)  Time elapsed: 0 s
15:26:27 test_createConfigProperty(org.eclipse.jst.j2ee.jca.test.JcaFactoryTest)  Time elapsed: 0 s
15:26:27 test_createConnectionDefinition(org.eclipse.jst.j2ee.jca.test.JcaFactoryTest)  Time elapsed: 0 s
15:26:27 test_createAdminObject(org.eclipse.jst.j2ee.jca.test.JcaFactoryTest)  Time elapsed: 0 s
15:26:27 test_JcaFactory(org.eclipse.jst.j2ee.jca.test.JcaFactoryTest)  Time elapsed: 0 s
15:26:27 test_createConnector(org.eclipse.jst.j2ee.jca.test.JcaFactoryTest)  Time elapsed: 0 s
15:26:27 test_createMessageListener(org.eclipse.jst.j2ee.jca.test.JcaFactoryTest)  Time elapsed: 0 s
15:26:27 test_createSecurityPermission(org.eclipse.jst.j2ee.jca.test.JcaFactoryTest)  Time elapsed: 0 s
15:26:27 test_createOutboundResourceAdapter(org.eclipse.jst.j2ee.jca.test.JcaFactoryTest)  Time elapsed: 0 s
15:26:27 test_createLicense(org.eclipse.jst.j2ee.jca.test.JcaFactoryTest)  Time elapsed: 0 s
15:26:27 test_createResourceAdapter(org.eclipse.jst.j2ee.jca.test.JcaFactoryTest)  Time elapsed: 0 s
15:26:27 test_createInboundResourceAdapter(org.eclipse.jst.j2ee.jca.test.JcaFactoryTest)  Time elapsed: 0 s
15:26:27 test_createActivationSpec(org.eclipse.jst.j2ee.jca.test.JcaFactoryTest)  Time elapsed: 0 s
15:26:27 test_getJcaPackage(org.eclipse.jst.j2ee.jca.test.JcaFactoryTest)  Time elapsed: 0 s
15:26:27 test_createAuthenticationMechanism(org.eclipse.jst.j2ee.jca.test.JcaFactoryTest)  Time elapsed: 0 s
15:26:27 test_createMessageAdapter(org.eclipse.jst.j2ee.jca.test.JcaFactoryTest)  Time elapsed: 0 s
15:26:27 test_createRequiredConfigPropertyType(org.eclipse.jst.j2ee.jca.test.JcaFactoryTest)  Time elapsed: 0 s
15:26:27 test_createConfigProperty(org.eclipse.jst.j2ee.jca.test.JcaFactoryTest)  Time elapsed: 0 s
15:26:27 test_createConnectionDefinition(org.eclipse.jst.j2ee.jca.test.JcaFactoryTest)  Time elapsed: 0 s
15:26:27 test_createAdminObject(org.eclipse.jst.j2ee.jca.test.JcaFactoryTest)  Time elapsed: 0 s
15:26:27 test_JcaFactory(org.eclipse.jst.j2ee.jca.test.JcaFactoryTest)  Time elapsed: 0 s
15:26:27 test_createConnector(org.eclipse.jst.j2ee.jca.test.JcaFactoryTest)  Time elapsed: 0 s
15:26:27 test_createMessageListener(org.eclipse.jst.j2ee.jca.test.JcaFactoryTest)  Time elapsed: 0 s
15:26:27 test_createSecurityPermission(org.eclipse.jst.j2ee.jca.test.JcaFactoryTest)  Time elapsed: 0 s
15:26:27 test_createOutboundResourceAdapter(org.eclipse.jst.j2ee.jca.test.JcaFactoryTest)  Time elapsed: 0 s
15:26:27 test_createLicense(org.eclipse.jst.j2ee.jca.test.JcaFactoryTest)  Time elapsed: 0 s
15:26:27 test_createFormLoginConfig(org.eclipse.jst.j2ee.webapplication.test.WebapplicationFactoryTest)  Time elapsed: 0 s
15:26:27 test_createErrorCodeErrorPage(org.eclipse.jst.j2ee.webapplication.test.WebapplicationFactoryTest)  Time elapsed: 0 s
15:26:27 test_createMimeMapping(org.eclipse.jst.j2ee.webapplication.test.WebapplicationFactoryTest)  Time elapsed: 0.001 s
15:26:27 test_createExceptionTypeErrorPage(org.eclipse.jst.j2ee.webapplication.test.WebapplicationFactoryTest)  Time elapsed: 0 s
15:26:27 test_createTagLibRef(org.eclipse.jst.j2ee.webapplication.test.WebapplicationFactoryTest)  Time elapsed: 0 s
15:26:27 test_createLocalEncodingMapping(org.eclipse.jst.j2ee.webapplication.test.WebapplicationFactoryTest)  Time elapsed: 0 s
15:26:27 test_createServlet(org.eclipse.jst.j2ee.webapplication.test.WebapplicationFactoryTest)  Time elapsed: 0 s
15:26:27 test_createJSPType(org.eclipse.jst.j2ee.webapplication.test.WebapplicationFactoryTest)  Time elapsed: 0 s
15:26:27 test_createSessionConfig(org.eclipse.jst.j2ee.webapplication.test.WebapplicationFactoryTest)  Time elapsed: 0 s
15:26:27 test_createServletMapping(org.eclipse.jst.j2ee.webapplication.test.WebapplicationFactoryTest)  Time elapsed: 0 s
15:26:27 test_createURLPatternType(org.eclipse.jst.j2ee.webapplication.test.WebapplicationFactoryTest)  Time elapsed: 0 s
15:26:27 test_createLocalEncodingMappingList(org.eclipse.jst.j2ee.webapplication.test.WebapplicationFactoryTest)  Time elapsed: 0 s
15:26:27 test_createFilterMapping(org.eclipse.jst.j2ee.webapplication.test.WebapplicationFactoryTest)  Time elapsed: 0 s
15:26:27 test_createAuthConstraint(org.eclipse.jst.j2ee.webapplication.test.WebapplicationFactoryTest)  Time elapsed: 0 s
15:26:27 test_createUserDataConstraint(org.eclipse.jst.j2ee.webapplication.test.WebapplicationFactoryTest)  Time elapsed: 0 s
15:26:27 test_createFilter(org.eclipse.jst.j2ee.webapplication.test.WebapplicationFactoryTest)  Time elapsed: 0 s
15:26:27 test_createRoleNameType(org.eclipse.jst.j2ee.webapplication.test.WebapplicationFactoryTest)  Time elapsed: 0 s
15:26:27 test_createWelcomeFileList(org.eclipse.jst.j2ee.webapplication.test.WebapplicationFactoryTest)  Time elapsed: 0 s
15:26:27 test_createWebApp(org.eclipse.jst.j2ee.webapplication.test.WebapplicationFactoryTest)  Time elapsed: 0 s
15:26:27 test_createInitParam(org.eclipse.jst.j2ee.webapplication.test.WebapplicationFactoryTest)  Time elapsed: 0 s
15:26:27 test_createWelcomeFile(org.eclipse.jst.j2ee.webapplication.test.WebapplicationFactoryTest)  Time elapsed: 0 s
15:26:27 test_getWebapplicationPackage(org.eclipse.jst.j2ee.webapplication.test.WebapplicationFactoryTest)  Time elapsed: 0 s
15:26:27 test_createContextParam(org.eclipse.jst.j2ee.webapplication.test.WebapplicationFactoryTest)  Time elapsed: 0 s
15:26:27 test_createSecurityConstraint(org.eclipse.jst.j2ee.webapplication.test.WebapplicationFactoryTest)  Time elapsed: 0 s
15:26:27 test_createHTTPMethodType(org.eclipse.jst.j2ee.webapplication.test.WebapplicationFactoryTest)  Time elapsed: 0 s
15:26:27 test_createWebResourceCollection(org.eclipse.jst.j2ee.webapplication.test.WebapplicationFactoryTest)  Time elapsed: 0 s
15:26:27 test_createErrorPage(org.eclipse.jst.j2ee.webapplication.test.WebapplicationFactoryTest)  Time elapsed: 0 s
15:26:27 test_createServletType(org.eclipse.jst.j2ee.webapplication.test.WebapplicationFactoryTest)  Time elapsed: 0 s
15:26:27 test_createLoginConfig(org.eclipse.jst.j2ee.webapplication.test.WebapplicationFactoryTest)  Time elapsed: 0 s
15:26:27 test_createSOAPHeader(org.eclipse.jst.j2ee.webservice.wscommon.test.WscommonFactoryTest)  Time elapsed: 0 s
15:26:27 test_createDisplayNameType(org.eclipse.jst.j2ee.webservice.wscommon.test.WscommonFactoryTest)  Time elapsed: 0 s
15:26:27 test_getWscommonPackage(org.eclipse.jst.j2ee.webservice.wscommon.test.WscommonFactoryTest)  Time elapsed: 0 s
15:26:27 test_createDescriptionType(org.eclipse.jst.j2ee.webservice.wscommon.test.WscommonFactoryTest)  Time elapsed: 0 s
15:26:27 test_createPortName(org.eclipse.jst.j2ee.webservice.wscommon.test.WscommonFactoryTest)  Time elapsed: 0 s
15:26:27 test_createSOAPRole(org.eclipse.jst.j2ee.webservice.wscommon.test.WscommonFactoryTest)  Time elapsed: 0 s
15:26:27 test_createInitParam(org.eclipse.jst.j2ee.webservice.wscommon.test.WscommonFactoryTest)  Time elapsed: 0 s
15:26:27 test_createEJBLink(org.eclipse.jst.j2ee.webservice.wsdd.test.WsddFactoryTest)  Time elapsed: 0 s
15:26:27 test_createWSDLPort(org.eclipse.jst.j2ee.webservice.wsdd.test.WsddFactoryTest)  Time elapsed: 0 s
15:26:27 test_createPortComponent(org.eclipse.jst.j2ee.webservice.wsdd.test.WsddFactoryTest)  Time elapsed: 0 s
15:26:27 test_createServiceImplBean(org.eclipse.jst.j2ee.webservice.wsdd.test.WsddFactoryTest)  Time elapsed: 0 s
15:26:27 test_createWebServices(org.eclipse.jst.j2ee.webservice.wsdd.test.WsddFactoryTest)  Time elapsed: 0 s
15:26:27 test_createBeanLink(org.eclipse.jst.j2ee.webservice.wsdd.test.WsddFactoryTest)  Time elapsed: 0 s
15:26:27 test_createWebServiceDescription(org.eclipse.jst.j2ee.webservice.wsdd.test.WsddFactoryTest)  Time elapsed: 0 s
15:26:27 test_createHandler(org.eclipse.jst.j2ee.webservice.wsdd.test.WsddFactoryTest)  Time elapsed: 0 s
15:26:27 test_createServletLink(org.eclipse.jst.j2ee.webservice.wsdd.test.WsddFactoryTest)  Time elapsed: 0.001 s
15:26:27 Running org.eclipse.jst.j2ee.client.test.ApplicationClientTest
15:26:27 Tests run: 4, Failures: 0, Errors: 0, Skipped: 0, Time elapsed: 0.046 s - in org.eclipse.jst.j2ee.client.test.ApplicationClientTest
15:26:28 test_getVersionID(org.eclipse.jst.j2ee.client.test.ApplicationClientTest)  Time elapsed: 0.036 s
15:26:28 test_getJ2EEVersionID(org.eclipse.jst.j2ee.client.test.ApplicationClientTest)  Time elapsed: 0.009 s
15:26:28 test_getCallbackHandlerClassName(org.eclipse.jst.j2ee.client.test.ApplicationClientTest)  Time elapsed: 0.001 s
15:26:28 test_setCallbackHandlerClassName(org.eclipse.jst.j2ee.client.test.ApplicationClientTest)  Time elapsed: 0 s
15:26:28 Running org.eclipse.jst.j2ee.client.test.ClientFactoryTest
15:26:28 Tests run: 2, Failures: 0, Errors: 0, Skipped: 0, Time elapsed: 0.001 s - in org.eclipse.jst.j2ee.client.test.ClientFactoryTest
15:26:28 test_ClientFactory(org.eclipse.jst.j2ee.client.test.ClientFactoryTest)  Time elapsed: 0 s
15:26:28 test_createApplicationClient(org.eclipse.jst.j2ee.client.test.ClientFactoryTest)  Time elapsed: 0 s
15:26:28 Running org.eclipse.jst.j2ee.application.test.ApplicationFactoryTest
15:26:28 Tests run: 6, Failures: 0, Errors: 0, Skipped: 0, Time elapsed: 0.001 s - in org.eclipse.jst.j2ee.application.test.ApplicationFactoryTest
15:26:28 test_createEjbModule(org.eclipse.jst.j2ee.application.test.ApplicationFactoryTest)  Time elapsed: 0 s
15:26:28 test_createApplication(org.eclipse.jst.j2ee.application.test.ApplicationFactoryTest)  Time elapsed: 0 s
15:26:28 test_createConnectorModule(org.eclipse.jst.j2ee.application.test.ApplicationFactoryTest)  Time elapsed: 0 s
15:26:28 test_createWebModule(org.eclipse.jst.j2ee.application.test.ApplicationFactoryTest)  Time elapsed: 0 s
15:26:28 test_createJavaClientModule(org.eclipse.jst.j2ee.application.test.ApplicationFactoryTest)  Time elapsed: 0 s
15:26:28 test_createModule(org.eclipse.jst.j2ee.application.test.ApplicationFactoryTest)  Time elapsed: 0 s
15:26:28 Running org.eclipse.jst.j2ee.application.test.ApplicationTest
15:26:28 Tests run: 7, Failures: 0, Errors: 0, Skipped: 0, Time elapsed: 0.002 s - in org.eclipse.jst.j2ee.application.test.ApplicationTest
15:26:28 test_getVersionID(org.eclipse.jst.j2ee.application.test.ApplicationTest)  Time elapsed: 0.001 s
15:26:28 test_getJ2EEVersionID(org.eclipse.jst.j2ee.application.test.ApplicationTest)  Time elapsed: 0.001 s
15:26:28 test_getSecurityRoleNamed(org.eclipse.jst.j2ee.application.test.ApplicationTest)  Time elapsed: 0 s
15:26:28 test_getModuleHavingAltDD(org.eclipse.jst.j2ee.application.test.ApplicationTest)  Time elapsed: 0 s
15:26:28 test_containsSecurityRole(org.eclipse.jst.j2ee.application.test.ApplicationTest)  Time elapsed: 0 s
15:26:28 test_getModule_2(org.eclipse.jst.j2ee.application.test.ApplicationTest)  Time elapsed: 0 s
15:26:28 test_getFirstModule(org.eclipse.jst.j2ee.application.test.ApplicationTest)  Time elapsed: 0 s
15:26:28 Running org.eclipse.jst.j2ee.jca.test.JcaFactoryTest
15:26:28 Tests run: 16, Failures: 0, Errors: 0, Skipped: 0, Time elapsed: 0.001 s - in org.eclipse.jst.j2ee.jca.test.JcaFactoryTest
15:26:28 test_createResourceAdapter(org.eclipse.jst.j2ee.jca.test.JcaFactoryTest)  Time elapsed: 0 s
15:26:28 test_createInboundResourceAdapter(org.eclipse.jst.j2ee.jca.test.JcaFactoryTest)  Time elapsed: 0 s
15:26:28 test_createActivationSpec(org.eclipse.jst.j2ee.jca.test.JcaFactoryTest)  Time elapsed: 0 s
15:26:28 test_getJcaPackage(org.eclipse.jst.j2ee.jca.test.JcaFactoryTest)  Time elapsed: 0 s
15:26:28 test_createAuthenticationMechanism(org.eclipse.jst.j2ee.jca.test.JcaFactoryTest)  Time elapsed: 0 s
15:26:28 test_createMessageAdapter(org.eclipse.jst.j2ee.jca.test.JcaFactoryTest)  Time elapsed: 0 s
15:26:28 test_createRequiredConfigPropertyType(org.eclipse.jst.j2ee.jca.test.JcaFactoryTest)  Time elapsed: 0 s
15:26:28 test_createConfigProperty(org.eclipse.jst.j2ee.jca.test.JcaFactoryTest)  Time elapsed: 0 s
15:26:28 test_createConnectionDefinition(org.eclipse.jst.j2ee.jca.test.JcaFactoryTest)  Time elapsed: 0 s
15:26:28 test_createAdminObject(org.eclipse.jst.j2ee.jca.test.JcaFactoryTest)  Time elapsed: 0 s
15:26:28 test_JcaFactory(org.eclipse.jst.j2ee.jca.test.JcaFactoryTest)  Time elapsed: 0 s
15:26:28 test_createConnector(org.eclipse.jst.j2ee.jca.test.JcaFactoryTest)  Time elapsed: 0 s
15:26:28 test_createMessageListener(org.eclipse.jst.j2ee.jca.test.JcaFactoryTest)  Time elapsed: 0 s
15:26:28 test_createSecurityPermission(org.eclipse.jst.j2ee.jca.test.JcaFactoryTest)  Time elapsed: 0 s
15:26:28 test_createOutboundResourceAdapter(org.eclipse.jst.j2ee.jca.test.JcaFactoryTest)  Time elapsed: 0 s
15:26:28 test_createLicense(org.eclipse.jst.j2ee.jca.test.JcaFactoryTest)  Time elapsed: 0 s
15:26:28 Running org.eclipse.jst.j2ee.jca.test.ConnectorTest
15:26:28 Tests run: 1, Failures: 0, Errors: 0, Skipped: 0, Time elapsed: 0.002 s - in org.eclipse.jst.j2ee.jca.test.ConnectorTest
15:26:28 test_getVersionID(org.eclipse.jst.j2ee.jca.test.ConnectorTest)  Time elapsed: 0.001 s
15:26:28 Running org.eclipse.jst.j2ee.jsp.test.JspFactoryTest
15:26:28 Tests run: 16, Failures: 0, Errors: 0, Skipped: 0, Time elapsed: 0.001 s - in org.eclipse.jst.j2ee.jsp.test.JspFactoryTest
15:26:28 test_createResourceAdapter(org.eclipse.jst.j2ee.jca.test.JcaFactoryTest)  Time elapsed: 0 s
15:26:28 test_createInboundResourceAdapter(org.eclipse.jst.j2ee.jca.test.JcaFactoryTest)  Time elapsed: 0 s
15:26:28 test_createActivationSpec(org.eclipse.jst.j2ee.jca.test.JcaFactoryTest)  Time elapsed: 0 s
15:26:28 test_getJcaPackage(org.eclipse.jst.j2ee.jca.test.JcaFactoryTest)  Time elapsed: 0 s
15:26:28 test_createAuthenticationMechanism(org.eclipse.jst.j2ee.jca.test.JcaFactoryTest)  Time elapsed: 0 s
15:26:28 test_createMessageAdapter(org.eclipse.jst.j2ee.jca.test.JcaFactoryTest)  Time elapsed: 0 s
15:26:28 test_createRequiredConfigPropertyType(org.eclipse.jst.j2ee.jca.test.JcaFactoryTest)  Time elapsed: 0 s
15:26:28 test_createConfigProperty(org.eclipse.jst.j2ee.jca.test.JcaFactoryTest)  Time elapsed: 0 s
15:26:28 test_createConnectionDefinition(org.eclipse.jst.j2ee.jca.test.JcaFactoryTest)  Time elapsed: 0 s
15:26:28 test_createAdminObject(org.eclipse.jst.j2ee.jca.test.JcaFactoryTest)  Time elapsed: 0 s
15:26:28 test_JcaFactory(org.eclipse.jst.j2ee.jca.test.JcaFactoryTest)  Time elapsed: 0 s
15:26:28 test_createConnector(org.eclipse.jst.j2ee.jca.test.JcaFactoryTest)  Time elapsed: 0 s
15:26:28 test_createMessageListener(org.eclipse.jst.j2ee.jca.test.JcaFactoryTest)  Time elapsed: 0 s
15:26:28 test_createSecurityPermission(org.eclipse.jst.j2ee.jca.test.JcaFactoryTest)  Time elapsed: 0 s
15:26:28 test_createOutboundResourceAdapter(org.eclipse.jst.j2ee.jca.test.JcaFactoryTest)  Time elapsed: 0 s
15:26:28 test_createLicense(org.eclipse.jst.j2ee.jca.test.JcaFactoryTest)  Time elapsed: 0 s
15:26:28 Running org.eclipse.jst.j2ee.webapplication.test.WebapplicationFactoryTest
15:26:28 Tests run: 29, Failures: 0, Errors: 0, Skipped: 0, Time elapsed: 0.003 s - in org.eclipse.jst.j2ee.webapplication.test.WebapplicationFactoryTest
15:26:28 test_createFormLoginConfig(org.eclipse.jst.j2ee.webapplication.test.WebapplicationFactoryTest)  Time elapsed: 0 s
15:26:28 test_createErrorCodeErrorPage(org.eclipse.jst.j2ee.webapplication.test.WebapplicationFactoryTest)  Time elapsed: 0 s
15:26:28 test_createMimeMapping(org.eclipse.jst.j2ee.webapplication.test.WebapplicationFactoryTest)  Time elapsed: 0 s
15:26:28 test_createExceptionTypeErrorPage(org.eclipse.jst.j2ee.webapplication.test.WebapplicationFactoryTest)  Time elapsed: 0 s
15:26:28 test_createTagLibRef(org.eclipse.jst.j2ee.webapplication.test.WebapplicationFactoryTest)  Time elapsed: 0 s
15:26:28 test_createLocalEncodingMapping(org.eclipse.jst.j2ee.webapplication.test.WebapplicationFactoryTest)  Time elapsed: 0 s
15:26:28 test_createServlet(org.eclipse.jst.j2ee.webapplication.test.WebapplicationFactoryTest)  Time elapsed: 0 s
15:26:28 test_createJSPType(org.eclipse.jst.j2ee.webapplication.test.WebapplicationFactoryTest)  Time elapsed: 0 s
15:26:28 test_createSessionConfig(org.eclipse.jst.j2ee.webapplication.test.WebapplicationFactoryTest)  Time elapsed: 0 s
15:26:28 test_createServletMapping(org.eclipse.jst.j2ee.webapplication.test.WebapplicationFactoryTest)  Time elapsed: 0 s
15:26:28 test_createURLPatternType(org.eclipse.jst.j2ee.webapplication.test.WebapplicationFactoryTest)  Time elapsed: 0 s
15:26:28 test_createLocalEncodingMappingList(org.eclipse.jst.j2ee.webapplication.test.WebapplicationFactoryTest)  Time elapsed: 0 s
15:26:28 test_createFilterMapping(org.eclipse.jst.j2ee.webapplication.test.WebapplicationFactoryTest)  Time elapsed: 0 s
15:26:28 test_createAuthConstraint(org.eclipse.jst.j2ee.webapplication.test.WebapplicationFactoryTest)  Time elapsed: 0 s
15:26:28 test_createUserDataConstraint(org.eclipse.jst.j2ee.webapplication.test.WebapplicationFactoryTest)  Time elapsed: 0 s
15:26:28 test_createFilter(org.eclipse.jst.j2ee.webapplication.test.WebapplicationFactoryTest)  Time elapsed: 0 s
15:26:28 test_createRoleNameType(org.eclipse.jst.j2ee.webapplication.test.WebapplicationFactoryTest)  Time elapsed: 0 s
15:26:28 test_createWelcomeFileList(org.eclipse.jst.j2ee.webapplication.test.WebapplicationFactoryTest)  Time elapsed: 0 s
15:26:28 test_createWebApp(org.eclipse.jst.j2ee.webapplication.test.WebapplicationFactoryTest)  Time elapsed: 0 s
15:26:28 test_createInitParam(org.eclipse.jst.j2ee.webapplication.test.WebapplicationFactoryTest)  Time elapsed: 0 s
15:26:28 test_createWelcomeFile(org.eclipse.jst.j2ee.webapplication.test.WebapplicationFactoryTest)  Time elapsed: 0 s
15:26:28 test_getWebapplicationPackage(org.eclipse.jst.j2ee.webapplication.test.WebapplicationFactoryTest)  Time elapsed: 0 s
15:26:28 test_createContextParam(org.eclipse.jst.j2ee.webapplication.test.WebapplicationFactoryTest)  Time elapsed: 0 s
15:26:28 test_createSecurityConstraint(org.eclipse.jst.j2ee.webapplication.test.WebapplicationFactoryTest)  Time elapsed: 0 s
15:26:28 test_createHTTPMethodType(org.eclipse.jst.j2ee.webapplication.test.WebapplicationFactoryTest)  Time elapsed: 0 s
15:26:28 test_createWebResourceCollection(org.eclipse.jst.j2ee.webapplication.test.WebapplicationFactoryTest)  Time elapsed: 0 s
15:26:28 test_createErrorPage(org.eclipse.jst.j2ee.webapplication.test.WebapplicationFactoryTest)  Time elapsed: 0 s
15:26:28 test_createServletType(org.eclipse.jst.j2ee.webapplication.test.WebapplicationFactoryTest)  Time elapsed: 0.001 s
15:26:28 test_createLoginConfig(org.eclipse.jst.j2ee.webapplication.test.WebapplicationFactoryTest)  Time elapsed: 0 s
15:26:28 
15:26:28 Results:
15:26:28 
15:26:28 Failures: 
15:26:28   ResourceTests.testResourceCreation:76 The resource should be unloaded
15:26:28 Errors: 
15:26:28   CopyTests.testAddCopyDirectory:78 » OpenFailure IWAE0037E Could not open /home...
15:26:28   CopyTests.testAddCopyModule:100 » OpenFailure IWAE0037E Could not open /home/j...
15:26:28   CopyTests.testAddCopyModuleFilesToEAR:139 » OpenFailure IWAE0037E Could not op...
15:26:28   CopyTests.testAddCopyStandaloneModule:167 » OpenFailure IWAE0037E Could not op...
15:26:28   CopyTests.testAddRenameAndDelete:184 » OpenFailure IWAE0037E Could not open /h...
15:26:28   CopyTests.testAddRenameAndDeleteStandalone:218 » OpenFailure IWAE0037E Could n...
15:26:28   DefectVerificationTests.testFilterMappingTranslator:83 » OpenFailure IWAE0037E...
15:26:28   DefectVerificationTests.testFormerDefect297:109 » OpenFailure IWAE0037E Could ...
15:26:28   DefectVerificationTests.testReadCrimsonCase:261 » OpenFailure IWAE0037E Could ...
15:26:28   DefectVerificationTests.testSavingEARWhileDeploying:172 » OpenFailure IWAE0037...
15:26:28   DefectVerificationTests.testServiceQNameTranslator:216 » OpenFailure IWAE0037E...
15:26:28   RarFileTests.testJ2Cauth:193 » OpenFailure IWAE0037E Could not open /home/jenk...
15:26:28   RarFileTests.testOpenAndExtract:153 » OpenFailure IWAE0037E Could not open /ho...
15:26:28   RarFileTests.testOpenAndRead:165 » OpenFailure IWAE0037E Could not open /home/...
15:26:28   RarFileTests.testSaveRarEar:178 » OpenFailure IWAE0037E Could not open /home/j...
15:26:28   RarFileTests.testaddCopyModule:114 » OpenFailure IWAE0037E Could not open /hom...
15:26:28   RarFileTests.testexpandRarModule:132 » OpenFailure IWAE0037E Could not open /h...
15:26:28   RarFileTests.testopenRarEar:172 » OpenFailure IWAE0037E Could not open /home/j...
15:26:28   ResourceTests.testResourceDirty:95 » OpenFailure IWAE0037E Could not open /hom...
15:26:28   SaveTests.testSave:63 » OpenFailure IWAE0037E Could not open /home/jenkins/age...
15:26:28   SaveTests.testSaveDirectory:93 » OpenFailure IWAE0037E Could not open /home/je...
15:26:28   SecurityRoleTests.testPushDownCopy:53 » OpenFailure IWAE0037E Could not open /...
15:26:28   SecurityRoleTests.testRollupAddAndPushDown:73 » OpenFailure IWAE0037E Could no...
15:26:28   SimpleTests.testContainerManagedEntityExtensionRead:110 » OpenFailure IWAE0037...
15:26:28   SimpleTests.testEJB11JarAdd:117 » OpenFailure IWAE0037E Could not open /home/j...
15:26:28   SimpleTests.testEJBSetAbstractSchemaName:125 » OpenFailure IWAE0037E Could not...
15:26:28   SimpleTests.testIndexing:142 » OpenFailure IWAE0037E Could not open /home/jenk...
15:26:28   SimpleTests.testIndexingWithCollections:173 » OpenFailure IWAE0037E Could not ...
15:26:28   SimpleTests.testOpenAndExtract1:213 » OpenFailure IWAE0037E Could not open /ho...
15:26:28   SimpleTests.testOpenAndExtract2:233 » OpenFailure IWAE0037E Could not open /ho...
15:26:28   SimpleTests.testOpenAndExtract3:253 » OpenFailure IWAE0037E Could not open /ho...
15:26:28   SimpleTests.testOpenAndRead:265 » OpenFailure IWAE0037E Could not open /home/j...
15:26:28   SimpleTests.testOpenAndSaveAsJarFile:292 » OpenFailure IWAE0037E Could not ope...
15:26:28   SimpleTests.testOpenDirectoryAndSaveAsJarFile:305 » OpenFailure IWAE0037E Coul...
15:26:28   SimpleTests.testReadEmptyTags:425 » OpenFailure IWAE0037E Could not open /home...
15:26:28   SimpleTests.testSafeClose:319 » OpenFailure IWAE0037E Could not open /home/jen...
15:26:28   SimpleTests.testSaveFailure:352 » OpenFailure IWAE0037E Could not open /home/j...
15:26:28   SimpleTests.testXmlValidation:387 » OpenFailure IWAE0037E Could not open /home...
15:26:28   WARFileTests.testAddCopyClass:56 » OpenFailure IWAE0037E Could not open /home/...
15:26:28   WARFileTests.testAddCopyLib:77 » OpenFailure IWAE0037E Could not open /home/je...
15:26:28   WARFileTests.testListClassesAndLibs:96 » OpenFailure IWAE0037E Could not open ...
15:26:28 
15:26:28 Tests run: 887, Failures: 1, Errors: 41, Skipped: 0
15:26:28 
15:26:28 [INFO] 
15:26:33 [INFO] ------------------------------------------------------------------------
15:26:33 [INFO] Skipping org.eclipse.jst.j2ee.tests
15:26:33 [INFO] This project has been banned from the build due to previous failures.
15:26:33 [INFO] ------------------------------------------------------------------------
15:26:33 [INFO] 
15:26:33 [INFO] ------------------------------------------------------------------------
15:26:33 [INFO] Skipping org.eclipse.jst.jee.tests
15:26:33 [INFO] This project has been banned from the build due to previous failures.
15:26:33 [INFO] ------------------------------------------------------------------------
15:26:33 [INFO] 
15:26:33 [INFO] ------------------------------------------------------------------------
15:26:33 [INFO] Skipping org.eclipse.jst.servlet.tests
15:26:33 [INFO] This project has been banned from the build due to previous failures.
15:26:33 [INFO] ------------------------------------------------------------------------
15:26:33 [INFO] 
15:26:33 [INFO] ----< org.eclipse.webtools.javaee:org.eclipse.jst.validation.test >-----
15:26:33 [INFO] Building org.eclipse.jst.validation.test 1.1.300-SNAPSHOT        [47/51]
15:26:33 [INFO] ------------------------[ eclipse-test-plugin ]-------------------------
15:26:33 [INFO] 
15:26:33 [INFO] --- maven-clean-plugin:2.5:clean (default-clean) @ org.eclipse.jst.validation.test ---
15:26:33 [INFO] 
15:26:33 [INFO] --- tycho-packaging-plugin:2.2.0:build-qualifier (default-build-qualifier) @ org.eclipse.jst.validation.test ---
15:26:33 [INFO] The project's OSGi version is 1.1.300.v202103311810
15:26:33 [INFO] 
15:26:33 [INFO] --- tycho-packaging-plugin:2.2.0:validate-id (default-validate-id) @ org.eclipse.jst.validation.test ---
15:26:33 [INFO] 
15:26:33 [INFO] --- tycho-packaging-plugin:2.2.0:validate-version (default-validate-version) @ org.eclipse.jst.validation.test ---
15:26:33 [INFO] 
15:26:33 [INFO] --- build-helper-maven-plugin:3.0.0:regex-property (regex-property) @ org.eclipse.jst.validation.test ---
15:26:33 [INFO] 
15:26:33 [INFO] --- maven-resources-plugin:2.4.3:resources (default-resources) @ org.eclipse.jst.validation.test ---
15:26:33 [WARNING] Using platform encoding (UTF-8 actually) to copy filtered resources, i.e. build is platform dependent!
15:26:33 [INFO] skip non existing resourceDirectory /home/jenkins/agent/workspace/webtools-javaee-gerrit_master/tests/org.eclipse.jst.validation.test/src/main/resources
15:26:33 [INFO] 
15:26:33 [INFO] --- tycho-compiler-plugin:2.2.0:compile (default-compile) @ org.eclipse.jst.validation.test ---
15:26:33 [INFO] Compiling 53 source files to /home/jenkins/agent/workspace/webtools-javaee-gerrit_master/tests/org.eclipse.jst.validation.test/target/classes
15:26:33 [INFO] 
15:26:33 [INFO] --- maven-resources-plugin:2.4.3:testResources (default-testResources) @ org.eclipse.jst.validation.test ---
15:26:33 [WARNING] Using platform encoding (UTF-8 actually) to copy filtered resources, i.e. build is platform dependent!
15:26:33 [INFO] skip non existing resourceDirectory /home/jenkins/agent/workspace/webtools-javaee-gerrit_master/tests/org.eclipse.jst.validation.test/src/test/resources
15:26:33 [INFO] 
15:26:33 [INFO] --- tycho-source-plugin:2.2.0:plugin-source (plugin-source) @ org.eclipse.jst.validation.test ---
15:26:33 [INFO] Building jar: /home/jenkins/agent/workspace/webtools-javaee-gerrit_master/tests/org.eclipse.jst.validation.test/target/org.eclipse.jst.validation.test-1.1.300-SNAPSHOT-sources.jar
15:26:33 [INFO] 
15:26:33 [INFO] --- target-platform-configuration:2.2.0:target-platform (default-target-platform) @ org.eclipse.jst.validation.test ---
15:26:33 [INFO] 
15:26:33 [INFO] --- tycho-packaging-plugin:2.2.0:package-plugin (default-package-plugin) @ org.eclipse.jst.validation.test ---
15:26:33 [INFO] Building jar: /home/jenkins/agent/workspace/webtools-javaee-gerrit_master/tests/org.eclipse.jst.validation.test/validationtest.jar
15:26:33 [INFO] Building jar: /home/jenkins/agent/workspace/webtools-javaee-gerrit_master/tests/org.eclipse.jst.validation.test/target/org.eclipse.jst.validation.test-1.1.300-SNAPSHOT.jar
15:26:34 [INFO] 
15:26:34 [INFO] --- tycho-p2-plugin:2.2.0:p2-metadata-default (default-p2-metadata-default) @ org.eclipse.jst.validation.test ---
15:26:34 [INFO] 
15:26:34 [INFO] --- tycho-surefire-plugin:2.2.0:test (default-test) @ org.eclipse.jst.validation.test ---
15:26:34 [INFO] Executing Test Runtime with timeout 0, logs (if any) will be placed at: /home/jenkins/agent/workspace/webtools-javaee-gerrit_master/tests/org.eclipse.jst.validation.test/target/work/data/.metadata/.log
15:26:34 [INFO] Command line:
15:26:34 	[/opt/tools/java/openjdk/jdk-11/11.0.2+9/bin/java, -Dosgi.noShutdown=false, -Dosgi.os=linux, -Dosgi.ws=gtk, -Dosgi.arch=x86_64, -Dosgi.clean=true, -jar, /home/jenkins/agent/workspace/webtools-javaee-gerrit_master/.repository/p2/osgi/bundle/org.eclipse.equinox.launcher/1.6.200.v20210416-2027/org.eclipse.equinox.launcher-1.6.200.v20210416-2027.jar, -data, /home/jenkins/agent/workspace/webtools-javaee-gerrit_master/tests/org.eclipse.jst.validation.test/target/work/data, -install, /home/jenkins/agent/workspace/webtools-javaee-gerrit_master/tests/org.eclipse.jst.validation.test/target/work, -configuration, /home/jenkins/agent/workspace/webtools-javaee-gerrit_master/tests/org.eclipse.jst.validation.test/target/work/configuration, -application, org.eclipse.tycho.surefire.osgibooter.headlesstest, -testproperties, /home/jenkins/agent/workspace/webtools-javaee-gerrit_master/tests/org.eclipse.jst.validation.test/target/surefire.properties]
15:26:34 Running org.eclipse.jst.validation.test.junit.ValidatorTest
15:26:39 Tests run: 1, Failures: 0, Errors: 0, Skipped: 1, Time elapsed: 0.014 s - in org.eclipse.jst.validation.test.junit.ValidatorTest
15:26:39 org.eclipse.jst.validation.test.junit.ValidatorTest skipped
15:26:39 Running org.eclipse.jst.validation.test.junit.OperationTest
15:26:39 Tests run: 1, Failures: 0, Errors: 0, Skipped: 1, Time elapsed: 0 s - in org.eclipse.jst.validation.test.junit.OperationTest
15:26:39 org.eclipse.jst.validation.test.junit.OperationTest skipped
15:26:39 Running org.eclipse.jst.validation.api.test.ValidationRegistryApiTest
15:26:39 Tests run: 1, Failures: 0, Errors: 0, Skipped: 0, Time elapsed: 0.62 s - in org.eclipse.jst.validation.api.test.ValidationRegistryApiTest
15:26:39 test_getValidator(org.eclipse.jst.validation.api.test.ValidationRegistryApiTest)  Time elapsed: 0.606 s
15:26:39 
15:26:39 Results:
15:26:39 
15:26:39 Tests run: 3, Failures: 0, Errors: 0, Skipped: 2
15:26:39 
15:26:39 [INFO] All tests passed!
15:26:43 [INFO] 
15:26:43 [INFO] --- tycho-pack200a-plugin:2.2.0:normalize (pack200-normalize) @ org.eclipse.jst.validation.test ---
15:26:43 [INFO] Pack200 normalizing jar /home/jenkins/agent/workspace/webtools-javaee-gerrit_master/tests/org.eclipse.jst.validation.test/target/org.eclipse.jst.validation.test-1.1.300-SNAPSHOT.jar
15:26:43 [INFO] 
15:26:43 [INFO] --- eclipse-jarsigner-plugin:1.1.4:sign (sign) @ org.eclipse.jst.validation.test ---
15:26:43 [INFO] Signing of nested jars of '/home/jenkins/agent/workspace/webtools-javaee-gerrit_master/tests/org.eclipse.jst.validation.test/target/org.eclipse.jst.validation.test-1.1.300-SNAPSHOT.jar_unpacked_5397378324592688911/testInput/FWK/BVT/opConstr.jar' is disabled.
15:26:43 [INFO] Signing jar: /home/jenkins/agent/workspace/webtools-javaee-gerrit_master/tests/org.eclipse.jst.validation.test/target/org.eclipse.jst.validation.test-1.1.300-SNAPSHOT.jar_unpacked_5397378324592688911/testInput/FWK/BVT/opConstr.jar
15:26:43 [INFO] Signing of nested jars of '/home/jenkins/agent/workspace/webtools-javaee-gerrit_master/tests/org.eclipse.jst.validation.test/target/org.eclipse.jst.validation.test-1.1.300-SNAPSHOT.jar_unpacked_5397378324592688911/testInput/Properties/aProperties.jar' is disabled.
15:26:45 [INFO] Signing jar: /home/jenkins/agent/workspace/webtools-javaee-gerrit_master/tests/org.eclipse.jst.validation.test/target/org.eclipse.jst.validation.test-1.1.300-SNAPSHOT.jar_unpacked_5397378324592688911/testInput/Properties/aProperties.jar
15:26:45 [INFO] Signing of nested jars of '/home/jenkins/agent/workspace/webtools-javaee-gerrit_master/tests/org.eclipse.jst.validation.test/target/org.eclipse.jst.validation.test-1.1.300-SNAPSHOT.jar_unpacked_5397378324592688911/validationtest.jar' is disabled.
15:26:46 [INFO] Signing jar: /home/jenkins/agent/workspace/webtools-javaee-gerrit_master/tests/org.eclipse.jst.validation.test/target/org.eclipse.jst.validation.test-1.1.300-SNAPSHOT.jar_unpacked_5397378324592688911/validationtest.jar
15:26:46 [INFO] Signing jar: /home/jenkins/agent/workspace/webtools-javaee-gerrit_master/tests/org.eclipse.jst.validation.test/target/org.eclipse.jst.validation.test-1.1.300-SNAPSHOT.jar
15:26:48 [INFO] Signing jar: /home/jenkins/agent/workspace/webtools-javaee-gerrit_master/tests/org.eclipse.jst.validation.test/target/org.eclipse.jst.validation.test-1.1.300-SNAPSHOT-sources.jar
15:26:50 [INFO] 
15:26:51 [INFO] --- tycho-pack200b-plugin:2.2.0:pack (pack200-pack) @ org.eclipse.jst.validation.test ---
15:26:51 [INFO] Pack200 packing jar /home/jenkins/agent/workspace/webtools-javaee-gerrit_master/tests/org.eclipse.jst.validation.test/target/org.eclipse.jst.validation.test-1.1.300-SNAPSHOT.jar
15:26:51 [INFO] 
15:26:51 [INFO] --- tycho-p2-plugin:2.2.0:p2-metadata (p2-metadata) @ org.eclipse.jst.validation.test ---
15:26:51 [INFO] No baseline version MavenProject: org.eclipse.webtools.javaee:org.eclipse.jst.validation.test:1.1.300-SNAPSHOT @ /home/jenkins/agent/workspace/webtools-javaee-gerrit_master/tests/org.eclipse.jst.validation.test/pom.xml
15:26:51 [INFO] 
15:26:51 [INFO] --- maven-install-plugin:2.3.1:install (default-install) @ org.eclipse.jst.validation.test ---
15:26:51 [INFO] Installing /home/jenkins/agent/workspace/webtools-javaee-gerrit_master/tests/org.eclipse.jst.validation.test/target/org.eclipse.jst.validation.test-1.1.300-SNAPSHOT.jar to /home/jenkins/agent/workspace/webtools-javaee-gerrit_master/.repository/org/eclipse/webtools/javaee/org.eclipse.jst.validation.test/1.1.300-SNAPSHOT/org.eclipse.jst.validation.test-1.1.300-SNAPSHOT.jar
15:26:51 [INFO] Installing /home/jenkins/agent/workspace/webtools-javaee-gerrit_master/tests/org.eclipse.jst.validation.test/pom.xml to /home/jenkins/agent/workspace/webtools-javaee-gerrit_master/.repository/org/eclipse/webtools/javaee/org.eclipse.jst.validation.test/1.1.300-SNAPSHOT/org.eclipse.jst.validation.test-1.1.300-SNAPSHOT.pom
15:26:52 [INFO] Installing /home/jenkins/agent/workspace/webtools-javaee-gerrit_master/tests/org.eclipse.jst.validation.test/target/org.eclipse.jst.validation.test-1.1.300-SNAPSHOT-sources.jar to /home/jenkins/agent/workspace/webtools-javaee-gerrit_master/.repository/org/eclipse/webtools/javaee/org.eclipse.jst.validation.test/1.1.300-SNAPSHOT/org.eclipse.jst.validation.test-1.1.300-SNAPSHOT-sources.jar
15:26:52 [INFO] Installing /home/jenkins/agent/workspace/webtools-javaee-gerrit_master/tests/org.eclipse.jst.validation.test/target/org.eclipse.jst.validation.test-1.1.300-SNAPSHOT.jar.pack.gz to /home/jenkins/agent/workspace/webtools-javaee-gerrit_master/.repository/org/eclipse/webtools/javaee/org.eclipse.jst.validation.test/1.1.300-SNAPSHOT/org.eclipse.jst.validation.test-1.1.300-SNAPSHOT-pack200.jar.pack.gz
15:26:52 [INFO] Installing /home/jenkins/agent/workspace/webtools-javaee-gerrit_master/tests/org.eclipse.jst.validation.test/target/p2content.xml to /home/jenkins/agent/workspace/webtools-javaee-gerrit_master/.repository/org/eclipse/webtools/javaee/org.eclipse.jst.validation.test/1.1.300-SNAPSHOT/org.eclipse.jst.validation.test-1.1.300-SNAPSHOT-p2metadata.xml
15:26:52 [INFO] Installing /home/jenkins/agent/workspace/webtools-javaee-gerrit_master/tests/org.eclipse.jst.validation.test/target/p2artifacts.xml to /home/jenkins/agent/workspace/webtools-javaee-gerrit_master/.repository/org/eclipse/webtools/javaee/org.eclipse.jst.validation.test/1.1.300-SNAPSHOT/org.eclipse.jst.validation.test-1.1.300-SNAPSHOT-p2artifacts.xml
15:26:52 [INFO] 
15:26:53 [INFO] --- tycho-p2-plugin:2.2.0:update-local-index (default-update-local-index) @ org.eclipse.jst.validation.test ---
15:26:53 [INFO] 
15:26:53 [INFO] ------------------------------------------------------------------------
15:26:53 [INFO] Skipping org.eclipse.webtools.javaee.site
15:26:53 [INFO] This project has been banned from the build due to previous failures.
15:26:53 [INFO] ------------------------------------------------------------------------
15:26:53 [INFO] ------------------------------------------------------------------------
15:26:53 [INFO] Reactor Summary:
15:26:53 [INFO] 
15:26:53 [INFO] org.eclipse.webtools.javaee 3.6.0-SNAPSHOT ......... SUCCESS [ 46.024 s]
15:26:53 [INFO] javaee.docs 3.6.0-SNAPSHOT ......................... SUCCESS [  0.024 s]
15:26:53 [INFO] org.eclipse.jst.ejb.doc.user 1.1.301-SNAPSHOT ...... SUCCESS [ 31.772 s]
15:26:53 [INFO] org.eclipse.jst.ejb.ui.infopop 1.0.300-SNAPSHOT .... SUCCESS [  4.384 s]
15:26:53 [INFO] org.eclipse.jst.j2ee.doc.user 1.1.400-SNAPSHOT ..... SUCCESS [01:06 min]
15:26:53 [INFO] org.eclipse.jst.j2ee.infopop 1.0.300-SNAPSHOT ...... SUCCESS [ 25.451 s]
15:26:53 [INFO] org.eclipse.jst.servlet.ui.infopop 1.0.500-SNAPSHOT  SUCCESS [  4.173 s]
15:26:53 [INFO] javaee.plugins 3.6.0-SNAPSHOT ...................... SUCCESS [  0.185 s]
15:26:53 [INFO] org.eclipse.jem.proxy 2.1.0-SNAPSHOT ............... SUCCESS [ 12.826 s]
15:26:53 [INFO] org.eclipse.jem 2.0.600-SNAPSHOT ................... SUCCESS [  7.891 s]
15:26:53 [INFO] org.eclipse.jem.workbench 2.1.0-SNAPSHOT ........... SUCCESS [  5.999 s]
15:26:53 [INFO] org.eclipse.jem.beaninfo.vm.common 2.1.0-SNAPSHOT .. SUCCESS [  3.781 s]
15:26:53 [INFO] org.eclipse.jem.beaninfo.vm 2.1.0-SNAPSHOT ......... SUCCESS [  3.544 s]
15:26:53 [INFO] org.eclipse.jem.beaninfo 2.0.300-SNAPSHOT .......... SUCCESS [  6.422 s]
15:26:53 [INFO] org.eclipse.jst.common.annotations.core 1.1.300-SNAPSHOT SUCCESS [  5.514 s]
15:26:53 [INFO] org.eclipse.jst.common.annotations.controller 1.1.300-SNAPSHOT SUCCESS [  4.748 s]
15:26:53 [INFO] org.eclipse.jst.common.annotations.ui 1.1.300-SNAPSHOT SUCCESS [  4.757 s]
15:26:53 [INFO] org.eclipse.jst.common.frameworks 1.1.701-SNAPSHOT . SUCCESS [  5.192 s]
15:26:53 [INFO] org.eclipse.jst.common.ui 1.0.301-SNAPSHOT ......... SUCCESS [  4.475 s]
15:26:53 [INFO] org.eclipse.jst.j2ee.core 1.4.3-SNAPSHOT ........... SUCCESS [ 29.609 s]
15:26:53 [INFO] org.eclipse.jst.j2ee 1.2.500-SNAPSHOT .............. SUCCESS [ 12.158 s]
15:26:53 [INFO] org.eclipse.jst.j2ee.jca 1.1.1000-SNAPSHOT ......... SUCCESS [ 11.023 s]
15:26:53 [INFO] org.eclipse.jst.jee 1.0.1000-SNAPSHOT .............. SUCCESS [  4.560 s]
15:26:53 [INFO] org.eclipse.jst.j2ee.ejb 1.1.901-SNAPSHOT .......... SUCCESS [  9.724 s]
15:26:53 [INFO] org.eclipse.jst.j2ee.ejb.annotation.model 1.1.500-SNAPSHOT SUCCESS [  6.016 s]
15:26:53 [INFO] org.eclipse.jst.j2ee.web 1.1.1000-SNAPSHOT ......... SUCCESS [ 15.174 s]
15:26:53 [INFO] org.eclipse.jst.j2ee.ui 1.1.931-SNAPSHOT ........... SUCCESS [ 30.455 s]
15:26:53 [INFO] org.eclipse.jst.j2ee.jca.ui 1.1.601-SNAPSHOT ....... SUCCESS [  9.420 s]
15:26:53 [INFO] org.eclipse.jst.j2ee.navigator.ui 1.1.800-SNAPSHOT . SUCCESS [  4.824 s]
15:26:53 [INFO] org.eclipse.jst.jee.ui 1.0.901-SNAPSHOT ............ SUCCESS [  4.440 s]
15:26:53 [INFO] org.eclipse.jst.ejb.ui 1.1.911-SNAPSHOT ............ SUCCESS [ 15.778 s]
15:26:53 [INFO] org.eclipse.jst.j2ee.ejb.annotations.emitter 1.1.300-SNAPSHOT SUCCESS [  4.839 s]
15:26:53 [INFO] org.eclipse.jst.j2ee.ejb.annotations.ui 1.2.0-SNAPSHOT SUCCESS [  5.930 s]
15:26:53 [INFO] org.eclipse.jst.j2ee.ejb.annotations.xdoclet 1.2.300-SNAPSHOT SUCCESS [  6.508 s]
15:26:53 [INFO] org.eclipse.jst.j2ee.webservice 1.1.700-SNAPSHOT ... SUCCESS [  6.217 s]
15:26:53 [INFO] org.eclipse.jst.j2ee.webservice.ui 1.1.800-SNAPSHOT  SUCCESS [  3.621 s]
15:26:53 [INFO] org.eclipse.jst.j2ee.xdoclet.runtime 1.2.0-SNAPSHOT  SUCCESS [  7.295 s]
15:26:53 [INFO] org.eclipse.jst.jee.ejb 1.0.500-SNAPSHOT ........... SUCCESS [  4.397 s]
15:26:53 [INFO] org.eclipse.jst.jee.web 1.0.702-SNAPSHOT ........... SUCCESS [  8.051 s]
15:26:53 [INFO] org.eclipse.jst.servlet.ui 1.1.1000-SNAPSHOT ....... SUCCESS [  7.956 s]
15:26:53 [INFO] org.eclipse.wtp.jee.capabilities 1.0.100-SNAPSHOT .. SUCCESS [  5.069 s]
15:26:53 [INFO] javaee.tests 3.6.0-SNAPSHOT ........................ SUCCESS [  0.093 s]
15:26:53 [INFO] org.eclipse.jst.validation.sample 1.1.100-SNAPSHOT . SUCCESS [  5.780 s]
15:26:53 [INFO] org.eclipse.jst.ejb.ui.tests 1.0.0-SNAPSHOT ........ SUCCESS [ 19.839 s]
15:26:53 [INFO] org.eclipse.jem.tests 1.3.0-SNAPSHOT ............... SUCCESS [  9.659 s]
15:26:53 [INFO] org.eclipse.jst.j2ee.core.tests 1.1.600-SNAPSHOT ... FAILURE [ 44.748 s]
15:26:53 [INFO] org.eclipse.jst.j2ee.tests 1.1.800-SNAPSHOT ........ SKIPPED
15:26:53 [INFO] org.eclipse.jst.jee.tests 1.0.100-SNAPSHOT ......... SKIPPED
15:26:53 [INFO] org.eclipse.jst.servlet.tests 1.2.0-SNAPSHOT ....... SKIPPED
15:26:53 [INFO] org.eclipse.jst.validation.test 1.1.300-SNAPSHOT ... SUCCESS [ 19.548 s]
15:26:53 [INFO] org.eclipse.webtools.javaee.site 3.6.0-SNAPSHOT .... SKIPPED
15:26:53 [INFO] ------------------------------------------------------------------------
15:26:53 [INFO] BUILD FAILURE
15:26:53 [INFO] ------------------------------------------------------------------------
15:26:53 [INFO] Total time:  13:17 min
15:26:53 [INFO] Finished at: 2021-05-25T19:26:53Z
15:26:53 [INFO] ------------------------------------------------------------------------
15:26:53 [ERROR] Failed to execute goal org.eclipse.tycho:tycho-surefire-plugin:2.2.0:test (default-test) on project org.eclipse.jst.j2ee.core.tests: There are test failures.
15:26:53 [ERROR] 
15:26:53 [ERROR] Please refer to /home/jenkins/agent/workspace/webtools-javaee-gerrit_master/tests/org.eclipse.jst.j2ee.core.tests/target/surefire-reports for the individual test results.
15:26:53 [ERROR] -> [Help 1]
15:26:53 org.apache.maven.lifecycle.LifecycleExecutionException: Failed to execute goal org.eclipse.tycho:tycho-surefire-plugin:2.2.0:test (default-test) on project org.eclipse.jst.j2ee.core.tests: There are test failures.
15:26:53 
15:26:53 Please refer to /home/jenkins/agent/workspace/webtools-javaee-gerrit_master/tests/org.eclipse.jst.j2ee.core.tests/target/surefire-reports for the individual test results.
15:26:53     at org.apache.maven.lifecycle.internal.MojoExecutor.execute (MojoExecutor.java:215)
15:26:53     at org.apache.maven.lifecycle.internal.MojoExecutor.execute (MojoExecutor.java:156)
15:26:53     at org.apache.maven.lifecycle.internal.MojoExecutor.execute (MojoExecutor.java:148)
15:26:53     at org.apache.maven.lifecycle.internal.LifecycleModuleBuilder.buildProject (LifecycleModuleBuilder.java:117)
15:26:53     at org.apache.maven.lifecycle.internal.LifecycleModuleBuilder.buildProject (LifecycleModuleBuilder.java:81)
15:26:53     at org.apache.maven.lifecycle.internal.builder.singlethreaded.SingleThreadedBuilder.build (SingleThreadedBuilder.java:56)
15:26:53     at org.apache.maven.lifecycle.internal.LifecycleStarter.execute (LifecycleStarter.java:128)
15:26:53     at org.apache.maven.DefaultMaven.doExecute (DefaultMaven.java:305)
15:26:53     at org.apache.maven.DefaultMaven.doExecute (DefaultMaven.java:192)
15:26:53     at org.apache.maven.DefaultMaven.execute (DefaultMaven.java:105)
15:26:53     at org.apache.maven.cli.MavenCli.execute (MavenCli.java:957)
15:26:53     at org.apache.maven.cli.MavenCli.doMain (MavenCli.java:289)
15:26:53     at org.apache.maven.cli.MavenCli.main (MavenCli.java:193)
15:26:53     at jdk.internal.reflect.NativeMethodAccessorImpl.invoke0 (Native Method)
15:26:53     at jdk.internal.reflect.NativeMethodAccessorImpl.invoke (NativeMethodAccessorImpl.java:62)
15:26:53     at jdk.internal.reflect.DelegatingMethodAccessorImpl.invoke (DelegatingMethodAccessorImpl.java:43)
15:26:53     at java.lang.reflect.Method.invoke (Method.java:566)
15:26:53     at org.codehaus.plexus.classworlds.launcher.Launcher.launchEnhanced (Launcher.java:282)
15:26:53     at org.codehaus.plexus.classworlds.launcher.Launcher.launch (Launcher.java:225)
15:26:53     at org.codehaus.plexus.classworlds.launcher.Launcher.mainWithExitCode (Launcher.java:406)
15:26:53     at org.codehaus.plexus.classworlds.launcher.Launcher.main (Launcher.java:347)
15:26:53 Caused by: org.apache.maven.plugin.MojoFailureException: There are test failures.
15:26:53 
15:26:53 Please refer to /home/jenkins/agent/workspace/webtools-javaee-gerrit_master/tests/org.eclipse.jst.j2ee.core.tests/target/surefire-reports for the individual test results.
15:26:53     at org.eclipse.tycho.surefire.TestMojo.runTest (TestMojo.java:1070)
15:26:53     at org.eclipse.tycho.surefire.TestMojo.execute (TestMojo.java:714)
15:26:53     at org.apache.maven.plugin.DefaultBuildPluginManager.executeMojo (DefaultBuildPluginManager.java:137)
15:26:53     at org.apache.maven.lifecycle.internal.MojoExecutor.execute (MojoExecutor.java:210)
15:26:53     at org.apache.maven.lifecycle.internal.MojoExecutor.execute (MojoExecutor.java:156)
15:26:53     at org.apache.maven.lifecycle.internal.MojoExecutor.execute (MojoExecutor.java:148)
15:26:53     at org.apache.maven.lifecycle.internal.LifecycleModuleBuilder.buildProject (LifecycleModuleBuilder.java:117)
15:26:53     at org.apache.maven.lifecycle.internal.LifecycleModuleBuilder.buildProject (LifecycleModuleBuilder.java:81)
15:26:53     at org.apache.maven.lifecycle.internal.builder.singlethreaded.SingleThreadedBuilder.build (SingleThreadedBuilder.java:56)
15:26:53     at org.apache.maven.lifecycle.internal.LifecycleStarter.execute (LifecycleStarter.java:128)
15:26:53     at org.apache.maven.DefaultMaven.doExecute (DefaultMaven.java:305)
15:26:53     at org.apache.maven.DefaultMaven.doExecute (DefaultMaven.java:192)
15:26:53     at org.apache.maven.DefaultMaven.execute (DefaultMaven.java:105)
15:26:53     at org.apache.maven.cli.MavenCli.execute (MavenCli.java:957)
15:26:53     at org.apache.maven.cli.MavenCli.doMain (MavenCli.java:289)
15:26:53     at org.apache.maven.cli.MavenCli.main (MavenCli.java:193)
15:26:53     at jdk.internal.reflect.NativeMethodAccessorImpl.invoke0 (Native Method)
15:26:53     at jdk.internal.reflect.NativeMethodAccessorImpl.invoke (NativeMethodAccessorImpl.java:62)
15:26:53     at jdk.internal.reflect.DelegatingMethodAccessorImpl.invoke (DelegatingMethodAccessorImpl.java:43)
15:26:53     at java.lang.reflect.Method.invoke (Method.java:566)
15:26:53     at org.codehaus.plexus.classworlds.launcher.Launcher.launchEnhanced (Launcher.java:282)
15:26:53     at org.codehaus.plexus.classworlds.launcher.Launcher.launch (Launcher.java:225)
15:26:53     at org.codehaus.plexus.classworlds.launcher.Launcher.mainWithExitCode (Launcher.java:406)
15:26:53     at org.codehaus.plexus.classworlds.launcher.Launcher.main (Launcher.java:347)
15:26:53 [ERROR] 
15:26:53 [ERROR] Re-run Maven using the -X switch to enable full debug logging.
15:26:53 [ERROR] 
15:26:53 [ERROR] For more information about the errors and possible solutions, please read the following articles:
15:26:53 [ERROR] [Help 1] http://cwiki.apache.org/confluence/display/MAVEN/MojoFailureException
15:26:53 [ERROR] 
15:26:53 [ERROR] After correcting the problems, you can resume the build with the command
15:26:53 [ERROR]   mvn <args> -rf :org.eclipse.jst.j2ee.core.tests
15:26:53 Build step 'Invoke top-level Maven targets' marked build as failure
15:26:56 Taking screenshot.
15:26:56 [webtools-javaee-gerrit_master] $ echo $XAUTHORITY
15:26:56 /home/jenkins/agent/workspace/webtools-javaee-gerrit_master/.Xauthority-17384122644004298727
15:26:56 [webtools-javaee-gerrit_master] $ ls -l $XAUTHORITY
15:26:56 -rw-r--r--. 1 jenkins 1000750000 0 May 25 19:13 /home/jenkins/agent/workspace/webtools-javaee-gerrit_master/.Xauthority-17384122644004298727
15:26:56 [webtools-javaee-gerrit_master] $ import -window root -display :70 screenshot.jpg
15:26:56 Terminating xvnc.
15:26:56 Recording test results
15:27:05 [Checks API] No suitable checks publisher found.
15:27:06 Finished: FAILURE