Console Output

Skipping 641 KB.. Full Log
    	at junit.framework.TestResult$1.protect(TestResult.java:122)
15:09:21     	at junit.framework.TestResult.runProtected(TestResult.java:142)
15:09:21     	at junit.framework.TestResult.run(TestResult.java:125)
15:09:21     	at junit.framework.TestCase.run(TestCase.java:130)
15:09:21     	at junit.framework.TestSuite.runTest(TestSuite.java:241)
15:09:21     	at junit.framework.TestSuite.run(TestSuite.java:236)
15:09:21     	at org.junit.internal.runners.JUnit38ClassRunner.run(JUnit38ClassRunner.java:90)
15:09:21     	at org.apache.maven.surefire.junit4.JUnit4Provider.execute(JUnit4Provider.java:365)
15:09:21     	at org.apache.maven.surefire.junit4.JUnit4Provider.executeWithRerun(JUnit4Provider.java:273)
15:09:21     	at org.apache.maven.surefire.junit4.JUnit4Provider.executeTestSet(JUnit4Provider.java:238)
15:09:21     	at org.apache.maven.surefire.junit4.JUnit4Provider.invoke(JUnit4Provider.java:159)
15:09:21     	at java.base/jdk.internal.reflect.NativeMethodAccessorImpl.invoke0(Native Method)
15:09:21     	at java.base/jdk.internal.reflect.NativeMethodAccessorImpl.invoke(NativeMethodAccessorImpl.java:62)
15:09:21     	at java.base/jdk.internal.reflect.DelegatingMethodAccessorImpl.invoke(DelegatingMethodAccessorImpl.java:43)
15:09:21     	at java.base/java.lang.reflect.Method.invoke(Method.java:566)
15:09:21     	at org.apache.maven.surefire.util.ReflectionUtils.invokeMethodWithArray2(ReflectionUtils.java:206)
15:09:21     	at org.apache.maven.surefire.booter.ProviderFactory$ProviderProxy.invoke(ProviderFactory.java:161)
15:09:21     	at org.apache.maven.surefire.booter.ProviderFactory.invokeProvider(ProviderFactory.java:84)
15:09:21     	at org.eclipse.tycho.surefire.osgibooter.OsgiSurefireBooter.run(OsgiSurefireBooter.java:116)
15:09:21     	at org.eclipse.tycho.surefire.osgibooter.HeadlessTestApplication.start(HeadlessTestApplication.java:23)
15:09:21     	at org.eclipse.equinox.internal.app.EclipseAppHandle.run(EclipseAppHandle.java:203)
15:09:21     	at org.eclipse.core.runtime.internal.adaptor.EclipseAppLauncher.runApplication(EclipseAppLauncher.java:134)
15:09:21     	at org.eclipse.core.runtime.internal.adaptor.EclipseAppLauncher.start(EclipseAppLauncher.java:104)
15:09:21     	at org.eclipse.core.runtime.adaptor.EclipseStarter.run(EclipseStarter.java:401)
15:09:21     	at org.eclipse.core.runtime.adaptor.EclipseStarter.run(EclipseStarter.java:255)
15:09:21     	at java.base/jdk.internal.reflect.NativeMethodAccessorImpl.invoke0(Native Method)
15:09:21     	at java.base/jdk.internal.reflect.NativeMethodAccessorImpl.invoke(NativeMethodAccessorImpl.java:62)
15:09:21     	at java.base/jdk.internal.reflect.DelegatingMethodAccessorImpl.invoke(DelegatingMethodAccessorImpl.java:43)
15:09:21     	at java.base/java.lang.reflect.Method.invoke(Method.java:566)
15:09:21     	at org.eclipse.equinox.launcher.Main.invokeFramework(Main.java:654)
15:09:21     	at org.eclipse.equinox.launcher.Main.basicRun(Main.java:591)
15:09:21     	at org.eclipse.equinox.launcher.Main.run(Main.java:1462)
15:09:21     	at org.eclipse.equinox.launcher.Main.main(Main.java:1435)
15:09:21 
15:09:21 *** ERROR ***: Tue May 25 19:09:21 UTC 2021    IWAE0037E Could not open /home/jenkins/agent/workspace/webtools-javaee-gerrit_master/tests/org.eclipse.jst.j2ee.core.tests/commonArchiveResources/WSSecured_InsuranceServices_EJB_WS.ear
15:09:21 
15:09:21 *** ERROR ***: Tue May 25 19:09:21 UTC 2021    java.io.FileNotFoundException: IWAE0036E URI Name: /home/jenkins/agent/workspace/webtools-javaee-gerrit_master/tests/org.eclipse.jst.j2ee.core.tests/commonArchiveResources/WSSecured_InsuranceServices_EJB_WS.ear; File name: /home/jenkins/agent/workspace/webtools-javaee-gerrit_master/tests/org.eclipse.jst.j2ee.core.tests/commonArchiveResources/WSSecured_InsuranceServices_EJB_WS.ear
15:09:21     	at org.eclipse.jst.j2ee.commonarchivecore.internal.impl.CommonarchiveFactoryImpl.createLoadStrategy(CommonarchiveFactoryImpl.java:342)
15:09:21     	at org.eclipse.jst.j2ee.commonarchivecore.internal.impl.CommonarchiveFactoryImpl.primOpenArchive(CommonarchiveFactoryImpl.java:876)
15:09:21     	at org.eclipse.jst.j2ee.commonarchivecore.internal.impl.CommonarchiveFactoryImpl.openEARFile(CommonarchiveFactoryImpl.java:639)
15:09:21     	at org.eclipse.jst.j2ee.archive.test.DefectVerificationTests.testServiceQNameTranslator(DefectVerificationTests.java:216)
15:09:21     	at java.base/jdk.internal.reflect.NativeMethodAccessorImpl.invoke0(Native Method)
15:09:21     	at java.base/jdk.internal.reflect.NativeMethodAccessorImpl.invoke(NativeMethodAccessorImpl.java:62)
15:09:21     	at java.base/jdk.internal.reflect.DelegatingMethodAccessorImpl.invoke(DelegatingMethodAccessorImpl.java:43)
15:09:21     	at java.base/java.lang.reflect.Method.invoke(Method.java:566)
15:09:21     	at junit.framework.TestCase.runTest(TestCase.java:177)
15:09:21     	at junit.framework.TestCase.runBare(TestCase.java:142)
15:09:21     	at junit.framework.TestResult$1.protect(TestResult.java:122)
15:09:21     	at junit.framework.TestResult.runProtected(TestResult.java:142)
15:09:21     	at junit.framework.TestResult.run(TestResult.java:125)
15:09:21     	at junit.framework.TestCase.run(TestCase.java:130)
15:09:21     	at junit.framework.TestSuite.runTest(TestSuite.java:241)
15:09:21     	at junit.framework.TestSuite.run(TestSuite.java:236)
15:09:21     	at org.junit.internal.runners.JUnit38ClassRunner.run(JUnit38ClassRunner.java:90)
15:09:21     	at org.apache.maven.surefire.junit4.JUnit4Provider.execute(JUnit4Provider.java:365)
15:09:21     	at org.apache.maven.surefire.junit4.JUnit4Provider.executeWithRerun(JUnit4Provider.java:273)
15:09:21     	at org.apache.maven.surefire.junit4.JUnit4Provider.executeTestSet(JUnit4Provider.java:238)
15:09:21     	at org.apache.maven.surefire.junit4.JUnit4Provider.invoke(JUnit4Provider.java:159)
15:09:21     	at java.base/jdk.internal.reflect.NativeMethodAccessorImpl.invoke0(Native Method)
15:09:21     	at java.base/jdk.internal.reflect.NativeMethodAccessorImpl.invoke(NativeMethodAccessorImpl.java:62)
15:09:21     	at java.base/jdk.internal.reflect.DelegatingMethodAccessorImpl.invoke(DelegatingMethodAccessorImpl.java:43)
15:09:21     	at java.base/java.lang.reflect.Method.invoke(Method.java:566)
15:09:21     	at org.apache.maven.surefire.util.ReflectionUtils.invokeMethodWithArray2(ReflectionUtils.java:206)
15:09:21     	at org.apache.maven.surefire.booter.ProviderFactory$ProviderProxy.invoke(ProviderFactory.java:161)
15:09:21     	at org.apache.maven.surefire.booter.ProviderFactory.invokeProvider(ProviderFactory.java:84)
15:09:21     	at org.eclipse.tycho.surefire.osgibooter.OsgiSurefireBooter.run(OsgiSurefireBooter.java:116)
15:09:21     	at org.eclipse.tycho.surefire.osgibooter.HeadlessTestApplication.start(HeadlessTestApplication.java:23)
15:09:21     	at org.eclipse.equinox.internal.app.EclipseAppHandle.run(EclipseAppHandle.java:203)
15:09:21     	at org.eclipse.core.runtime.internal.adaptor.EclipseAppLauncher.runApplication(EclipseAppLauncher.java:134)
15:09:21     	at org.eclipse.core.runtime.internal.adaptor.EclipseAppLauncher.start(EclipseAppLauncher.java:104)
15:09:21     	at org.eclipse.core.runtime.adaptor.EclipseStarter.run(EclipseStarter.java:401)
15:09:21     	at org.eclipse.core.runtime.adaptor.EclipseStarter.run(EclipseStarter.java:255)
15:09:21     	at java.base/jdk.internal.reflect.NativeMethodAccessorImpl.invoke0(Native Method)
15:09:21     	at java.base/jdk.internal.reflect.NativeMethodAccessorImpl.invoke(NativeMethodAccessorImpl.java:62)
15:09:21     	at java.base/jdk.internal.reflect.DelegatingMethodAccessorImpl.invoke(DelegatingMethodAccessorImpl.java:43)
15:09:21     	at java.base/java.lang.reflect.Method.invoke(Method.java:566)
15:09:21     	at org.eclipse.equinox.launcher.Main.invokeFramework(Main.java:654)
15:09:21     	at org.eclipse.equinox.launcher.Main.basicRun(Main.java:591)
15:09:21     	at org.eclipse.equinox.launcher.Main.run(Main.java:1462)
15:09:21     	at org.eclipse.equinox.launcher.Main.main(Main.java:1435)
15:09:21 
15:09:21 *** ERROR ***: Tue May 25 19:09:21 UTC 2021    java.io.FileNotFoundException: IWAE0036E URI Name: /home/jenkins/agent/workspace/webtools-javaee-gerrit_master/tests/org.eclipse.jst.j2ee.core.tests/commonArchiveResources/WSSecured_InsuranceServices_EJB_WS.ear; File name: /home/jenkins/agent/workspace/webtools-javaee-gerrit_master/tests/org.eclipse.jst.j2ee.core.tests/commonArchiveResources/WSSecured_InsuranceServices_EJB_WS.ear
15:09:21     	at org.eclipse.jst.j2ee.commonarchivecore.internal.impl.CommonarchiveFactoryImpl.createLoadStrategy(CommonarchiveFactoryImpl.java:342)
15:09:21     	at org.eclipse.jst.j2ee.commonarchivecore.internal.impl.CommonarchiveFactoryImpl.primOpenArchive(CommonarchiveFactoryImpl.java:876)
15:09:21     	at org.eclipse.jst.j2ee.commonarchivecore.internal.impl.CommonarchiveFactoryImpl.openEARFile(CommonarchiveFactoryImpl.java:639)
15:09:21     	at org.eclipse.jst.j2ee.archive.test.DefectVerificationTests.testServiceQNameTranslator(DefectVerificationTests.java:216)
15:09:21     	at java.base/jdk.internal.reflect.NativeMethodAccessorImpl.invoke0(Native Method)
15:09:21     	at java.base/jdk.internal.reflect.NativeMethodAccessorImpl.invoke(NativeMethodAccessorImpl.java:62)
15:09:21     	at java.base/jdk.internal.reflect.DelegatingMethodAccessorImpl.invoke(DelegatingMethodAccessorImpl.java:43)
15:09:21     	at java.base/java.lang.reflect.Method.invoke(Method.java:566)
15:09:21     	at junit.framework.TestCase.runTest(TestCase.java:177)
15:09:21     	at junit.framework.TestCase.runBare(TestCase.java:142)
15:09:21     	at junit.framework.TestResult$1.protect(TestResult.java:122)
15:09:21     	at junit.framework.TestResult.runProtected(TestResult.java:142)
15:09:21     	at junit.framework.TestResult.run(TestResult.java:125)
15:09:21     	at junit.framework.TestCase.run(TestCase.java:130)
15:09:21     	at junit.framework.TestSuite.runTest(TestSuite.java:241)
15:09:21     	at junit.framework.TestSuite.run(TestSuite.java:236)
15:09:21     	at org.junit.internal.runners.JUnit38ClassRunner.run(JUnit38ClassRunner.java:90)
15:09:21     	at org.apache.maven.surefire.junit4.JUnit4Provider.execute(JUnit4Provider.java:365)
15:09:21     	at org.apache.maven.surefire.junit4.JUnit4Provider.executeWithRerun(JUnit4Provider.java:273)
15:09:21     	at org.apache.maven.surefire.junit4.JUnit4Provider.executeTestSet(JUnit4Provider.java:238)
15:09:21     	at org.apache.maven.surefire.junit4.JUnit4Provider.invoke(JUnit4Provider.java:159)
15:09:21     	at java.base/jdk.internal.reflect.NativeMethodAccessorImpl.invoke0(Native Method)
15:09:21     	at java.base/jdk.internal.reflect.NativeMethodAccessorImpl.invoke(NativeMethodAccessorImpl.java:62)
15:09:21     	at java.base/jdk.internal.reflect.DelegatingMethodAccessorImpl.invoke(DelegatingMethodAccessorImpl.java:43)
15:09:21     	at java.base/java.lang.reflect.Method.invoke(Method.java:566)
15:09:21     	at org.apache.maven.surefire.util.ReflectionUtils.invokeMethodWithArray2(ReflectionUtils.java:206)
15:09:21     	at org.apache.maven.surefire.booter.ProviderFactory$ProviderProxy.invoke(ProviderFactory.java:161)
15:09:21     	at org.apache.maven.surefire.booter.ProviderFactory.invokeProvider(ProviderFactory.java:84)
15:09:21     	at org.eclipse.tycho.surefire.osgibooter.OsgiSurefireBooter.run(OsgiSurefireBooter.java:116)
15:09:21     	at org.eclipse.tycho.surefire.osgibooter.HeadlessTestApplication.start(HeadlessTestApplication.java:23)
15:09:21     	at org.eclipse.equinox.internal.app.EclipseAppHandle.run(EclipseAppHandle.java:203)
15:09:21     	at org.eclipse.core.runtime.internal.adaptor.EclipseAppLauncher.runApplication(EclipseAppLauncher.java:134)
15:09:21     	at org.eclipse.core.runtime.internal.adaptor.EclipseAppLauncher.start(EclipseAppLauncher.java:104)
15:09:21     	at org.eclipse.core.runtime.adaptor.EclipseStarter.run(EclipseStarter.java:401)
15:09:21     	at org.eclipse.core.runtime.adaptor.EclipseStarter.run(EclipseStarter.java:255)
15:09:21     	at java.base/jdk.internal.reflect.NativeMethodAccessorImpl.invoke0(Native Method)
15:09:21     	at java.base/jdk.internal.reflect.NativeMethodAccessorImpl.invoke(NativeMethodAccessorImpl.java:62)
15:09:21     	at java.base/jdk.internal.reflect.DelegatingMethodAccessorImpl.invoke(DelegatingMethodAccessorImpl.java:43)
15:09:21     	at java.base/java.lang.reflect.Method.invoke(Method.java:566)
15:09:21     	at org.eclipse.equinox.launcher.Main.invokeFramework(Main.java:654)
15:09:21     	at org.eclipse.equinox.launcher.Main.basicRun(Main.java:591)
15:09:21     	at org.eclipse.equinox.launcher.Main.run(Main.java:1462)
15:09:21     	at org.eclipse.equinox.launcher.Main.main(Main.java:1435)
15:09:21 
15:09:21 *** ERROR ***: Tue May 25 19:09:21 UTC 2021    IWAE0037E Could not open /home/jenkins/agent/workspace/webtools-javaee-gerrit_master/tests/org.eclipse.jst.j2ee.core.tests/commonArchiveResources/WSSecured_InsuranceServices_EJB_WS.ear
15:09:21     IWAE0036E URI Name: /home/jenkins/agent/workspace/webtools-javaee-gerrit_master/tests/org.eclipse.jst.j2ee.core.tests/commonArchiveResources/WSSecured_InsuranceServices_EJB_WS.ear; File name: /home/jenkins/agent/workspace/webtools-javaee-gerrit_master/tests/org.eclipse.jst.j2ee.core.tests/commonArchiveResources/WSSecured_InsuranceServices_EJB_WS.ear
15:09:21 Tests run: 7, Failures: 0, Errors: 5, Skipped: 0, Time elapsed: 0.052 s <<< FAILURE! - in org.eclipse.jst.j2ee.archive.test.DefectVerificationTests
15:09:21 testSavingEARWhileDeploying(org.eclipse.jst.j2ee.archive.test.DefectVerificationTests)  Time elapsed: 0.033 s  <<< ERROR!
15:09:21 org.eclipse.jst.j2ee.commonarchivecore.internal.exception.OpenFailureException: IWAE0037E Could not open /home/jenkins/agent/workspace/webtools-javaee-gerrit_master/tests/org.eclipse.jst.j2ee.core.tests/commonArchiveResources/AuctionApp.ear
15:09:21 	at org.eclipse.jst.j2ee.archive.test.DefectVerificationTests.testSavingEARWhileDeploying(DefectVerificationTests.java:172)
15:09:21 Caused by: java.io.FileNotFoundException: IWAE0036E URI Name: /home/jenkins/agent/workspace/webtools-javaee-gerrit_master/tests/org.eclipse.jst.j2ee.core.tests/commonArchiveResources/AuctionApp.ear; File name: /home/jenkins/agent/workspace/webtools-javaee-gerrit_master/tests/org.eclipse.jst.j2ee.core.tests/commonArchiveResources/AuctionApp.ear
15:09:21 	at org.eclipse.jst.j2ee.archive.test.DefectVerificationTests.testSavingEARWhileDeploying(DefectVerificationTests.java:172)
15:09:21 
15:09:21 testFilterMappingTranslator(org.eclipse.jst.j2ee.archive.test.DefectVerificationTests)  Time elapsed: 0.001 s  <<< ERROR!
15:09:21 org.eclipse.jst.j2ee.commonarchivecore.internal.exception.OpenFailureException: IWAE0037E Could not open /home/jenkins/agent/workspace/webtools-javaee-gerrit_master/tests/org.eclipse.jst.j2ee.core.tests/commonArchiveResources/QIDefectsNew.ear
15:09:21 	at org.eclipse.jst.j2ee.archive.test.DefectVerificationTests.testFilterMappingTranslator(DefectVerificationTests.java:83)
15:09:21 Caused by: java.io.FileNotFoundException: IWAE0036E URI Name: /home/jenkins/agent/workspace/webtools-javaee-gerrit_master/tests/org.eclipse.jst.j2ee.core.tests/commonArchiveResources/QIDefectsNew.ear; File name: /home/jenkins/agent/workspace/webtools-javaee-gerrit_master/tests/org.eclipse.jst.j2ee.core.tests/commonArchiveResources/QIDefectsNew.ear
15:09:21 	at org.eclipse.jst.j2ee.archive.test.DefectVerificationTests.testFilterMappingTranslator(DefectVerificationTests.java:83)
15:09:21 
15:09:21 testReadCrimsonCase(org.eclipse.jst.j2ee.archive.test.DefectVerificationTests)  Time elapsed: 0.002 s  <<< ERROR!
15:09:21 org.eclipse.jst.j2ee.commonarchivecore.internal.exception.OpenFailureException: IWAE0037E Could not open /home/jenkins/agent/workspace/webtools-javaee-gerrit_master/tests/org.eclipse.jst.j2ee.core.tests/commonArchiveResources/ejb_sam_Hello.ear
15:09:21 	at org.eclipse.jst.j2ee.archive.test.DefectVerificationTests.testReadCrimsonCase(DefectVerificationTests.java:261)
15:09:21 Caused by: java.io.FileNotFoundException: IWAE0036E URI Name: /home/jenkins/agent/workspace/webtools-javaee-gerrit_master/tests/org.eclipse.jst.j2ee.core.tests/commonArchiveResources/ejb_sam_Hello.ear; File name: /home/jenkins/agent/workspace/webtools-javaee-gerrit_master/tests/org.eclipse.jst.j2ee.core.tests/commonArchiveResources/ejb_sam_Hello.ear
15:09:21 	at org.eclipse.jst.j2ee.archive.test.DefectVerificationTests.testReadCrimsonCase(DefectVerificationTests.java:261)
15:09:21 
15:09:21 testFormerDefect297(org.eclipse.jst.j2ee.archive.test.DefectVerificationTests)  Time elapsed: 0 s  <<< ERROR!
15:09:21 org.eclipse.jst.j2ee.commonarchivecore.internal.exception.OpenFailureException: IWAE0037E Could not open /home/jenkins/agent/workspace/webtools-javaee-gerrit_master/tests/org.eclipse.jst.j2ee.core.tests/commonArchiveResources/sample.ear
15:09:21 	at org.eclipse.jst.j2ee.archive.test.DefectVerificationTests.testFormerDefect297(DefectVerificationTests.java:109)
15:09:21 Caused by: java.io.FileNotFoundException: IWAE0036E URI Name: /home/jenkins/agent/workspace/webtools-javaee-gerrit_master/tests/org.eclipse.jst.j2ee.core.tests/commonArchiveResources/sample.ear; File name: /home/jenkins/agent/workspace/webtools-javaee-gerrit_master/tests/org.eclipse.jst.j2ee.core.tests/commonArchiveResources/sample.ear
15:09:21 	at org.eclipse.jst.j2ee.archive.test.DefectVerificationTests.testFormerDefect297(DefectVerificationTests.java:109)
15:09:21 
15:09:21 testServiceQNameTranslator(org.eclipse.jst.j2ee.archive.test.DefectVerificationTests)  Time elapsed: 0.001 s  <<< ERROR!
15:09:21 org.eclipse.jst.j2ee.commonarchivecore.internal.exception.OpenFailureException: IWAE0037E Could not open /home/jenkins/agent/workspace/webtools-javaee-gerrit_master/tests/org.eclipse.jst.j2ee.core.tests/commonArchiveResources/WSSecured_InsuranceServices_EJB_WS.ear
15:09:21 	at org.eclipse.jst.j2ee.archive.test.DefectVerificationTests.testServiceQNameTranslator(DefectVerificationTests.java:216)
15:09:21 Caused by: java.io.FileNotFoundException: IWAE0036E URI Name: /home/jenkins/agent/workspace/webtools-javaee-gerrit_master/tests/org.eclipse.jst.j2ee.core.tests/commonArchiveResources/WSSecured_InsuranceServices_EJB_WS.ear; File name: /home/jenkins/agent/workspace/webtools-javaee-gerrit_master/tests/org.eclipse.jst.j2ee.core.tests/commonArchiveResources/WSSecured_InsuranceServices_EJB_WS.ear
15:09:21 	at org.eclipse.jst.j2ee.archive.test.DefectVerificationTests.testServiceQNameTranslator(DefectVerificationTests.java:216)
15:09:21 
15:09:21 testCreatingEARFile(org.eclipse.jst.j2ee.archive.test.DefectVerificationTests)  Time elapsed: 0 s
15:09:21 testFormerDefect1459(org.eclipse.jst.j2ee.archive.test.DefectVerificationTests)  Time elapsed: 0.009 s
15:09:21 Running org.eclipse.jst.j2ee.archive.test.SecurityRoleTests
15:09:21 Tests run: 2, Failures: 0, Errors: 2, Skipped: 0, Time elapsed: 0.002 s <<< FAILURE! - in org.eclipse.jst.j2ee.archive.test.SecurityRoleTests
15:09:21 testRollupAddAndPushDown(org.eclipse.jst.j2ee.archive.test.SecurityRoleTests)  Time elapsed: 0 s  <<< ERROR!
15:09:21 org.eclipse.jst.j2ee.commonarchivecore.internal.exception.OpenFailureException: IWAE0037E Could not open /home/jenkins/agent/workspace/webtools-javaee-gerrit_master/tests/org.eclipse.jst.j2ee.core.tests/commonArchiveResources/sample.ear
15:09:21 	at org.eclipse.jst.j2ee.archive.test.SecurityRoleTests.testRollupAddAndPushDown(SecurityRoleTests.java:73)
15:09:21 Caused by: java.io.FileNotFoundException: IWAE0036E URI Name: /home/jenkins/agent/workspace/webtools-javaee-gerrit_master/tests/org.eclipse.jst.j2ee.core.tests/commonArchiveResources/sample.ear; File name: /home/jenkins/agent/workspace/webtools-javaee-gerrit_master/tests/org.eclipse.jst.j2ee.core.tests/commonArchiveResources/sample.ear
15:09:21 	at org.eclipse.jst.j2ee.archive.test.SecurityRoleTests.testRollupAddAndPushDown(SecurityRoleTests.java:73)
15:09:21 
15:09:21 testPushDownCopy(org.eclipse.jst.j2ee.archive.test.SecurityRoleTests)  Time elapsed: 0 s  <<< ERROR!
15:09:21 org.eclipse.jst.j2ee.commonarchivecore.internal.exception.OpenFailureException: IWAE0037E Could not open /home/jenkins/agent/workspace/webtools-javaee-gerrit_master/tests/org.eclipse.jst.j2ee.core.tests/commonArchiveResources/sample.ear
15:09:21 	at org.eclipse.jst.j2ee.archive.test.SecurityRoleTests.testPushDownCopy(SecurityRoleTests.java:53)
15:09:21 Caused by: java.io.FileNotFoundException: IWAE0036E URI Name: /home/jenkins/agent/workspace/webtools-javaee-gerrit_master/tests/org.eclipse.jst.j2ee.core.tests/commonArchiveResources/sample.ear; File name: /home/jenkins/agent/workspace/webtools-javaee-gerrit_master/tests/org.eclipse.jst.j2ee.core.tests/commonArchiveResources/sample.ear
15:09:21 	at org.eclipse.jst.j2ee.archive.test.SecurityRoleTests.testPushDownCopy(SecurityRoleTests.java:53)
15:09:21 
15:09:21 Running org.eclipse.jst.j2ee.archive.test.TestInvalidXmlMultiplicity
15:09:21 Tests run: 3, Failures: 0, Errors: 0, Skipped: 0, Time elapsed: 0.002 s - in org.eclipse.jst.j2ee.archive.test.TestInvalidXmlMultiplicity
15:09:21 test1(org.eclipse.jst.j2ee.archive.test.TestInvalidXmlMultiplicity)  Time elapsed: 0 s
15:09:21 test2(org.eclipse.jst.j2ee.archive.test.TestInvalidXmlMultiplicity)  Time elapsed: 0.001 s
15:09:21 test3(org.eclipse.jst.j2ee.archive.test.TestInvalidXmlMultiplicity)  Time elapsed: 0 s
15:09:21 Running org.eclipse.jst.j2ee.archive.test.CopyTests
15:09:21 Tests run: 6, Failures: 0, Errors: 6, Skipped: 0, Time elapsed: 0.003 s <<< FAILURE! - in org.eclipse.jst.j2ee.archive.test.CopyTests
15:09:21 testAddCopyModuleFilesToEAR(org.eclipse.jst.j2ee.archive.test.CopyTests)  Time elapsed: 0.001 s  <<< ERROR!
15:09:21 org.eclipse.jst.j2ee.commonarchivecore.internal.exception.OpenFailureException: IWAE0037E Could not open /home/jenkins/agent/workspace/webtools-javaee-gerrit_master/tests/org.eclipse.jst.j2ee.core.tests/commonArchiveResources/bankejbs.jar
15:09:21 	at org.eclipse.jst.j2ee.archive.test.CopyTests.testAddCopyModuleFilesToEAR(CopyTests.java:139)
15:09:21 Caused by: java.io.FileNotFoundException: IWAE0036E URI Name: /home/jenkins/agent/workspace/webtools-javaee-gerrit_master/tests/org.eclipse.jst.j2ee.core.tests/commonArchiveResources/bankejbs.jar; File name: /home/jenkins/agent/workspace/webtools-javaee-gerrit_master/tests/org.eclipse.jst.j2ee.core.tests/commonArchiveResources/bankejbs.jar
15:09:21 	at org.eclipse.jst.j2ee.archive.test.CopyTests.testAddCopyModuleFilesToEAR(CopyTests.java:139)
15:09:21 
15:09:21 testAddRenameAndDeleteStandalone(org.eclipse.jst.j2ee.archive.test.CopyTests)  Time elapsed: 0 s  <<< ERROR!
15:09:21 org.eclipse.jst.j2ee.commonarchivecore.internal.exception.OpenFailureException: IWAE0037E Could not open /home/jenkins/agent/workspace/webtools-javaee-gerrit_master/tests/org.eclipse.jst.j2ee.core.tests/commonArchiveResources/bankejbs.jar
15:09:21 	at org.eclipse.jst.j2ee.archive.test.CopyTests.testAddRenameAndDeleteStandalone(CopyTests.java:218)
15:09:21 Caused by: java.io.FileNotFoundException: IWAE0036E URI Name: /home/jenkins/agent/workspace/webtools-javaee-gerrit_master/tests/org.eclipse.jst.j2ee.core.tests/commonArchiveResources/bankejbs.jar; File name: /home/jenkins/agent/workspace/webtools-javaee-gerrit_master/tests/org.eclipse.jst.j2ee.core.tests/commonArchiveResources/bankejbs.jar
15:09:21 	at org.eclipse.jst.j2ee.archive.test.CopyTests.testAddRenameAndDeleteStandalone(CopyTests.java:218)
15:09:21 
15:09:21 testAddCopyDirectory(org.eclipse.jst.j2ee.archive.test.CopyTests)  Time elapsed: 0 s  <<< ERROR!
15:09:21 org.eclipse.jst.j2ee.commonarchivecore.internal.exception.OpenFailureException: IWAE0037E Could not open /home/jenkins/agent/workspace/webtools-javaee-gerrit_master/tests/org.eclipse.jst.j2ee.core.tests/commonArchiveResources/example2.war
15:09:21 	at org.eclipse.jst.j2ee.archive.test.CopyTests.testAddCopyDirectory(CopyTests.java:78)
15:09:21 Caused by: java.io.FileNotFoundException: IWAE0036E URI Name: /home/jenkins/agent/workspace/webtools-javaee-gerrit_master/tests/org.eclipse.jst.j2ee.core.tests/commonArchiveResources/example2.war; File name: /home/jenkins/agent/workspace/webtools-javaee-gerrit_master/tests/org.eclipse.jst.j2ee.core.tests/commonArchiveResources/example2.war
15:09:21 	at org.eclipse.jst.j2ee.archive.test.CopyTests.testAddCopyDirectory(CopyTests.java:78)
15:09:21 
15:09:21 testAddCopyModule(org.eclipse.jst.j2ee.archive.test.CopyTests)  Time elapsed: 0 s  <<< ERROR!
15:09:21 org.eclipse.jst.j2ee.commonarchivecore.internal.exception.OpenFailureException: IWAE0037E Could not open /home/jenkins/agent/workspace/webtools-javaee-gerrit_master/tests/org.eclipse.jst.j2ee.core.tests/commonArchiveResources/sample.ear
15:09:21 	at org.eclipse.jst.j2ee.archive.test.CopyTests.testAddCopyModule(CopyTests.java:100)
15:09:21 Caused by: java.io.FileNotFoundException: IWAE0036E URI Name: /home/jenkins/agent/workspace/webtools-javaee-gerrit_master/tests/org.eclipse.jst.j2ee.core.tests/commonArchiveResources/sample.ear; File name: /home/jenkins/agent/workspace/webtools-javaee-gerrit_master/tests/org.eclipse.jst.j2ee.core.tests/commonArchiveResources/sample.ear
15:09:21 	at org.eclipse.jst.j2ee.archive.test.CopyTests.testAddCopyModule(CopyTests.java:100)
15:09:21 
15:09:21 testAddRenameAndDelete(org.eclipse.jst.j2ee.archive.test.CopyTests)  Time elapsed: 0.001 s  <<< ERROR!
15:09:21 org.eclipse.jst.j2ee.commonarchivecore.internal.exception.OpenFailureException: IWAE0037E Could not open /home/jenkins/agent/workspace/webtools-javaee-gerrit_master/tests/org.eclipse.jst.j2ee.core.tests/commonArchiveResources/sample.ear
15:09:21 	at org.eclipse.jst.j2ee.archive.test.CopyTests.testAddRenameAndDelete(CopyTests.java:184)
15:09:21 Caused by: java.io.FileNotFoundException: IWAE0036E URI Name: /home/jenkins/agent/workspace/webtools-javaee-gerrit_master/tests/org.eclipse.jst.j2ee.core.tests/commonArchiveResources/sample.ear; File name: /home/jenkins/agent/workspace/webtools-javaee-gerrit_master/tests/org.eclipse.jst.j2ee.core.tests/commonArchiveResources/sample.ear
15:09:21 	at org.eclipse.jst.j2ee.archive.test.CopyTests.testAddRenameAndDelete(CopyTests.java:184)
15:09:21 
15:09:21 testAddCopyStandaloneModule(org.eclipse.jst.j2ee.archive.test.CopyTests)  Time elapsed: 0 s  <<< ERROR!
15:09:21 org.eclipse.jst.j2ee.commonarchivecore.internal.exception.OpenFailureException: IWAE0037E Could not open /home/jenkins/agent/workspace/webtools-javaee-gerrit_master/tests/org.eclipse.jst.j2ee.core.tests/commonArchiveResources/bankejbs.jar
15:09:21 	at org.eclipse.jst.j2ee.archive.test.CopyTests.testAddCopyStandaloneModule(CopyTests.java:167)
15:09:21 Caused by: java.io.FileNotFoundException: IWAE0036E URI Name: /home/jenkins/agent/workspace/webtools-javaee-gerrit_master/tests/org.eclipse.jst.j2ee.core.tests/commonArchiveResources/bankejbs.jar; File name: /home/jenkins/agent/workspace/webtools-javaee-gerrit_master/tests/org.eclipse.jst.j2ee.core.tests/commonArchiveResources/bankejbs.jar
15:09:21 	at org.eclipse.jst.j2ee.archive.test.CopyTests.testAddCopyStandaloneModule(CopyTests.java:167)
15:09:21 
15:09:21 Running org.eclipse.jst.j2ee.archive.test.ResourceTests
15:09:21 Tests run: 2, Failures: 1, Errors: 1, Skipped: 0, Time elapsed: 0.077 s <<< FAILURE! - in org.eclipse.jst.j2ee.archive.test.ResourceTests
15:09:21 testResourceDirty(org.eclipse.jst.j2ee.archive.test.ResourceTests)  Time elapsed: 0.001 s  <<< ERROR!
15:09:21 org.eclipse.jst.j2ee.commonarchivecore.internal.exception.OpenFailureException: IWAE0037E Could not open /home/jenkins/agent/workspace/webtools-javaee-gerrit_master/tests/org.eclipse.jst.j2ee.core.tests/commonArchiveResources/bankejbs.jar
15:09:21 	at org.eclipse.jst.j2ee.archive.test.ResourceTests.testResourceDirty(ResourceTests.java:95)
15:09:21 Caused by: java.io.FileNotFoundException: IWAE0036E URI Name: /home/jenkins/agent/workspace/webtools-javaee-gerrit_master/tests/org.eclipse.jst.j2ee.core.tests/commonArchiveResources/bankejbs.jar; File name: /home/jenkins/agent/workspace/webtools-javaee-gerrit_master/tests/org.eclipse.jst.j2ee.core.tests/commonArchiveResources/bankejbs.jar
15:09:21 	at org.eclipse.jst.j2ee.archive.test.ResourceTests.testResourceDirty(ResourceTests.java:95)
15:09:21 
15:09:21 testResourceCreation(org.eclipse.jst.j2ee.archive.test.ResourceTests)  Time elapsed: 0.074 s  <<< FAILURE!
15:09:21 junit.framework.AssertionFailedError: The resource should be unloaded
15:09:21 	at org.eclipse.jst.j2ee.archive.test.ResourceTests.testResourceCreation(ResourceTests.java:76)
15:09:21 
15:09:21 Running org.eclipse.jst.j2ee.archive.test.SaveTests
15:09:21 Tests run: 2, Failures: 0, Errors: 2, Skipped: 0, Time elapsed: 0.002 s <<< FAILURE! - in org.eclipse.jst.j2ee.archive.test.SaveTests
15:09:21 testSave(org.eclipse.jst.j2ee.archive.test.SaveTests)  Time elapsed: 0.001 s  <<< ERROR!
15:09:21 org.eclipse.jst.j2ee.commonarchivecore.internal.exception.OpenFailureException: IWAE0037E Could not open /home/jenkins/agent/workspace/webtools-javaee-gerrit_master/tests/org.eclipse.jst.j2ee.core.tests/commonArchiveResources/example2.war
15:09:21 	at org.eclipse.jst.j2ee.archive.test.SaveTests.testSave(SaveTests.java:63)
15:09:21 Caused by: java.io.FileNotFoundException: IWAE0036E URI Name: /home/jenkins/agent/workspace/webtools-javaee-gerrit_master/tests/org.eclipse.jst.j2ee.core.tests/commonArchiveResources/example2.war; File name: /home/jenkins/agent/workspace/webtools-javaee-gerrit_master/tests/org.eclipse.jst.j2ee.core.tests/commonArchiveResources/example2.war
15:09:21 	at org.eclipse.jst.j2ee.archive.test.SaveTests.testSave(SaveTests.java:63)
15:09:21 
15:09:21 testSaveDirectory(org.eclipse.jst.j2ee.archive.test.SaveTests)  Time elapsed: 0 s  <<< ERROR!
15:09:21 org.eclipse.jst.j2ee.commonarchivecore.internal.exception.OpenFailureException: IWAE0037E Could not open /home/jenkins/agent/workspace/webtools-javaee-gerrit_master/tests/org.eclipse.jst.j2ee.core.tests/commonArchiveResources/sample.ear
15:09:21 	at org.eclipse.jst.j2ee.archive.test.SaveTests.testSaveDirectory(SaveTests.java:93)
15:09:21 Caused by: java.io.FileNotFoundException: IWAE0036E URI Name: /home/jenkins/agent/workspace/webtools-javaee-gerrit_master/tests/org.eclipse.jst.j2ee.core.tests/commonArchiveResources/sample.ear; File name: /home/jenkins/agent/workspace/webtools-javaee-gerrit_master/tests/org.eclipse.jst.j2ee.core.tests/commonArchiveResources/sample.ear
15:09:21 	at org.eclipse.jst.j2ee.archive.test.SaveTests.testSaveDirectory(SaveTests.java:93)
15:09:21 
15:09:21 Running org.eclipse.jst.j2ee.archive.test.ClientContainerResourceLoadTest
15:09:21 org.eclipse.jst.j2ee.commonarchivecore.internal.exception.OpenFailureException: IWAE0037E Could not open /home/jenkins/agent/workspace/webtools-javaee-gerrit_master/tests/org.eclipse.jst.j2ee.core.tests/commonArchiveResources/mtapp2.ear
15:09:21 Stack trace of nested exception:
15:09:21 java.io.FileNotFoundException: IWAE0036E URI Name: /home/jenkins/agent/workspace/webtools-javaee-gerrit_master/tests/org.eclipse.jst.j2ee.core.tests/commonArchiveResources/mtapp2.ear; File name: /home/jenkins/agent/workspace/webtools-javaee-gerrit_master/tests/org.eclipse.jst.j2ee.core.tests/commonArchiveResources/mtapp2.ear
15:09:21 	at org.eclipse.jst.j2ee.commonarchivecore.internal.impl.CommonarchiveFactoryImpl.createLoadStrategy(CommonarchiveFactoryImpl.java:342)
15:09:21 	at org.eclipse.jst.j2ee.commonarchivecore.internal.impl.CommonarchiveFactoryImpl.primOpenArchive(CommonarchiveFactoryImpl.java:876)
15:09:21 	at org.eclipse.jst.j2ee.commonarchivecore.internal.impl.CommonarchiveFactoryImpl.primOpenArchive(CommonarchiveFactoryImpl.java:902)
15:09:21 	at org.eclipse.jst.j2ee.commonarchivecore.internal.impl.CommonarchiveFactoryImpl.openEARFile(CommonarchiveFactoryImpl.java:657)
15:09:21 	at org.eclipse.jst.j2ee.archive.test.ClientContainerResourceLoadTest.testClientContainerLoad(ClientContainerResourceLoadTest.java:57)
15:09:21 	at java.base/jdk.internal.reflect.NativeMethodAccessorImpl.invoke0(Native Method)
15:09:21 	at java.base/jdk.internal.reflect.NativeMethodAccessorImpl.invoke(NativeMethodAccessorImpl.java:62)
15:09:21 	at java.base/jdk.internal.reflect.DelegatingMethodAccessorImpl.invoke(DelegatingMethodAccessorImpl.java:43)
15:09:21 	at java.base/java.lang.reflect.Method.invoke(Method.java:566)
15:09:21 	at junit.framework.TestCase.runTest(TestCase.java:177)
15:09:21 	at junit.framework.TestCase.runBare(TestCase.java:142)
15:09:21 	at junit.framework.TestResult$1.protect(TestResult.java:122)
15:09:21 	at junit.framework.TestResult.runProtected(TestResult.java:142)
15:09:21 	at junit.framework.TestResult.run(TestResult.java:125)
15:09:21 	at junit.framework.TestCase.run(TestCase.java:130)
15:09:21 	at junit.framework.TestSuite.runTest(TestSuite.java:241)
15:09:21 	at junit.framework.TestSuite.run(TestSuite.java:236)
15:09:21 	at org.junit.internal.runners.JUnit38ClassRunner.run(JUnit38ClassRunner.java:90)
15:09:21 	at org.apache.maven.surefire.junit4.JUnit4Provider.execute(JUnit4Provider.java:365)
15:09:21 	at org.apache.maven.surefire.junit4.JUnit4Provider.executeWithRerun(JUnit4Provider.java:273)
15:09:21 	at org.apache.maven.surefire.junit4.JUnit4Provider.executeTestSet(JUnit4Provider.java:238)
15:09:21 	at org.apache.maven.surefire.junit4.JUnit4Provider.invoke(JUnit4Provider.java:159)
15:09:21 	at java.base/jdk.internal.reflect.NativeMethodAccessorImpl.invoke0(Native Method)
15:09:21 	at java.base/jdk.internal.reflect.NativeMethodAccessorImpl.invoke(NativeMethodAccessorImpl.java:62)
15:09:21 	at java.base/jdk.internal.reflect.DelegatingMethodAccessorImpl.invoke(DelegatingMethodAccessorImpl.java:43)
15:09:21 	at java.base/java.lang.reflect.Method.invoke(Method.java:566)
15:09:21 	at org.apache.maven.surefire.util.ReflectionUtils.invokeMethodWithArray2(ReflectionUtils.java:206)
15:09:21 	at org.apache.maven.surefire.booter.ProviderFactory$ProviderProxy.invoke(ProviderFactory.java:161)
15:09:21 	at org.apache.maven.surefire.booter.ProviderFactory.invokeProvider(ProviderFactory.java:84)
15:09:21 	at org.eclipse.tycho.surefire.osgibooter.OsgiSurefireBooter.run(OsgiSurefireBooter.java:116)
15:09:21 	at org.eclipse.tycho.surefire.osgibooter.HeadlessTestApplication.start(HeadlessTestApplication.java:23)
15:09:21 	at org.eclipse.equinox.internal.app.EclipseAppHandle.run(EclipseAppHandle.java:203)
15:09:21 	at org.eclipse.core.runtime.internal.adaptor.EclipseAppLauncher.runApplication(EclipseAppLauncher.java:134)
15:09:21 	at org.eclipse.core.runtime.internal.adaptor.EclipseAppLauncher.start(EclipseAppLauncher.java:104)
15:09:21 	at org.eclipse.core.runtime.adaptor.EclipseStarter.run(EclipseStarter.java:401)
15:09:21 	at org.eclipse.core.runtime.adaptor.EclipseStarter.run(EclipseStarter.java:255)
15:09:21 	at java.base/jdk.internal.reflect.NativeMethodAccessorImpl.invoke0(Native Method)
15:09:21 	at java.base/jdk.internal.reflect.NativeMethodAccessorImpl.invoke(NativeMethodAccessorImpl.java:62)
15:09:21 	at java.base/jdk.internal.reflect.DelegatingMethodAccessorImpl.invoke(DelegatingMethodAccessorImpl.java:43)
15:09:21 	at java.base/java.lang.reflect.Method.invoke(Method.java:566)
15:09:21 	at org.eclipse.equinox.launcher.Main.invokeFramework(Main.java:654)
15:09:21 	at org.eclipse.equinox.launcher.Main.basicRun(Main.java:591)
15:09:21 	at org.eclipse.equinox.launcher.Main.run(Main.java:1462)
15:09:21 	at org.eclipse.equinox.launcher.Main.main(Main.java:1435)
15:09:21 Tests run: 1, Failures: 0, Errors: 0, Skipped: 0, Time elapsed: 0.005 s - in org.eclipse.jst.j2ee.archive.test.ClientContainerResourceLoadTest
15:09:21 testClientContainerLoad(org.eclipse.jst.j2ee.archive.test.ClientContainerResourceLoadTest)  Time elapsed: 0.003 s
15:09:21 Running org.eclipse.jst.j2ee.archive.test.LooseArchiveTests
15:09:21 Tests run: 5, Failures: 0, Errors: 0, Skipped: 0, Time elapsed: 1.069 s - in org.eclipse.jst.j2ee.archive.test.LooseArchiveTests
15:09:22 testLooseConfigCreation(org.eclipse.jst.j2ee.archive.test.LooseArchiveTests)  Time elapsed: 0.72 s
15:09:22 testLooseAppCreation(org.eclipse.jst.j2ee.archive.test.LooseArchiveTests)  Time elapsed: 0.013 s
15:09:22 testLooseConfigOpenAndSave(org.eclipse.jst.j2ee.archive.test.LooseArchiveTests)  Time elapsed: 0.201 s
15:09:22 testLooseConfigOpenAndReOpen(org.eclipse.jst.j2ee.archive.test.LooseArchiveTests)  Time elapsed: 0.023 s
15:09:22 testLooseConfigUnimodeOpenAndSave(org.eclipse.jst.j2ee.archive.test.LooseArchiveTests)  Time elapsed: 0.11 s
15:09:22 Running org.eclipse.jst.j2ee.archive.test.DiscriminatorTest
15:09:22 Tests run: 1, Failures: 0, Errors: 0, Skipped: 0, Time elapsed: 0.001 s - in org.eclipse.jst.j2ee.archive.test.DiscriminatorTest
15:09:22 testDiscriminator(org.eclipse.jst.j2ee.archive.test.DiscriminatorTest)  Time elapsed: 0 s
15:09:22 Running org.eclipse.jst.j2ee.archive.test.WARFileTests
15:09:22 Tests run: 3, Failures: 0, Errors: 3, Skipped: 0, Time elapsed: 0.002 s <<< FAILURE! - in org.eclipse.jst.j2ee.archive.test.WARFileTests
15:09:22 testAddCopyLib(org.eclipse.jst.j2ee.archive.test.WARFileTests)  Time elapsed: 0.001 s  <<< ERROR!
15:09:22 org.eclipse.jst.j2ee.commonarchivecore.internal.exception.OpenFailureException: IWAE0037E Could not open /home/jenkins/agent/workspace/webtools-javaee-gerrit_master/tests/org.eclipse.jst.j2ee.core.tests/commonArchiveResources/example2.war
15:09:22 	at org.eclipse.jst.j2ee.archive.test.WARFileTests.testAddCopyLib(WARFileTests.java:77)
15:09:22 Caused by: java.io.FileNotFoundException: IWAE0036E URI Name: /home/jenkins/agent/workspace/webtools-javaee-gerrit_master/tests/org.eclipse.jst.j2ee.core.tests/commonArchiveResources/example2.war; File name: /home/jenkins/agent/workspace/webtools-javaee-gerrit_master/tests/org.eclipse.jst.j2ee.core.tests/commonArchiveResources/example2.war
15:09:22 	at org.eclipse.jst.j2ee.archive.test.WARFileTests.testAddCopyLib(WARFileTests.java:77)
15:09:22 
15:09:22 testAddCopyClass(org.eclipse.jst.j2ee.archive.test.WARFileTests)  Time elapsed: 0 s  <<< ERROR!
15:09:22 org.eclipse.jst.j2ee.commonarchivecore.internal.exception.OpenFailureException: IWAE0037E Could not open /home/jenkins/agent/workspace/webtools-javaee-gerrit_master/tests/org.eclipse.jst.j2ee.core.tests/commonArchiveResources/example2.war
15:09:22 	at org.eclipse.jst.j2ee.archive.test.WARFileTests.testAddCopyClass(WARFileTests.java:56)
15:09:22 Caused by: java.io.FileNotFoundException: IWAE0036E URI Name: /home/jenkins/agent/workspace/webtools-javaee-gerrit_master/tests/org.eclipse.jst.j2ee.core.tests/commonArchiveResources/example2.war; File name: /home/jenkins/agent/workspace/webtools-javaee-gerrit_master/tests/org.eclipse.jst.j2ee.core.tests/commonArchiveResources/example2.war
15:09:22 	at org.eclipse.jst.j2ee.archive.test.WARFileTests.testAddCopyClass(WARFileTests.java:56)
15:09:22 
15:09:22 testListClassesAndLibs(org.eclipse.jst.j2ee.archive.test.WARFileTests)  Time elapsed: 0 s  <<< ERROR!
15:09:22 org.eclipse.jst.j2ee.commonarchivecore.internal.exception.OpenFailureException: IWAE0037E Could not open /home/jenkins/agent/workspace/webtools-javaee-gerrit_master/tests/org.eclipse.jst.j2ee.core.tests/commonArchiveResources/example2.war
15:09:22 	at org.eclipse.jst.j2ee.archive.test.WARFileTests.testListClassesAndLibs(WARFileTests.java:96)
15:09:22 Caused by: java.io.FileNotFoundException: IWAE0036E URI Name: /home/jenkins/agent/workspace/webtools-javaee-gerrit_master/tests/org.eclipse.jst.j2ee.core.tests/commonArchiveResources/example2.war; File name: /home/jenkins/agent/workspace/webtools-javaee-gerrit_master/tests/org.eclipse.jst.j2ee.core.tests/commonArchiveResources/example2.war
15:09:22 	at org.eclipse.jst.j2ee.archive.test.WARFileTests.testListClassesAndLibs(WARFileTests.java:96)
15:09:22 
15:09:22 Running org.eclipse.jst.j2ee.archive.test.JavaTests
15:09:22 Tests run: 1, Failures: 0, Errors: 0, Skipped: 0, Time elapsed: 0.001 s - in org.eclipse.jst.j2ee.archive.test.JavaTests
15:09:22 testJavaReflection(org.eclipse.jst.j2ee.archive.test.JavaTests)  Time elapsed: 0 s
15:09:22 Running org.eclipse.jst.j2ee.archive.test.RarFileTests
15:09:22 Tests run: 7, Failures: 0, Errors: 7, Skipped: 0, Time elapsed: 0.004 s <<< FAILURE! - in org.eclipse.jst.j2ee.archive.test.RarFileTests
15:09:22 testOpenAndRead(org.eclipse.jst.j2ee.archive.test.RarFileTests)  Time elapsed: 0 s  <<< ERROR!
15:09:22 org.eclipse.jst.j2ee.commonarchivecore.internal.exception.OpenFailureException: IWAE0037E Could not open /home/jenkins/agent/workspace/webtools-javaee-gerrit_master/tests/org.eclipse.jst.j2ee.core.tests/commonArchiveResources/sample.rar
15:09:22 	at org.eclipse.jst.j2ee.archive.test.RarFileTests.testOpenAndRead(RarFileTests.java:165)
15:09:22 Caused by: java.io.FileNotFoundException: IWAE0036E URI Name: /home/jenkins/agent/workspace/webtools-javaee-gerrit_master/tests/org.eclipse.jst.j2ee.core.tests/commonArchiveResources/sample.rar; File name: /home/jenkins/agent/workspace/webtools-javaee-gerrit_master/tests/org.eclipse.jst.j2ee.core.tests/commonArchiveResources/sample.rar
15:09:22 	at org.eclipse.jst.j2ee.archive.test.RarFileTests.testOpenAndRead(RarFileTests.java:165)
15:09:22 
15:09:22 testaddCopyModule(org.eclipse.jst.j2ee.archive.test.RarFileTests)  Time elapsed: 0 s  <<< ERROR!
15:09:22 org.eclipse.jst.j2ee.commonarchivecore.internal.exception.OpenFailureException: IWAE0037E Could not open /home/jenkins/agent/workspace/webtools-javaee-gerrit_master/tests/org.eclipse.jst.j2ee.core.tests/commonArchiveResources/sample.rar
15:09:22 	at org.eclipse.jst.j2ee.archive.test.RarFileTests.testaddCopyModule(RarFileTests.java:114)
15:09:22 Caused by: java.io.FileNotFoundException: IWAE0036E URI Name: /home/jenkins/agent/workspace/webtools-javaee-gerrit_master/tests/org.eclipse.jst.j2ee.core.tests/commonArchiveResources/sample.rar; File name: /home/jenkins/agent/workspace/webtools-javaee-gerrit_master/tests/org.eclipse.jst.j2ee.core.tests/commonArchiveResources/sample.rar
15:09:22 	at org.eclipse.jst.j2ee.archive.test.RarFileTests.testaddCopyModule(RarFileTests.java:114)
15:09:22 
15:09:22 testSaveRarEar(org.eclipse.jst.j2ee.archive.test.RarFileTests)  Time elapsed: 0.001 s  <<< ERROR!
15:09:22 org.eclipse.jst.j2ee.commonarchivecore.internal.exception.OpenFailureException: IWAE0037E Could not open /home/jenkins/agent/workspace/webtools-javaee-gerrit_master/tests/org.eclipse.jst.j2ee.core.tests/commonArchiveResources/sample.rar
15:09:22 	at org.eclipse.jst.j2ee.archive.test.RarFileTests.testSaveRarEar(RarFileTests.java:178)
15:09:22 Caused by: java.io.FileNotFoundException: IWAE0036E URI Name: /home/jenkins/agent/workspace/webtools-javaee-gerrit_master/tests/org.eclipse.jst.j2ee.core.tests/commonArchiveResources/sample.rar; File name: /home/jenkins/agent/workspace/webtools-javaee-gerrit_master/tests/org.eclipse.jst.j2ee.core.tests/commonArchiveResources/sample.rar
15:09:22 	at org.eclipse.jst.j2ee.archive.test.RarFileTests.testSaveRarEar(RarFileTests.java:178)
15:09:22 
15:09:22 testexpandRarModule(org.eclipse.jst.j2ee.archive.test.RarFileTests)  Time elapsed: 0 s  <<< ERROR!
15:09:22 org.eclipse.jst.j2ee.commonarchivecore.internal.exception.OpenFailureException: IWAE0037E Could not open /home/jenkins/agent/workspace/webtools-javaee-gerrit_master/tests/org.eclipse.jst.j2ee.core.tests/commonArchiveResources/sample.rar
15:09:22 	at org.eclipse.jst.j2ee.archive.test.RarFileTests.testexpandRarModule(RarFileTests.java:132)
15:09:22 Caused by: java.io.FileNotFoundException: IWAE0036E URI Name: /home/jenkins/agent/workspace/webtools-javaee-gerrit_master/tests/org.eclipse.jst.j2ee.core.tests/commonArchiveResources/sample.rar; File name: /home/jenkins/agent/workspace/webtools-javaee-gerrit_master/tests/org.eclipse.jst.j2ee.core.tests/commonArchiveResources/sample.rar
15:09:22 	at org.eclipse.jst.j2ee.archive.test.RarFileTests.testexpandRarModule(RarFileTests.java:132)
15:09:22 
15:09:22 testJ2Cauth(org.eclipse.jst.j2ee.archive.test.RarFileTests)  Time elapsed: 0 s  <<< ERROR!
15:09:22 org.eclipse.jst.j2ee.commonarchivecore.internal.exception.OpenFailureException: IWAE0037E Could not open /home/jenkins/agent/workspace/webtools-javaee-gerrit_master/tests/org.eclipse.jst.j2ee.core.tests/commonArchiveResources/sample.rar
15:09:22 	at org.eclipse.jst.j2ee.archive.test.RarFileTests.testJ2Cauth(RarFileTests.java:193)
15:09:22 Caused by: java.io.FileNotFoundException: IWAE0036E URI Name: /home/jenkins/agent/workspace/webtools-javaee-gerrit_master/tests/org.eclipse.jst.j2ee.core.tests/commonArchiveResources/sample.rar; File name: /home/jenkins/agent/workspace/webtools-javaee-gerrit_master/tests/org.eclipse.jst.j2ee.core.tests/commonArchiveResources/sample.rar
15:09:22 	at org.eclipse.jst.j2ee.archive.test.RarFileTests.testJ2Cauth(RarFileTests.java:193)
15:09:22 
15:09:22 testOpenAndExtract(org.eclipse.jst.j2ee.archive.test.RarFileTests)  Time elapsed: 0 s  <<< ERROR!
15:09:22 org.eclipse.jst.j2ee.commonarchivecore.internal.exception.OpenFailureException: IWAE0037E Could not open /home/jenkins/agent/workspace/webtools-javaee-gerrit_master/tests/org.eclipse.jst.j2ee.core.tests/commonArchiveResources/sample.rar
15:09:22 	at org.eclipse.jst.j2ee.archive.test.RarFileTests.testOpenAndExtract(RarFileTests.java:153)
15:09:22 Caused by: java.io.FileNotFoundException: IWAE0036E URI Name: /home/jenkins/agent/workspace/webtools-javaee-gerrit_master/tests/org.eclipse.jst.j2ee.core.tests/commonArchiveResources/sample.rar; File name: /home/jenkins/agent/workspace/webtools-javaee-gerrit_master/tests/org.eclipse.jst.j2ee.core.tests/commonArchiveResources/sample.rar
15:09:22 	at org.eclipse.jst.j2ee.archive.test.RarFileTests.testOpenAndExtract(RarFileTests.java:153)
15:09:22 
15:09:22 testopenRarEar(org.eclipse.jst.j2ee.archive.test.RarFileTests)  Time elapsed: 0.001 s  <<< ERROR!
15:09:22 org.eclipse.jst.j2ee.commonarchivecore.internal.exception.OpenFailureException: IWAE0037E Could not open /home/jenkins/agent/workspace/webtools-javaee-gerrit_master/tests/org.eclipse.jst.j2ee.core.tests/commonArchiveResources/testrar.ear
15:09:22 	at org.eclipse.jst.j2ee.archive.test.RarFileTests.testopenRarEar(RarFileTests.java:172)
15:09:22 Caused by: java.io.FileNotFoundException: IWAE0036E URI Name: /home/jenkins/agent/workspace/webtools-javaee-gerrit_master/tests/org.eclipse.jst.j2ee.core.tests/commonArchiveResources/testrar.ear; File name: /home/jenkins/agent/workspace/webtools-javaee-gerrit_master/tests/org.eclipse.jst.j2ee.core.tests/commonArchiveResources/testrar.ear
15:09:22 	at org.eclipse.jst.j2ee.archive.test.RarFileTests.testopenRarEar(RarFileTests.java:172)
15:09:22 
15:09:22 Running org.eclipse.jst.j2ee.archive.test.TestModuleClassLoading
15:09:22 org.eclipse.jst.j2ee.commonarchivecore.internal.exception.OpenFailureException: IWAE0037E Could not open /home/jenkins/agent/workspace/webtools-javaee-gerrit_master/tests/org.eclipse.jst.j2ee.core.tests/commonArchiveResources/PROTO.ear
15:09:22 org.eclipse.jst.j2ee.commonarchivecore.internal.exception.OpenFailureException: IWAE0037E Could not open /home/jenkins/agent/workspace/webtools-javaee-gerrit_master/tests/org.eclipse.jst.j2ee.core.tests/commonArchiveResources/SEIinAnotherJar.ear
15:09:22 org.eclipse.jst.j2ee.commonarchivecore.internal.exception.OpenFailureException: IWAE0037E Could not open /home/jenkins/agent/workspace/webtools-javaee-gerrit_master/tests/org.eclipse.jst.j2ee.core.tests/commonArchiveResources/SEIinWEB-INF_lib_jar.ear
15:09:22 Tests run: 1, Failures: 0, Errors: 0, Skipped: 0, Time elapsed: 0.001 s - in org.eclipse.jst.j2ee.archive.test.TestModuleClassLoading
15:09:22 testAddModuleClassLoading(org.eclipse.jst.j2ee.archive.test.TestModuleClassLoading)  Time elapsed: 0 s
15:09:22 Running org.eclipse.jst.j2ee.ejb.test.CMRFieldTest
15:09:22 Tests run: 6, Failures: 0, Errors: 0, Skipped: 0, Time elapsed: 0.002 s - in org.eclipse.jst.j2ee.ejb.test.CMRFieldTest
15:09:22 test_getRole(org.eclipse.jst.j2ee.ejb.test.CMRFieldTest)  Time elapsed: 0 s
15:09:22 test_setCollectionTypeName(org.eclipse.jst.j2ee.ejb.test.CMRFieldTest)  Time elapsed: 0.001 s
15:09:22 test_setCollectionType(org.eclipse.jst.j2ee.ejb.test.CMRFieldTest)  Time elapsed: 0 s
15:09:22 test_getCollectionType(org.eclipse.jst.j2ee.ejb.test.CMRFieldTest)  Time elapsed: 0 s
15:09:22 test_setRole(org.eclipse.jst.j2ee.ejb.test.CMRFieldTest)  Time elapsed: 0 s
15:09:22 test_getCollectionTypeName(org.eclipse.jst.j2ee.ejb.test.CMRFieldTest)  Time elapsed: 0 s
15:09:22 Running org.eclipse.jst.j2ee.ejb.test.MethodPermissionTest
15:09:22 Tests run: 5, Failures: 0, Errors: 0, Skipped: 0, Time elapsed: 0.003 s - in org.eclipse.jst.j2ee.ejb.test.MethodPermissionTest
15:09:22 test_MethodPermission(org.eclipse.jst.j2ee.ejb.test.MethodPermissionTest)  Time elapsed: 0.001 s
15:09:22 test_isEquivalent(org.eclipse.jst.j2ee.ejb.test.MethodPermissionTest)  Time elapsed: 0 s
15:09:22 test_hasSecurityRole(org.eclipse.jst.j2ee.ejb.test.MethodPermissionTest)  Time elapsed: 0 s
15:09:22 test_getSecurityRole(org.eclipse.jst.j2ee.ejb.test.MethodPermissionTest)  Time elapsed: 0 s
15:09:22 test_hasSecurityRole_2(org.eclipse.jst.j2ee.ejb.test.MethodPermissionTest)  Time elapsed: 0.001 s
15:09:22 Running org.eclipse.jst.j2ee.ejb.test.EJBRelationTest
15:09:22 Tests run: 6, Failures: 0, Errors: 0, Skipped: 0, Time elapsed: 0.002 s - in org.eclipse.jst.j2ee.ejb.test.EJBRelationTest
15:09:22 test_containsRelationshipRole(org.eclipse.jst.j2ee.ejb.test.EJBRelationTest)  Time elapsed: 0 s
15:09:22 test_getSecondRole(org.eclipse.jst.j2ee.ejb.test.EJBRelationTest)  Time elapsed: 0 s
15:09:22 test_getFirstRole(org.eclipse.jst.j2ee.ejb.test.EJBRelationTest)  Time elapsed: 0 s
15:09:22 test_getOppositeRole(org.eclipse.jst.j2ee.ejb.test.EJBRelationTest)  Time elapsed: 0 s
15:09:22 test_EJBRelation(org.eclipse.jst.j2ee.ejb.test.EJBRelationTest)  Time elapsed: 0 s
15:09:22 test_setFoward(org.eclipse.jst.j2ee.ejb.test.EJBRelationTest)  Time elapsed: 0 s
15:09:22 Running org.eclipse.jst.j2ee.ejb.test.ContainerManagedEntityTest
15:09:22 Tests run: 15, Failures: 0, Errors: 0, Skipped: 0, Time elapsed: 0.005 s - in org.eclipse.jst.j2ee.ejb.test.ContainerManagedEntityTest
15:09:23 test_isUnknownPrimaryKey(org.eclipse.jst.j2ee.ejb.test.ContainerManagedEntityTest)  Time elapsed: 0.001 s
15:09:23 test_addPersistentAttribute(org.eclipse.jst.j2ee.ejb.test.ContainerManagedEntityTest)  Time elapsed: 0 s
15:09:23 test_addKeyAttributeName(org.eclipse.jst.j2ee.ejb.test.ContainerManagedEntityTest)  Time elapsed: 0 s
15:09:23 test_getKeyAttribute(org.eclipse.jst.j2ee.ejb.test.ContainerManagedEntityTest)  Time elapsed: 0 s
15:09:23 test_isContainerManagedEntity(org.eclipse.jst.j2ee.ejb.test.ContainerManagedEntityTest)  Time elapsed: 0.001 s
15:09:23 test_getPrimaryKeyAttribute(org.eclipse.jst.j2ee.ejb.test.ContainerManagedEntityTest)  Time elapsed: 0 s
15:09:23 test_isVersion1_X(org.eclipse.jst.j2ee.ejb.test.ContainerManagedEntityTest)  Time elapsed: 0 s
15:09:23 test_isVersion2_X(org.eclipse.jst.j2ee.ejb.test.ContainerManagedEntityTest)  Time elapsed: 0 s
15:09:23 test_removePersistentAttribute_2(org.eclipse.jst.j2ee.ejb.test.ContainerManagedEntityTest)  Time elapsed: 0 s
15:09:23 test_listPersistentFieldNames(org.eclipse.jst.j2ee.ejb.test.ContainerManagedEntityTest)  Time elapsed: 0 s
15:09:23 test_isKeyAttribute(org.eclipse.jst.j2ee.ejb.test.ContainerManagedEntityTest)  Time elapsed: 0.001 s
15:09:23 test_getCMPVersionID(org.eclipse.jst.j2ee.ejb.test.ContainerManagedEntityTest)  Time elapsed: 0 s
15:09:23 test_setPrimKeyField(org.eclipse.jst.j2ee.ejb.test.ContainerManagedEntityTest)  Time elapsed: 0 s
15:09:23 test_addPersistentAttributeName(org.eclipse.jst.j2ee.ejb.test.ContainerManagedEntityTest)  Time elapsed: 0 s
15:09:23 test_removePersistentAttribute(org.eclipse.jst.j2ee.ejb.test.ContainerManagedEntityTest)  Time elapsed: 0 s
15:09:23 Running org.eclipse.jst.j2ee.ejb.test.EJBJarTest
15:09:23 Tests run: 15, Failures: 0, Errors: 0, Skipped: 0, Time elapsed: 0.006 s - in org.eclipse.jst.j2ee.ejb.test.EJBJarTest
15:09:23 test_EJBJar(org.eclipse.jst.j2ee.ejb.test.EJBJarTest)  Time elapsed: 0 s
15:09:23 test_containsContainerManagedBeans(org.eclipse.jst.j2ee.ejb.test.EJBJarTest)  Time elapsed: 0.001 s
15:09:23 test_containsSecurityRole(org.eclipse.jst.j2ee.ejb.test.EJBJarTest)  Time elapsed: 0 s
15:09:23 test_getBeanManagedBeans(org.eclipse.jst.j2ee.ejb.test.EJBJarTest)  Time elapsed: 0 s
15:09:23 test_getContainerManagedBeans(org.eclipse.jst.j2ee.ejb.test.EJBJarTest)  Time elapsed: 0 s
15:09:23 test_getEJB11ContainerManagedBeans(org.eclipse.jst.j2ee.ejb.test.EJBJarTest)  Time elapsed: 0.001 s
15:09:23 test_getEJB20ContainerManagedBeans(org.eclipse.jst.j2ee.ejb.test.EJBJarTest)  Time elapsed: 0 s
15:09:23 test_getMessageDrivenBeans(org.eclipse.jst.j2ee.ejb.test.EJBJarTest)  Time elapsed: 0 s
15:09:23 test_getEjbRelations(org.eclipse.jst.j2ee.ejb.test.EJBJarTest)  Time elapsed: 0 s
15:09:23 test_getEnterpiseBeanFromRef(org.eclipse.jst.j2ee.ejb.test.EJBJarTest)  Time elapsed: 0.001 s
15:09:23 test_getEnterpriseBeanNamed(org.eclipse.jst.j2ee.ejb.test.EJBJarTest)  Time elapsed: 0 s
15:09:23 test_getEnterpriseBeansWithReference(org.eclipse.jst.j2ee.ejb.test.EJBJarTest)  Time elapsed: 0 s
15:09:23 test_getEnterpriseBeanWithReference(org.eclipse.jst.j2ee.ejb.test.EJBJarTest)  Time elapsed: 0.001 s
15:09:23 test_getSessionBeans(org.eclipse.jst.j2ee.ejb.test.EJBJarTest)  Time elapsed: 0 s
15:09:23 test_getEJBRelation(org.eclipse.jst.j2ee.ejb.test.EJBJarTest)  Time elapsed: 0 s
15:09:23 Running org.eclipse.jst.j2ee.ejb.test.QueryMethodTest
15:09:23 Tests run: 1, Failures: 0, Errors: 0, Skipped: 0, Time elapsed: 0.673 s - in org.eclipse.jst.j2ee.ejb.test.QueryMethodTest
15:09:23 test_getClientTypeJavaClasses(org.eclipse.jst.j2ee.ejb.test.QueryMethodTest)  Time elapsed: 0.672 s
15:09:23 Running org.eclipse.jst.j2ee.ejb.test.QueryTest
15:09:23 Tests run: 3, Failures: 0, Errors: 0, Skipped: 0, Time elapsed: 0.001 s - in org.eclipse.jst.j2ee.ejb.test.QueryTest
15:09:23 test_isRemoteResultMapping(org.eclipse.jst.j2ee.ejb.test.QueryTest)  Time elapsed: 0 s
15:09:23 test_isLocalResultMapping(org.eclipse.jst.j2ee.ejb.test.QueryTest)  Time elapsed: 0 s
15:09:23 test_Query(org.eclipse.jst.j2ee.ejb.test.QueryTest)  Time elapsed: 0 s
15:09:23 Running org.eclipse.jst.j2ee.ejb.test.CMPAttributeTest
15:09:23 Tests run: 10, Failures: 0, Errors: 0, Skipped: 0, Time elapsed: 0.004 s - in org.eclipse.jst.j2ee.ejb.test.CMPAttributeTest
15:09:23 test_getSetterName(org.eclipse.jst.j2ee.ejb.test.CMPAttributeTest)  Time elapsed: 0 s
15:09:23 test_getType(org.eclipse.jst.j2ee.ejb.test.CMPAttributeTest)  Time elapsed: 0 s
15:09:23 test_getOriginatingType(org.eclipse.jst.j2ee.ejb.test.CMPAttributeTest)  Time elapsed: 0 s
15:09:23 test_setDerived(org.eclipse.jst.j2ee.ejb.test.CMPAttributeTest)  Time elapsed: 0.001 s
15:09:23 test_setOriginatingType(org.eclipse.jst.j2ee.ejb.test.CMPAttributeTest)  Time elapsed: 0 s
15:09:23 test_isCMRField(org.eclipse.jst.j2ee.ejb.test.CMPAttributeTest)  Time elapsed: 0 s
15:09:23 test_getGetterName(org.eclipse.jst.j2ee.ejb.test.CMPAttributeTest)  Time elapsed: 0 s
15:09:23 test_isDerived(org.eclipse.jst.j2ee.ejb.test.CMPAttributeTest)  Time elapsed: 0 s
15:09:23 test_isKey(org.eclipse.jst.j2ee.ejb.test.CMPAttributeTest)  Time elapsed: 0 s
15:09:23 test_isPrimKeyField(org.eclipse.jst.j2ee.ejb.test.CMPAttributeTest)  Time elapsed: 0 s
15:09:23 Running org.eclipse.jst.j2ee.ejb.test.EntityTest
15:09:23 Tests run: 2, Failures: 0, Errors: 0, Skipped: 0, Time elapsed: 0.728 s - in org.eclipse.jst.j2ee.ejb.test.EntityTest
15:09:24 test_setPrimaryKeyName(org.eclipse.jst.j2ee.ejb.test.EntityTest)  Time elapsed: 0.354 s
15:09:24 test_getPrimaryKeyName(org.eclipse.jst.j2ee.ejb.test.EntityTest)  Time elapsed: 0.373 s
15:09:24 Running org.eclipse.jst.j2ee.ejb.test.MethodElementTest
15:09:24 Tests run: 21, Failures: 0, Errors: 0, Skipped: 0, Time elapsed: 0.355 s - in org.eclipse.jst.j2ee.ejb.test.MethodElementTest
15:09:24 test_initializeFromSignature(org.eclipse.jst.j2ee.ejb.test.MethodElementTest)  Time elapsed: 0.001 s
15:09:24 test_applyZeroParams(org.eclipse.jst.j2ee.ejb.test.MethodElementTest)  Time elapsed: 0 s
15:09:24 test_equalSignature(org.eclipse.jst.j2ee.ejb.test.MethodElementTest)  Time elapsed: 0 s
15:09:24 test_isRemote(org.eclipse.jst.j2ee.ejb.test.MethodElementTest)  Time elapsed: 0 s
15:09:24 test_getTypeJavaClass(org.eclipse.jst.j2ee.ejb.test.MethodElementTest)  Time elapsed: 0.346 s
15:09:24 test_isHome(org.eclipse.jst.j2ee.ejb.test.MethodElementTest)  Time elapsed: 0 s
15:09:24 test_getSignature(org.eclipse.jst.j2ee.ejb.test.MethodElementTest)  Time elapsed: 0 s
15:09:24 test_nameAndParamsEquals(org.eclipse.jst.j2ee.ejb.test.MethodElementTest)  Time elapsed: 0.002 s
15:09:24 test_isLocalHome(org.eclipse.jst.j2ee.ejb.test.MethodElementTest)  Time elapsed: 0 s
15:09:24 test_isUnspecified(org.eclipse.jst.j2ee.ejb.test.MethodElementTest)  Time elapsed: 0 s
15:09:24 test_isEquivalent(org.eclipse.jst.j2ee.ejb.test.MethodElementTest)  Time elapsed: 0.001 s
15:09:24 test_MethodElement(org.eclipse.jst.j2ee.ejb.test.MethodElementTest)  Time elapsed: 0 s
15:09:24 test_hasMethodParams(org.eclipse.jst.j2ee.ejb.test.MethodElementTest)  Time elapsed: 0 s
15:09:24 test_isLocal(org.eclipse.jst.j2ee.ejb.test.MethodElementTest)  Time elapsed: 0 s
15:09:24 test_isValid(org.eclipse.jst.j2ee.ejb.test.MethodElementTest)  Time elapsed: 0 s
15:09:24 test_getMethodParams(org.eclipse.jst.j2ee.ejb.test.MethodElementTest)  Time elapsed: 0 s
15:09:24 test_isDefault(org.eclipse.jst.j2ee.ejb.test.MethodElementTest)  Time elapsed: 0 s
15:09:24 test_addMethodParams(org.eclipse.jst.j2ee.ejb.test.MethodElementTest)  Time elapsed: 0 s
15:09:24 test_removeMethodParams(org.eclipse.jst.j2ee.ejb.test.MethodElementTest)  Time elapsed: 0 s
15:09:24 testEJBJarPopulation(org.eclipse.jst.j2ee.ejb.test.MethodElementTest)  Time elapsed: 0 s
15:09:24 test14EJBJarPopulation(org.eclipse.jst.j2ee.ejb.test.MethodElementTest)  Time elapsed: 0 s
15:09:24 Running org.eclipse.jst.j2ee.ejb.test.EJBRelationshipRoleTest
15:09:24 Tests run: 13, Failures: 0, Errors: 0, Skipped: 0, Time elapsed: 0.006 s - in org.eclipse.jst.j2ee.ejb.test.EJBRelationshipRoleTest
15:09:24 test_isNavigable(org.eclipse.jst.j2ee.ejb.test.EJBRelationshipRoleTest)  Time elapsed: 0 s
15:09:24 test_getLogicalName(org.eclipse.jst.j2ee.ejb.test.EJBRelationshipRoleTest)  Time elapsed: 0 s
15:09:24 test_getName(org.eclipse.jst.j2ee.ejb.test.EJBRelationshipRoleTest)  Time elapsed: 0.001 s
15:09:24 test_isForward(org.eclipse.jst.j2ee.ejb.test.EJBRelationshipRoleTest)  Time elapsed: 0 s
15:09:24 test_isMany(org.eclipse.jst.j2ee.ejb.test.EJBRelationshipRoleTest)  Time elapsed: 0 s
15:09:24 test_setKey(org.eclipse.jst.j2ee.ejb.test.EJBRelationshipRoleTest)  Time elapsed: 0.002 s
15:09:24 test_EJBRelationshipRole(org.eclipse.jst.j2ee.ejb.test.EJBRelationshipRoleTest)  Time elapsed: 0 s
15:09:24 test_setFoward(org.eclipse.jst.j2ee.ejb.test.EJBRelationshipRoleTest)  Time elapsed: 0 s
15:09:24 test_setName(org.eclipse.jst.j2ee.ejb.test.EJBRelationshipRoleTest)  Time elapsed: 0 s
15:09:24 test_getSourceEntity(org.eclipse.jst.j2ee.ejb.test.EJBRelationshipRoleTest)  Time elapsed: 0 s
15:09:24 test_setRequired(org.eclipse.jst.j2ee.ejb.test.EJBRelationshipRoleTest)  Time elapsed: 0 s
15:09:24 test_isKey(org.eclipse.jst.j2ee.ejb.test.EJBRelationshipRoleTest)  Time elapsed: 0 s
15:09:24 test_getOpposite(org.eclipse.jst.j2ee.ejb.test.EJBRelationshipRoleTest)  Time elapsed: 0 s
15:09:24 Running org.eclipse.jst.j2ee.ejb.test.AssemblyDescriptorTest
15:09:24 Tests run: 5, Failures: 0, Errors: 0, Skipped: 0, Time elapsed: 1.641 s - in org.eclipse.jst.j2ee.ejb.test.AssemblyDescriptorTest
15:09:26 test_getMethodPermissionMethodElements(org.eclipse.jst.j2ee.ejb.test.AssemblyDescriptorTest)  Time elapsed: 0.323 s
15:09:26 test_getMethodTransactionMethodElements(org.eclipse.jst.j2ee.ejb.test.AssemblyDescriptorTest)  Time elapsed: 0.374 s
15:09:26 test_getSecurityRoleNamed(org.eclipse.jst.j2ee.ejb.test.AssemblyDescriptorTest)  Time elapsed: 0.298 s
15:09:26 test_renameSecurityRole(org.eclipse.jst.j2ee.ejb.test.AssemblyDescriptorTest)  Time elapsed: 0.324 s
15:09:26 test_removeData(org.eclipse.jst.j2ee.ejb.test.AssemblyDescriptorTest)  Time elapsed: 0.321 s
15:09:26 Running org.eclipse.jst.j2ee.ejb.test.MethodTransactionTest
15:09:26 Tests run: 2, Failures: 0, Errors: 0, Skipped: 0, Time elapsed: 0.302 s - in org.eclipse.jst.j2ee.ejb.test.MethodTransactionTest
15:09:26 test_isEquivalent(org.eclipse.jst.j2ee.ejb.test.MethodTransactionTest)  Time elapsed: 0 s
15:09:26 test_getMethodElements(org.eclipse.jst.j2ee.ejb.test.MethodTransactionTest)  Time elapsed: 0.301 s
15:09:26 Running org.eclipse.jst.j2ee.ejb.test.SessionTest
15:09:26 Tests run: 3, Failures: 0, Errors: 0, Skipped: 0, Time elapsed: 0.002 s - in org.eclipse.jst.j2ee.ejb.test.SessionTest
15:09:26 test_hasServiceEndpoint(org.eclipse.jst.j2ee.ejb.test.SessionTest)  Time elapsed: 0 s
15:09:26 test_getServiceEndpointName(org.eclipse.jst.j2ee.ejb.test.SessionTest)  Time elapsed: 0 s
15:09:26 test_setServiceEndpointName(org.eclipse.jst.j2ee.ejb.test.SessionTest)  Time elapsed: 0 s
15:09:26 Running org.eclipse.jst.j2ee.ejb.test.EjbFactoryTest
15:09:26 Tests run: 26, Failures: 0, Errors: 0, Skipped: 0, Time elapsed: 0.006 s - in org.eclipse.jst.j2ee.ejb.test.EjbFactoryTest
15:09:26 test_createActivationConfig(org.eclipse.jst.j2ee.ejb.test.EjbFactoryTest)  Time elapsed: 0 s
15:09:26 test_createExcludeList(org.eclipse.jst.j2ee.ejb.test.EjbFactoryTest)  Time elapsed: 0 s
15:09:26 test_createEJBRelationshipRole(org.eclipse.jst.j2ee.ejb.test.EjbFactoryTest)  Time elapsed: 0.001 s
15:09:26 test_createContainerManagedEntity(org.eclipse.jst.j2ee.ejb.test.EjbFactoryTest)  Time elapsed: 0 s
15:09:26 test_createMessageDrivenDestination(org.eclipse.jst.j2ee.ejb.test.EjbFactoryTest)  Time elapsed: 0 s
15:09:26 test_createMethodElement_2(org.eclipse.jst.j2ee.ejb.test.EjbFactoryTest)  Time elapsed: 0 s
15:09:26 test_createCMPAttribute(org.eclipse.jst.j2ee.ejb.test.EjbFactoryTest)  Time elapsed: 0 s
15:09:26 test_createSession(org.eclipse.jst.j2ee.ejb.test.EjbFactoryTest)  Time elapsed: 0 s
15:09:26 test_createMethodElementFrom(org.eclipse.jst.j2ee.ejb.test.EjbFactoryTest)  Time elapsed: 0 s
15:09:26 test_createEJBRelation(org.eclipse.jst.j2ee.ejb.test.EjbFactoryTest)  Time elapsed: 0.001 s
15:09:26 test_createMethodElementFrom_2(org.eclipse.jst.j2ee.ejb.test.EjbFactoryTest)  Time elapsed: 0 s
15:09:26 test_EjbFactory(org.eclipse.jst.j2ee.ejb.test.EjbFactoryTest)  Time elapsed: 0 s
15:09:26 test_createQuery(org.eclipse.jst.j2ee.ejb.test.EjbFactoryTest)  Time elapsed: 0 s
15:09:26 test_createQueryMethod(org.eclipse.jst.j2ee.ejb.test.EjbFactoryTest)  Time elapsed: 0 s
15:09:26 test_createActivationConfigProperty(org.eclipse.jst.j2ee.ejb.test.EjbFactoryTest)  Time elapsed: 0 s
15:09:26 test_createEJBJar(org.eclipse.jst.j2ee.ejb.test.EjbFactoryTest)  Time elapsed: 0 s
15:09:26 test_createMethodPermission(org.eclipse.jst.j2ee.ejb.test.EjbFactoryTest)  Time elapsed: 0 s
15:09:26 test_createEntity(org.eclipse.jst.j2ee.ejb.test.EjbFactoryTest)  Time elapsed: 0 s
15:09:26 test_createRelationships(org.eclipse.jst.j2ee.ejb.test.EjbFactoryTest)  Time elapsed: 0 s
15:09:26 test_createEJBMethodCategory(org.eclipse.jst.j2ee.ejb.test.EjbFactoryTest)  Time elapsed: 0.001 s
15:09:26 test_createMethodTransaction(org.eclipse.jst.j2ee.ejb.test.EjbFactoryTest)  Time elapsed: 0 s
15:09:26 test_createMethodElement(org.eclipse.jst.j2ee.ejb.test.EjbFactoryTest)  Time elapsed: 0 s
15:09:26 test_createAssemblyDescriptor(org.eclipse.jst.j2ee.ejb.test.EjbFactoryTest)  Time elapsed: 0 s
15:09:26 test_createRoleSource(org.eclipse.jst.j2ee.ejb.test.EjbFactoryTest)  Time elapsed: 0.001 s
15:09:26 test_createCMRField(org.eclipse.jst.j2ee.ejb.test.EjbFactoryTest)  Time elapsed: 0 s
15:09:26 test_createMessageDriven(org.eclipse.jst.j2ee.ejb.test.EjbFactoryTest)  Time elapsed: 0 s
15:09:26 Running org.eclipse.jst.j2ee.common.tests.CommonTests
15:09:26 Tests run: 0, Failures: 0, Errors: 0, Skipped: 0, Time elapsed: 0 s - in org.eclipse.jst.j2ee.common.tests.CommonTests
15:09:26 Running org.eclipse.jst.j2ee.common.test.QNameTest
15:09:26 Tests run: 1, Failures: 0, Errors: 0, Skipped: 0, Time elapsed: 0.001 s - in org.eclipse.jst.j2ee.common.test.QNameTest
15:09:26 test_setValues(org.eclipse.jst.j2ee.common.test.QNameTest)  Time elapsed: 0.001 s
15:09:26 Running org.eclipse.jst.j2ee.common.test.ListenerTest
15:09:26 Tests run: 2, Failures: 0, Errors: 0, Skipped: 0, Time elapsed: 0.001 s - in org.eclipse.jst.j2ee.common.test.ListenerTest
15:09:26 test_setListenerClassName(org.eclipse.jst.j2ee.common.test.ListenerTest)  Time elapsed: 0 s
15:09:26 test_getListenerClassName(org.eclipse.jst.j2ee.common.test.ListenerTest)  Time elapsed: 0 s
15:09:26 Running org.eclipse.jst.j2ee.common.test.EjbRefTest
15:09:26 Tests run: 5, Failures: 0, Errors: 0, Skipped: 0, Time elapsed: 0.001 s - in org.eclipse.jst.j2ee.common.test.EjbRefTest
15:09:26 test_isLinked(org.eclipse.jst.j2ee.common.test.EjbRefTest)  Time elapsed: 0 s
15:09:26 test_EjbRef(org.eclipse.jst.j2ee.common.test.EjbRefTest)  Time elapsed: 0 s
15:09:26 test_isEquivalent(org.eclipse.jst.j2ee.common.test.EjbRefTest)  Time elapsed: 0 s
15:09:26 test_isLocal(org.eclipse.jst.j2ee.common.test.EjbRefTest)  Time elapsed: 0 s
15:09:26 test_getLinkedEjb(org.eclipse.jst.j2ee.common.test.EjbRefTest)  Time elapsed: 0 s
15:09:26 Running org.eclipse.jst.j2ee.common.test.CommonFactoryTest
15:09:26 Tests run: 22, Failures: 0, Errors: 0, Skipped: 0, Time elapsed: 0.004 s - in org.eclipse.jst.j2ee.common.test.CommonFactoryTest
15:09:26 test_createCompatibilityDescriptionGroup(org.eclipse.jst.j2ee.common.test.CommonFactoryTest)  Time elapsed: 0 s
15:09:26 test_createUseCallerIdentity(org.eclipse.jst.j2ee.common.test.CommonFactoryTest)  Time elapsed: 0 s
15:09:26 test_createDescriptionGroup(org.eclipse.jst.j2ee.common.test.CommonFactoryTest)  Time elapsed: 0 s
15:09:26 test_createIconType(org.eclipse.jst.j2ee.common.test.CommonFactoryTest)  Time elapsed: 0 s
15:09:26 test_createResourceRef(org.eclipse.jst.j2ee.common.test.CommonFactoryTest)  Time elapsed: 0 s
15:09:26 test_createDisplayName(org.eclipse.jst.j2ee.common.test.CommonFactoryTest)  Time elapsed: 0.001 s
15:09:26 test_createIdentity(org.eclipse.jst.j2ee.common.test.CommonFactoryTest)  Time elapsed: 0 s
15:09:26 test_createSecurityIdentity(org.eclipse.jst.j2ee.common.test.CommonFactoryTest)  Time elapsed: 0 s
15:09:26 test_createResourceEnvRef(org.eclipse.jst.j2ee.common.test.CommonFactoryTest)  Time elapsed: 0 s
15:09:26 test_createDescription(org.eclipse.jst.j2ee.common.test.CommonFactoryTest)  Time elapsed: 0 s
15:09:26 test_createQName(org.eclipse.jst.j2ee.common.test.CommonFactoryTest)  Time elapsed: 0 s
15:09:26 test_CommonFactory(org.eclipse.jst.j2ee.common.test.CommonFactoryTest)  Time elapsed: 0 s
15:09:26 test_createParamValue(org.eclipse.jst.j2ee.common.test.CommonFactoryTest)  Time elapsed: 0 s
15:09:26 test_createEjbRef(org.eclipse.jst.j2ee.common.test.CommonFactoryTest)  Time elapsed: 0 s
15:09:26 test_createListener(org.eclipse.jst.j2ee.common.test.CommonFactoryTest)  Time elapsed: 0 s
15:09:26 test_createMessageDestination(org.eclipse.jst.j2ee.common.test.CommonFactoryTest)  Time elapsed: 0 s
15:09:26 test_createEnvEntry(org.eclipse.jst.j2ee.common.test.CommonFactoryTest)  Time elapsed: 0 s
15:09:26 test_createSecurityRole(org.eclipse.jst.j2ee.common.test.CommonFactoryTest)  Time elapsed: 0 s
15:09:26 test_createMessageDestinationRef(org.eclipse.jst.j2ee.common.test.CommonFactoryTest)  Time elapsed: 0 s
15:09:26 test_createEJBLocalRef(org.eclipse.jst.j2ee.common.test.CommonFactoryTest)  Time elapsed: 0 s
15:09:26 test_createSecurityRoleRef(org.eclipse.jst.j2ee.common.test.CommonFactoryTest)  Time elapsed: 0 s
15:09:26 test_createRunAsSpecifiedIdentity(org.eclipse.jst.j2ee.common.test.CommonFactoryTest)  Time elapsed: 0 s
15:09:26 Running org.eclipse.jst.j2ee.webservice.wsdd.test.WsddFactoryTest
15:09:26 Tests run: 9, Failures: 0, Errors: 0, Skipped: 0, Time elapsed: 0.002 s - in org.eclipse.jst.j2ee.webservice.wsdd.test.WsddFactoryTest
15:09:26 test_createEJBLink(org.eclipse.jst.j2ee.webservice.wsdd.test.WsddFactoryTest)  Time elapsed: 0 s
15:09:26 test_createWSDLPort(org.eclipse.jst.j2ee.webservice.wsdd.test.WsddFactoryTest)  Time elapsed: 0 s
15:09:26 test_createPortComponent(org.eclipse.jst.j2ee.webservice.wsdd.test.WsddFactoryTest)  Time elapsed: 0.001 s
15:09:26 test_createServiceImplBean(org.eclipse.jst.j2ee.webservice.wsdd.test.WsddFactoryTest)  Time elapsed: 0 s
15:09:26 test_createWebServices(org.eclipse.jst.j2ee.webservice.wsdd.test.WsddFactoryTest)  Time elapsed: 0 s
15:09:26 test_createBeanLink(org.eclipse.jst.j2ee.webservice.wsdd.test.WsddFactoryTest)  Time elapsed: 0 s
15:09:26 test_createWebServiceDescription(org.eclipse.jst.j2ee.webservice.wsdd.test.WsddFactoryTest)  Time elapsed: 0 s
15:09:26 test_createHandler(org.eclipse.jst.j2ee.webservice.wsdd.test.WsddFactoryTest)  Time elapsed: 0 s
15:09:26 test_createServletLink(org.eclipse.jst.j2ee.webservice.wsdd.test.WsddFactoryTest)  Time elapsed: 0 s
15:09:26 Running org.eclipse.jst.j2ee.webservice.wscommon.test.WscommonFactoryTest
15:09:26 Tests run: 7, Failures: 0, Errors: 0, Skipped: 0, Time elapsed: 0.003 s - in org.eclipse.jst.j2ee.webservice.wscommon.test.WscommonFactoryTest
15:09:26 test_createSOAPHeader(org.eclipse.jst.j2ee.webservice.wscommon.test.WscommonFactoryTest)  Time elapsed: 0.001 s
15:09:26 test_createDisplayNameType(org.eclipse.jst.j2ee.webservice.wscommon.test.WscommonFactoryTest)  Time elapsed: 0 s
15:09:26 test_getWscommonPackage(org.eclipse.jst.j2ee.webservice.wscommon.test.WscommonFactoryTest)  Time elapsed: 0 s
15:09:26 test_createDescriptionType(org.eclipse.jst.j2ee.webservice.wscommon.test.WscommonFactoryTest)  Time elapsed: 0 s
15:09:26 test_createPortName(org.eclipse.jst.j2ee.webservice.wscommon.test.WscommonFactoryTest)  Time elapsed: 0.001 s
15:09:26 test_createSOAPRole(org.eclipse.jst.j2ee.webservice.wscommon.test.WscommonFactoryTest)  Time elapsed: 0 s
15:09:26 test_createInitParam(org.eclipse.jst.j2ee.webservice.wscommon.test.WscommonFactoryTest)  Time elapsed: 0 s
15:09:26 Running org.eclipse.jst.j2ee.core.tests.api.AllAPITest
15:09:26 Tests run: 243, Failures: 0, Errors: 0, Skipped: 0, Time elapsed: 2.818 s - in org.eclipse.jst.j2ee.core.tests.api.AllAPITest
15:09:29 test_createEjbModule(org.eclipse.jst.j2ee.application.test.ApplicationFactoryTest)  Time elapsed: 0 s
15:09:29 test_createApplication(org.eclipse.jst.j2ee.application.test.ApplicationFactoryTest)  Time elapsed: 0 s
15:09:29 test_createConnectorModule(org.eclipse.jst.j2ee.application.test.ApplicationFactoryTest)  Time elapsed: 0 s
15:09:29 test_createWebModule(org.eclipse.jst.j2ee.application.test.ApplicationFactoryTest)  Time elapsed: 0 s
15:09:29 test_createJavaClientModule(org.eclipse.jst.j2ee.application.test.ApplicationFactoryTest)  Time elapsed: 0 s
15:09:29 test_createModule(org.eclipse.jst.j2ee.application.test.ApplicationFactoryTest)  Time elapsed: 0 s
15:09:29 test_getVersionID(org.eclipse.jst.j2ee.application.test.ApplicationTest)  Time elapsed: 0.001 s
15:09:29 test_getJ2EEVersionID(org.eclipse.jst.j2ee.application.test.ApplicationTest)  Time elapsed: 0.001 s
15:09:29 test_getSecurityRoleNamed(org.eclipse.jst.j2ee.application.test.ApplicationTest)  Time elapsed: 0 s
15:09:29 test_getModuleHavingAltDD(org.eclipse.jst.j2ee.application.test.ApplicationTest)  Time elapsed: 0 s
15:09:29 test_containsSecurityRole(org.eclipse.jst.j2ee.application.test.ApplicationTest)  Time elapsed: 0 s
15:09:29 test_getModule_2(org.eclipse.jst.j2ee.application.test.ApplicationTest)  Time elapsed: 0 s
15:09:29 test_getFirstModule(org.eclipse.jst.j2ee.application.test.ApplicationTest)  Time elapsed: 0.001 s
15:09:29 test_getVersionID(org.eclipse.jst.j2ee.client.test.ApplicationClientTest)  Time elapsed: 0.018 s
15:09:29 test_getJ2EEVersionID(org.eclipse.jst.j2ee.client.test.ApplicationClientTest)  Time elapsed: 0.01 s
15:09:29 test_getCallbackHandlerClassName(org.eclipse.jst.j2ee.client.test.ApplicationClientTest)  Time elapsed: 0.001 s
15:09:29 test_setCallbackHandlerClassName(org.eclipse.jst.j2ee.client.test.ApplicationClientTest)  Time elapsed: 0 s
15:09:29 test_ClientFactory(org.eclipse.jst.j2ee.client.test.ClientFactoryTest)  Time elapsed: 0 s
15:09:29 test_createApplicationClient(org.eclipse.jst.j2ee.client.test.ClientFactoryTest)  Time elapsed: 0 s
15:09:29 test_createCompatibilityDescriptionGroup(org.eclipse.jst.j2ee.common.test.CommonFactoryTest)  Time elapsed: 0 s
15:09:29 test_createUseCallerIdentity(org.eclipse.jst.j2ee.common.test.CommonFactoryTest)  Time elapsed: 0 s
15:09:29 test_createDescriptionGroup(org.eclipse.jst.j2ee.common.test.CommonFactoryTest)  Time elapsed: 0 s
15:09:29 test_createIconType(org.eclipse.jst.j2ee.common.test.CommonFactoryTest)  Time elapsed: 0 s
15:09:29 test_createResourceRef(org.eclipse.jst.j2ee.common.test.CommonFactoryTest)  Time elapsed: 0 s
15:09:29 test_createDisplayName(org.eclipse.jst.j2ee.common.test.CommonFactoryTest)  Time elapsed: 0 s
15:09:29 test_createIdentity(org.eclipse.jst.j2ee.common.test.CommonFactoryTest)  Time elapsed: 0 s
15:09:29 test_createSecurityIdentity(org.eclipse.jst.j2ee.common.test.CommonFactoryTest)  Time elapsed: 0.001 s
15:09:29 test_createResourceEnvRef(org.eclipse.jst.j2ee.common.test.CommonFactoryTest)  Time elapsed: 0 s
15:09:29 test_createDescription(org.eclipse.jst.j2ee.common.test.CommonFactoryTest)  Time elapsed: 0 s
15:09:29 test_createQName(org.eclipse.jst.j2ee.common.test.CommonFactoryTest)  Time elapsed: 0 s
15:09:29 test_CommonFactory(org.eclipse.jst.j2ee.common.test.CommonFactoryTest)  Time elapsed: 0 s
15:09:29 test_createParamValue(org.eclipse.jst.j2ee.common.test.CommonFactoryTest)  Time elapsed: 0 s
15:09:29 test_createEjbRef(org.eclipse.jst.j2ee.common.test.CommonFactoryTest)  Time elapsed: 0 s
15:09:29 test_createListener(org.eclipse.jst.j2ee.common.test.CommonFactoryTest)  Time elapsed: 0 s
15:09:29 test_createMessageDestination(org.eclipse.jst.j2ee.common.test.CommonFactoryTest)  Time elapsed: 0 s
15:09:29 test_createEnvEntry(org.eclipse.jst.j2ee.common.test.CommonFactoryTest)  Time elapsed: 0 s
15:09:29 test_createSecurityRole(org.eclipse.jst.j2ee.common.test.CommonFactoryTest)  Time elapsed: 0 s
15:09:29 test_createMessageDestinationRef(org.eclipse.jst.j2ee.common.test.CommonFactoryTest)  Time elapsed: 0 s
15:09:29 test_createEJBLocalRef(org.eclipse.jst.j2ee.common.test.CommonFactoryTest)  Time elapsed: 0 s
15:09:29 test_createSecurityRoleRef(org.eclipse.jst.j2ee.common.test.CommonFactoryTest)  Time elapsed: 0 s
15:09:29 test_createRunAsSpecifiedIdentity(org.eclipse.jst.j2ee.common.test.CommonFactoryTest)  Time elapsed: 0 s
15:09:29 test_isLinked(org.eclipse.jst.j2ee.common.test.EjbRefTest)  Time elapsed: 0 s
15:09:29 test_EjbRef(org.eclipse.jst.j2ee.common.test.EjbRefTest)  Time elapsed: 0 s
15:09:29 test_isEquivalent(org.eclipse.jst.j2ee.common.test.EjbRefTest)  Time elapsed: 0 s
15:09:29 test_isLocal(org.eclipse.jst.j2ee.common.test.EjbRefTest)  Time elapsed: 0 s
15:09:29 test_getLinkedEjb(org.eclipse.jst.j2ee.common.test.EjbRefTest)  Time elapsed: 0 s
15:09:29 test_setListenerClassName(org.eclipse.jst.j2ee.common.test.ListenerTest)  Time elapsed: 0 s
15:09:29 test_getListenerClassName(org.eclipse.jst.j2ee.common.test.ListenerTest)  Time elapsed: 0 s
15:09:29 test_setValues(org.eclipse.jst.j2ee.common.test.QNameTest)  Time elapsed: 0 s
15:09:29 test_getMethodPermissionMethodElements(org.eclipse.jst.j2ee.ejb.test.AssemblyDescriptorTest)  Time elapsed: 0.294 s
15:09:29 test_getMethodTransactionMethodElements(org.eclipse.jst.j2ee.ejb.test.AssemblyDescriptorTest)  Time elapsed: 0.36 s
15:09:29 test_getSecurityRoleNamed(org.eclipse.jst.j2ee.ejb.test.AssemblyDescriptorTest)  Time elapsed: 0.271 s
15:09:29 test_renameSecurityRole(org.eclipse.jst.j2ee.ejb.test.AssemblyDescriptorTest)  Time elapsed: 0.277 s
15:09:29 test_removeData(org.eclipse.jst.j2ee.ejb.test.AssemblyDescriptorTest)  Time elapsed: 0.316 s
15:09:29 test_getSetterName(org.eclipse.jst.j2ee.ejb.test.CMPAttributeTest)  Time elapsed: 0 s
15:09:29 test_getType(org.eclipse.jst.j2ee.ejb.test.CMPAttributeTest)  Time elapsed: 0 s
15:09:29 test_getOriginatingType(org.eclipse.jst.j2ee.ejb.test.CMPAttributeTest)  Time elapsed: 0.001 s
15:09:29 test_setDerived(org.eclipse.jst.j2ee.ejb.test.CMPAttributeTest)  Time elapsed: 0 s
15:09:29 test_setOriginatingType(org.eclipse.jst.j2ee.ejb.test.CMPAttributeTest)  Time elapsed: 0 s
15:09:29 test_isCMRField(org.eclipse.jst.j2ee.ejb.test.CMPAttributeTest)  Time elapsed: 0 s
15:09:29 test_getGetterName(org.eclipse.jst.j2ee.ejb.test.CMPAttributeTest)  Time elapsed: 0 s
15:09:29 test_isDerived(org.eclipse.jst.j2ee.ejb.test.CMPAttributeTest)  Time elapsed: 0 s
15:09:29 test_isKey(org.eclipse.jst.j2ee.ejb.test.CMPAttributeTest)  Time elapsed: 0 s
15:09:29 test_isPrimKeyField(org.eclipse.jst.j2ee.ejb.test.CMPAttributeTest)  Time elapsed: 0 s
15:09:29 test_getRole(org.eclipse.jst.j2ee.ejb.test.CMRFieldTest)  Time elapsed: 0 s
15:09:29 test_setCollectionTypeName(org.eclipse.jst.j2ee.ejb.test.CMRFieldTest)  Time elapsed: 0.001 s
15:09:29 test_setCollectionType(org.eclipse.jst.j2ee.ejb.test.CMRFieldTest)  Time elapsed: 0 s
15:09:29 test_getCollectionType(org.eclipse.jst.j2ee.ejb.test.CMRFieldTest)  Time elapsed: 0 s
15:09:29 test_setRole(org.eclipse.jst.j2ee.ejb.test.CMRFieldTest)  Time elapsed: 0 s
15:09:29 test_getCollectionTypeName(org.eclipse.jst.j2ee.ejb.test.CMRFieldTest)  Time elapsed: 0 s
15:09:29 test_isUnknownPrimaryKey(org.eclipse.jst.j2ee.ejb.test.ContainerManagedEntityTest)  Time elapsed: 0 s
15:09:29 test_addPersistentAttribute(org.eclipse.jst.j2ee.ejb.test.ContainerManagedEntityTest)  Time elapsed: 0 s
15:09:29 test_addKeyAttributeName(org.eclipse.jst.j2ee.ejb.test.ContainerManagedEntityTest)  Time elapsed: 0 s
15:09:29 test_getKeyAttribute(org.eclipse.jst.j2ee.ejb.test.ContainerManagedEntityTest)  Time elapsed: 0 s
15:09:29 test_isContainerManagedEntity(org.eclipse.jst.j2ee.ejb.test.ContainerManagedEntityTest)  Time elapsed: 0 s
15:09:29 test_getPrimaryKeyAttribute(org.eclipse.jst.j2ee.ejb.test.ContainerManagedEntityTest)  Time elapsed: 0 s
15:09:29 test_isVersion1_X(org.eclipse.jst.j2ee.ejb.test.ContainerManagedEntityTest)  Time elapsed: 0.001 s
15:09:29 test_isVersion2_X(org.eclipse.jst.j2ee.ejb.test.ContainerManagedEntityTest)  Time elapsed: 0 s
15:09:29 test_removePersistentAttribute_2(org.eclipse.jst.j2ee.ejb.test.ContainerManagedEntityTest)  Time elapsed: 0 s
15:09:29 test_listPersistentFieldNames(org.eclipse.jst.j2ee.ejb.test.ContainerManagedEntityTest)  Time elapsed: 0 s
15:09:29 test_isKeyAttribute(org.eclipse.jst.j2ee.ejb.test.ContainerManagedEntityTest)  Time elapsed: 0 s
15:09:29 test_getCMPVersionID(org.eclipse.jst.j2ee.ejb.test.ContainerManagedEntityTest)  Time elapsed: 0 s
15:09:29 test_setPrimKeyField(org.eclipse.jst.j2ee.ejb.test.ContainerManagedEntityTest)  Time elapsed: 0 s
15:09:29 test_addPersistentAttributeName(org.eclipse.jst.j2ee.ejb.test.ContainerManagedEntityTest)  Time elapsed: 0 s
15:09:29 test_removePersistentAttribute(org.eclipse.jst.j2ee.ejb.test.ContainerManagedEntityTest)  Time elapsed: 0 s
15:09:29 test_createActivationConfig(org.eclipse.jst.j2ee.ejb.test.EjbFactoryTest)  Time elapsed: 0 s
15:09:29 test_createExcludeList(org.eclipse.jst.j2ee.ejb.test.EjbFactoryTest)  Time elapsed: 0 s
15:09:29 test_createEJBRelationshipRole(org.eclipse.jst.j2ee.ejb.test.EjbFactoryTest)  Time elapsed: 0.001 s
15:09:29 test_createContainerManagedEntity(org.eclipse.jst.j2ee.ejb.test.EjbFactoryTest)  Time elapsed: 0 s
15:09:29 test_createMessageDrivenDestination(org.eclipse.jst.j2ee.ejb.test.EjbFactoryTest)  Time elapsed: 0 s
15:09:29 test_createMethodElement_2(org.eclipse.jst.j2ee.ejb.test.EjbFactoryTest)  Time elapsed: 0 s
15:09:29 test_createCMPAttribute(org.eclipse.jst.j2ee.ejb.test.EjbFactoryTest)  Time elapsed: 0 s
15:09:29 test_createSession(org.eclipse.jst.j2ee.ejb.test.EjbFactoryTest)  Time elapsed: 0 s
15:09:29 test_createMethodElementFrom(org.eclipse.jst.j2ee.ejb.test.EjbFactoryTest)  Time elapsed: 0 s
15:09:29 test_createEJBRelation(org.eclipse.jst.j2ee.ejb.test.EjbFactoryTest)  Time elapsed: 0 s
15:09:29 test_createMethodElementFrom_2(org.eclipse.jst.j2ee.ejb.test.EjbFactoryTest)  Time elapsed: 0 s
15:09:29 test_EjbFactory(org.eclipse.jst.j2ee.ejb.test.EjbFactoryTest)  Time elapsed: 0 s
15:09:29 test_createQuery(org.eclipse.jst.j2ee.ejb.test.EjbFactoryTest)  Time elapsed: 0 s
15:09:29 test_createQueryMethod(org.eclipse.jst.j2ee.ejb.test.EjbFactoryTest)  Time elapsed: 0 s
15:09:29 test_createActivationConfigProperty(org.eclipse.jst.j2ee.ejb.test.EjbFactoryTest)  Time elapsed: 0 s
15:09:29 test_createEJBJar(org.eclipse.jst.j2ee.ejb.test.EjbFactoryTest)  Time elapsed: 0.001 s
15:09:29 test_createMethodPermission(org.eclipse.jst.j2ee.ejb.test.EjbFactoryTest)  Time elapsed: 0 s
15:09:29 test_createEntity(org.eclipse.jst.j2ee.ejb.test.EjbFactoryTest)  Time elapsed: 0 s
15:09:29 test_createRelationships(org.eclipse.jst.j2ee.ejb.test.EjbFactoryTest)  Time elapsed: 0 s
15:09:29 test_createEJBMethodCategory(org.eclipse.jst.j2ee.ejb.test.EjbFactoryTest)  Time elapsed: 0 s
15:09:29 test_createMethodTransaction(org.eclipse.jst.j2ee.ejb.test.EjbFactoryTest)  Time elapsed: 0 s
15:09:29 test_createMethodElement(org.eclipse.jst.j2ee.ejb.test.EjbFactoryTest)  Time elapsed: 0 s
15:09:29 test_createAssemblyDescriptor(org.eclipse.jst.j2ee.ejb.test.EjbFactoryTest)  Time elapsed: 0 s
15:09:29 test_createRoleSource(org.eclipse.jst.j2ee.ejb.test.EjbFactoryTest)  Time elapsed: 0 s
15:09:29 test_createCMRField(org.eclipse.jst.j2ee.ejb.test.EjbFactoryTest)  Time elapsed: 0 s
15:09:29 test_createMessageDriven(org.eclipse.jst.j2ee.ejb.test.EjbFactoryTest)  Time elapsed: 0 s
15:09:29 test_isNavigable(org.eclipse.jst.j2ee.ejb.test.EJBRelationshipRoleTest)  Time elapsed: 0 s
15:09:29 test_getLogicalName(org.eclipse.jst.j2ee.ejb.test.EJBRelationshipRoleTest)  Time elapsed: 0 s
15:09:29 test_getName(org.eclipse.jst.j2ee.ejb.test.EJBRelationshipRoleTest)  Time elapsed: 0.001 s
15:09:29 test_isForward(org.eclipse.jst.j2ee.ejb.test.EJBRelationshipRoleTest)  Time elapsed: 0 s
15:09:29 test_isMany(org.eclipse.jst.j2ee.ejb.test.EJBRelationshipRoleTest)  Time elapsed: 0 s
15:09:29 test_setKey(org.eclipse.jst.j2ee.ejb.test.EJBRelationshipRoleTest)  Time elapsed: 0 s
15:09:29 test_EJBRelationshipRole(org.eclipse.jst.j2ee.ejb.test.EJBRelationshipRoleTest)  Time elapsed: 0 s
15:09:29 test_setFoward(org.eclipse.jst.j2ee.ejb.test.EJBRelationshipRoleTest)  Time elapsed: 0 s
15:09:29 test_setName(org.eclipse.jst.j2ee.ejb.test.EJBRelationshipRoleTest)  Time elapsed: 0 s
15:09:29 test_getSourceEntity(org.eclipse.jst.j2ee.ejb.test.EJBRelationshipRoleTest)  Time elapsed: 0 s
15:09:29 test_setRequired(org.eclipse.jst.j2ee.ejb.test.EJBRelationshipRoleTest)  Time elapsed: 0 s
15:09:29 test_isKey(org.eclipse.jst.j2ee.ejb.test.EJBRelationshipRoleTest)  Time elapsed: 0 s
15:09:29 test_getOpposite(org.eclipse.jst.j2ee.ejb.test.EJBRelationshipRoleTest)  Time elapsed: 0.001 s
15:09:29 test_containsRelationshipRole(org.eclipse.jst.j2ee.ejb.test.EJBRelationTest)  Time elapsed: 0 s
15:09:29 test_getSecondRole(org.eclipse.jst.j2ee.ejb.test.EJBRelationTest)  Time elapsed: 0 s
15:09:29 test_getFirstRole(org.eclipse.jst.j2ee.ejb.test.EJBRelationTest)  Time elapsed: 0 s
15:09:29 test_getOppositeRole(org.eclipse.jst.j2ee.ejb.test.EJBRelationTest)  Time elapsed: 0 s
15:09:29 test_EJBRelation(org.eclipse.jst.j2ee.ejb.test.EJBRelationTest)  Time elapsed: 0 s
15:09:29 test_setFoward(org.eclipse.jst.j2ee.ejb.test.EJBRelationTest)  Time elapsed: 0 s
15:09:29 test_setPrimaryKeyName(org.eclipse.jst.j2ee.ejb.test.EntityTest)  Time elapsed: 0.308 s
15:09:29 test_getPrimaryKeyName(org.eclipse.jst.j2ee.ejb.test.EntityTest)  Time elapsed: 0.302 s
15:09:29 test_initializeFromSignature(org.eclipse.jst.j2ee.ejb.test.MethodElementTest)  Time elapsed: 0 s
15:09:29 test_applyZeroParams(org.eclipse.jst.j2ee.ejb.test.MethodElementTest)  Time elapsed: 0 s
15:09:29 test_equalSignature(org.eclipse.jst.j2ee.ejb.test.MethodElementTest)  Time elapsed: 0 s
15:09:29 test_isRemote(org.eclipse.jst.j2ee.ejb.test.MethodElementTest)  Time elapsed: 0 s
15:09:29 test_getTypeJavaClass(org.eclipse.jst.j2ee.ejb.test.MethodElementTest)  Time elapsed: 0.305 s
15:09:29 test_isHome(org.eclipse.jst.j2ee.ejb.test.MethodElementTest)  Time elapsed: 0 s
15:09:29 test_getSignature(org.eclipse.jst.j2ee.ejb.test.MethodElementTest)  Time elapsed: 0 s
15:09:29 test_nameAndParamsEquals(org.eclipse.jst.j2ee.ejb.test.MethodElementTest)  Time elapsed: 0.001 s
15:09:29 test_isLocalHome(org.eclipse.jst.j2ee.ejb.test.MethodElementTest)  Time elapsed: 0 s
15:09:29 test_isUnspecified(org.eclipse.jst.j2ee.ejb.test.MethodElementTest)  Time elapsed: 0 s
15:09:29 test_isEquivalent(org.eclipse.jst.j2ee.ejb.test.MethodElementTest)  Time elapsed: 0 s
15:09:29 test_MethodElement(org.eclipse.jst.j2ee.ejb.test.MethodElementTest)  Time elapsed: 0.001 s
15:09:29 test_hasMethodParams(org.eclipse.jst.j2ee.ejb.test.MethodElementTest)  Time elapsed: 0 s
15:09:29 test_isLocal(org.eclipse.jst.j2ee.ejb.test.MethodElementTest)  Time elapsed: 0 s
15:09:29 test_isValid(org.eclipse.jst.j2ee.ejb.test.MethodElementTest)  Time elapsed: 0 s
15:09:29 test_getMethodParams(org.eclipse.jst.j2ee.ejb.test.MethodElementTest)  Time elapsed: 0 s
15:09:29 test_isDefault(org.eclipse.jst.j2ee.ejb.test.MethodElementTest)  Time elapsed: 0 s
15:09:29 test_addMethodParams(org.eclipse.jst.j2ee.ejb.test.MethodElementTest)  Time elapsed: 0 s
15:09:29 test_removeMethodParams(org.eclipse.jst.j2ee.ejb.test.MethodElementTest)  Time elapsed: 0.001 s
15:09:29 testEJBJarPopulation(org.eclipse.jst.j2ee.ejb.test.MethodElementTest)  Time elapsed: 0 s
15:09:29 test14EJBJarPopulation(org.eclipse.jst.j2ee.ejb.test.MethodElementTest)  Time elapsed: 0 s
15:09:29 test_MethodPermission(org.eclipse.jst.j2ee.ejb.test.MethodPermissionTest)  Time elapsed: 0 s
15:09:29 test_isEquivalent(org.eclipse.jst.j2ee.ejb.test.MethodPermissionTest)  Time elapsed: 0 s
15:09:29 test_hasSecurityRole(org.eclipse.jst.j2ee.ejb.test.MethodPermissionTest)  Time elapsed: 0 s
15:09:29 test_getSecurityRole(org.eclipse.jst.j2ee.ejb.test.MethodPermissionTest)  Time elapsed: 0 s
15:09:29 test_hasSecurityRole_2(org.eclipse.jst.j2ee.ejb.test.MethodPermissionTest)  Time elapsed: 0 s
15:09:29 test_getClientTypeJavaClasses(org.eclipse.jst.j2ee.ejb.test.QueryMethodTest)  Time elapsed: 0.311 s
15:09:29 test_isRemoteResultMapping(org.eclipse.jst.j2ee.ejb.test.QueryTest)  Time elapsed: 0 s
15:09:29 test_isLocalResultMapping(org.eclipse.jst.j2ee.ejb.test.QueryTest)  Time elapsed: 0 s
15:09:29 test_Query(org.eclipse.jst.j2ee.ejb.test.QueryTest)  Time elapsed: 0 s
15:09:29 test_hasServiceEndpoint(org.eclipse.jst.j2ee.ejb.test.SessionTest)  Time elapsed: 0 s
15:09:29 test_getServiceEndpointName(org.eclipse.jst.j2ee.ejb.test.SessionTest)  Time elapsed: 0 s
15:09:29 test_setServiceEndpointName(org.eclipse.jst.j2ee.ejb.test.SessionTest)  Time elapsed: 0 s
15:09:29 test_getVersionID(org.eclipse.jst.j2ee.jca.test.ConnectorTest)  Time elapsed: 0.002 s
15:09:29 test_createResourceAdapter(org.eclipse.jst.j2ee.jca.test.JcaFactoryTest)  Time elapsed: 0 s
15:09:29 test_createInboundResourceAdapter(org.eclipse.jst.j2ee.jca.test.JcaFactoryTest)  Time elapsed: 0 s
15:09:29 test_createActivationSpec(org.eclipse.jst.j2ee.jca.test.JcaFactoryTest)  Time elapsed: 0 s
15:09:29 test_getJcaPackage(org.eclipse.jst.j2ee.jca.test.JcaFactoryTest)  Time elapsed: 0 s
15:09:29 test_createAuthenticationMechanism(org.eclipse.jst.j2ee.jca.test.JcaFactoryTest)  Time elapsed: 0 s
15:09:29 test_createMessageAdapter(org.eclipse.jst.j2ee.jca.test.JcaFactoryTest)  Time elapsed: 0 s
15:09:29 test_createRequiredConfigPropertyType(org.eclipse.jst.j2ee.jca.test.JcaFactoryTest)  Time elapsed: 0.001 s
15:09:29 test_createConfigProperty(org.eclipse.jst.j2ee.jca.test.JcaFactoryTest)  Time elapsed: 0 s
15:09:29 test_createConnectionDefinition(org.eclipse.jst.j2ee.jca.test.JcaFactoryTest)  Time elapsed: 0 s
15:09:29 test_createAdminObject(org.eclipse.jst.j2ee.jca.test.JcaFactoryTest)  Time elapsed: 0 s
15:09:29 test_JcaFactory(org.eclipse.jst.j2ee.jca.test.JcaFactoryTest)  Time elapsed: 0 s
15:09:29 test_createConnector(org.eclipse.jst.j2ee.jca.test.JcaFactoryTest)  Time elapsed: 0 s
15:09:29 test_createMessageListener(org.eclipse.jst.j2ee.jca.test.JcaFactoryTest)  Time elapsed: 0 s
15:09:29 test_createSecurityPermission(org.eclipse.jst.j2ee.jca.test.JcaFactoryTest)  Time elapsed: 0 s
15:09:29 test_createOutboundResourceAdapter(org.eclipse.jst.j2ee.jca.test.JcaFactoryTest)  Time elapsed: 0 s
15:09:29 test_createLicense(org.eclipse.jst.j2ee.jca.test.JcaFactoryTest)  Time elapsed: 0 s
15:09:29 test_createResourceAdapter(org.eclipse.jst.j2ee.jca.test.JcaFactoryTest)  Time elapsed: 0 s
15:09:29 test_createInboundResourceAdapter(org.eclipse.jst.j2ee.jca.test.JcaFactoryTest)  Time elapsed: 0.001 s
15:09:29 test_createActivationSpec(org.eclipse.jst.j2ee.jca.test.JcaFactoryTest)  Time elapsed: 0 s
15:09:29 test_getJcaPackage(org.eclipse.jst.j2ee.jca.test.JcaFactoryTest)  Time elapsed: 0 s
15:09:29 test_createAuthenticationMechanism(org.eclipse.jst.j2ee.jca.test.JcaFactoryTest)  Time elapsed: 0 s
15:09:29 test_createMessageAdapter(org.eclipse.jst.j2ee.jca.test.JcaFactoryTest)  Time elapsed: 0 s
15:09:29 test_createRequiredConfigPropertyType(org.eclipse.jst.j2ee.jca.test.JcaFactoryTest)  Time elapsed: 0 s
15:09:29 test_createConfigProperty(org.eclipse.jst.j2ee.jca.test.JcaFactoryTest)  Time elapsed: 0 s
15:09:29 test_createConnectionDefinition(org.eclipse.jst.j2ee.jca.test.JcaFactoryTest)  Time elapsed: 0 s
15:09:29 test_createAdminObject(org.eclipse.jst.j2ee.jca.test.JcaFactoryTest)  Time elapsed: 0 s
15:09:29 test_JcaFactory(org.eclipse.jst.j2ee.jca.test.JcaFactoryTest)  Time elapsed: 0 s
15:09:29 test_createConnector(org.eclipse.jst.j2ee.jca.test.JcaFactoryTest)  Time elapsed: 0 s
15:09:29 test_createMessageListener(org.eclipse.jst.j2ee.jca.test.JcaFactoryTest)  Time elapsed: 0.001 s
15:09:29 test_createSecurityPermission(org.eclipse.jst.j2ee.jca.test.JcaFactoryTest)  Time elapsed: 0 s
15:09:29 test_createOutboundResourceAdapter(org.eclipse.jst.j2ee.jca.test.JcaFactoryTest)  Time elapsed: 0 s
15:09:29 test_createLicense(org.eclipse.jst.j2ee.jca.test.JcaFactoryTest)  Time elapsed: 0 s
15:09:29 test_createFormLoginConfig(org.eclipse.jst.j2ee.webapplication.test.WebapplicationFactoryTest)  Time elapsed: 0 s
15:09:29 test_createErrorCodeErrorPage(org.eclipse.jst.j2ee.webapplication.test.WebapplicationFactoryTest)  Time elapsed: 0 s
15:09:29 test_createMimeMapping(org.eclipse.jst.j2ee.webapplication.test.WebapplicationFactoryTest)  Time elapsed: 0 s
15:09:29 test_createExceptionTypeErrorPage(org.eclipse.jst.j2ee.webapplication.test.WebapplicationFactoryTest)  Time elapsed: 0 s
15:09:29 test_createTagLibRef(org.eclipse.jst.j2ee.webapplication.test.WebapplicationFactoryTest)  Time elapsed: 0 s
15:09:29 test_createLocalEncodingMapping(org.eclipse.jst.j2ee.webapplication.test.WebapplicationFactoryTest)  Time elapsed: 0.001 s
15:09:29 test_createServlet(org.eclipse.jst.j2ee.webapplication.test.WebapplicationFactoryTest)  Time elapsed: 0 s
15:09:29 test_createJSPType(org.eclipse.jst.j2ee.webapplication.test.WebapplicationFactoryTest)  Time elapsed: 0 s
15:09:29 test_createSessionConfig(org.eclipse.jst.j2ee.webapplication.test.WebapplicationFactoryTest)  Time elapsed: 0 s
15:09:29 test_createServletMapping(org.eclipse.jst.j2ee.webapplication.test.WebapplicationFactoryTest)  Time elapsed: 0 s
15:09:29 test_createURLPatternType(org.eclipse.jst.j2ee.webapplication.test.WebapplicationFactoryTest)  Time elapsed: 0 s
15:09:29 test_createLocalEncodingMappingList(org.eclipse.jst.j2ee.webapplication.test.WebapplicationFactoryTest)  Time elapsed: 0 s
15:09:29 test_createFilterMapping(org.eclipse.jst.j2ee.webapplication.test.WebapplicationFactoryTest)  Time elapsed: 0 s
15:09:29 test_createAuthConstraint(org.eclipse.jst.j2ee.webapplication.test.WebapplicationFactoryTest)  Time elapsed: 0 s
15:09:29 test_createUserDataConstraint(org.eclipse.jst.j2ee.webapplication.test.WebapplicationFactoryTest)  Time elapsed: 0 s
15:09:29 test_createFilter(org.eclipse.jst.j2ee.webapplication.test.WebapplicationFactoryTest)  Time elapsed: 0.001 s
15:09:29 test_createRoleNameType(org.eclipse.jst.j2ee.webapplication.test.WebapplicationFactoryTest)  Time elapsed: 0.001 s
15:09:29 test_createWelcomeFileList(org.eclipse.jst.j2ee.webapplication.test.WebapplicationFactoryTest)  Time elapsed: 0 s
15:09:29 test_createWebApp(org.eclipse.jst.j2ee.webapplication.test.WebapplicationFactoryTest)  Time elapsed: 0 s
15:09:29 test_createInitParam(org.eclipse.jst.j2ee.webapplication.test.WebapplicationFactoryTest)  Time elapsed: 0.001 s
15:09:29 test_createWelcomeFile(org.eclipse.jst.j2ee.webapplication.test.WebapplicationFactoryTest)  Time elapsed: 0 s
15:09:29 test_getWebapplicationPackage(org.eclipse.jst.j2ee.webapplication.test.WebapplicationFactoryTest)  Time elapsed: 0 s
15:09:29 test_createContextParam(org.eclipse.jst.j2ee.webapplication.test.WebapplicationFactoryTest)  Time elapsed: 0 s
15:09:29 test_createSecurityConstraint(org.eclipse.jst.j2ee.webapplication.test.WebapplicationFactoryTest)  Time elapsed: 0 s
15:09:29 test_createHTTPMethodType(org.eclipse.jst.j2ee.webapplication.test.WebapplicationFactoryTest)  Time elapsed: 0 s
15:09:29 test_createWebResourceCollection(org.eclipse.jst.j2ee.webapplication.test.WebapplicationFactoryTest)  Time elapsed: 0 s
15:09:29 test_createErrorPage(org.eclipse.jst.j2ee.webapplication.test.WebapplicationFactoryTest)  Time elapsed: 0 s
15:09:29 test_createServletType(org.eclipse.jst.j2ee.webapplication.test.WebapplicationFactoryTest)  Time elapsed: 0 s
15:09:29 test_createLoginConfig(org.eclipse.jst.j2ee.webapplication.test.WebapplicationFactoryTest)  Time elapsed: 0 s
15:09:29 test_createSOAPHeader(org.eclipse.jst.j2ee.webservice.wscommon.test.WscommonFactoryTest)  Time elapsed: 0.001 s
15:09:29 test_createDisplayNameType(org.eclipse.jst.j2ee.webservice.wscommon.test.WscommonFactoryTest)  Time elapsed: 0 s
15:09:29 test_getWscommonPackage(org.eclipse.jst.j2ee.webservice.wscommon.test.WscommonFactoryTest)  Time elapsed: 0 s
15:09:29 test_createDescriptionType(org.eclipse.jst.j2ee.webservice.wscommon.test.WscommonFactoryTest)  Time elapsed: 0 s
15:09:29 test_createPortName(org.eclipse.jst.j2ee.webservice.wscommon.test.WscommonFactoryTest)  Time elapsed: 0 s
15:09:29 test_createSOAPRole(org.eclipse.jst.j2ee.webservice.wscommon.test.WscommonFactoryTest)  Time elapsed: 0 s
15:09:29 test_createInitParam(org.eclipse.jst.j2ee.webservice.wscommon.test.WscommonFactoryTest)  Time elapsed: 0 s
15:09:29 test_createEJBLink(org.eclipse.jst.j2ee.webservice.wsdd.test.WsddFactoryTest)  Time elapsed: 0 s
15:09:29 test_createWSDLPort(org.eclipse.jst.j2ee.webservice.wsdd.test.WsddFactoryTest)  Time elapsed: 0 s
15:09:29 test_createPortComponent(org.eclipse.jst.j2ee.webservice.wsdd.test.WsddFactoryTest)  Time elapsed: 0 s
15:09:29 test_createServiceImplBean(org.eclipse.jst.j2ee.webservice.wsdd.test.WsddFactoryTest)  Time elapsed: 0 s
15:09:29 test_createWebServices(org.eclipse.jst.j2ee.webservice.wsdd.test.WsddFactoryTest)  Time elapsed: 0 s
15:09:29 test_createBeanLink(org.eclipse.jst.j2ee.webservice.wsdd.test.WsddFactoryTest)  Time elapsed: 0 s
15:09:29 test_createWebServiceDescription(org.eclipse.jst.j2ee.webservice.wsdd.test.WsddFactoryTest)  Time elapsed: 0 s
15:09:29 test_createHandler(org.eclipse.jst.j2ee.webservice.wsdd.test.WsddFactoryTest)  Time elapsed: 0 s
15:09:29 test_createServletLink(org.eclipse.jst.j2ee.webservice.wsdd.test.WsddFactoryTest)  Time elapsed: 0 s
15:09:29 Running org.eclipse.jst.j2ee.core.api.test.AllCoreAPITests
15:09:29 Tests run: 243, Failures: 0, Errors: 0, Skipped: 0, Time elapsed: 2.75 s - in org.eclipse.jst.j2ee.core.api.test.AllCoreAPITests
15:09:32 test_createEjbModule(org.eclipse.jst.j2ee.application.test.ApplicationFactoryTest)  Time elapsed: 0 s
15:09:32 test_createApplication(org.eclipse.jst.j2ee.application.test.ApplicationFactoryTest)  Time elapsed: 0.001 s
15:09:32 test_createConnectorModule(org.eclipse.jst.j2ee.application.test.ApplicationFactoryTest)  Time elapsed: 0 s
15:09:32 test_createWebModule(org.eclipse.jst.j2ee.application.test.ApplicationFactoryTest)  Time elapsed: 0 s
15:09:32 test_createJavaClientModule(org.eclipse.jst.j2ee.application.test.ApplicationFactoryTest)  Time elapsed: 0 s
15:09:32 test_createModule(org.eclipse.jst.j2ee.application.test.ApplicationFactoryTest)  Time elapsed: 0 s
15:09:32 test_getVersionID(org.eclipse.jst.j2ee.application.test.ApplicationTest)  Time elapsed: 0.001 s
15:09:32 test_getJ2EEVersionID(org.eclipse.jst.j2ee.application.test.ApplicationTest)  Time elapsed: 0 s
15:09:32 test_getSecurityRoleNamed(org.eclipse.jst.j2ee.application.test.ApplicationTest)  Time elapsed: 0.001 s
15:09:32 test_getModuleHavingAltDD(org.eclipse.jst.j2ee.application.test.ApplicationTest)  Time elapsed: 0 s
15:09:32 test_containsSecurityRole(org.eclipse.jst.j2ee.application.test.ApplicationTest)  Time elapsed: 0 s
15:09:32 test_getModule_2(org.eclipse.jst.j2ee.application.test.ApplicationTest)  Time elapsed: 0 s
15:09:32 test_getFirstModule(org.eclipse.jst.j2ee.application.test.ApplicationTest)  Time elapsed: 0 s
15:09:32 test_getVersionID(org.eclipse.jst.j2ee.client.test.ApplicationClientTest)  Time elapsed: 0.01 s
15:09:32 test_getJ2EEVersionID(org.eclipse.jst.j2ee.client.test.ApplicationClientTest)  Time elapsed: 0.01 s
15:09:32 test_getCallbackHandlerClassName(org.eclipse.jst.j2ee.client.test.ApplicationClientTest)  Time elapsed: 0 s
15:09:32 test_setCallbackHandlerClassName(org.eclipse.jst.j2ee.client.test.ApplicationClientTest)  Time elapsed: 0 s
15:09:32 test_ClientFactory(org.eclipse.jst.j2ee.client.test.ClientFactoryTest)  Time elapsed: 0 s
15:09:32 test_createApplicationClient(org.eclipse.jst.j2ee.client.test.ClientFactoryTest)  Time elapsed: 0 s
15:09:32 test_createCompatibilityDescriptionGroup(org.eclipse.jst.j2ee.common.test.CommonFactoryTest)  Time elapsed: 0 s
15:09:32 test_createUseCallerIdentity(org.eclipse.jst.j2ee.common.test.CommonFactoryTest)  Time elapsed: 0 s
15:09:32 test_createDescriptionGroup(org.eclipse.jst.j2ee.common.test.CommonFactoryTest)  Time elapsed: 0 s
15:09:32 test_createIconType(org.eclipse.jst.j2ee.common.test.CommonFactoryTest)  Time elapsed: 0 s
15:09:32 test_createResourceRef(org.eclipse.jst.j2ee.common.test.CommonFactoryTest)  Time elapsed: 0 s
15:09:32 test_createDisplayName(org.eclipse.jst.j2ee.common.test.CommonFactoryTest)  Time elapsed: 0 s
15:09:32 test_createIdentity(org.eclipse.jst.j2ee.common.test.CommonFactoryTest)  Time elapsed: 0 s
15:09:32 test_createSecurityIdentity(org.eclipse.jst.j2ee.common.test.CommonFactoryTest)  Time elapsed: 0 s
15:09:32 test_createResourceEnvRef(org.eclipse.jst.j2ee.common.test.CommonFactoryTest)  Time elapsed: 0 s
15:09:32 test_createDescription(org.eclipse.jst.j2ee.common.test.CommonFactoryTest)  Time elapsed: 0 s
15:09:32 test_createQName(org.eclipse.jst.j2ee.common.test.CommonFactoryTest)  Time elapsed: 0 s
15:09:32 test_CommonFactory(org.eclipse.jst.j2ee.common.test.CommonFactoryTest)  Time elapsed: 0 s
15:09:32 test_createParamValue(org.eclipse.jst.j2ee.common.test.CommonFactoryTest)  Time elapsed: 0 s
15:09:32 test_createEjbRef(org.eclipse.jst.j2ee.common.test.CommonFactoryTest)  Time elapsed: 0 s
15:09:32 test_createListener(org.eclipse.jst.j2ee.common.test.CommonFactoryTest)  Time elapsed: 0 s
15:09:32 test_createMessageDestination(org.eclipse.jst.j2ee.common.test.CommonFactoryTest)  Time elapsed: 0 s
15:09:32 test_createEnvEntry(org.eclipse.jst.j2ee.common.test.CommonFactoryTest)  Time elapsed: 0 s
15:09:32 test_createSecurityRole(org.eclipse.jst.j2ee.common.test.CommonFactoryTest)  Time elapsed: 0 s
15:09:32 test_createMessageDestinationRef(org.eclipse.jst.j2ee.common.test.CommonFactoryTest)  Time elapsed: 0.001 s
15:09:32 test_createEJBLocalRef(org.eclipse.jst.j2ee.common.test.CommonFactoryTest)  Time elapsed: 0 s
15:09:32 test_createSecurityRoleRef(org.eclipse.jst.j2ee.common.test.CommonFactoryTest)  Time elapsed: 0 s
15:09:32 test_createRunAsSpecifiedIdentity(org.eclipse.jst.j2ee.common.test.CommonFactoryTest)  Time elapsed: 0 s
15:09:32 test_isLinked(org.eclipse.jst.j2ee.common.test.EjbRefTest)  Time elapsed: 0 s
15:09:32 test_EjbRef(org.eclipse.jst.j2ee.common.test.EjbRefTest)  Time elapsed: 0 s
15:09:32 test_isEquivalent(org.eclipse.jst.j2ee.common.test.EjbRefTest)  Time elapsed: 0 s
15:09:32 test_isLocal(org.eclipse.jst.j2ee.common.test.EjbRefTest)  Time elapsed: 0 s
15:09:32 test_getLinkedEjb(org.eclipse.jst.j2ee.common.test.EjbRefTest)  Time elapsed: 0 s
15:09:32 test_setListenerClassName(org.eclipse.jst.j2ee.common.test.ListenerTest)  Time elapsed: 0 s
15:09:32 test_getListenerClassName(org.eclipse.jst.j2ee.common.test.ListenerTest)  Time elapsed: 0 s
15:09:32 test_setValues(org.eclipse.jst.j2ee.common.test.QNameTest)  Time elapsed: 0.001 s
15:09:32 test_getMethodPermissionMethodElements(org.eclipse.jst.j2ee.ejb.test.AssemblyDescriptorTest)  Time elapsed: 0.281 s
15:09:32 test_getMethodTransactionMethodElements(org.eclipse.jst.j2ee.ejb.test.AssemblyDescriptorTest)  Time elapsed: 0.298 s
15:09:32 test_getSecurityRoleNamed(org.eclipse.jst.j2ee.ejb.test.AssemblyDescriptorTest)  Time elapsed: 0.297 s
15:09:32 test_renameSecurityRole(org.eclipse.jst.j2ee.ejb.test.AssemblyDescriptorTest)  Time elapsed: 0.276 s
15:09:32 test_removeData(org.eclipse.jst.j2ee.ejb.test.AssemblyDescriptorTest)  Time elapsed: 0.312 s
15:09:32 test_getSetterName(org.eclipse.jst.j2ee.ejb.test.CMPAttributeTest)  Time elapsed: 0 s
15:09:32 test_getType(org.eclipse.jst.j2ee.ejb.test.CMPAttributeTest)  Time elapsed: 0 s
15:09:32 test_getOriginatingType(org.eclipse.jst.j2ee.ejb.test.CMPAttributeTest)  Time elapsed: 0 s
15:09:32 test_setDerived(org.eclipse.jst.j2ee.ejb.test.CMPAttributeTest)  Time elapsed: 0 s
15:09:32 test_setOriginatingType(org.eclipse.jst.j2ee.ejb.test.CMPAttributeTest)  Time elapsed: 0 s
15:09:32 test_isCMRField(org.eclipse.jst.j2ee.ejb.test.CMPAttributeTest)  Time elapsed: 0 s
15:09:32 test_getGetterName(org.eclipse.jst.j2ee.ejb.test.CMPAttributeTest)  Time elapsed: 0 s
15:09:32 test_isDerived(org.eclipse.jst.j2ee.ejb.test.CMPAttributeTest)  Time elapsed: 0 s
15:09:32 test_isKey(org.eclipse.jst.j2ee.ejb.test.CMPAttributeTest)  Time elapsed: 0.001 s
15:09:32 test_isPrimKeyField(org.eclipse.jst.j2ee.ejb.test.CMPAttributeTest)  Time elapsed: 0 s
15:09:32 test_getRole(org.eclipse.jst.j2ee.ejb.test.CMRFieldTest)  Time elapsed: 0 s
15:09:32 test_setCollectionTypeName(org.eclipse.jst.j2ee.ejb.test.CMRFieldTest)  Time elapsed: 0 s
15:09:32 test_setCollectionType(org.eclipse.jst.j2ee.ejb.test.CMRFieldTest)  Time elapsed: 0 s
15:09:32 test_getCollectionType(org.eclipse.jst.j2ee.ejb.test.CMRFieldTest)  Time elapsed: 0 s
15:09:32 test_setRole(org.eclipse.jst.j2ee.ejb.test.CMRFieldTest)  Time elapsed: 0 s
15:09:32 test_getCollectionTypeName(org.eclipse.jst.j2ee.ejb.test.CMRFieldTest)  Time elapsed: 0 s
15:09:32 test_isUnknownPrimaryKey(org.eclipse.jst.j2ee.ejb.test.ContainerManagedEntityTest)  Time elapsed: 0 s
15:09:32 test_addPersistentAttribute(org.eclipse.jst.j2ee.ejb.test.ContainerManagedEntityTest)  Time elapsed: 0 s
15:09:32 test_addKeyAttributeName(org.eclipse.jst.j2ee.ejb.test.ContainerManagedEntityTest)  Time elapsed: 0 s
15:09:32 test_getKeyAttribute(org.eclipse.jst.j2ee.ejb.test.ContainerManagedEntityTest)  Time elapsed: 0 s
15:09:32 test_isContainerManagedEntity(org.eclipse.jst.j2ee.ejb.test.ContainerManagedEntityTest)  Time elapsed: 0 s
15:09:32 test_getPrimaryKeyAttribute(org.eclipse.jst.j2ee.ejb.test.ContainerManagedEntityTest)  Time elapsed: 0 s
15:09:32 test_isVersion1_X(org.eclipse.jst.j2ee.ejb.test.ContainerManagedEntityTest)  Time elapsed: 0 s
15:09:32 test_isVersion2_X(org.eclipse.jst.j2ee.ejb.test.ContainerManagedEntityTest)  Time elapsed: 0 s
15:09:32 test_removePersistentAttribute_2(org.eclipse.jst.j2ee.ejb.test.ContainerManagedEntityTest)  Time elapsed: 0 s
15:09:32 test_listPersistentFieldNames(org.eclipse.jst.j2ee.ejb.test.ContainerManagedEntityTest)  Time elapsed: 0 s
15:09:32 test_isKeyAttribute(org.eclipse.jst.j2ee.ejb.test.ContainerManagedEntityTest)  Time elapsed: 0 s
15:09:32 test_getCMPVersionID(org.eclipse.jst.j2ee.ejb.test.ContainerManagedEntityTest)  Time elapsed: 0 s
15:09:32 test_setPrimKeyField(org.eclipse.jst.j2ee.ejb.test.ContainerManagedEntityTest)  Time elapsed: 0 s
15:09:32 test_addPersistentAttributeName(org.eclipse.jst.j2ee.ejb.test.ContainerManagedEntityTest)  Time elapsed: 0 s
15:09:32 test_removePersistentAttribute(org.eclipse.jst.j2ee.ejb.test.ContainerManagedEntityTest)  Time elapsed: 0 s
15:09:32 test_createActivationConfig(org.eclipse.jst.j2ee.ejb.test.EjbFactoryTest)  Time elapsed: 0.001 s
15:09:32 test_createExcludeList(org.eclipse.jst.j2ee.ejb.test.EjbFactoryTest)  Time elapsed: 0 s
15:09:32 test_createEJBRelationshipRole(org.eclipse.jst.j2ee.ejb.test.EjbFactoryTest)  Time elapsed: 0 s
15:09:32 test_createContainerManagedEntity(org.eclipse.jst.j2ee.ejb.test.EjbFactoryTest)  Time elapsed: 0 s
15:09:32 test_createMessageDrivenDestination(org.eclipse.jst.j2ee.ejb.test.EjbFactoryTest)  Time elapsed: 0 s
15:09:32 test_createMethodElement_2(org.eclipse.jst.j2ee.ejb.test.EjbFactoryTest)  Time elapsed: 0 s
15:09:32 test_createCMPAttribute(org.eclipse.jst.j2ee.ejb.test.EjbFactoryTest)  Time elapsed: 0 s
15:09:32 test_createSession(org.eclipse.jst.j2ee.ejb.test.EjbFactoryTest)  Time elapsed: 0 s
15:09:32 test_createMethodElementFrom(org.eclipse.jst.j2ee.ejb.test.EjbFactoryTest)  Time elapsed: 0 s
15:09:32 test_createEJBRelation(org.eclipse.jst.j2ee.ejb.test.EjbFactoryTest)  Time elapsed: 0 s
15:09:32 test_createMethodElementFrom_2(org.eclipse.jst.j2ee.ejb.test.EjbFactoryTest)  Time elapsed: 0 s
15:09:32 test_EjbFactory(org.eclipse.jst.j2ee.ejb.test.EjbFactoryTest)  Time elapsed: 0 s
15:09:32 test_createQuery(org.eclipse.jst.j2ee.ejb.test.EjbFactoryTest)  Time elapsed: 0 s
15:09:32 test_createQueryMethod(org.eclipse.jst.j2ee.ejb.test.EjbFactoryTest)  Time elapsed: 0 s
15:09:32 test_createActivationConfigProperty(org.eclipse.jst.j2ee.ejb.test.EjbFactoryTest)  Time elapsed: 0 s
15:09:32 test_createEJBJar(org.eclipse.jst.j2ee.ejb.test.EjbFactoryTest)  Time elapsed: 0 s
15:09:32 test_createMethodPermission(org.eclipse.jst.j2ee.ejb.test.EjbFactoryTest)  Time elapsed: 0.001 s
15:09:32 test_createEntity(org.eclipse.jst.j2ee.ejb.test.EjbFactoryTest)  Time elapsed: 0 s
15:09:32 test_createRelationships(org.eclipse.jst.j2ee.ejb.test.EjbFactoryTest)  Time elapsed: 0 s
15:09:32 test_createEJBMethodCategory(org.eclipse.jst.j2ee.ejb.test.EjbFactoryTest)  Time elapsed: 0 s
15:09:32 test_createMethodTransaction(org.eclipse.jst.j2ee.ejb.test.EjbFactoryTest)  Time elapsed: 0 s
15:09:32 test_createMethodElement(org.eclipse.jst.j2ee.ejb.test.EjbFactoryTest)  Time elapsed: 0 s
15:09:32 test_createAssemblyDescriptor(org.eclipse.jst.j2ee.ejb.test.EjbFactoryTest)  Time elapsed: 0 s
15:09:32 test_createRoleSource(org.eclipse.jst.j2ee.ejb.test.EjbFactoryTest)  Time elapsed: 0 s
15:09:32 test_createCMRField(org.eclipse.jst.j2ee.ejb.test.EjbFactoryTest)  Time elapsed: 0 s
15:09:32 test_createMessageDriven(org.eclipse.jst.j2ee.ejb.test.EjbFactoryTest)  Time elapsed: 0 s
15:09:32 test_isNavigable(org.eclipse.jst.j2ee.ejb.test.EJBRelationshipRoleTest)  Time elapsed: 0 s
15:09:32 test_getLogicalName(org.eclipse.jst.j2ee.ejb.test.EJBRelationshipRoleTest)  Time elapsed: 0 s
15:09:32 test_getName(org.eclipse.jst.j2ee.ejb.test.EJBRelationshipRoleTest)  Time elapsed: 0 s
15:09:32 test_isForward(org.eclipse.jst.j2ee.ejb.test.EJBRelationshipRoleTest)  Time elapsed: 0 s
15:09:32 test_isMany(org.eclipse.jst.j2ee.ejb.test.EJBRelationshipRoleTest)  Time elapsed: 0 s
15:09:32 test_setKey(org.eclipse.jst.j2ee.ejb.test.EJBRelationshipRoleTest)  Time elapsed: 0 s
15:09:32 test_EJBRelationshipRole(org.eclipse.jst.j2ee.ejb.test.EJBRelationshipRoleTest)  Time elapsed: 0 s
15:09:32 test_setFoward(org.eclipse.jst.j2ee.ejb.test.EJBRelationshipRoleTest)  Time elapsed: 0 s
15:09:32 test_setName(org.eclipse.jst.j2ee.ejb.test.EJBRelationshipRoleTest)  Time elapsed: 0 s
15:09:32 test_getSourceEntity(org.eclipse.jst.j2ee.ejb.test.EJBRelationshipRoleTest)  Time elapsed: 0 s
15:09:32 test_setRequired(org.eclipse.jst.j2ee.ejb.test.EJBRelationshipRoleTest)  Time elapsed: 0 s
15:09:32 test_isKey(org.eclipse.jst.j2ee.ejb.test.EJBRelationshipRoleTest)  Time elapsed: 0 s
15:09:32 test_getOpposite(org.eclipse.jst.j2ee.ejb.test.EJBRelationshipRoleTest)  Time elapsed: 0 s
15:09:32 test_containsRelationshipRole(org.eclipse.jst.j2ee.ejb.test.EJBRelationTest)  Time elapsed: 0 s
15:09:32 test_getSecondRole(org.eclipse.jst.j2ee.ejb.test.EJBRelationTest)  Time elapsed: 0 s
15:09:32 test_getFirstRole(org.eclipse.jst.j2ee.ejb.test.EJBRelationTest)  Time elapsed: 0 s
15:09:32 test_getOppositeRole(org.eclipse.jst.j2ee.ejb.test.EJBRelationTest)  Time elapsed: 0 s
15:09:32 test_EJBRelation(org.eclipse.jst.j2ee.ejb.test.EJBRelationTest)  Time elapsed: 0 s
15:09:32 test_setFoward(org.eclipse.jst.j2ee.ejb.test.EJBRelationTest)  Time elapsed: 0 s
15:09:32 test_setPrimaryKeyName(org.eclipse.jst.j2ee.ejb.test.EntityTest)  Time elapsed: 0.295 s
15:09:32 test_getPrimaryKeyName(org.eclipse.jst.j2ee.ejb.test.EntityTest)  Time elapsed: 0.322 s
15:09:32 test_initializeFromSignature(org.eclipse.jst.j2ee.ejb.test.MethodElementTest)  Time elapsed: 0 s
15:09:32 test_applyZeroParams(org.eclipse.jst.j2ee.ejb.test.MethodElementTest)  Time elapsed: 0 s
15:09:32 test_equalSignature(org.eclipse.jst.j2ee.ejb.test.MethodElementTest)  Time elapsed: 0 s
15:09:32 test_isRemote(org.eclipse.jst.j2ee.ejb.test.MethodElementTest)  Time elapsed: 0 s
15:09:32 test_getTypeJavaClass(org.eclipse.jst.j2ee.ejb.test.MethodElementTest)  Time elapsed: 0.316 s
15:09:32 test_isHome(org.eclipse.jst.j2ee.ejb.test.MethodElementTest)  Time elapsed: 0.001 s
15:09:32 test_getSignature(org.eclipse.jst.j2ee.ejb.test.MethodElementTest)  Time elapsed: 0 s
15:09:32 test_nameAndParamsEquals(org.eclipse.jst.j2ee.ejb.test.MethodElementTest)  Time elapsed: 0 s
15:09:32 test_isLocalHome(org.eclipse.jst.j2ee.ejb.test.MethodElementTest)  Time elapsed: 0 s
15:09:32 test_isUnspecified(org.eclipse.jst.j2ee.ejb.test.MethodElementTest)  Time elapsed: 0 s
15:09:32 test_isEquivalent(org.eclipse.jst.j2ee.ejb.test.MethodElementTest)  Time elapsed: 0 s
15:09:32 test_MethodElement(org.eclipse.jst.j2ee.ejb.test.MethodElementTest)  Time elapsed: 0.001 s
15:09:32 test_hasMethodParams(org.eclipse.jst.j2ee.ejb.test.MethodElementTest)  Time elapsed: 0 s
15:09:32 test_isLocal(org.eclipse.jst.j2ee.ejb.test.MethodElementTest)  Time elapsed: 0 s
15:09:32 test_isValid(org.eclipse.jst.j2ee.ejb.test.MethodElementTest)  Time elapsed: 0 s
15:09:32 test_getMethodParams(org.eclipse.jst.j2ee.ejb.test.MethodElementTest)  Time elapsed: 0 s
15:09:32 test_isDefault(org.eclipse.jst.j2ee.ejb.test.MethodElementTest)  Time elapsed: 0 s
15:09:32 test_addMethodParams(org.eclipse.jst.j2ee.ejb.test.MethodElementTest)  Time elapsed: 0 s
15:09:32 test_removeMethodParams(org.eclipse.jst.j2ee.ejb.test.MethodElementTest)  Time elapsed: 0 s
15:09:32 testEJBJarPopulation(org.eclipse.jst.j2ee.ejb.test.MethodElementTest)  Time elapsed: 0.001 s
15:09:32 test14EJBJarPopulation(org.eclipse.jst.j2ee.ejb.test.MethodElementTest)  Time elapsed: 0 s
15:09:32 test_MethodPermission(org.eclipse.jst.j2ee.ejb.test.MethodPermissionTest)  Time elapsed: 0 s
15:09:32 test_isEquivalent(org.eclipse.jst.j2ee.ejb.test.MethodPermissionTest)  Time elapsed: 0 s
15:09:32 test_hasSecurityRole(org.eclipse.jst.j2ee.ejb.test.MethodPermissionTest)  Time elapsed: 0 s
15:09:32 test_getSecurityRole(org.eclipse.jst.j2ee.ejb.test.MethodPermissionTest)  Time elapsed: 0 s
15:09:32 test_hasSecurityRole_2(org.eclipse.jst.j2ee.ejb.test.MethodPermissionTest)  Time elapsed: 0 s
15:09:32 test_getClientTypeJavaClasses(org.eclipse.jst.j2ee.ejb.test.QueryMethodTest)  Time elapsed: 0.295 s
15:09:32 test_isRemoteResultMapping(org.eclipse.jst.j2ee.ejb.test.QueryTest)  Time elapsed: 0 s
15:09:32 test_isLocalResultMapping(org.eclipse.jst.j2ee.ejb.test.QueryTest)  Time elapsed: 0 s
15:09:32 test_Query(org.eclipse.jst.j2ee.ejb.test.QueryTest)  Time elapsed: 0 s
15:09:32 test_hasServiceEndpoint(org.eclipse.jst.j2ee.ejb.test.SessionTest)  Time elapsed: 0 s
15:09:32 test_getServiceEndpointName(org.eclipse.jst.j2ee.ejb.test.SessionTest)  Time elapsed: 0 s
15:09:32 test_setServiceEndpointName(org.eclipse.jst.j2ee.ejb.test.SessionTest)  Time elapsed: 0 s
15:09:32 test_getVersionID(org.eclipse.jst.j2ee.jca.test.ConnectorTest)  Time elapsed: 0.001 s
15:09:32 test_createResourceAdapter(org.eclipse.jst.j2ee.jca.test.JcaFactoryTest)  Time elapsed: 0 s
15:09:32 test_createInboundResourceAdapter(org.eclipse.jst.j2ee.jca.test.JcaFactoryTest)  Time elapsed: 0.001 s
15:09:32 test_createActivationSpec(org.eclipse.jst.j2ee.jca.test.JcaFactoryTest)  Time elapsed: 0 s
15:09:32 test_getJcaPackage(org.eclipse.jst.j2ee.jca.test.JcaFactoryTest)  Time elapsed: 0 s
15:09:32 test_createAuthenticationMechanism(org.eclipse.jst.j2ee.jca.test.JcaFactoryTest)  Time elapsed: 0 s
15:09:32 test_createMessageAdapter(org.eclipse.jst.j2ee.jca.test.JcaFactoryTest)  Time elapsed: 0 s
15:09:32 test_createRequiredConfigPropertyType(org.eclipse.jst.j2ee.jca.test.JcaFactoryTest)  Time elapsed: 0 s
15:09:32 test_createConfigProperty(org.eclipse.jst.j2ee.jca.test.JcaFactoryTest)  Time elapsed: 0 s
15:09:32 test_createConnectionDefinition(org.eclipse.jst.j2ee.jca.test.JcaFactoryTest)  Time elapsed: 0 s
15:09:32 test_createAdminObject(org.eclipse.jst.j2ee.jca.test.JcaFactoryTest)  Time elapsed: 0 s
15:09:32 test_JcaFactory(org.eclipse.jst.j2ee.jca.test.JcaFactoryTest)  Time elapsed: 0 s
15:09:32 test_createConnector(org.eclipse.jst.j2ee.jca.test.JcaFactoryTest)  Time elapsed: 0 s
15:09:32 test_createMessageListener(org.eclipse.jst.j2ee.jca.test.JcaFactoryTest)  Time elapsed: 0 s
15:09:32 test_createSecurityPermission(org.eclipse.jst.j2ee.jca.test.JcaFactoryTest)  Time elapsed: 0 s
15:09:32 test_createOutboundResourceAdapter(org.eclipse.jst.j2ee.jca.test.JcaFactoryTest)  Time elapsed: 0 s
15:09:32 test_createLicense(org.eclipse.jst.j2ee.jca.test.JcaFactoryTest)  Time elapsed: 0 s
15:09:32 test_createResourceAdapter(org.eclipse.jst.j2ee.jca.test.JcaFactoryTest)  Time elapsed: 0 s
15:09:32 test_createInboundResourceAdapter(org.eclipse.jst.j2ee.jca.test.JcaFactoryTest)  Time elapsed: 0 s
15:09:32 test_createActivationSpec(org.eclipse.jst.j2ee.jca.test.JcaFactoryTest)  Time elapsed: 0 s
15:09:32 test_getJcaPackage(org.eclipse.jst.j2ee.jca.test.JcaFactoryTest)  Time elapsed: 0 s
15:09:32 test_createAuthenticationMechanism(org.eclipse.jst.j2ee.jca.test.JcaFactoryTest)  Time elapsed: 0.001 s
15:09:32 test_createMessageAdapter(org.eclipse.jst.j2ee.jca.test.JcaFactoryTest)  Time elapsed: 0 s
15:09:32 test_createRequiredConfigPropertyType(org.eclipse.jst.j2ee.jca.test.JcaFactoryTest)  Time elapsed: 0 s
15:09:32 test_createConfigProperty(org.eclipse.jst.j2ee.jca.test.JcaFactoryTest)  Time elapsed: 0 s
15:09:32 test_createConnectionDefinition(org.eclipse.jst.j2ee.jca.test.JcaFactoryTest)  Time elapsed: 0 s
15:09:32 test_createAdminObject(org.eclipse.jst.j2ee.jca.test.JcaFactoryTest)  Time elapsed: 0 s
15:09:32 test_JcaFactory(org.eclipse.jst.j2ee.jca.test.JcaFactoryTest)  Time elapsed: 0 s
15:09:32 test_createConnector(org.eclipse.jst.j2ee.jca.test.JcaFactoryTest)  Time elapsed: 0 s
15:09:32 test_createMessageListener(org.eclipse.jst.j2ee.jca.test.JcaFactoryTest)  Time elapsed: 0 s
15:09:32 test_createSecurityPermission(org.eclipse.jst.j2ee.jca.test.JcaFactoryTest)  Time elapsed: 0 s
15:09:32 test_createOutboundResourceAdapter(org.eclipse.jst.j2ee.jca.test.JcaFactoryTest)  Time elapsed: 0 s
15:09:32 test_createLicense(org.eclipse.jst.j2ee.jca.test.JcaFactoryTest)  Time elapsed: 0 s
15:09:32 test_createFormLoginConfig(org.eclipse.jst.j2ee.webapplication.test.WebapplicationFactoryTest)  Time elapsed: 0 s
15:09:32 test_createErrorCodeErrorPage(org.eclipse.jst.j2ee.webapplication.test.WebapplicationFactoryTest)  Time elapsed: 0 s
15:09:32 test_createMimeMapping(org.eclipse.jst.j2ee.webapplication.test.WebapplicationFactoryTest)  Time elapsed: 0 s
15:09:32 test_createExceptionTypeErrorPage(org.eclipse.jst.j2ee.webapplication.test.WebapplicationFactoryTest)  Time elapsed: 0 s
15:09:32 test_createTagLibRef(org.eclipse.jst.j2ee.webapplication.test.WebapplicationFactoryTest)  Time elapsed: 0 s
15:09:32 test_createLocalEncodingMapping(org.eclipse.jst.j2ee.webapplication.test.WebapplicationFactoryTest)  Time elapsed: 0 s
15:09:32 test_createServlet(org.eclipse.jst.j2ee.webapplication.test.WebapplicationFactoryTest)  Time elapsed: 0 s
15:09:32 test_createJSPType(org.eclipse.jst.j2ee.webapplication.test.WebapplicationFactoryTest)  Time elapsed: 0 s
15:09:32 test_createSessionConfig(org.eclipse.jst.j2ee.webapplication.test.WebapplicationFactoryTest)  Time elapsed: 0 s
15:09:32 test_createServletMapping(org.eclipse.jst.j2ee.webapplication.test.WebapplicationFactoryTest)  Time elapsed: 0 s
15:09:32 test_createURLPatternType(org.eclipse.jst.j2ee.webapplication.test.WebapplicationFactoryTest)  Time elapsed: 0 s
15:09:32 test_createLocalEncodingMappingList(org.eclipse.jst.j2ee.webapplication.test.WebapplicationFactoryTest)  Time elapsed: 0 s
15:09:32 test_createFilterMapping(org.eclipse.jst.j2ee.webapplication.test.WebapplicationFactoryTest)  Time elapsed: 0 s
15:09:32 test_createAuthConstraint(org.eclipse.jst.j2ee.webapplication.test.WebapplicationFactoryTest)  Time elapsed: 0 s
15:09:32 test_createUserDataConstraint(org.eclipse.jst.j2ee.webapplication.test.WebapplicationFactoryTest)  Time elapsed: 0 s
15:09:32 test_createFilter(org.eclipse.jst.j2ee.webapplication.test.WebapplicationFactoryTest)  Time elapsed: 0 s
15:09:32 test_createRoleNameType(org.eclipse.jst.j2ee.webapplication.test.WebapplicationFactoryTest)  Time elapsed: 0 s
15:09:32 test_createWelcomeFileList(org.eclipse.jst.j2ee.webapplication.test.WebapplicationFactoryTest)  Time elapsed: 0 s
15:09:32 test_createWebApp(org.eclipse.jst.j2ee.webapplication.test.WebapplicationFactoryTest)  Time elapsed: 0.001 s
15:09:32 test_createInitParam(org.eclipse.jst.j2ee.webapplication.test.WebapplicationFactoryTest)  Time elapsed: 0 s
15:09:32 test_createWelcomeFile(org.eclipse.jst.j2ee.webapplication.test.WebapplicationFactoryTest)  Time elapsed: 0 s
15:09:32 test_getWebapplicationPackage(org.eclipse.jst.j2ee.webapplication.test.WebapplicationFactoryTest)  Time elapsed: 0 s
15:09:32 test_createContextParam(org.eclipse.jst.j2ee.webapplication.test.WebapplicationFactoryTest)  Time elapsed: 0 s
15:09:32 test_createSecurityConstraint(org.eclipse.jst.j2ee.webapplication.test.WebapplicationFactoryTest)  Time elapsed: 0 s
15:09:32 test_createHTTPMethodType(org.eclipse.jst.j2ee.webapplication.test.WebapplicationFactoryTest)  Time elapsed: 0 s
15:09:32 test_createWebResourceCollection(org.eclipse.jst.j2ee.webapplication.test.WebapplicationFactoryTest)  Time elapsed: 0 s
15:09:32 test_createErrorPage(org.eclipse.jst.j2ee.webapplication.test.WebapplicationFactoryTest)  Time elapsed: 0 s
15:09:32 test_createServletType(org.eclipse.jst.j2ee.webapplication.test.WebapplicationFactoryTest)  Time elapsed: 0 s
15:09:32 test_createLoginConfig(org.eclipse.jst.j2ee.webapplication.test.WebapplicationFactoryTest)  Time elapsed: 0 s
15:09:32 test_createSOAPHeader(org.eclipse.jst.j2ee.webservice.wscommon.test.WscommonFactoryTest)  Time elapsed: 0 s
15:09:32 test_createDisplayNameType(org.eclipse.jst.j2ee.webservice.wscommon.test.WscommonFactoryTest)  Time elapsed: 0 s
15:09:32 test_getWscommonPackage(org.eclipse.jst.j2ee.webservice.wscommon.test.WscommonFactoryTest)  Time elapsed: 0 s
15:09:32 test_createDescriptionType(org.eclipse.jst.j2ee.webservice.wscommon.test.WscommonFactoryTest)  Time elapsed: 0 s
15:09:32 test_createPortName(org.eclipse.jst.j2ee.webservice.wscommon.test.WscommonFactoryTest)  Time elapsed: 0 s
15:09:32 test_createSOAPRole(org.eclipse.jst.j2ee.webservice.wscommon.test.WscommonFactoryTest)  Time elapsed: 0 s
15:09:32 test_createInitParam(org.eclipse.jst.j2ee.webservice.wscommon.test.WscommonFactoryTest)  Time elapsed: 0 s
15:09:32 test_createEJBLink(org.eclipse.jst.j2ee.webservice.wsdd.test.WsddFactoryTest)  Time elapsed: 0 s
15:09:32 test_createWSDLPort(org.eclipse.jst.j2ee.webservice.wsdd.test.WsddFactoryTest)  Time elapsed: 0 s
15:09:32 test_createPortComponent(org.eclipse.jst.j2ee.webservice.wsdd.test.WsddFactoryTest)  Time elapsed: 0 s
15:09:32 test_createServiceImplBean(org.eclipse.jst.j2ee.webservice.wsdd.test.WsddFactoryTest)  Time elapsed: 0 s
15:09:32 test_createWebServices(org.eclipse.jst.j2ee.webservice.wsdd.test.WsddFactoryTest)  Time elapsed: 0 s
15:09:32 test_createBeanLink(org.eclipse.jst.j2ee.webservice.wsdd.test.WsddFactoryTest)  Time elapsed: 0 s
15:09:32 test_createWebServiceDescription(org.eclipse.jst.j2ee.webservice.wsdd.test.WsddFactoryTest)  Time elapsed: 0 s
15:09:32 test_createHandler(org.eclipse.jst.j2ee.webservice.wsdd.test.WsddFactoryTest)  Time elapsed: 0 s
15:09:32 test_createServletLink(org.eclipse.jst.j2ee.webservice.wsdd.test.WsddFactoryTest)  Time elapsed: 0 s
15:09:32 Running org.eclipse.jst.j2ee.client.test.ApplicationClientTest
15:09:32 Tests run: 4, Failures: 0, Errors: 0, Skipped: 0, Time elapsed: 0.023 s - in org.eclipse.jst.j2ee.client.test.ApplicationClientTest
15:09:32 test_getVersionID(org.eclipse.jst.j2ee.client.test.ApplicationClientTest)  Time elapsed: 0.012 s
15:09:32 test_getJ2EEVersionID(org.eclipse.jst.j2ee.client.test.ApplicationClientTest)  Time elapsed: 0.01 s
15:09:32 test_getCallbackHandlerClassName(org.eclipse.jst.j2ee.client.test.ApplicationClientTest)  Time elapsed: 0 s
15:09:32 test_setCallbackHandlerClassName(org.eclipse.jst.j2ee.client.test.ApplicationClientTest)  Time elapsed: 0 s
15:09:32 Running org.eclipse.jst.j2ee.client.test.ClientFactoryTest
15:09:32 Tests run: 2, Failures: 0, Errors: 0, Skipped: 0, Time elapsed: 0.001 s - in org.eclipse.jst.j2ee.client.test.ClientFactoryTest
15:09:32 test_ClientFactory(org.eclipse.jst.j2ee.client.test.ClientFactoryTest)  Time elapsed: 0 s
15:09:32 test_createApplicationClient(org.eclipse.jst.j2ee.client.test.ClientFactoryTest)  Time elapsed: 0 s
15:09:32 Running org.eclipse.jst.j2ee.application.test.ApplicationFactoryTest
15:09:32 Tests run: 6, Failures: 0, Errors: 0, Skipped: 0, Time elapsed: 0.002 s - in org.eclipse.jst.j2ee.application.test.ApplicationFactoryTest
15:09:32 test_createEjbModule(org.eclipse.jst.j2ee.application.test.ApplicationFactoryTest)  Time elapsed: 0 s
15:09:32 test_createApplication(org.eclipse.jst.j2ee.application.test.ApplicationFactoryTest)  Time elapsed: 0 s
15:09:32 test_createConnectorModule(org.eclipse.jst.j2ee.application.test.ApplicationFactoryTest)  Time elapsed: 0 s
15:09:32 test_createWebModule(org.eclipse.jst.j2ee.application.test.ApplicationFactoryTest)  Time elapsed: 0.001 s
15:09:32 test_createJavaClientModule(org.eclipse.jst.j2ee.application.test.ApplicationFactoryTest)  Time elapsed: 0 s
15:09:32 test_createModule(org.eclipse.jst.j2ee.application.test.ApplicationFactoryTest)  Time elapsed: 0 s
15:09:32 Running org.eclipse.jst.j2ee.application.test.ApplicationTest
15:09:32 Tests run: 7, Failures: 0, Errors: 0, Skipped: 0, Time elapsed: 0.002 s - in org.eclipse.jst.j2ee.application.test.ApplicationTest
15:09:32 test_getVersionID(org.eclipse.jst.j2ee.application.test.ApplicationTest)  Time elapsed: 0.001 s
15:09:32 test_getJ2EEVersionID(org.eclipse.jst.j2ee.application.test.ApplicationTest)  Time elapsed: 0 s
15:09:32 test_getSecurityRoleNamed(org.eclipse.jst.j2ee.application.test.ApplicationTest)  Time elapsed: 0 s
15:09:32 test_getModuleHavingAltDD(org.eclipse.jst.j2ee.application.test.ApplicationTest)  Time elapsed: 0 s
15:09:32 test_containsSecurityRole(org.eclipse.jst.j2ee.application.test.ApplicationTest)  Time elapsed: 0 s
15:09:32 test_getModule_2(org.eclipse.jst.j2ee.application.test.ApplicationTest)  Time elapsed: 0 s
15:09:32 test_getFirstModule(org.eclipse.jst.j2ee.application.test.ApplicationTest)  Time elapsed: 0 s
15:09:32 Running org.eclipse.jst.j2ee.jca.test.JcaFactoryTest
15:09:32 Tests run: 16, Failures: 0, Errors: 0, Skipped: 0, Time elapsed: 0.002 s - in org.eclipse.jst.j2ee.jca.test.JcaFactoryTest
15:09:32 test_createResourceAdapter(org.eclipse.jst.j2ee.jca.test.JcaFactoryTest)  Time elapsed: 0 s
15:09:32 test_createInboundResourceAdapter(org.eclipse.jst.j2ee.jca.test.JcaFactoryTest)  Time elapsed: 0 s
15:09:32 test_createActivationSpec(org.eclipse.jst.j2ee.jca.test.JcaFactoryTest)  Time elapsed: 0 s
15:09:32 test_getJcaPackage(org.eclipse.jst.j2ee.jca.test.JcaFactoryTest)  Time elapsed: 0 s
15:09:32 test_createAuthenticationMechanism(org.eclipse.jst.j2ee.jca.test.JcaFactoryTest)  Time elapsed: 0 s
15:09:32 test_createMessageAdapter(org.eclipse.jst.j2ee.jca.test.JcaFactoryTest)  Time elapsed: 0 s
15:09:32 test_createRequiredConfigPropertyType(org.eclipse.jst.j2ee.jca.test.JcaFactoryTest)  Time elapsed: 0 s
15:09:32 test_createConfigProperty(org.eclipse.jst.j2ee.jca.test.JcaFactoryTest)  Time elapsed: 0 s
15:09:32 test_createConnectionDefinition(org.eclipse.jst.j2ee.jca.test.JcaFactoryTest)  Time elapsed: 0 s
15:09:32 test_createAdminObject(org.eclipse.jst.j2ee.jca.test.JcaFactoryTest)  Time elapsed: 0 s
15:09:32 test_JcaFactory(org.eclipse.jst.j2ee.jca.test.JcaFactoryTest)  Time elapsed: 0 s
15:09:32 test_createConnector(org.eclipse.jst.j2ee.jca.test.JcaFactoryTest)  Time elapsed: 0 s
15:09:32 test_createMessageListener(org.eclipse.jst.j2ee.jca.test.JcaFactoryTest)  Time elapsed: 0 s
15:09:32 test_createSecurityPermission(org.eclipse.jst.j2ee.jca.test.JcaFactoryTest)  Time elapsed: 0 s
15:09:32 test_createOutboundResourceAdapter(org.eclipse.jst.j2ee.jca.test.JcaFactoryTest)  Time elapsed: 0 s
15:09:32 test_createLicense(org.eclipse.jst.j2ee.jca.test.JcaFactoryTest)  Time elapsed: 0 s
15:09:32 Running org.eclipse.jst.j2ee.jca.test.ConnectorTest
15:09:32 Tests run: 1, Failures: 0, Errors: 0, Skipped: 0, Time elapsed: 0.002 s - in org.eclipse.jst.j2ee.jca.test.ConnectorTest
15:09:32 test_getVersionID(org.eclipse.jst.j2ee.jca.test.ConnectorTest)  Time elapsed: 0.002 s
15:09:32 Running org.eclipse.jst.j2ee.jsp.test.JspFactoryTest
15:09:32 Tests run: 16, Failures: 0, Errors: 0, Skipped: 0, Time elapsed: 0.003 s - in org.eclipse.jst.j2ee.jsp.test.JspFactoryTest
15:09:32 test_createResourceAdapter(org.eclipse.jst.j2ee.jca.test.JcaFactoryTest)  Time elapsed: 0 s
15:09:32 test_createInboundResourceAdapter(org.eclipse.jst.j2ee.jca.test.JcaFactoryTest)  Time elapsed: 0 s
15:09:32 test_createActivationSpec(org.eclipse.jst.j2ee.jca.test.JcaFactoryTest)  Time elapsed: 0 s
15:09:32 test_getJcaPackage(org.eclipse.jst.j2ee.jca.test.JcaFactoryTest)  Time elapsed: 0 s
15:09:32 test_createAuthenticationMechanism(org.eclipse.jst.j2ee.jca.test.JcaFactoryTest)  Time elapsed: 0 s
15:09:32 test_createMessageAdapter(org.eclipse.jst.j2ee.jca.test.JcaFactoryTest)  Time elapsed: 0 s
15:09:32 test_createRequiredConfigPropertyType(org.eclipse.jst.j2ee.jca.test.JcaFactoryTest)  Time elapsed: 0 s
15:09:32 test_createConfigProperty(org.eclipse.jst.j2ee.jca.test.JcaFactoryTest)  Time elapsed: 0 s
15:09:32 test_createConnectionDefinition(org.eclipse.jst.j2ee.jca.test.JcaFactoryTest)  Time elapsed: 0 s
15:09:32 test_createAdminObject(org.eclipse.jst.j2ee.jca.test.JcaFactoryTest)  Time elapsed: 0 s
15:09:32 test_JcaFactory(org.eclipse.jst.j2ee.jca.test.JcaFactoryTest)  Time elapsed: 0 s
15:09:32 test_createConnector(org.eclipse.jst.j2ee.jca.test.JcaFactoryTest)  Time elapsed: 0 s
15:09:32 test_createMessageListener(org.eclipse.jst.j2ee.jca.test.JcaFactoryTest)  Time elapsed: 0 s
15:09:32 test_createSecurityPermission(org.eclipse.jst.j2ee.jca.test.JcaFactoryTest)  Time elapsed: 0 s
15:09:32 test_createOutboundResourceAdapter(org.eclipse.jst.j2ee.jca.test.JcaFactoryTest)  Time elapsed: 0 s
15:09:32 test_createLicense(org.eclipse.jst.j2ee.jca.test.JcaFactoryTest)  Time elapsed: 0 s
15:09:32 Running org.eclipse.jst.j2ee.webapplication.test.WebapplicationFactoryTest
15:09:32 Tests run: 29, Failures: 0, Errors: 0, Skipped: 0, Time elapsed: 0.003 s - in org.eclipse.jst.j2ee.webapplication.test.WebapplicationFactoryTest
15:09:32 test_createFormLoginConfig(org.eclipse.jst.j2ee.webapplication.test.WebapplicationFactoryTest)  Time elapsed: 0.001 s
15:09:32 test_createErrorCodeErrorPage(org.eclipse.jst.j2ee.webapplication.test.WebapplicationFactoryTest)  Time elapsed: 0 s
15:09:32 test_createMimeMapping(org.eclipse.jst.j2ee.webapplication.test.WebapplicationFactoryTest)  Time elapsed: 0 s
15:09:32 test_createExceptionTypeErrorPage(org.eclipse.jst.j2ee.webapplication.test.WebapplicationFactoryTest)  Time elapsed: 0 s
15:09:32 test_createTagLibRef(org.eclipse.jst.j2ee.webapplication.test.WebapplicationFactoryTest)  Time elapsed: 0 s
15:09:32 test_createLocalEncodingMapping(org.eclipse.jst.j2ee.webapplication.test.WebapplicationFactoryTest)  Time elapsed: 0 s
15:09:32 test_createServlet(org.eclipse.jst.j2ee.webapplication.test.WebapplicationFactoryTest)  Time elapsed: 0 s
15:09:32 test_createJSPType(org.eclipse.jst.j2ee.webapplication.test.WebapplicationFactoryTest)  Time elapsed: 0 s
15:09:32 test_createSessionConfig(org.eclipse.jst.j2ee.webapplication.test.WebapplicationFactoryTest)  Time elapsed: 0 s
15:09:32 test_createServletMapping(org.eclipse.jst.j2ee.webapplication.test.WebapplicationFactoryTest)  Time elapsed: 0 s
15:09:32 test_createURLPatternType(org.eclipse.jst.j2ee.webapplication.test.WebapplicationFactoryTest)  Time elapsed: 0 s
15:09:32 test_createLocalEncodingMappingList(org.eclipse.jst.j2ee.webapplication.test.WebapplicationFactoryTest)  Time elapsed: 0 s
15:09:32 test_createFilterMapping(org.eclipse.jst.j2ee.webapplication.test.WebapplicationFactoryTest)  Time elapsed: 0 s
15:09:32 test_createAuthConstraint(org.eclipse.jst.j2ee.webapplication.test.WebapplicationFactoryTest)  Time elapsed: 0 s
15:09:32 test_createUserDataConstraint(org.eclipse.jst.j2ee.webapplication.test.WebapplicationFactoryTest)  Time elapsed: 0 s
15:09:32 test_createFilter(org.eclipse.jst.j2ee.webapplication.test.WebapplicationFactoryTest)  Time elapsed: 0 s
15:09:32 test_createRoleNameType(org.eclipse.jst.j2ee.webapplication.test.WebapplicationFactoryTest)  Time elapsed: 0 s
15:09:32 test_createWelcomeFileList(org.eclipse.jst.j2ee.webapplication.test.WebapplicationFactoryTest)  Time elapsed: 0 s
15:09:32 test_createWebApp(org.eclipse.jst.j2ee.webapplication.test.WebapplicationFactoryTest)  Time elapsed: 0 s
15:09:32 test_createInitParam(org.eclipse.jst.j2ee.webapplication.test.WebapplicationFactoryTest)  Time elapsed: 0 s
15:09:32 test_createWelcomeFile(org.eclipse.jst.j2ee.webapplication.test.WebapplicationFactoryTest)  Time elapsed: 0 s
15:09:32 test_getWebapplicationPackage(org.eclipse.jst.j2ee.webapplication.test.WebapplicationFactoryTest)  Time elapsed: 0 s
15:09:32 test_createContextParam(org.eclipse.jst.j2ee.webapplication.test.WebapplicationFactoryTest)  Time elapsed: 0 s
15:09:32 test_createSecurityConstraint(org.eclipse.jst.j2ee.webapplication.test.WebapplicationFactoryTest)  Time elapsed: 0 s
15:09:32 test_createHTTPMethodType(org.eclipse.jst.j2ee.webapplication.test.WebapplicationFactoryTest)  Time elapsed: 0 s
15:09:32 test_createWebResourceCollection(org.eclipse.jst.j2ee.webapplication.test.WebapplicationFactoryTest)  Time elapsed: 0 s
15:09:32 test_createErrorPage(org.eclipse.jst.j2ee.webapplication.test.WebapplicationFactoryTest)  Time elapsed: 0 s
15:09:32 test_createServletType(org.eclipse.jst.j2ee.webapplication.test.WebapplicationFactoryTest)  Time elapsed: 0 s
15:09:32 test_createLoginConfig(org.eclipse.jst.j2ee.webapplication.test.WebapplicationFactoryTest)  Time elapsed: 0 s
15:09:32 
15:09:32 Results:
15:09:32 
15:09:32 Failures: 
15:09:32   ResourceTests.testResourceCreation:76 The resource should be unloaded
15:09:32 Errors: 
15:09:32   CopyTests.testAddCopyDirectory:78 » OpenFailure IWAE0037E Could not open /home...
15:09:32   CopyTests.testAddCopyModule:100 » OpenFailure IWAE0037E Could not open /home/j...
15:09:32   CopyTests.testAddCopyModuleFilesToEAR:139 » OpenFailure IWAE0037E Could not op...
15:09:32   CopyTests.testAddCopyStandaloneModule:167 » OpenFailure IWAE0037E Could not op...
15:09:32   CopyTests.testAddRenameAndDelete:184 » OpenFailure IWAE0037E Could not open /h...
15:09:32   CopyTests.testAddRenameAndDeleteStandalone:218 » OpenFailure IWAE0037E Could n...
15:09:32   DefectVerificationTests.testFilterMappingTranslator:83 » OpenFailure IWAE0037E...
15:09:32   DefectVerificationTests.testFormerDefect297:109 » OpenFailure IWAE0037E Could ...
15:09:32   DefectVerificationTests.testReadCrimsonCase:261 » OpenFailure IWAE0037E Could ...
15:09:32   DefectVerificationTests.testSavingEARWhileDeploying:172 » OpenFailure IWAE0037...
15:09:32   DefectVerificationTests.testServiceQNameTranslator:216 » OpenFailure IWAE0037E...
15:09:32   RarFileTests.testJ2Cauth:193 » OpenFailure IWAE0037E Could not open /home/jenk...
15:09:32   RarFileTests.testOpenAndExtract:153 » OpenFailure IWAE0037E Could not open /ho...
15:09:32   RarFileTests.testOpenAndRead:165 » OpenFailure IWAE0037E Could not open /home/...
15:09:32   RarFileTests.testSaveRarEar:178 » OpenFailure IWAE0037E Could not open /home/j...
15:09:32   RarFileTests.testaddCopyModule:114 » OpenFailure IWAE0037E Could not open /hom...
15:09:32   RarFileTests.testexpandRarModule:132 » OpenFailure IWAE0037E Could not open /h...
15:09:32   RarFileTests.testopenRarEar:172 » OpenFailure IWAE0037E Could not open /home/j...
15:09:32   ResourceTests.testResourceDirty:95 » OpenFailure IWAE0037E Could not open /hom...
15:09:32   SaveTests.testSave:63 » OpenFailure IWAE0037E Could not open /home/jenkins/age...
15:09:32   SaveTests.testSaveDirectory:93 » OpenFailure IWAE0037E Could not open /home/je...
15:09:32   SecurityRoleTests.testPushDownCopy:53 » OpenFailure IWAE0037E Could not open /...
15:09:32   SecurityRoleTests.testRollupAddAndPushDown:73 » OpenFailure IWAE0037E Could no...
15:09:32   SimpleTests.testContainerManagedEntityExtensionRead:110 » OpenFailure IWAE0037...
15:09:32   SimpleTests.testEJB11JarAdd:117 » OpenFailure IWAE0037E Could not open /home/j...
15:09:32   SimpleTests.testEJBSetAbstractSchemaName:125 » OpenFailure IWAE0037E Could not...
15:09:32   SimpleTests.testIndexing:142 » OpenFailure IWAE0037E Could not open /home/jenk...
15:09:32   SimpleTests.testIndexingWithCollections:173 » OpenFailure IWAE0037E Could not ...
15:09:32   SimpleTests.testOpenAndExtract1:213 » OpenFailure IWAE0037E Could not open /ho...
15:09:32   SimpleTests.testOpenAndExtract2:233 » OpenFailure IWAE0037E Could not open /ho...
15:09:32   SimpleTests.testOpenAndExtract3:253 » OpenFailure IWAE0037E Could not open /ho...
15:09:32   SimpleTests.testOpenAndRead:265 » OpenFailure IWAE0037E Could not open /home/j...
15:09:32   SimpleTests.testOpenAndSaveAsJarFile:292 » OpenFailure IWAE0037E Could not ope...
15:09:32   SimpleTests.testOpenDirectoryAndSaveAsJarFile:305 » OpenFailure IWAE0037E Coul...
15:09:32   SimpleTests.testReadEmptyTags:425 » OpenFailure IWAE0037E Could not open /home...
15:09:32   SimpleTests.testSafeClose:319 » OpenFailure IWAE0037E Could not open /home/jen...
15:09:32   SimpleTests.testSaveFailure:352 » OpenFailure IWAE0037E Could not open /home/j...
15:09:32   SimpleTests.testXmlValidation:387 » OpenFailure IWAE0037E Could not open /home...
15:09:32   WARFileTests.testAddCopyClass:56 » OpenFailure IWAE0037E Could not open /home/...
15:09:32   WARFileTests.testAddCopyLib:77 » OpenFailure IWAE0037E Could not open /home/je...
15:09:32   WARFileTests.testListClassesAndLibs:96 » OpenFailure IWAE0037E Could not open ...
15:09:32 
15:09:32 Tests run: 887, Failures: 1, Errors: 41, Skipped: 0
15:09:32 
15:09:32 [INFO] 
15:09:40 [INFO] ------------------------------------------------------------------------
15:09:40 [INFO] Skipping org.eclipse.jst.j2ee.tests
15:09:40 [INFO] This project has been banned from the build due to previous failures.
15:09:40 [INFO] ------------------------------------------------------------------------
15:09:40 [INFO] 
15:09:40 [INFO] ------------------------------------------------------------------------
15:09:40 [INFO] Skipping org.eclipse.jst.jee.tests
15:09:40 [INFO] This project has been banned from the build due to previous failures.
15:09:40 [INFO] ------------------------------------------------------------------------
15:09:40 [INFO] 
15:09:40 [INFO] ------------------------------------------------------------------------
15:09:40 [INFO] Skipping org.eclipse.jst.servlet.tests
15:09:40 [INFO] This project has been banned from the build due to previous failures.
15:09:40 [INFO] ------------------------------------------------------------------------
15:09:40 [INFO] 
15:09:40 [INFO] ----< org.eclipse.webtools.javaee:org.eclipse.jst.validation.test >-----
15:09:40 [INFO] Building org.eclipse.jst.validation.test 1.1.300-SNAPSHOT        [47/51]
15:09:40 [INFO] ------------------------[ eclipse-test-plugin ]-------------------------
15:09:40 [INFO] 
15:09:40 [INFO] --- maven-clean-plugin:2.5:clean (default-clean) @ org.eclipse.jst.validation.test ---
15:09:40 [INFO] 
15:09:40 [INFO] --- tycho-packaging-plugin:2.2.0:build-qualifier (default-build-qualifier) @ org.eclipse.jst.validation.test ---
15:09:40 [INFO] The project's OSGi version is 1.1.300.v202103311810
15:09:40 [INFO] 
15:09:40 [INFO] --- tycho-packaging-plugin:2.2.0:validate-id (default-validate-id) @ org.eclipse.jst.validation.test ---
15:09:40 [INFO] 
15:09:40 [INFO] --- tycho-packaging-plugin:2.2.0:validate-version (default-validate-version) @ org.eclipse.jst.validation.test ---
15:09:40 [INFO] 
15:09:40 [INFO] --- build-helper-maven-plugin:3.0.0:regex-property (regex-property) @ org.eclipse.jst.validation.test ---
15:09:40 [INFO] 
15:09:40 [INFO] --- maven-resources-plugin:2.4.3:resources (default-resources) @ org.eclipse.jst.validation.test ---
15:09:40 [WARNING] Using platform encoding (UTF-8 actually) to copy filtered resources, i.e. build is platform dependent!
15:09:40 [INFO] skip non existing resourceDirectory /home/jenkins/agent/workspace/webtools-javaee-gerrit_master/tests/org.eclipse.jst.validation.test/src/main/resources
15:09:40 [INFO] 
15:09:40 [INFO] --- tycho-compiler-plugin:2.2.0:compile (default-compile) @ org.eclipse.jst.validation.test ---
15:09:40 [INFO] Compiling 53 source files to /home/jenkins/agent/workspace/webtools-javaee-gerrit_master/tests/org.eclipse.jst.validation.test/target/classes
15:09:40 [INFO] 
15:09:40 [INFO] --- maven-resources-plugin:2.4.3:testResources (default-testResources) @ org.eclipse.jst.validation.test ---
15:09:40 [WARNING] Using platform encoding (UTF-8 actually) to copy filtered resources, i.e. build is platform dependent!
15:09:40 [INFO] skip non existing resourceDirectory /home/jenkins/agent/workspace/webtools-javaee-gerrit_master/tests/org.eclipse.jst.validation.test/src/test/resources
15:09:40 [INFO] 
15:09:40 [INFO] --- tycho-source-plugin:2.2.0:plugin-source (plugin-source) @ org.eclipse.jst.validation.test ---
15:09:40 [INFO] Building jar: /home/jenkins/agent/workspace/webtools-javaee-gerrit_master/tests/org.eclipse.jst.validation.test/target/org.eclipse.jst.validation.test-1.1.300-SNAPSHOT-sources.jar
15:09:40 [INFO] 
15:09:40 [INFO] --- target-platform-configuration:2.2.0:target-platform (default-target-platform) @ org.eclipse.jst.validation.test ---
15:09:40 [INFO] 
15:09:40 [INFO] --- tycho-packaging-plugin:2.2.0:package-plugin (default-package-plugin) @ org.eclipse.jst.validation.test ---
15:09:40 [INFO] Building jar: /home/jenkins/agent/workspace/webtools-javaee-gerrit_master/tests/org.eclipse.jst.validation.test/validationtest.jar
15:09:40 [INFO] Building jar: /home/jenkins/agent/workspace/webtools-javaee-gerrit_master/tests/org.eclipse.jst.validation.test/target/org.eclipse.jst.validation.test-1.1.300-SNAPSHOT.jar
15:09:40 [INFO] 
15:09:40 [INFO] --- tycho-p2-plugin:2.2.0:p2-metadata-default (default-p2-metadata-default) @ org.eclipse.jst.validation.test ---
15:09:40 [INFO] 
15:09:40 [INFO] --- tycho-surefire-plugin:2.2.0:test (default-test) @ org.eclipse.jst.validation.test ---
15:09:40 [INFO] Executing Test Runtime with timeout 0, logs (if any) will be placed at: /home/jenkins/agent/workspace/webtools-javaee-gerrit_master/tests/org.eclipse.jst.validation.test/target/work/data/.metadata/.log
15:09:41 [INFO] Command line:
15:09:41 	[/opt/tools/java/openjdk/jdk-11/11.0.2+9/bin/java, -Dosgi.noShutdown=false, -Dosgi.os=linux, -Dosgi.ws=gtk, -Dosgi.arch=x86_64, -Dosgi.clean=true, -jar, /home/jenkins/agent/workspace/webtools-javaee-gerrit_master/.repository/p2/osgi/bundle/org.eclipse.equinox.launcher/1.6.200.v20210416-2027/org.eclipse.equinox.launcher-1.6.200.v20210416-2027.jar, -data, /home/jenkins/agent/workspace/webtools-javaee-gerrit_master/tests/org.eclipse.jst.validation.test/target/work/data, -install, /home/jenkins/agent/workspace/webtools-javaee-gerrit_master/tests/org.eclipse.jst.validation.test/target/work, -configuration, /home/jenkins/agent/workspace/webtools-javaee-gerrit_master/tests/org.eclipse.jst.validation.test/target/work/configuration, -application, org.eclipse.tycho.surefire.osgibooter.headlesstest, -testproperties, /home/jenkins/agent/workspace/webtools-javaee-gerrit_master/tests/org.eclipse.jst.validation.test/target/surefire.properties]
15:09:41 Running org.eclipse.jst.validation.test.junit.ValidatorTest
15:09:45 Tests run: 1, Failures: 0, Errors: 0, Skipped: 1, Time elapsed: 0.014 s - in org.eclipse.jst.validation.test.junit.ValidatorTest
15:09:45 org.eclipse.jst.validation.test.junit.ValidatorTest skipped
15:09:45 Running org.eclipse.jst.validation.test.junit.OperationTest
15:09:45 Tests run: 1, Failures: 0, Errors: 0, Skipped: 1, Time elapsed: 0.001 s - in org.eclipse.jst.validation.test.junit.OperationTest
15:09:45 org.eclipse.jst.validation.test.junit.OperationTest skipped
15:09:45 Running org.eclipse.jst.validation.api.test.ValidationRegistryApiTest
15:09:45 Tests run: 1, Failures: 0, Errors: 0, Skipped: 0, Time elapsed: 0.539 s - in org.eclipse.jst.validation.api.test.ValidationRegistryApiTest
15:09:45 test_getValidator(org.eclipse.jst.validation.api.test.ValidationRegistryApiTest)  Time elapsed: 0.525 s
15:09:45 
15:09:45 Results:
15:09:45 
15:09:45 Tests run: 3, Failures: 0, Errors: 0, Skipped: 2
15:09:45 
15:09:45 [INFO] All tests passed!
15:09:51 [INFO] 
15:09:51 [INFO] --- tycho-pack200a-plugin:2.2.0:normalize (pack200-normalize) @ org.eclipse.jst.validation.test ---
15:09:51 [INFO] Pack200 normalizing jar /home/jenkins/agent/workspace/webtools-javaee-gerrit_master/tests/org.eclipse.jst.validation.test/target/org.eclipse.jst.validation.test-1.1.300-SNAPSHOT.jar
15:09:51 [INFO] 
15:09:51 [INFO] --- eclipse-jarsigner-plugin:1.1.4:sign (sign) @ org.eclipse.jst.validation.test ---
15:09:51 [INFO] Signing of nested jars of '/home/jenkins/agent/workspace/webtools-javaee-gerrit_master/tests/org.eclipse.jst.validation.test/target/org.eclipse.jst.validation.test-1.1.300-SNAPSHOT.jar_unpacked_1071279093557091222/testInput/FWK/BVT/opConstr.jar' is disabled.
15:09:51 [INFO] Signing jar: /home/jenkins/agent/workspace/webtools-javaee-gerrit_master/tests/org.eclipse.jst.validation.test/target/org.eclipse.jst.validation.test-1.1.300-SNAPSHOT.jar_unpacked_1071279093557091222/testInput/FWK/BVT/opConstr.jar
15:09:51 [INFO] Signing of nested jars of '/home/jenkins/agent/workspace/webtools-javaee-gerrit_master/tests/org.eclipse.jst.validation.test/target/org.eclipse.jst.validation.test-1.1.300-SNAPSHOT.jar_unpacked_1071279093557091222/testInput/Properties/aProperties.jar' is disabled.
15:09:52 [INFO] Signing jar: /home/jenkins/agent/workspace/webtools-javaee-gerrit_master/tests/org.eclipse.jst.validation.test/target/org.eclipse.jst.validation.test-1.1.300-SNAPSHOT.jar_unpacked_1071279093557091222/testInput/Properties/aProperties.jar
15:09:52 [INFO] Signing of nested jars of '/home/jenkins/agent/workspace/webtools-javaee-gerrit_master/tests/org.eclipse.jst.validation.test/target/org.eclipse.jst.validation.test-1.1.300-SNAPSHOT.jar_unpacked_1071279093557091222/validationtest.jar' is disabled.
15:09:54 [INFO] Signing jar: /home/jenkins/agent/workspace/webtools-javaee-gerrit_master/tests/org.eclipse.jst.validation.test/target/org.eclipse.jst.validation.test-1.1.300-SNAPSHOT.jar_unpacked_1071279093557091222/validationtest.jar
15:09:54 [INFO] Signing jar: /home/jenkins/agent/workspace/webtools-javaee-gerrit_master/tests/org.eclipse.jst.validation.test/target/org.eclipse.jst.validation.test-1.1.300-SNAPSHOT.jar
15:09:55 [INFO] Signing jar: /home/jenkins/agent/workspace/webtools-javaee-gerrit_master/tests/org.eclipse.jst.validation.test/target/org.eclipse.jst.validation.test-1.1.300-SNAPSHOT-sources.jar
15:09:56 [INFO] 
15:09:58 [INFO] --- tycho-pack200b-plugin:2.2.0:pack (pack200-pack) @ org.eclipse.jst.validation.test ---
15:09:58 [INFO] Pack200 packing jar /home/jenkins/agent/workspace/webtools-javaee-gerrit_master/tests/org.eclipse.jst.validation.test/target/org.eclipse.jst.validation.test-1.1.300-SNAPSHOT.jar
15:09:58 [INFO] 
15:09:58 [INFO] --- tycho-p2-plugin:2.2.0:p2-metadata (p2-metadata) @ org.eclipse.jst.validation.test ---
15:09:58 [INFO] No baseline version MavenProject: org.eclipse.webtools.javaee:org.eclipse.jst.validation.test:1.1.300-SNAPSHOT @ /home/jenkins/agent/workspace/webtools-javaee-gerrit_master/tests/org.eclipse.jst.validation.test/pom.xml
15:09:58 [INFO] 
15:09:58 [INFO] --- maven-install-plugin:2.3.1:install (default-install) @ org.eclipse.jst.validation.test ---
15:09:58 [INFO] Installing /home/jenkins/agent/workspace/webtools-javaee-gerrit_master/tests/org.eclipse.jst.validation.test/target/org.eclipse.jst.validation.test-1.1.300-SNAPSHOT.jar to /home/jenkins/agent/workspace/webtools-javaee-gerrit_master/.repository/org/eclipse/webtools/javaee/org.eclipse.jst.validation.test/1.1.300-SNAPSHOT/org.eclipse.jst.validation.test-1.1.300-SNAPSHOT.jar
15:09:58 [INFO] Installing /home/jenkins/agent/workspace/webtools-javaee-gerrit_master/tests/org.eclipse.jst.validation.test/pom.xml to /home/jenkins/agent/workspace/webtools-javaee-gerrit_master/.repository/org/eclipse/webtools/javaee/org.eclipse.jst.validation.test/1.1.300-SNAPSHOT/org.eclipse.jst.validation.test-1.1.300-SNAPSHOT.pom
15:09:58 [INFO] Installing /home/jenkins/agent/workspace/webtools-javaee-gerrit_master/tests/org.eclipse.jst.validation.test/target/org.eclipse.jst.validation.test-1.1.300-SNAPSHOT-sources.jar to /home/jenkins/agent/workspace/webtools-javaee-gerrit_master/.repository/org/eclipse/webtools/javaee/org.eclipse.jst.validation.test/1.1.300-SNAPSHOT/org.eclipse.jst.validation.test-1.1.300-SNAPSHOT-sources.jar
15:09:58 [INFO] Installing /home/jenkins/agent/workspace/webtools-javaee-gerrit_master/tests/org.eclipse.jst.validation.test/target/org.eclipse.jst.validation.test-1.1.300-SNAPSHOT.jar.pack.gz to /home/jenkins/agent/workspace/webtools-javaee-gerrit_master/.repository/org/eclipse/webtools/javaee/org.eclipse.jst.validation.test/1.1.300-SNAPSHOT/org.eclipse.jst.validation.test-1.1.300-SNAPSHOT-pack200.jar.pack.gz
15:09:58 [INFO] Installing /home/jenkins/agent/workspace/webtools-javaee-gerrit_master/tests/org.eclipse.jst.validation.test/target/p2content.xml to /home/jenkins/agent/workspace/webtools-javaee-gerrit_master/.repository/org/eclipse/webtools/javaee/org.eclipse.jst.validation.test/1.1.300-SNAPSHOT/org.eclipse.jst.validation.test-1.1.300-SNAPSHOT-p2metadata.xml
15:09:58 [INFO] Installing /home/jenkins/agent/workspace/webtools-javaee-gerrit_master/tests/org.eclipse.jst.validation.test/target/p2artifacts.xml to /home/jenkins/agent/workspace/webtools-javaee-gerrit_master/.repository/org/eclipse/webtools/javaee/org.eclipse.jst.validation.test/1.1.300-SNAPSHOT/org.eclipse.jst.validation.test-1.1.300-SNAPSHOT-p2artifacts.xml
15:09:59 [INFO] 
15:09:59 [INFO] --- tycho-p2-plugin:2.2.0:update-local-index (default-update-local-index) @ org.eclipse.jst.validation.test ---
15:09:59 [INFO] 
15:09:59 [INFO] ------------------------------------------------------------------------
15:09:59 [INFO] Skipping org.eclipse.webtools.javaee.site
15:09:59 [INFO] This project has been banned from the build due to previous failures.
15:09:59 [INFO] ------------------------------------------------------------------------
15:09:59 [INFO] ------------------------------------------------------------------------
15:09:59 [INFO] Reactor Summary:
15:09:59 [INFO] 
15:09:59 [INFO] org.eclipse.webtools.javaee 3.6.0-SNAPSHOT ......... SUCCESS [01:03 min]
15:09:59 [INFO] javaee.docs 3.6.0-SNAPSHOT ......................... SUCCESS [  0.038 s]
15:09:59 [INFO] org.eclipse.jst.ejb.doc.user 1.1.301-SNAPSHOT ...... SUCCESS [ 26.890 s]
15:09:59 [INFO] org.eclipse.jst.ejb.ui.infopop 1.0.300-SNAPSHOT .... SUCCESS [  4.332 s]
15:09:59 [INFO] org.eclipse.jst.j2ee.doc.user 1.1.400-SNAPSHOT ..... SUCCESS [  6.016 s]
15:09:59 [INFO] org.eclipse.jst.j2ee.infopop 1.0.300-SNAPSHOT ...... SUCCESS [  4.832 s]
15:09:59 [INFO] org.eclipse.jst.servlet.ui.infopop 1.0.500-SNAPSHOT  SUCCESS [  4.562 s]
15:09:59 [INFO] javaee.plugins 3.6.0-SNAPSHOT ...................... SUCCESS [  0.016 s]
15:09:59 [INFO] org.eclipse.jem.proxy 2.1.0-SNAPSHOT ............... SUCCESS [ 12.429 s]
15:09:59 [INFO] org.eclipse.jem 2.0.600-SNAPSHOT ................... SUCCESS [ 11.709 s]
15:09:59 [INFO] org.eclipse.jem.workbench 2.1.0-SNAPSHOT ........... SUCCESS [  4.239 s]
15:09:59 [INFO] org.eclipse.jem.beaninfo.vm.common 2.1.0-SNAPSHOT .. SUCCESS [  4.596 s]
15:09:59 [INFO] org.eclipse.jem.beaninfo.vm 2.1.0-SNAPSHOT ......... SUCCESS [  7.324 s]
15:09:59 [INFO] org.eclipse.jem.beaninfo 2.0.300-SNAPSHOT .......... SUCCESS [  6.921 s]
15:09:59 [INFO] org.eclipse.jst.common.annotations.core 1.1.300-SNAPSHOT SUCCESS [  5.987 s]
15:09:59 [INFO] org.eclipse.jst.common.annotations.controller 1.1.300-SNAPSHOT SUCCESS [  6.144 s]
15:09:59 [INFO] org.eclipse.jst.common.annotations.ui 1.1.300-SNAPSHOT SUCCESS [  4.594 s]
15:09:59 [INFO] org.eclipse.jst.common.frameworks 1.1.701-SNAPSHOT . SUCCESS [  4.677 s]
15:09:59 [INFO] org.eclipse.jst.common.ui 1.0.301-SNAPSHOT ......... SUCCESS [  6.709 s]
15:09:59 [INFO] org.eclipse.jst.j2ee.core 1.4.3-SNAPSHOT ........... SUCCESS [ 30.700 s]
15:09:59 [INFO] org.eclipse.jst.j2ee 1.2.500-SNAPSHOT .............. SUCCESS [ 12.739 s]
15:09:59 [INFO] org.eclipse.jst.j2ee.jca 1.1.1000-SNAPSHOT ......... SUCCESS [  7.357 s]
15:09:59 [INFO] org.eclipse.jst.jee 1.0.1000-SNAPSHOT .............. SUCCESS [  5.148 s]
15:09:59 [INFO] org.eclipse.jst.j2ee.ejb 1.1.901-SNAPSHOT .......... SUCCESS [  7.333 s]
15:09:59 [INFO] org.eclipse.jst.j2ee.ejb.annotation.model 1.1.500-SNAPSHOT SUCCESS [  6.981 s]
15:09:59 [INFO] org.eclipse.jst.j2ee.web 1.1.1000-SNAPSHOT ......... SUCCESS [ 11.978 s]
15:09:59 [INFO] org.eclipse.jst.j2ee.ui 1.1.931-SNAPSHOT ........... SUCCESS [  8.046 s]
15:09:59 [INFO] org.eclipse.jst.j2ee.jca.ui 1.1.601-SNAPSHOT ....... SUCCESS [  4.196 s]
15:09:59 [INFO] org.eclipse.jst.j2ee.navigator.ui 1.1.800-SNAPSHOT . SUCCESS [  6.153 s]
15:09:59 [INFO] org.eclipse.jst.jee.ui 1.0.901-SNAPSHOT ............ SUCCESS [  5.366 s]
15:09:59 [INFO] org.eclipse.jst.ejb.ui 1.1.911-SNAPSHOT ............ SUCCESS [  6.194 s]
15:09:59 [INFO] org.eclipse.jst.j2ee.ejb.annotations.emitter 1.1.300-SNAPSHOT SUCCESS [  6.083 s]
15:09:59 [INFO] org.eclipse.jst.j2ee.ejb.annotations.ui 1.2.0-SNAPSHOT SUCCESS [  7.529 s]
15:09:59 [INFO] org.eclipse.jst.j2ee.ejb.annotations.xdoclet 1.2.300-SNAPSHOT SUCCESS [  5.305 s]
15:09:59 [INFO] org.eclipse.jst.j2ee.webservice 1.1.700-SNAPSHOT ... SUCCESS [  6.868 s]
15:09:59 [INFO] org.eclipse.jst.j2ee.webservice.ui 1.1.800-SNAPSHOT  SUCCESS [  8.046 s]
15:09:59 [INFO] org.eclipse.jst.j2ee.xdoclet.runtime 1.2.0-SNAPSHOT  SUCCESS [  6.389 s]
15:09:59 [INFO] org.eclipse.jst.jee.ejb 1.0.500-SNAPSHOT ........... SUCCESS [  5.665 s]
15:09:59 [INFO] org.eclipse.jst.jee.web 1.0.702-SNAPSHOT ........... SUCCESS [  3.245 s]
15:09:59 [INFO] org.eclipse.jst.servlet.ui 1.1.1000-SNAPSHOT ....... SUCCESS [  5.335 s]
15:09:59 [INFO] org.eclipse.wtp.jee.capabilities 1.0.100-SNAPSHOT .. SUCCESS [  3.630 s]
15:09:59 [INFO] javaee.tests 3.6.0-SNAPSHOT ........................ SUCCESS [  0.011 s]
15:09:59 [INFO] org.eclipse.jst.validation.sample 1.1.100-SNAPSHOT . SUCCESS [  5.578 s]
15:09:59 [INFO] org.eclipse.jst.ejb.ui.tests 1.0.0-SNAPSHOT ........ SUCCESS [ 17.345 s]
15:09:59 [INFO] org.eclipse.jem.tests 1.3.0-SNAPSHOT ............... SUCCESS [  9.534 s]
15:09:59 [INFO] org.eclipse.jst.j2ee.core.tests 1.1.600-SNAPSHOT ... FAILURE [ 50.076 s]
15:09:59 [INFO] org.eclipse.jst.j2ee.tests 1.1.800-SNAPSHOT ........ SKIPPED
15:09:59 [INFO] org.eclipse.jst.jee.tests 1.0.100-SNAPSHOT ......... SKIPPED
15:09:59 [INFO] org.eclipse.jst.servlet.tests 1.2.0-SNAPSHOT ....... SKIPPED
15:09:59 [INFO] org.eclipse.jst.validation.test 1.1.300-SNAPSHOT ... SUCCESS [ 19.032 s]
15:09:59 [INFO] org.eclipse.webtools.javaee.site 3.6.0-SNAPSHOT .... SKIPPED
15:09:59 [INFO] ------------------------------------------------------------------------
15:09:59 [INFO] BUILD FAILURE
15:09:59 [INFO] ------------------------------------------------------------------------
15:09:59 [INFO] Total time:  12:22 min
15:09:59 [INFO] Finished at: 2021-05-25T19:09:59Z
15:09:59 [INFO] ------------------------------------------------------------------------
15:09:59 [ERROR] Failed to execute goal org.eclipse.tycho:tycho-surefire-plugin:2.2.0:test (default-test) on project org.eclipse.jst.j2ee.core.tests: There are test failures.
15:09:59 [ERROR] 
15:09:59 [ERROR] Please refer to /home/jenkins/agent/workspace/webtools-javaee-gerrit_master/tests/org.eclipse.jst.j2ee.core.tests/target/surefire-reports for the individual test results.
15:09:59 [ERROR] -> [Help 1]
15:09:59 org.apache.maven.lifecycle.LifecycleExecutionException: Failed to execute goal org.eclipse.tycho:tycho-surefire-plugin:2.2.0:test (default-test) on project org.eclipse.jst.j2ee.core.tests: There are test failures.
15:09:59 
15:09:59 Please refer to /home/jenkins/agent/workspace/webtools-javaee-gerrit_master/tests/org.eclipse.jst.j2ee.core.tests/target/surefire-reports for the individual test results.
15:09:59     at org.apache.maven.lifecycle.internal.MojoExecutor.execute (MojoExecutor.java:215)
15:09:59     at org.apache.maven.lifecycle.internal.MojoExecutor.execute (MojoExecutor.java:156)
15:09:59     at org.apache.maven.lifecycle.internal.MojoExecutor.execute (MojoExecutor.java:148)
15:09:59     at org.apache.maven.lifecycle.internal.LifecycleModuleBuilder.buildProject (LifecycleModuleBuilder.java:117)
15:09:59     at org.apache.maven.lifecycle.internal.LifecycleModuleBuilder.buildProject (LifecycleModuleBuilder.java:81)
15:09:59     at org.apache.maven.lifecycle.internal.builder.singlethreaded.SingleThreadedBuilder.build (SingleThreadedBuilder.java:56)
15:09:59     at org.apache.maven.lifecycle.internal.LifecycleStarter.execute (LifecycleStarter.java:128)
15:09:59     at org.apache.maven.DefaultMaven.doExecute (DefaultMaven.java:305)
15:09:59     at org.apache.maven.DefaultMaven.doExecute (DefaultMaven.java:192)
15:09:59     at org.apache.maven.DefaultMaven.execute (DefaultMaven.java:105)
15:09:59     at org.apache.maven.cli.MavenCli.execute (MavenCli.java:957)
15:09:59     at org.apache.maven.cli.MavenCli.doMain (MavenCli.java:289)
15:09:59     at org.apache.maven.cli.MavenCli.main (MavenCli.java:193)
15:09:59     at jdk.internal.reflect.NativeMethodAccessorImpl.invoke0 (Native Method)
15:09:59     at jdk.internal.reflect.NativeMethodAccessorImpl.invoke (NativeMethodAccessorImpl.java:62)
15:09:59     at jdk.internal.reflect.DelegatingMethodAccessorImpl.invoke (DelegatingMethodAccessorImpl.java:43)
15:09:59     at java.lang.reflect.Method.invoke (Method.java:566)
15:09:59     at org.codehaus.plexus.classworlds.launcher.Launcher.launchEnhanced (Launcher.java:282)
15:09:59     at org.codehaus.plexus.classworlds.launcher.Launcher.launch (Launcher.java:225)
15:09:59     at org.codehaus.plexus.classworlds.launcher.Launcher.mainWithExitCode (Launcher.java:406)
15:09:59     at org.codehaus.plexus.classworlds.launcher.Launcher.main (Launcher.java:347)
15:09:59 Caused by: org.apache.maven.plugin.MojoFailureException: There are test failures.
15:09:59 
15:09:59 Please refer to /home/jenkins/agent/workspace/webtools-javaee-gerrit_master/tests/org.eclipse.jst.j2ee.core.tests/target/surefire-reports for the individual test results.
15:09:59     at org.eclipse.tycho.surefire.TestMojo.runTest (TestMojo.java:1070)
15:09:59     at org.eclipse.tycho.surefire.TestMojo.execute (TestMojo.java:714)
15:09:59     at org.apache.maven.plugin.DefaultBuildPluginManager.executeMojo (DefaultBuildPluginManager.java:137)
15:09:59     at org.apache.maven.lifecycle.internal.MojoExecutor.execute (MojoExecutor.java:210)
15:09:59     at org.apache.maven.lifecycle.internal.MojoExecutor.execute (MojoExecutor.java:156)
15:09:59     at org.apache.maven.lifecycle.internal.MojoExecutor.execute (MojoExecutor.java:148)
15:09:59     at org.apache.maven.lifecycle.internal.LifecycleModuleBuilder.buildProject (LifecycleModuleBuilder.java:117)
15:09:59     at org.apache.maven.lifecycle.internal.LifecycleModuleBuilder.buildProject (LifecycleModuleBuilder.java:81)
15:09:59     at org.apache.maven.lifecycle.internal.builder.singlethreaded.SingleThreadedBuilder.build (SingleThreadedBuilder.java:56)
15:09:59     at org.apache.maven.lifecycle.internal.LifecycleStarter.execute (LifecycleStarter.java:128)
15:09:59     at org.apache.maven.DefaultMaven.doExecute (DefaultMaven.java:305)
15:09:59     at org.apache.maven.DefaultMaven.doExecute (DefaultMaven.java:192)
15:09:59     at org.apache.maven.DefaultMaven.execute (DefaultMaven.java:105)
15:09:59     at org.apache.maven.cli.MavenCli.execute (MavenCli.java:957)
15:09:59     at org.apache.maven.cli.MavenCli.doMain (MavenCli.java:289)
15:09:59     at org.apache.maven.cli.MavenCli.main (MavenCli.java:193)
15:09:59     at jdk.internal.reflect.NativeMethodAccessorImpl.invoke0 (Native Method)
15:09:59     at jdk.internal.reflect.NativeMethodAccessorImpl.invoke (NativeMethodAccessorImpl.java:62)
15:09:59     at jdk.internal.reflect.DelegatingMethodAccessorImpl.invoke (DelegatingMethodAccessorImpl.java:43)
15:09:59     at java.lang.reflect.Method.invoke (Method.java:566)
15:09:59     at org.codehaus.plexus.classworlds.launcher.Launcher.launchEnhanced (Launcher.java:282)
15:09:59     at org.codehaus.plexus.classworlds.launcher.Launcher.launch (Launcher.java:225)
15:09:59     at org.codehaus.plexus.classworlds.launcher.Launcher.mainWithExitCode (Launcher.java:406)
15:09:59     at org.codehaus.plexus.classworlds.launcher.Launcher.main (Launcher.java:347)
15:09:59 [ERROR] 
15:09:59 [ERROR] Re-run Maven using the -X switch to enable full debug logging.
15:09:59 [ERROR] 
15:09:59 [ERROR] For more information about the errors and possible solutions, please read the following articles:
15:09:59 [ERROR] [Help 1] http://cwiki.apache.org/confluence/display/MAVEN/MojoFailureException
15:09:59 [ERROR] 
15:09:59 [ERROR] After correcting the problems, you can resume the build with the command
15:09:59 [ERROR]   mvn <args> -rf :org.eclipse.jst.j2ee.core.tests
15:09:59 Build step 'Invoke top-level Maven targets' marked build as failure
15:10:06 Taking screenshot.
15:10:06 [webtools-javaee-gerrit_master] $ echo $XAUTHORITY
15:10:06 /home/jenkins/agent/workspace/webtools-javaee-gerrit_master/.Xauthority-13770398256766130213
15:10:06 [webtools-javaee-gerrit_master] $ ls -l $XAUTHORITY
15:10:06 -rw-r--r--. 1 jenkins 1000750000 0 May 25 18:57 /home/jenkins/agent/workspace/webtools-javaee-gerrit_master/.Xauthority-13770398256766130213
15:10:06 [webtools-javaee-gerrit_master] $ import -window root -display :22 screenshot.jpg
15:10:06 Terminating xvnc.
15:10:06 Recording test results
15:10:21 [Checks API] No suitable checks publisher found.
15:10:23 Finished: FAILURE