FailedConsole Output

Skipping 3,447 KB.. Full Log
gAAAA==:web:org.eclipse.virgo.web.enterprise.security:check
Skipping task ':web:org.eclipse.virgo.web.enterprise.security:check' as it has no actions.
:web:org.eclipse.virgo.web.enterprise.security:check (Thread[Daemon worker,5,main]) completed. Took 0.001 secs.
:web:org.eclipse.virgo.web.enterprise.security:build (Thread[Daemon worker,5,main]) started.
:web:org.eclipse.virgo.web.enterprise.security:build
Skipping task ':web:org.eclipse.virgo.web.enterprise.security:build' as it has no actions.
:web:org.eclipse.virgo.web.enterprise.security:build (Thread[Daemon worker,5,main]) completed. Took 0.0 secs.
:web:org.eclipse.virgo.web.enterprise.security.openejb.classloading.hook:findbugsMain (Thread[Daemon worker,5,main]) started.
:web:org.eclipse.virgo.web.enterprise.security.openejb.classloading.hook:findbugsMain
Putting task artifact state for task ':web:org.eclipse.virgo.web.enterprise.security.openejb.classloading.hook:findbugsMain' into context took 0.005 secs.
Task :web:org.eclipse.virgo.web.enterprise.security.openejb.classloading.hook:findbugsMain class loader hash: e1d5c4b3003235964bf4bb274716a6a0
Task :web:org.eclipse.virgo.web.enterprise.security.openejb.classloading.hook:findbugsMain actions class loader hashes: [0c0afac576bb2de41200bc36bccb9200, e1d5c4b3003235964bf4bb274716a6a0]
Executing task ':web:org.eclipse.virgo.web.enterprise.security.openejb.classloading.hook:findbugsMain' (up-to-date check took 0.003 secs) due to:
  No history is available.
Starting process 'Gradle FindBugs Worker 109'. Working directory: /jobs/genie.virgo/virgo-master/workspace/web/org.eclipse.virgo.web.enterprise.security.openejb.classloading.hook Command: /opt/public/common/java/oracle/jdk1.8.0_192_x64/bin/java -Djava.security.manager=worker.org.gradle.process.internal.worker.child.BootstrapSecurityManager -Dfile.encoding=UTF-8 -Duser.country=US -Duser.language=en -Duser.variant -cp /opt/public/hipp/homes/genie.virgo/.gradle/caches/3.5.1/workerMain/gradle-worker.jar worker.org.gradle.process.internal.worker.GradleWorkerMain 'Gradle FindBugs Worker 109'
Successfully started process 'Gradle FindBugs Worker 109'
Initialized native services in: /opt/public/hipp/homes/genie.virgo/.gradle/native

Scanning archives (0 / 2)
Scanning archives (1 / 2)
Scanning archives (2 / 2)

2 analysis passes to perform

Pass 1: Analyzing classes (0 / 21) - 00% complete
Pass 1: Analyzing classes (1 / 21) - 04% complete
Pass 1: Analyzing classes (2 / 21) - 09% complete
Pass 1: Analyzing classes (3 / 21) - 14% complete
Pass 1: Analyzing classes (4 / 21) - 19% complete
Pass 1: Analyzing classes (5 / 21) - 23% complete
Pass 1: Analyzing classes (6 / 21) - 28% complete
Pass 1: Analyzing classes (7 / 21) - 33% complete
Pass 1: Analyzing classes (8 / 21) - 38% complete
Pass 1: Analyzing classes (9 / 21) - 42% complete
Pass 1: Analyzing classes (10 / 21) - 47% complete
Pass 1: Analyzing classes (11 / 21) - 52% complete
Pass 1: Analyzing classes (12 / 21) - 57% complete
Pass 1: Analyzing classes (13 / 21) - 61% complete
Pass 1: Analyzing classes (14 / 21) - 66% complete
Pass 1: Analyzing classes (15 / 21) - 71% complete
Pass 1: Analyzing classes (16 / 21) - 76% complete
Pass 1: Analyzing classes (17 / 21) - 80% complete
Pass 1: Analyzing classes (18 / 21) - 85% complete
Pass 1: Analyzing classes (19 / 21) - 90% complete
Pass 1: Analyzing classes (20 / 21) - 95% complete
Pass 1: Analyzing classes (21 / 21) - 100% complete

Pass 2: Analyzing classes (0 / 1) - 00% complete
Pass 2: Analyzing classes (1 / 1) - 100% complete
Done with analysis
:web:org.eclipse.virgo.web.enterprise.security.openejb.classloading.hook:findbugsMain (Thread[Daemon worker,5,main]) completed. Took 3.27 secs.
:web:org.eclipse.virgo.web.enterprise.security.openejb.classloading.hook:compileTestJava (Thread[Daemon worker,5,main]) started.
:web:org.eclipse.virgo.web.enterprise.security.openejb.classloading.hook:compileTestJava
Putting task artifact state for task ':web:org.eclipse.virgo.web.enterprise.security.openejb.classloading.hook:compileTestJava' into context took 0.005 secs.
file or directory '/jobs/genie.virgo/virgo-master/workspace/web/org.eclipse.virgo.web.enterprise.security.openejb.classloading.hook/src/test/java', not found
Skipping task ':web:org.eclipse.virgo.web.enterprise.security.openejb.classloading.hook:compileTestJava' as it has no source files and no previous output files.
:web:org.eclipse.virgo.web.enterprise.security.openejb.classloading.hook:compileTestJava NO-SOURCE
:web:org.eclipse.virgo.web.enterprise.security.openejb.classloading.hook:compileTestJava (Thread[Daemon worker,5,main]) completed. Took 0.005 secs.
:web:org.eclipse.virgo.web.enterprise.security.openejb.classloading.hook:processTestResources (Thread[Daemon worker,5,main]) started.
:web:org.eclipse.virgo.web.enterprise.security.openejb.classloading.hook:processTestResources
Putting task artifact state for task ':web:org.eclipse.virgo.web.enterprise.security.openejb.classloading.hook:processTestResources' into context took 0.0 secs.
file or directory '/jobs/genie.virgo/virgo-master/workspace/web/org.eclipse.virgo.web.enterprise.security.openejb.classloading.hook/src/test/resources', not found
Skipping task ':web:org.eclipse.virgo.web.enterprise.security.openejb.classloading.hook:processTestResources' as it has no source files and no previous output files.
:web:org.eclipse.virgo.web.enterprise.security.openejb.classloading.hook:processTestResources NO-SOURCE
:web:org.eclipse.virgo.web.enterprise.security.openejb.classloading.hook:processTestResources (Thread[Daemon worker,5,main]) completed. Took 0.001 secs.
:web:org.eclipse.virgo.web.enterprise.security.openejb.classloading.hook:testClasses (Thread[Daemon worker,5,main]) started.
:web:org.eclipse.virgo.web.enterprise.security.openejb.classloading.hook:testClasses
Skipping task ':web:org.eclipse.virgo.web.enterprise.security.openejb.classloading.hook:testClasses' as it has no actions.
:web:org.eclipse.virgo.web.enterprise.security.openejb.classloading.hook:testClasses UP-TO-DATE
:web:org.eclipse.virgo.web.enterprise.security.openejb.classloading.hook:testClasses (Thread[Daemon worker,5,main]) completed. Took 0.0 secs.
:web:org.eclipse.virgo.web.enterprise.security.openejb.classloading.hook:test (Thread[Daemon worker,5,main]) started.
:web:org.eclipse.virgo.web.enterprise.security.openejb.classloading.hook:test
Putting task artifact state for task ':web:org.eclipse.virgo.web.enterprise.security.openejb.classloading.hook:test' into context took 0.0 secs.
file or directory '/jobs/genie.virgo/virgo-master/workspace/web/org.eclipse.virgo.web.enterprise.security.openejb.classloading.hook/build/classes/test', not found
Skipping task ':web:org.eclipse.virgo.web.enterprise.security.openejb.classloading.hook:test' as it has no source files and no previous output files.
:web:org.eclipse.virgo.web.enterprise.security.openejb.classloading.hook:test NO-SOURCE
:web:org.eclipse.virgo.web.enterprise.security.openejb.classloading.hook:test (Thread[Daemon worker,5,main]) completed. Took 0.0 secs.
:web:org.eclipse.virgo.web.enterprise.security.openejb.classloading.hook:check (Thread[Daemon worker,5,main]) started.
:web:org.eclipse.virgo.web.enterprise.security.openejb.classloading.hook:check
Skipping task ':web:org.eclipse.virgo.web.enterprise.security.openejb.classloading.hook:check' as it has no actions.
:web:org.eclipse.virgo.web.enterprise.security.openejb.classloading.hook:check (Thread[Daemon worker,5,main]) completed. Took 0.001 secs.
:web:org.eclipse.virgo.web.enterprise.security.openejb.classloading.hook:build (Thread[Daemon worker,5,main]) started.
:web:org.eclipse.virgo.web.enterprise.security.openejb.classloading.hook:build
Skipping task ':web:org.eclipse.virgo.web.enterprise.security.openejb.classloading.hook:build' as it has no actions.
:web:org.eclipse.virgo.web.enterprise.security.openejb.classloading.hook:build (Thread[Daemon worker,5,main]) completed. Took 0.0 secs.
:web:org.eclipse.virgo.web.enterprise.security.valve:findbugsMain (Thread[Daemon worker,5,main]) started.
:web:org.eclipse.virgo.web.enterprise.security.valve:findbugsMain
Putting task artifact state for task ':web:org.eclipse.virgo.web.enterprise.security.valve:findbugsMain' into context took 0.0 secs.
Task :web:org.eclipse.virgo.web.enterprise.security.valve:findbugsMain class loader hash: e1d5c4b3003235964bf4bb274716a6a0
Task :web:org.eclipse.virgo.web.enterprise.security.valve:findbugsMain actions class loader hashes: [0c0afac576bb2de41200bc36bccb9200, e1d5c4b3003235964bf4bb274716a6a0]
Executing task ':web:org.eclipse.virgo.web.enterprise.security.valve:findbugsMain' (up-to-date check took 0.004 secs) due to:
  No history is available.
Starting process 'Gradle FindBugs Worker 110'. Working directory: /jobs/genie.virgo/virgo-master/workspace/web/org.eclipse.virgo.web.enterprise.security.valve Command: /opt/public/common/java/oracle/jdk1.8.0_192_x64/bin/java -Djava.security.manager=worker.org.gradle.process.internal.worker.child.BootstrapSecurityManager -Dfile.encoding=UTF-8 -Duser.country=US -Duser.language=en -Duser.variant -cp /opt/public/hipp/homes/genie.virgo/.gradle/caches/3.5.1/workerMain/gradle-worker.jar worker.org.gradle.process.internal.worker.GradleWorkerMain 'Gradle FindBugs Worker 110'
Successfully started process 'Gradle FindBugs Worker 110'
Initialized native services in: /opt/public/hipp/homes/genie.virgo/.gradle/native

Scanning archives (0 / 8)
Scanning archives (1 / 8)
Scanning archives (2 / 8)
Scanning archives (3 / 8)
Scanning archives (4 / 8)
Scanning archives (5 / 8)
Scanning archives (6 / 8)
Scanning archives (7 / 8)
Scanning archives (8 / 8)

2 analysis passes to perform

Pass 1: Analyzing classes (0 / 46) - 00% complete
Pass 1: Analyzing classes (1 / 46) - 02% complete
Pass 1: Analyzing classes (2 / 46) - 04% complete
Pass 1: Analyzing classes (3 / 46) - 06% complete
Pass 1: Analyzing classes (4 / 46) - 08% complete
Pass 1: Analyzing classes (5 / 46) - 10% complete
Pass 1: Analyzing classes (6 / 46) - 13% complete
Pass 1: Analyzing classes (7 / 46) - 15% complete
Pass 1: Analyzing classes (8 / 46) - 17% complete
Pass 1: Analyzing classes (9 / 46) - 19% complete
Pass 1: Analyzing classes (10 / 46) - 21% complete
Pass 1: Analyzing classes (11 / 46) - 23% complete
Pass 1: Analyzing classes (12 / 46) - 26% complete
Pass 1: Analyzing classes (13 / 46) - 28% complete
Pass 1: Analyzing classes (14 / 46) - 30% complete
Pass 1: Analyzing classes (15 / 46) - 32% complete
Pass 1: Analyzing classes (16 / 46) - 34% complete
Pass 1: Analyzing classes (17 / 46) - 36% complete
Pass 1: Analyzing classes (18 / 46) - 39% complete
Pass 1: Analyzing classes (19 / 46) - 41% complete
Pass 1: Analyzing classes (20 / 46) - 43% complete
Pass 1: Analyzing classes (21 / 46) - 45% complete
Pass 1: Analyzing classes (22 / 46) - 47% complete
Pass 1: Analyzing classes (23 / 46) - 50% complete
Pass 1: Analyzing classes (24 / 46) - 52% complete
Pass 1: Analyzing classes (25 / 46) - 54% complete
Pass 1: Analyzing classes (26 / 46) - 56% complete
Pass 1: Analyzing classes (27 / 46) - 58% complete
Pass 1: Analyzing classes (28 / 46) - 60% complete
Pass 1: Analyzing classes (29 / 46) - 63% complete
Pass 1: Analyzing classes (30 / 46) - 65% complete
Pass 1: Analyzing classes (31 / 46) - 67% complete
Pass 1: Analyzing classes (32 / 46) - 69% complete
Pass 1: Analyzing classes (33 / 46) - 71% complete
Pass 1: Analyzing classes (34 / 46) - 73% complete
Pass 1: Analyzing classes (35 / 46) - 76% complete
Pass 1: Analyzing classes (36 / 46) - 78% complete
Pass 1: Analyzing classes (37 / 46) - 80% complete
Pass 1: Analyzing classes (38 / 46) - 82% complete
Pass 1: Analyzing classes (39 / 46) - 84% complete
Pass 1: Analyzing classes (40 / 46) - 86% complete
Pass 1: Analyzing classes (41 / 46) - 89% complete
Pass 1: Analyzing classes (42 / 46) - 91% complete
Pass 1: Analyzing classes (43 / 46) - 93% complete
Pass 1: Analyzing classes (44 / 46) - 95% complete
Pass 1: Analyzing classes (45 / 46) - 97% complete
Pass 1: Analyzing classes (46 / 46) - 100% complete

Pass 2: Analyzing classes (0 / 1) - 00% complete
Pass 2: Analyzing classes (1 / 1) - 100% complete
Done with analysis
:web:org.eclipse.virgo.web.enterprise.security.valve:findbugsMain (Thread[Daemon worker,5,main]) completed. Took 3.309 secs.
:web:org.eclipse.virgo.web.enterprise.security.valve:compileTestJava (Thread[Daemon worker,5,main]) started.
:web:org.eclipse.virgo.web.enterprise.security.valve:compileTestJava
Putting task artifact state for task ':web:org.eclipse.virgo.web.enterprise.security.valve:compileTestJava' into context took 0.005 secs.
file or directory '/jobs/genie.virgo/virgo-master/workspace/web/org.eclipse.virgo.web.enterprise.security.valve/src/test/java', not found
Skipping task ':web:org.eclipse.virgo.web.enterprise.security.valve:compileTestJava' as it has no source files and no previous output files.
:web:org.eclipse.virgo.web.enterprise.security.valve:compileTestJava NO-SOURCE
:web:org.eclipse.virgo.web.enterprise.security.valve:compileTestJava (Thread[Daemon worker,5,main]) completed. Took 0.005 secs.
:web:org.eclipse.virgo.web.enterprise.security.valve:processTestResources (Thread[Daemon worker,5,main]) started.
:web:org.eclipse.virgo.web.enterprise.security.valve:processTestResources
Putting task artifact state for task ':web:org.eclipse.virgo.web.enterprise.security.valve:processTestResources' into context took 0.001 secs.
file or directory '/jobs/genie.virgo/virgo-master/workspace/web/org.eclipse.virgo.web.enterprise.security.valve/src/test/resources', not found
Skipping task ':web:org.eclipse.virgo.web.enterprise.security.valve:processTestResources' as it has no source files and no previous output files.
:web:org.eclipse.virgo.web.enterprise.security.valve:processTestResources NO-SOURCE
:web:org.eclipse.virgo.web.enterprise.security.valve:processTestResources (Thread[Daemon worker,5,main]) completed. Took 0.001 secs.
:web:org.eclipse.virgo.web.enterprise.security.valve:testClasses (Thread[Daemon worker,5,main]) started.
:web:org.eclipse.virgo.web.enterprise.security.valve:testClasses
Skipping task ':web:org.eclipse.virgo.web.enterprise.security.valve:testClasses' as it has no actions.
:web:org.eclipse.virgo.web.enterprise.security.valve:testClasses UP-TO-DATE
:web:org.eclipse.virgo.web.enterprise.security.valve:testClasses (Thread[Daemon worker,5,main]) completed. Took 0.0 secs.
:web:org.eclipse.virgo.web.enterprise.security.valve:test (Thread[Daemon worker,5,main]) started.
:web:org.eclipse.virgo.web.enterprise.security.valve:test
Putting task artifact state for task ':web:org.eclipse.virgo.web.enterprise.security.valve:test' into context took 0.0 secs.
file or directory '/jobs/genie.virgo/virgo-master/workspace/web/org.eclipse.virgo.web.enterprise.security.valve/build/classes/test', not found
Skipping task ':web:org.eclipse.virgo.web.enterprise.security.valve:test' as it has no source files and no previous output files.
:web:org.eclipse.virgo.web.enterprise.security.valve:test NO-SOURCE
:web:org.eclipse.virgo.web.enterprise.security.valve:test (Thread[Daemon worker,5,main]) completed. Took 0.001 secs.
:web:org.eclipse.virgo.web.enterprise.security.valve:check (Thread[Daemon worker,5,main]) started.
:web:org.eclipse.virgo.web.enterprise.security.valve:check
Skipping task ':web:org.eclipse.virgo.web.enterprise.security.valve:check' as it has no actions.
:web:org.eclipse.virgo.web.enterprise.security.valve:check (Thread[Daemon worker,5,main]) completed. Took 0.0 secs.
:web:org.eclipse.virgo.web.enterprise.security.valve:build (Thread[Daemon worker,5,main]) started.
:web:org.eclipse.virgo.web.enterprise.security.valve:build
Skipping task ':web:org.eclipse.virgo.web.enterprise.security.valve:build' as it has no actions.
:web:org.eclipse.virgo.web.enterprise.security.valve:build (Thread[Daemon worker,5,main]) completed. Took 0.0 secs.
:web:org.eclipse.virgo.web.enterprise.services.accessor:findbugsMain (Thread[Daemon worker,5,main]) started.
:web:org.eclipse.virgo.web.enterprise.services.accessor:findbugsMain
Putting task artifact state for task ':web:org.eclipse.virgo.web.enterprise.services.accessor:findbugsMain' into context took 0.0 secs.
Task :web:org.eclipse.virgo.web.enterprise.services.accessor:findbugsMain class loader hash: e1d5c4b3003235964bf4bb274716a6a0
Task :web:org.eclipse.virgo.web.enterprise.services.accessor:findbugsMain actions class loader hashes: [0c0afac576bb2de41200bc36bccb9200, e1d5c4b3003235964bf4bb274716a6a0]
Executing task ':web:org.eclipse.virgo.web.enterprise.services.accessor:findbugsMain' (up-to-date check took 0.014 secs) due to:
  No history is available.
Starting process 'Gradle FindBugs Worker 111'. Working directory: /jobs/genie.virgo/virgo-master/workspace/web/org.eclipse.virgo.web.enterprise.services.accessor Command: /opt/public/common/java/oracle/jdk1.8.0_192_x64/bin/java -Djava.security.manager=worker.org.gradle.process.internal.worker.child.BootstrapSecurityManager -Dfile.encoding=UTF-8 -Duser.country=US -Duser.language=en -Duser.variant -cp /opt/public/hipp/homes/genie.virgo/.gradle/caches/3.5.1/workerMain/gradle-worker.jar worker.org.gradle.process.internal.worker.GradleWorkerMain 'Gradle FindBugs Worker 111'
Successfully started process 'Gradle FindBugs Worker 111'
Initialized native services in: /opt/public/hipp/homes/genie.virgo/.gradle/native

Scanning archives (0 / 23)
Scanning archives (1 / 23)
Scanning archives (2 / 23)
Scanning archives (3 / 23)
Scanning archives (4 / 23)
Scanning archives (5 / 23)
Scanning archives (6 / 23)
Scanning archives (7 / 23)
Scanning archives (8 / 23)
Scanning archives (9 / 23)
Scanning archives (10 / 23)
Scanning archives (11 / 23)
Scanning archives (12 / 23)
Scanning archives (13 / 23)
Scanning archives (14 / 23)
Scanning archives (15 / 23)
Scanning archives (16 / 23)
Scanning archives (17 / 23)
Scanning archives (18 / 23)
Scanning archives (19 / 23)
Scanning archives (20 / 23)
Scanning archives (21 / 23)
Scanning archives (22 / 23)
Scanning archives (23 / 23)

2 analysis passes to perform

Pass 1: Analyzing classes (0 / 112) - 00% complete
Pass 1: Analyzing classes (1 / 112) - 00% complete
Pass 1: Analyzing classes (2 / 112) - 01% complete
Pass 1: Analyzing classes (3 / 112) - 02% complete
Pass 1: Analyzing classes (4 / 112) - 03% complete
Pass 1: Analyzing classes (5 / 112) - 04% complete
Pass 1: Analyzing classes (6 / 112) - 05% complete
Pass 1: Analyzing classes (7 / 112) - 06% complete
Pass 1: Analyzing classes (8 / 112) - 07% complete
Pass 1: Analyzing classes (9 / 112) - 08% complete
Pass 1: Analyzing classes (10 / 112) - 08% complete
Pass 1: Analyzing classes (11 / 112) - 09% complete
Pass 1: Analyzing classes (12 / 112) - 10% complete
Pass 1: Analyzing classes (13 / 112) - 11% complete
Pass 1: Analyzing classes (14 / 112) - 12% complete
Pass 1: Analyzing classes (15 / 112) - 13% complete
Pass 1: Analyzing classes (16 / 112) - 14% complete
Pass 1: Analyzing classes (17 / 112) - 15% complete
Pass 1: Analyzing classes (18 / 112) - 16% complete
Pass 1: Analyzing classes (19 / 112) - 16% complete
Pass 1: Analyzing classes (20 / 112) - 17% complete
Pass 1: Analyzing classes (21 / 112) - 18% complete
Pass 1: Analyzing classes (22 / 112) - 19% complete
Pass 1: Analyzing classes (23 / 112) - 20% complete
Pass 1: Analyzing classes (24 / 112) - 21% complete
Pass 1: Analyzing classes (25 / 112) - 22% complete
Pass 1: Analyzing classes (26 / 112) - 23% complete
Pass 1: Analyzing classes (27 / 112) - 24% complete
Pass 1: Analyzing classes (28 / 112) - 25% complete
Pass 1: Analyzing classes (29 / 112) - 25% complete
Pass 1: Analyzing classes (30 / 112) - 26% complete
Pass 1: Analyzing classes (31 / 112) - 27% complete
Pass 1: Analyzing classes (32 / 112) - 28% complete
Pass 1: Analyzing classes (33 / 112) - 29% complete
Pass 1: Analyzing classes (34 / 112) - 30% complete
Pass 1: Analyzing classes (35 / 112) - 31% complete
Pass 1: Analyzing classes (36 / 112) - 32% complete
Pass 1: Analyzing classes (37 / 112) - 33% complete
Pass 1: Analyzing classes (38 / 112) - 33% complete
Pass 1: Analyzing classes (39 / 112) - 34% complete
Pass 1: Analyzing classes (40 / 112) - 35% complete
Pass 1: Analyzing classes (41 / 112) - 36% complete
Pass 1: Analyzing classes (42 / 112) - 37% complete
Pass 1: Analyzing classes (43 / 112) - 38% complete
Pass 1: Analyzing classes (44 / 112) - 39% complete
Pass 1: Analyzing classes (45 / 112) - 40% complete
Pass 1: Analyzing classes (46 / 112) - 41% complete
Pass 1: Analyzing classes (47 / 112) - 41% complete
Pass 1: Analyzing classes (48 / 112) - 42% complete
Pass 1: Analyzing classes (49 / 112) - 43% complete
Pass 1: Analyzing classes (50 / 112) - 44% complete
Pass 1: Analyzing classes (51 / 112) - 45% complete
Pass 1: Analyzing classes (52 / 112) - 46% complete
Pass 1: Analyzing classes (53 / 112) - 47% complete
Pass 1: Analyzing classes (54 / 112) - 48% complete
Pass 1: Analyzing classes (55 / 112) - 49% complete
Pass 1: Analyzing classes (56 / 112) - 50% complete
Pass 1: Analyzing classes (57 / 112) - 50% complete
Pass 1: Analyzing classes (58 / 112) - 51% complete
Pass 1: Analyzing classes (59 / 112) - 52% complete
Pass 1: Analyzing classes (60 / 112) - 53% complete
Pass 1: Analyzing classes (61 / 112) - 54% complete
Pass 1: Analyzing classes (62 / 112) - 55% complete
Pass 1: Analyzing classes (63 / 112) - 56% complete
Pass 1: Analyzing classes (64 / 112) - 57% complete
Pass 1: Analyzing classes (65 / 112) - 58% complete
Pass 1: Analyzing classes (66 / 112) - 58% complete
Pass 1: Analyzing classes (67 / 112) - 59% complete
Pass 1: Analyzing classes (68 / 112) - 60% complete
Pass 1: Analyzing classes (69 / 112) - 61% complete
Pass 1: Analyzing classes (70 / 112) - 62% complete
Pass 1: Analyzing classes (71 / 112) - 63% complete
Pass 1: Analyzing classes (72 / 112) - 64% complete
Pass 1: Analyzing classes (73 / 112) - 65% complete
Pass 1: Analyzing classes (74 / 112) - 66% complete
Pass 1: Analyzing classes (75 / 112) - 66% complete
Pass 1: Analyzing classes (76 / 112) - 67% complete
Pass 1: Analyzing classes (77 / 112) - 68% complete
Pass 1: Analyzing classes (78 / 112) - 69% complete
Pass 1: Analyzing classes (79 / 112) - 70% complete
Pass 1: Analyzing classes (80 / 112) - 71% complete
Pass 1: Analyzing classes (81 / 112) - 72% complete
Pass 1: Analyzing classes (82 / 112) - 73% complete
Pass 1: Analyzing classes (83 / 112) - 74% complete
Pass 1: Analyzing classes (84 / 112) - 75% complete
Pass 1: Analyzing classes (85 / 112) - 75% complete
Pass 1: Analyzing classes (86 / 112) - 76% complete
Pass 1: Analyzing classes (87 / 112) - 77% complete
Pass 1: Analyzing classes (88 / 112) - 78% complete
Pass 1: Analyzing classes (89 / 112) - 79% complete
Pass 1: Analyzing classes (90 / 112) - 80% complete
Pass 1: Analyzing classes (91 / 112) - 81% complete
Pass 1: Analyzing classes (92 / 112) - 82% complete
Pass 1: Analyzing classes (93 / 112) - 83% complete
Pass 1: Analyzing classes (94 / 112) - 83% complete
Pass 1: Analyzing classes (95 / 112) - 84% complete
Pass 1: Analyzing classes (96 / 112) - 85% complete
Pass 1: Analyzing classes (97 / 112) - 86% complete
Pass 1: Analyzing classes (98 / 112) - 87% complete
Pass 1: Analyzing classes (99 / 112) - 88% complete
Pass 1: Analyzing classes (100 / 112) - 89% complete
Pass 1: Analyzing classes (101 / 112) - 90% complete
Pass 1: Analyzing classes (102 / 112) - 91% complete
Pass 1: Analyzing classes (103 / 112) - 91% complete
Pass 1: Analyzing classes (104 / 112) - 92% complete
Pass 1: Analyzing classes (105 / 112) - 93% complete
Pass 1: Analyzing classes (106 / 112) - 94% complete
Pass 1: Analyzing classes (107 / 112) - 95% complete
Pass 1: Analyzing classes (108 / 112) - 96% complete
Pass 1: Analyzing classes (109 / 112) - 97% complete
Pass 1: Analyzing classes (110 / 112) - 98% complete
Pass 1: Analyzing classes (111 / 112) - 99% complete
Pass 1: Analyzing classes (112 / 112) - 100% complete

Pass 2: Analyzing classes (0 / 9) - 00% complete
Pass 2: Analyzing classes (1 / 9) - 11% complete
Pass 2: Analyzing classes (2 / 9) - 22% complete
Pass 2: Analyzing classes (3 / 9) - 33% complete
Pass 2: Analyzing classes (4 / 9) - 44% complete
Pass 2: Analyzing classes (5 / 9) - 55% complete
Pass 2: Analyzing classes (6 / 9) - 66% complete
Pass 2: Analyzing classes (7 / 9) - 77% complete
Pass 2: Analyzing classes (8 / 9) - 88% complete
Pass 2: Analyzing classes (9 / 9) - 100% complete
Done with analysis
:web:org.eclipse.virgo.web.enterprise.services.accessor:findbugsMain (Thread[Daemon worker,5,main]) completed. Took 5.277 secs.
:web:org.eclipse.virgo.web.enterprise.services.accessor:compileTestJava (Thread[Daemon worker,5,main]) started.
:web:org.eclipse.virgo.web.enterprise.services.accessor:compileTestJava
Putting task artifact state for task ':web:org.eclipse.virgo.web.enterprise.services.accessor:compileTestJava' into context took 0.006 secs.
Task :web:org.eclipse.virgo.web.enterprise.services.accessor:compileTestJava class loader hash: e1d5c4b3003235964bf4bb274716a6a0
Task :web:org.eclipse.virgo.web.enterprise.services.accessor:compileTestJava actions class loader hashes: [a7dca6360d61447814913dd8e8f289bc, 0c0afac576bb2de41200bc36bccb9200, e1d5c4b3003235964bf4bb274716a6a0]
Executing task ':web:org.eclipse.virgo.web.enterprise.services.accessor:compileTestJava' (up-to-date check took 0.013 secs) due to:
  No history is available.
All input files are considered out-of-date for incremental task ':web:org.eclipse.virgo.web.enterprise.services.accessor:compileTestJava'.
Compiling with Java command line compiler 'java'.
Starting process 'command 'java''. Working directory: /jobs/genie.virgo/virgo-master/workspace/web/org.eclipse.virgo.web.enterprise.services.accessor Command: java -cp /opt/public/hipp/homes/genie.virgo/.gradle/caches/modules-2/files-2.1/org.eclipse.jdt.core.compiler/ecj/4.6.1/5555607add54eb79c5a0729134e663fe2e6300c2/ecj-4.6.1.jar org.eclipse.jdt.internal.compiler.batch.Main -warn:-unused @/jobs/genie.virgo/virgo-master/workspace/web/org.eclipse.virgo.web.enterprise.services.accessor/build/tmp/compileTestJava/java-compiler-args.txt
Successfully started process 'command 'java''
Picked up JAVA_TOOL_OPTIONS: -Xmx2G -Djava.io.tmpdir=/tmp/genie.virgo -DforkCount=1
----------
1. WARNING in /jobs/genie.virgo/virgo-master/workspace/web/org.eclipse.virgo.web.enterprise.services.accessor/src/test/java/org/eclipse/virgo/web/enterprise/services/accessor/WebAppBundleClassloaderCustomizerTest.java (at line 94)
	assertTrue(((List<ClassLoaderDelegateHook>) field.get(PluggableDelegatingClassLoaderDelegateHook.getInstance())).contains(webAppBundleClassloaderCustomizer.getWebAppBundleClassLoaderDelegateHook()));
	           ^^^^^^^^^^^^^^^^^^^^^^^^^^^^^^^^^^^^^^^^^^^^^^^^^^^^^^^^^^^^^^^^^^^^^^^^^^^^^^^^^^^^^^^^^^^^^^^^^^^^^
Type safety: Unchecked cast from Object to List<ClassLoaderDelegateHook>
----------
2. WARNING in /jobs/genie.virgo/virgo-master/workspace/web/org.eclipse.virgo.web.enterprise.services.accessor/src/test/java/org/eclipse/virgo/web/enterprise/services/accessor/WebAppBundleClassloaderCustomizerTest.java (at line 98)
	assertTrue(((Map<Bundle, Set<String>>) field2.get(webAppBundleClassloaderCustomizer.getWebAppBundleClassLoaderDelegateHook())).containsKey(webBundle));
	           ^^^^^^^^^^^^^^^^^^^^^^^^^^^^^^^^^^^^^^^^^^^^^^^^^^^^^^^^^^^^^^^^^^^^^^^^^^^^^^^^^^^^^^^^^^^^^^^^^^^^^^^^^^^^^^^^^^^
Type safety: Unchecked cast from Object to Map<Bundle,Set<String>>
----------
3. WARNING in /jobs/genie.virgo/virgo-master/workspace/web/org.eclipse.virgo.web.enterprise.services.accessor/src/test/java/org/eclipse/virgo/web/enterprise/services/accessor/WebAppBundleClassloaderCustomizerTest.java (at line 104)
	assertTrue(((List<ClassLoaderDelegateHook>) field.get(PluggableDelegatingClassLoaderDelegateHook.getInstance())).isEmpty());
	           ^^^^^^^^^^^^^^^^^^^^^^^^^^^^^^^^^^^^^^^^^^^^^^^^^^^^^^^^^^^^^^^^^^^^^^^^^^^^^^^^^^^^^^^^^^^^^^^^^^^^^
Type safety: Unchecked cast from Object to List<ClassLoaderDelegateHook>
----------
3 problems (3 warnings)
:web:org.eclipse.virgo.web.enterprise.services.accessor:compileTestJava (Thread[Daemon worker,5,main]) completed. Took 0.875 secs.
:web:org.eclipse.virgo.web.enterprise.services.accessor:processTestResources (Thread[Daemon worker,5,main]) started.
:web:org.eclipse.virgo.web.enterprise.services.accessor:processTestResources
Putting task artifact state for task ':web:org.eclipse.virgo.web.enterprise.services.accessor:processTestResources' into context took 0.002 secs.
file or directory '/jobs/genie.virgo/virgo-master/workspace/web/org.eclipse.virgo.web.enterprise.services.accessor/src/test/resources', not found
Skipping task ':web:org.eclipse.virgo.web.enterprise.services.accessor:processTestResources' as it has no source files and no previous output files.
:web:org.eclipse.virgo.web.enterprise.services.accessor:processTestResources NO-SOURCE
:web:org.eclipse.virgo.web.enterprise.services.accessor:processTestResources (Thread[Daemon worker,5,main]) completed. Took 0.003 secs.
:web:org.eclipse.virgo.web.enterprise.services.accessor:testClasses (Thread[Daemon worker,5,main]) started.
:web:org.eclipse.virgo.web.enterprise.services.accessor:testClasses
Skipping task ':web:org.eclipse.virgo.web.enterprise.services.accessor:testClasses' as it has no actions.
:web:org.eclipse.virgo.web.enterprise.services.accessor:testClasses (Thread[Daemon worker,5,main]) completed. Took 0.0 secs.
:web:org.eclipse.virgo.web.enterprise.services.accessor:test (Thread[Daemon worker,5,main]) started.
:web:org.eclipse.virgo.web.enterprise.services.accessor:test
Putting task artifact state for task ':web:org.eclipse.virgo.web.enterprise.services.accessor:test' into context took 0.0 secs.
Task :web:org.eclipse.virgo.web.enterprise.services.accessor:test class loader hash: e1d5c4b3003235964bf4bb274716a6a0
Task :web:org.eclipse.virgo.web.enterprise.services.accessor:test actions class loader hashes: [e1d5c4b3003235964bf4bb274716a6a0, 0c0afac576bb2de41200bc36bccb9200]
Executing task ':web:org.eclipse.virgo.web.enterprise.services.accessor:test' (up-to-date check took 0.059 secs) due to:
  No history is available.
Starting process 'Gradle Test Executor 112'. Working directory: /jobs/genie.virgo/virgo-master/workspace/web/org.eclipse.virgo.web.enterprise.services.accessor Command: /opt/public/common/java/oracle/jdk1.8.0_192_x64/bin/java -Djava.security.manager=worker.org.gradle.process.internal.worker.child.BootstrapSecurityManager -Djdk.management.heapdump.allowAnyFileSuffix=true -javaagent:build/tmp/expandedArchives/org.jacoco.agent-0.8.1.jar_8cthkl45n2xyfgevaovgvpys6/jacocoagent.jar=destfile=build/jacoco/test.exec,append=true,inclnolocationclasses=false,dumponexit=true,output=file,jmx=false -Dfile.encoding=UTF-8 -Duser.country=US -Duser.language=en -Duser.variant -ea -cp /opt/public/hipp/homes/genie.virgo/.gradle/caches/3.5.1/workerMain/gradle-worker.jar worker.org.gradle.process.internal.worker.GradleWorkerMain 'Gradle Test Executor 112'
Successfully started process 'Gradle Test Executor 112'
Picked up JAVA_TOOL_OPTIONS: -Xmx2G -Djava.io.tmpdir=/tmp/genie.virgo -DforkCount=1
Initialized native services in: /opt/public/hipp/homes/genie.virgo/.gradle/native
Gradle Test Executor 112 started executing tests.

org.eclipse.virgo.web.enterprise.services.accessor.ServicesAccessorCommandProviderTest > testListApi STANDARD_ERROR
    SLF4J: Failed to load class "org.slf4j.impl.StaticLoggerBinder".
    SLF4J: Defaulting to no-operation (NOP) logger implementation
    SLF4J: See http://www.slf4j.org/codes.html#StaticLoggerBinder for further details.
Gradle Test Executor 112 finished executing tests.
Finished generating test XML results (0.001 secs) into: /jobs/genie.virgo/virgo-master/workspace/web/org.eclipse.virgo.web.enterprise.services.accessor/build/test-results/test
Generating HTML test report...
Finished generating test html results (0.002 secs) into: /jobs/genie.virgo/virgo-master/workspace/web/org.eclipse.virgo.web.enterprise.services.accessor/build/reports/tests/test
:web:org.eclipse.virgo.web.enterprise.services.accessor:test (Thread[Daemon worker,5,main]) completed. Took 1.358 secs.
:web:org.eclipse.virgo.web.enterprise.services.accessor:check (Thread[Daemon worker,5,main]) started.
:web:org.eclipse.virgo.web.enterprise.services.accessor:check
Skipping task ':web:org.eclipse.virgo.web.enterprise.services.accessor:check' as it has no actions.
:web:org.eclipse.virgo.web.enterprise.services.accessor:check (Thread[Daemon worker,5,main]) completed. Took 0.001 secs.
:web:org.eclipse.virgo.web.enterprise.services.accessor:build (Thread[Daemon worker,5,main]) started.
:web:org.eclipse.virgo.web.enterprise.services.accessor:build
Skipping task ':web:org.eclipse.virgo.web.enterprise.services.accessor:build' as it has no actions.
:web:org.eclipse.virgo.web.enterprise.services.accessor:build (Thread[Daemon worker,5,main]) completed. Took 0.0 secs.
:web:org.eclipse.virgo.web.servlet.adapter:findbugsMain (Thread[Daemon worker,5,main]) started.
:web:org.eclipse.virgo.web.servlet.adapter:findbugsMain
Putting task artifact state for task ':web:org.eclipse.virgo.web.servlet.adapter:findbugsMain' into context took 0.006 secs.
file or directory '/jobs/genie.virgo/virgo-master/workspace/web/org.eclipse.virgo.web.servlet.adapter/build/classes/main', not found
Skipping task ':web:org.eclipse.virgo.web.servlet.adapter:findbugsMain' as it has no source files and no previous output files.
:web:org.eclipse.virgo.web.servlet.adapter:findbugsMain NO-SOURCE
:web:org.eclipse.virgo.web.servlet.adapter:findbugsMain (Thread[Daemon worker,5,main]) completed. Took 0.007 secs.
:web:org.eclipse.virgo.web.servlet.adapter:compileTestJava (Thread[Daemon worker,5,main]) started.
:web:org.eclipse.virgo.web.servlet.adapter:compileTestJava
Putting task artifact state for task ':web:org.eclipse.virgo.web.servlet.adapter:compileTestJava' into context took 0.0 secs.
file or directory '/jobs/genie.virgo/virgo-master/workspace/web/org.eclipse.virgo.web.servlet.adapter/src/test/java', not found
Skipping task ':web:org.eclipse.virgo.web.servlet.adapter:compileTestJava' as it has no source files and no previous output files.
:web:org.eclipse.virgo.web.servlet.adapter:compileTestJava NO-SOURCE
:web:org.eclipse.virgo.web.servlet.adapter:compileTestJava (Thread[Daemon worker,5,main]) completed. Took 0.0 secs.
:web:org.eclipse.virgo.web.servlet.adapter:processTestResources (Thread[Daemon worker,5,main]) started.
:web:org.eclipse.virgo.web.servlet.adapter:processTestResources
Putting task artifact state for task ':web:org.eclipse.virgo.web.servlet.adapter:processTestResources' into context took 0.0 secs.
file or directory '/jobs/genie.virgo/virgo-master/workspace/web/org.eclipse.virgo.web.servlet.adapter/src/test/resources', not found
Skipping task ':web:org.eclipse.virgo.web.servlet.adapter:processTestResources' as it has no source files and no previous output files.
:web:org.eclipse.virgo.web.servlet.adapter:processTestResources NO-SOURCE
:web:org.eclipse.virgo.web.servlet.adapter:processTestResources (Thread[Daemon worker,5,main]) completed. Took 0.001 secs.
:web:org.eclipse.virgo.web.servlet.adapter:testClasses (Thread[Daemon worker,5,main]) started.
:web:org.eclipse.virgo.web.servlet.adapter:testClasses
Skipping task ':web:org.eclipse.virgo.web.servlet.adapter:testClasses' as it has no actions.
:web:org.eclipse.virgo.web.servlet.adapter:testClasses UP-TO-DATE
:web:org.eclipse.virgo.web.servlet.adapter:testClasses (Thread[Daemon worker,5,main]) completed. Took 0.0 secs.
:web:org.eclipse.virgo.web.servlet.adapter:test (Thread[Daemon worker,5,main]) started.
:web:org.eclipse.virgo.web.servlet.adapter:test
Putting task artifact state for task ':web:org.eclipse.virgo.web.servlet.adapter:test' into context took 0.0 secs.
file or directory '/jobs/genie.virgo/virgo-master/workspace/web/org.eclipse.virgo.web.servlet.adapter/build/classes/test', not found
Skipping task ':web:org.eclipse.virgo.web.servlet.adapter:test' as it has no source files and no previous output files.
:web:org.eclipse.virgo.web.servlet.adapter:test NO-SOURCE
:web:org.eclipse.virgo.web.servlet.adapter:test (Thread[Daemon worker,5,main]) completed. Took 0.001 secs.
:web:org.eclipse.virgo.web.servlet.adapter:check (Thread[Daemon worker,5,main]) started.
:web:org.eclipse.virgo.web.servlet.adapter:check
Skipping task ':web:org.eclipse.virgo.web.servlet.adapter:check' as it has no actions.
:web:org.eclipse.virgo.web.servlet.adapter:check UP-TO-DATE
:web:org.eclipse.virgo.web.servlet.adapter:check (Thread[Daemon worker,5,main]) completed. Took 0.0 secs.
:web:org.eclipse.virgo.web.servlet.adapter:build (Thread[Daemon worker,5,main]) started.
:web:org.eclipse.virgo.web.servlet.adapter:build
Skipping task ':web:org.eclipse.virgo.web.servlet.adapter:build' as it has no actions.
:web:org.eclipse.virgo.web.servlet.adapter:build (Thread[Daemon worker,5,main]) completed. Took 0.0 secs.
:web:org.eclipse.virgo.web.spring.integration:findbugsMain (Thread[Daemon worker,5,main]) started.
:web:org.eclipse.virgo.web.spring.integration:findbugsMain
Putting task artifact state for task ':web:org.eclipse.virgo.web.spring.integration:findbugsMain' into context took 0.0 secs.
file or directory '/jobs/genie.virgo/virgo-master/workspace/web/org.eclipse.virgo.web.spring.integration/build/classes/main', not found
Skipping task ':web:org.eclipse.virgo.web.spring.integration:findbugsMain' as it has no source files and no previous output files.
:web:org.eclipse.virgo.web.spring.integration:findbugsMain NO-SOURCE
:web:org.eclipse.virgo.web.spring.integration:findbugsMain (Thread[Daemon worker,5,main]) completed. Took 0.0 secs.
:web:org.eclipse.virgo.web.spring.integration:compileTestJava (Thread[Daemon worker,5,main]) started.
:web:org.eclipse.virgo.web.spring.integration:compileTestJava
Putting task artifact state for task ':web:org.eclipse.virgo.web.spring.integration:compileTestJava' into context took 0.0 secs.
file or directory '/jobs/genie.virgo/virgo-master/workspace/web/org.eclipse.virgo.web.spring.integration/src/test/java', not found
Skipping task ':web:org.eclipse.virgo.web.spring.integration:compileTestJava' as it has no source files and no previous output files.
:web:org.eclipse.virgo.web.spring.integration:compileTestJava NO-SOURCE
:web:org.eclipse.virgo.web.spring.integration:compileTestJava (Thread[Daemon worker,5,main]) completed. Took 0.0 secs.
:web:org.eclipse.virgo.web.spring.integration:processTestResources (Thread[Daemon worker,5,main]) started.
:web:org.eclipse.virgo.web.spring.integration:processTestResources
Putting task artifact state for task ':web:org.eclipse.virgo.web.spring.integration:processTestResources' into context took 0.0 secs.
file or directory '/jobs/genie.virgo/virgo-master/workspace/web/org.eclipse.virgo.web.spring.integration/src/test/resources', not found
Skipping task ':web:org.eclipse.virgo.web.spring.integration:processTestResources' as it has no source files and no previous output files.
:web:org.eclipse.virgo.web.spring.integration:processTestResources NO-SOURCE
:web:org.eclipse.virgo.web.spring.integration:processTestResources (Thread[Daemon worker,5,main]) completed. Took 0.0 secs.
:web:org.eclipse.virgo.web.spring.integration:testClasses (Thread[Daemon worker,5,main]) started.
:web:org.eclipse.virgo.web.spring.integration:testClasses
Skipping task ':web:org.eclipse.virgo.web.spring.integration:testClasses' as it has no actions.
:web:org.eclipse.virgo.web.spring.integration:testClasses UP-TO-DATE
:web:org.eclipse.virgo.web.spring.integration:testClasses (Thread[Daemon worker,5,main]) completed. Took 0.0 secs.
:web:org.eclipse.virgo.web.spring.integration:test (Thread[Daemon worker,5,main]) started.
:web:org.eclipse.virgo.web.spring.integration:test
Putting task artifact state for task ':web:org.eclipse.virgo.web.spring.integration:test' into context took 0.0 secs.
file or directory '/jobs/genie.virgo/virgo-master/workspace/web/org.eclipse.virgo.web.spring.integration/build/classes/test', not found
Skipping task ':web:org.eclipse.virgo.web.spring.integration:test' as it has no source files and no previous output files.
:web:org.eclipse.virgo.web.spring.integration:test NO-SOURCE
:web:org.eclipse.virgo.web.spring.integration:test (Thread[Daemon worker,5,main]) completed. Took 0.001 secs.
:web:org.eclipse.virgo.web.spring.integration:check (Thread[Daemon worker,5,main]) started.
:web:org.eclipse.virgo.web.spring.integration:check
Skipping task ':web:org.eclipse.virgo.web.spring.integration:check' as it has no actions.
:web:org.eclipse.virgo.web.spring.integration:check UP-TO-DATE
:web:org.eclipse.virgo.web.spring.integration:check (Thread[Daemon worker,5,main]) completed. Took 0.0 secs.
:web:org.eclipse.virgo.web.spring.integration:build (Thread[Daemon worker,5,main]) started.
:web:org.eclipse.virgo.web.spring.integration:build
Skipping task ':web:org.eclipse.virgo.web.spring.integration:build' as it has no actions.
:web:org.eclipse.virgo.web.spring.integration:build (Thread[Daemon worker,5,main]) completed. Took 0.0 secs.
:web:org.eclipse.virgo.web.tomcat.support:findbugsMain (Thread[Daemon worker,5,main]) started.
:web:org.eclipse.virgo.web.tomcat.support:findbugsMain
Putting task artifact state for task ':web:org.eclipse.virgo.web.tomcat.support:findbugsMain' into context took 0.001 secs.
Task :web:org.eclipse.virgo.web.tomcat.support:findbugsMain class loader hash: e1d5c4b3003235964bf4bb274716a6a0
Task :web:org.eclipse.virgo.web.tomcat.support:findbugsMain actions class loader hashes: [0c0afac576bb2de41200bc36bccb9200, e1d5c4b3003235964bf4bb274716a6a0]
Executing task ':web:org.eclipse.virgo.web.tomcat.support:findbugsMain' (up-to-date check took 0.013 secs) due to:
  No history is available.
Starting process 'Gradle FindBugs Worker 113'. Working directory: /jobs/genie.virgo/virgo-master/workspace/web/org.eclipse.virgo.web.tomcat.support Command: /opt/public/common/java/oracle/jdk1.8.0_192_x64/bin/java -Djava.security.manager=worker.org.gradle.process.internal.worker.child.BootstrapSecurityManager -Dfile.encoding=UTF-8 -Duser.country=US -Duser.language=en -Duser.variant -cp /opt/public/hipp/homes/genie.virgo/.gradle/caches/3.5.1/workerMain/gradle-worker.jar worker.org.gradle.process.internal.worker.GradleWorkerMain 'Gradle FindBugs Worker 113'
Successfully started process 'Gradle FindBugs Worker 113'
Initialized native services in: /opt/public/hipp/homes/genie.virgo/.gradle/native

Scanning archives (0 / 41)
Scanning archives (1 / 41)
Scanning archives (2 / 41)
Scanning archives (3 / 41)
Scanning archives (4 / 41)
Scanning archives (5 / 41)
Scanning archives (6 / 41)
Scanning archives (7 / 41)
Scanning archives (8 / 41)
Scanning archives (9 / 41)
Scanning archives (10 / 41)
Scanning archives (11 / 41)
Scanning archives (12 / 41)
Scanning archives (13 / 41)
Scanning archives (14 / 41)
Scanning archives (15 / 41)
Scanning archives (16 / 41)
Scanning archives (17 / 41)
Scanning archives (18 / 41)
Scanning archives (19 / 41)
Scanning archives (20 / 41)
Scanning archives (21 / 41)
Scanning archives (22 / 41)
Scanning archives (23 / 41)
Scanning archives (24 / 41)
Scanning archives (25 / 41)
Scanning archives (26 / 41)
Scanning archives (27 / 41)
Scanning archives (28 / 41)
Scanning archives (29 / 41)
Scanning archives (30 / 41)
Scanning archives (31 / 41)
Scanning archives (32 / 41)
Scanning archives (33 / 41)
Scanning archives (34 / 41)
Scanning archives (35 / 41)
Scanning archives (36 / 41)
Scanning archives (37 / 41)
Scanning archives (38 / 41)
Scanning archives (39 / 41)
Scanning archives (40 / 41)
Scanning archives (41 / 41)

2 analysis passes to perform

Pass 1: Analyzing classes (0 / 131) - 00% complete
Pass 1: Analyzing classes (1 / 131) - 00% complete
Pass 1: Analyzing classes (2 / 131) - 01% complete
Pass 1: Analyzing classes (3 / 131) - 02% complete
Pass 1: Analyzing classes (4 / 131) - 03% complete
Pass 1: Analyzing classes (5 / 131) - 03% complete
Pass 1: Analyzing classes (6 / 131) - 04% complete
Pass 1: Analyzing classes (7 / 131) - 05% complete
Pass 1: Analyzing classes (8 / 131) - 06% complete
Pass 1: Analyzing classes (9 / 131) - 06% complete
Pass 1: Analyzing classes (10 / 131) - 07% complete
Pass 1: Analyzing classes (11 / 131) - 08% complete
Pass 1: Analyzing classes (12 / 131) - 09% complete
Pass 1: Analyzing classes (13 / 131) - 09% complete
Pass 1: Analyzing classes (14 / 131) - 10% complete
Pass 1: Analyzing classes (15 / 131) - 11% complete
Pass 1: Analyzing classes (16 / 131) - 12% complete
Pass 1: Analyzing classes (17 / 131) - 12% complete
Pass 1: Analyzing classes (18 / 131) - 13% complete
Pass 1: Analyzing classes (19 / 131) - 14% complete
Pass 1: Analyzing classes (20 / 131) - 15% complete
Pass 1: Analyzing classes (21 / 131) - 16% complete
Pass 1: Analyzing classes (22 / 131) - 16% complete
Pass 1: Analyzing classes (23 / 131) - 17% complete
Pass 1: Analyzing classes (24 / 131) - 18% complete
Pass 1: Analyzing classes (25 / 131) - 19% complete
Pass 1: Analyzing classes (26 / 131) - 19% complete
Pass 1: Analyzing classes (27 / 131) - 20% complete
Pass 1: Analyzing classes (28 / 131) - 21% complete
Pass 1: Analyzing classes (29 / 131) - 22% complete
Pass 1: Analyzing classes (30 / 131) - 22% complete
Pass 1: Analyzing classes (31 / 131) - 23% complete
Pass 1: Analyzing classes (32 / 131) - 24% complete
Pass 1: Analyzing classes (33 / 131) - 25% complete
Pass 1: Analyzing classes (34 / 131) - 25% complete
Pass 1: Analyzing classes (35 / 131) - 26% complete
Pass 1: Analyzing classes (36 / 131) - 27% complete
Pass 1: Analyzing classes (37 / 131) - 28% complete
Pass 1: Analyzing classes (38 / 131) - 29% complete
Pass 1: Analyzing classes (39 / 131) - 29% complete
Pass 1: Analyzing classes (40 / 131) - 30% complete
Pass 1: Analyzing classes (41 / 131) - 31% complete
Pass 1: Analyzing classes (42 / 131) - 32% complete
Pass 1: Analyzing classes (43 / 131) - 32% complete
Pass 1: Analyzing classes (44 / 131) - 33% complete
Pass 1: Analyzing classes (45 / 131) - 34% complete
Pass 1: Analyzing classes (46 / 131) - 35% complete
Pass 1: Analyzing classes (47 / 131) - 35% complete
Pass 1: Analyzing classes (48 / 131) - 36% complete
Pass 1: Analyzing classes (49 / 131) - 37% complete
Pass 1: Analyzing classes (50 / 131) - 38% complete
Pass 1: Analyzing classes (51 / 131) - 38% complete
Pass 1: Analyzing classes (52 / 131) - 39% complete
Pass 1: Analyzing classes (53 / 131) - 40% complete
Pass 1: Analyzing classes (54 / 131) - 41% complete
Pass 1: Analyzing classes (55 / 131) - 41% complete
Pass 1: Analyzing classes (56 / 131) - 42% complete
Pass 1: Analyzing classes (57 / 131) - 43% complete
Pass 1: Analyzing classes (58 / 131) - 44% complete
Pass 1: Analyzing classes (59 / 131) - 45% complete
Pass 1: Analyzing classes (60 / 131) - 45% complete
Pass 1: Analyzing classes (61 / 131) - 46% complete
Pass 1: Analyzing classes (62 / 131) - 47% complete
Pass 1: Analyzing classes (63 / 131) - 48% complete
Pass 1: Analyzing classes (64 / 131) - 48% complete
Pass 1: Analyzing classes (65 / 131) - 49% complete
Pass 1: Analyzing classes (66 / 131) - 50% complete
Pass 1: Analyzing classes (67 / 131) - 51% complete
Pass 1: Analyzing classes (68 / 131) - 51% complete
Pass 1: Analyzing classes (69 / 131) - 52% complete
Pass 1: Analyzing classes (70 / 131) - 53% complete
Pass 1: Analyzing classes (71 / 131) - 54% complete
Pass 1: Analyzing classes (72 / 131) - 54% complete
Pass 1: Analyzing classes (73 / 131) - 55% complete
Pass 1: Analyzing classes (74 / 131) - 56% complete
Pass 1: Analyzing classes (75 / 131) - 57% complete
Pass 1: Analyzing classes (76 / 131) - 58% complete
Pass 1: Analyzing classes (77 / 131) - 58% complete
Pass 1: Analyzing classes (78 / 131) - 59% complete
Pass 1: Analyzing classes (79 / 131) - 60% complete
Pass 1: Analyzing classes (80 / 131) - 61% complete
Pass 1: Analyzing classes (81 / 131) - 61% complete
Pass 1: Analyzing classes (82 / 131) - 62% complete
Pass 1: Analyzing classes (83 / 131) - 63% complete
Pass 1: Analyzing classes (84 / 131) - 64% complete
Pass 1: Analyzing classes (85 / 131) - 64% complete
Pass 1: Analyzing classes (86 / 131) - 65% complete
Pass 1: Analyzing classes (87 / 131) - 66% complete
Pass 1: Analyzing classes (88 / 131) - 67% complete
Pass 1: Analyzing classes (89 / 131) - 67% complete
Pass 1: Analyzing classes (90 / 131) - 68% complete
Pass 1: Analyzing classes (91 / 131) - 69% complete
Pass 1: Analyzing classes (92 / 131) - 70% complete
Pass 1: Analyzing classes (93 / 131) - 70% complete
Pass 1: Analyzing classes (94 / 131) - 71% complete
Pass 1: Analyzing classes (95 / 131) - 72% complete
Pass 1: Analyzing classes (96 / 131) - 73% complete
Pass 1: Analyzing classes (97 / 131) - 74% complete
Pass 1: Analyzing classes (98 / 131) - 74% complete
Pass 1: Analyzing classes (99 / 131) - 75% complete
Pass 1: Analyzing classes (100 / 131) - 76% complete
Pass 1: Analyzing classes (101 / 131) - 77% complete
Pass 1: Analyzing classes (102 / 131) - 77% complete
Pass 1: Analyzing classes (103 / 131) - 78% complete
Pass 1: Analyzing classes (104 / 131) - 79% complete
Pass 1: Analyzing classes (105 / 131) - 80% complete
Pass 1: Analyzing classes (106 / 131) - 80% complete
Pass 1: Analyzing classes (107 / 131) - 81% complete
Pass 1: Analyzing classes (108 / 131) - 82% complete
Pass 1: Analyzing classes (109 / 131) - 83% complete
Pass 1: Analyzing classes (110 / 131) - 83% complete
Pass 1: Analyzing classes (111 / 131) - 84% complete
Pass 1: Analyzing classes (112 / 131) - 85% complete
Pass 1: Analyzing classes (113 / 131) - 86% complete
Pass 1: Analyzing classes (114 / 131) - 87% complete
Pass 1: Analyzing classes (115 / 131) - 87% complete
Pass 1: Analyzing classes (116 / 131) - 88% complete
Pass 1: Analyzing classes (117 / 131) - 89% complete
Pass 1: Analyzing classes (118 / 131) - 90% complete
Pass 1: Analyzing classes (119 / 131) - 90% complete
Pass 1: Analyzing classes (120 / 131) - 91% complete
Pass 1: Analyzing classes (121 / 131) - 92% complete
Pass 1: Analyzing classes (122 / 131) - 93% complete
Pass 1: Analyzing classes (123 / 131) - 93% complete
Pass 1: Analyzing classes (124 / 131) - 94% complete
Pass 1: Analyzing classes (125 / 131) - 95% complete
Pass 1: Analyzing classes (126 / 131) - 96% complete
Pass 1: Analyzing classes (127 / 131) - 96% complete
Pass 1: Analyzing classes (128 / 131) - 97% complete
Pass 1: Analyzing classes (129 / 131) - 98% complete
Pass 1: Analyzing classes (130 / 131) - 99% complete
Pass 1: Analyzing classes (131 / 131) - 100% complete

Pass 2: Analyzing classes (0 / 8) - 00% complete
Pass 2: Analyzing classes (1 / 8) - 12% complete
Pass 2: Analyzing classes (2 / 8) - 25% complete
Pass 2: Analyzing classes (3 / 8) - 37% complete
Pass 2: Analyzing classes (4 / 8) - 50% complete
Pass 2: Analyzing classes (5 / 8) - 62% complete
Pass 2: Analyzing classes (6 / 8) - 75% complete
Pass 2: Analyzing classes (7 / 8) - 87% complete
Pass 2: Analyzing classes (8 / 8) - 100% complete
Done with analysis
:web:org.eclipse.virgo.web.tomcat.support:findbugsMain (Thread[Daemon worker,5,main]) completed. Took 4.742 secs.
:web:org.eclipse.virgo.web.tomcat.support:compileTestJava (Thread[Daemon worker,5,main]) started.
:web:org.eclipse.virgo.web.tomcat.support:compileTestJava
Putting task artifact state for task ':web:org.eclipse.virgo.web.tomcat.support:compileTestJava' into context took 0.005 secs.
file or directory '/jobs/genie.virgo/virgo-master/workspace/web/org.eclipse.virgo.web.tomcat.support/src/test/java', not found
Skipping task ':web:org.eclipse.virgo.web.tomcat.support:compileTestJava' as it has no source files and no previous output files.
:web:org.eclipse.virgo.web.tomcat.support:compileTestJava NO-SOURCE
:web:org.eclipse.virgo.web.tomcat.support:compileTestJava (Thread[Daemon worker,5,main]) completed. Took 0.006 secs.
:web:org.eclipse.virgo.web.tomcat.support:processTestResources (Thread[Daemon worker,5,main]) started.
:web:org.eclipse.virgo.web.tomcat.support:processTestResources
Putting task artifact state for task ':web:org.eclipse.virgo.web.tomcat.support:processTestResources' into context took 0.0 secs.
file or directory '/jobs/genie.virgo/virgo-master/workspace/web/org.eclipse.virgo.web.tomcat.support/src/test/resources', not found
Skipping task ':web:org.eclipse.virgo.web.tomcat.support:processTestResources' as it has no source files and no previous output files.
:web:org.eclipse.virgo.web.tomcat.support:processTestResources NO-SOURCE
:web:org.eclipse.virgo.web.tomcat.support:processTestResources (Thread[Daemon worker,5,main]) completed. Took 0.0 secs.
:web:org.eclipse.virgo.web.tomcat.support:testClasses (Thread[Daemon worker,5,main]) started.
:web:org.eclipse.virgo.web.tomcat.support:testClasses
Skipping task ':web:org.eclipse.virgo.web.tomcat.support:testClasses' as it has no actions.
:web:org.eclipse.virgo.web.tomcat.support:testClasses UP-TO-DATE
:web:org.eclipse.virgo.web.tomcat.support:testClasses (Thread[Daemon worker,5,main]) completed. Took 0.0 secs.
:web:org.eclipse.virgo.web.tomcat.support:test (Thread[Daemon worker,5,main]) started.
:web:org.eclipse.virgo.web.tomcat.support:test
Putting task artifact state for task ':web:org.eclipse.virgo.web.tomcat.support:test' into context took 0.001 secs.
file or directory '/jobs/genie.virgo/virgo-master/workspace/web/org.eclipse.virgo.web.tomcat.support/build/classes/test', not found
Skipping task ':web:org.eclipse.virgo.web.tomcat.support:test' as it has no source files and no previous output files.
:web:org.eclipse.virgo.web.tomcat.support:test NO-SOURCE
:web:org.eclipse.virgo.web.tomcat.support:test (Thread[Daemon worker,5,main]) completed. Took 0.001 secs.
:web:org.eclipse.virgo.web.tomcat.support:check (Thread[Daemon worker,5,main]) started.
:web:org.eclipse.virgo.web.tomcat.support:check
Skipping task ':web:org.eclipse.virgo.web.tomcat.support:check' as it has no actions.
:web:org.eclipse.virgo.web.tomcat.support:check (Thread[Daemon worker,5,main]) completed. Took 0.0 secs.
:web:org.eclipse.virgo.web.tomcat.support:build (Thread[Daemon worker,5,main]) started.
:web:org.eclipse.virgo.web.tomcat.support:build
Skipping task ':web:org.eclipse.virgo.web.tomcat.support:build' as it has no actions.
:web:org.eclipse.virgo.web.tomcat.support:build (Thread[Daemon worker,5,main]) completed. Took 0.0 secs.
:web:org.eclipse.virgo.web.war.deployer:findbugsMain (Thread[Daemon worker,5,main]) started.
:web:org.eclipse.virgo.web.war.deployer:findbugsMain
Putting task artifact state for task ':web:org.eclipse.virgo.web.war.deployer:findbugsMain' into context took 0.0 secs.
Task :web:org.eclipse.virgo.web.war.deployer:findbugsMain class loader hash: e1d5c4b3003235964bf4bb274716a6a0
Task :web:org.eclipse.virgo.web.war.deployer:findbugsMain actions class loader hashes: [0c0afac576bb2de41200bc36bccb9200, e1d5c4b3003235964bf4bb274716a6a0]
Executing task ':web:org.eclipse.virgo.web.war.deployer:findbugsMain' (up-to-date check took 0.008 secs) due to:
  No history is available.
Starting process 'Gradle FindBugs Worker 114'. Working directory: /jobs/genie.virgo/virgo-master/workspace/web/org.eclipse.virgo.web.war.deployer Command: /opt/public/common/java/oracle/jdk1.8.0_192_x64/bin/java -Djava.security.manager=worker.org.gradle.process.internal.worker.child.BootstrapSecurityManager -Dfile.encoding=UTF-8 -Duser.country=US -Duser.language=en -Duser.variant -cp /opt/public/hipp/homes/genie.virgo/.gradle/caches/3.5.1/workerMain/gradle-worker.jar worker.org.gradle.process.internal.worker.GradleWorkerMain 'Gradle FindBugs Worker 114'
Successfully started process 'Gradle FindBugs Worker 114'
Initialized native services in: /opt/public/hipp/homes/genie.virgo/.gradle/native

Scanning archives (0 / 24)
Scanning archives (1 / 24)
Scanning archives (2 / 24)
Scanning archives (3 / 24)
Scanning archives (4 / 24)
Scanning archives (5 / 24)
Scanning archives (6 / 24)
Scanning archives (7 / 24)
Scanning archives (8 / 24)
Scanning archives (9 / 24)
Scanning archives (10 / 24)
Scanning archives (11 / 24)
Scanning archives (12 / 24)
Scanning archives (13 / 24)
Scanning archives (14 / 24)
Scanning archives (15 / 24)
Scanning archives (16 / 24)
Scanning archives (17 / 24)
Scanning archives (18 / 24)
Scanning archives (19 / 24)
Scanning archives (20 / 24)
Scanning archives (21 / 24)
Scanning archives (22 / 24)
Scanning archives (23 / 24)
Scanning archives (24 / 24)

2 analysis passes to perform

Pass 1: Analyzing classes (0 / 95) - 00% complete
Pass 1: Analyzing classes (1 / 95) - 01% complete
Pass 1: Analyzing classes (2 / 95) - 02% complete
Pass 1: Analyzing classes (3 / 95) - 03% complete
Pass 1: Analyzing classes (4 / 95) - 04% complete
Pass 1: Analyzing classes (5 / 95) - 05% complete
Pass 1: Analyzing classes (6 / 95) - 06% complete
Pass 1: Analyzing classes (7 / 95) - 07% complete
Pass 1: Analyzing classes (8 / 95) - 08% complete
Pass 1: Analyzing classes (9 / 95) - 09% complete
Pass 1: Analyzing classes (10 / 95) - 10% complete
Pass 1: Analyzing classes (11 / 95) - 11% complete
Pass 1: Analyzing classes (12 / 95) - 12% complete
Pass 1: Analyzing classes (13 / 95) - 13% complete
Pass 1: Analyzing classes (14 / 95) - 14% complete
Pass 1: Analyzing classes (15 / 95) - 15% complete
Pass 1: Analyzing classes (16 / 95) - 16% complete
Pass 1: Analyzing classes (17 / 95) - 17% complete
Pass 1: Analyzing classes (18 / 95) - 18% complete
Pass 1: Analyzing classes (19 / 95) - 20% complete
Pass 1: Analyzing classes (20 / 95) - 21% complete
Pass 1: Analyzing classes (21 / 95) - 22% complete
Pass 1: Analyzing classes (22 / 95) - 23% complete
Pass 1: Analyzing classes (23 / 95) - 24% complete
Pass 1: Analyzing classes (24 / 95) - 25% complete
Pass 1: Analyzing classes (25 / 95) - 26% complete
Pass 1: Analyzing classes (26 / 95) - 27% complete
Pass 1: Analyzing classes (27 / 95) - 28% complete
Pass 1: Analyzing classes (28 / 95) - 29% complete
Pass 1: Analyzing classes (29 / 95) - 30% complete
Pass 1: Analyzing classes (30 / 95) - 31% complete
Pass 1: Analyzing classes (31 / 95) - 32% complete
Pass 1: Analyzing classes (32 / 95) - 33% complete
Pass 1: Analyzing classes (33 / 95) - 34% complete
Pass 1: Analyzing classes (34 / 95) - 35% complete
Pass 1: Analyzing classes (35 / 95) - 36% complete
Pass 1: Analyzing classes (36 / 95) - 37% complete
Pass 1: Analyzing classes (37 / 95) - 38% complete
Pass 1: Analyzing classes (38 / 95) - 40% complete
Pass 1: Analyzing classes (39 / 95) - 41% complete
Pass 1: Analyzing classes (40 / 95) - 42% complete
Pass 1: Analyzing classes (41 / 95) - 43% complete
Pass 1: Analyzing classes (42 / 95) - 44% complete
Pass 1: Analyzing classes (43 / 95) - 45% complete
Pass 1: Analyzing classes (44 / 95) - 46% complete
Pass 1: Analyzing classes (45 / 95) - 47% complete
Pass 1: Analyzing classes (46 / 95) - 48% complete
Pass 1: Analyzing classes (47 / 95) - 49% complete
Pass 1: Analyzing classes (48 / 95) - 50% complete
Pass 1: Analyzing classes (49 / 95) - 51% complete
Pass 1: Analyzing classes (50 / 95) - 52% complete
Pass 1: Analyzing classes (51 / 95) - 53% complete
Pass 1: Analyzing classes (52 / 95) - 54% complete
Pass 1: Analyzing classes (53 / 95) - 55% complete
Pass 1: Analyzing classes (54 / 95) - 56% complete
Pass 1: Analyzing classes (55 / 95) - 57% complete
Pass 1: Analyzing classes (56 / 95) - 58% complete
Pass 1: Analyzing classes (57 / 95) - 60% complete
Pass 1: Analyzing classes (58 / 95) - 61% complete
Pass 1: Analyzing classes (59 / 95) - 62% complete
Pass 1: Analyzing classes (60 / 95) - 63% complete
Pass 1: Analyzing classes (61 / 95) - 64% complete
Pass 1: Analyzing classes (62 / 95) - 65% complete
Pass 1: Analyzing classes (63 / 95) - 66% complete
Pass 1: Analyzing classes (64 / 95) - 67% complete
Pass 1: Analyzing classes (65 / 95) - 68% complete
Pass 1: Analyzing classes (66 / 95) - 69% complete
Pass 1: Analyzing classes (67 / 95) - 70% complete
Pass 1: Analyzing classes (68 / 95) - 71% complete
Pass 1: Analyzing classes (69 / 95) - 72% complete
Pass 1: Analyzing classes (70 / 95) - 73% complete
Pass 1: Analyzing classes (71 / 95) - 74% complete
Pass 1: Analyzing classes (72 / 95) - 75% complete
Pass 1: Analyzing classes (73 / 95) - 76% complete
Pass 1: Analyzing classes (74 / 95) - 77% complete
Pass 1: Analyzing classes (75 / 95) - 78% complete
Pass 1: Analyzing classes (76 / 95) - 80% complete
Pass 1: Analyzing classes (77 / 95) - 81% complete
Pass 1: Analyzing classes (78 / 95) - 82% complete
Pass 1: Analyzing classes (79 / 95) - 83% complete
Pass 1: Analyzing classes (80 / 95) - 84% complete
Pass 1: Analyzing classes (81 / 95) - 85% complete
Pass 1: Analyzing classes (82 / 95) - 86% complete
Pass 1: Analyzing classes (83 / 95) - 87% complete
Pass 1: Analyzing classes (84 / 95) - 88% complete
Pass 1: Analyzing classes (85 / 95) - 89% complete
Pass 1: Analyzing classes (86 / 95) - 90% complete
Pass 1: Analyzing classes (87 / 95) - 91% complete
Pass 1: Analyzing classes (88 / 95) - 92% complete
Pass 1: Analyzing classes (89 / 95) - 93% complete
Pass 1: Analyzing classes (90 / 95) - 94% complete
Pass 1: Analyzing classes (91 / 95) - 95% complete
Pass 1: Analyzing classes (92 / 95) - 96% complete
Pass 1: Analyzing classes (93 / 95) - 97% complete
Pass 1: Analyzing classes (94 / 95) - 98% complete
Pass 1: Analyzing classes (95 / 95) - 100% complete

Pass 2: Analyzing classes (0 / 5) - 00% complete
Pass 2: Analyzing classes (1 / 5) - 20% complete
Pass 2: Analyzing classes (2 / 5) - 40% complete
Pass 2: Analyzing classes (3 / 5) - 60% complete
Pass 2: Analyzing classes (4 / 5) - 80% complete
Pass 2: Analyzing classes (5 / 5) - 100% complete
Done with analysis
FindBugs rule violations were found. See the report at: file:///jobs/genie.virgo/virgo-master/workspace/web/org.eclipse.virgo.web.war.deployer/build/reports/findbugs/main.xml
:web:org.eclipse.virgo.web.war.deployer:findbugsMain (Thread[Daemon worker,5,main]) completed. Took 5.245 secs.
:web:org.eclipse.virgo.web.war.deployer:compileTestJava (Thread[Daemon worker,5,main]) started.
:web:org.eclipse.virgo.web.war.deployer:compileTestJava
Putting task artifact state for task ':web:org.eclipse.virgo.web.war.deployer:compileTestJava' into context took 0.008 secs.
Task :web:org.eclipse.virgo.web.war.deployer:compileTestJava class loader hash: e1d5c4b3003235964bf4bb274716a6a0
Task :web:org.eclipse.virgo.web.war.deployer:compileTestJava actions class loader hashes: [a7dca6360d61447814913dd8e8f289bc, 0c0afac576bb2de41200bc36bccb9200, e1d5c4b3003235964bf4bb274716a6a0]
Executing task ':web:org.eclipse.virgo.web.war.deployer:compileTestJava' (up-to-date check took 0.007 secs) due to:
  No history is available.
All input files are considered out-of-date for incremental task ':web:org.eclipse.virgo.web.war.deployer:compileTestJava'.
Compiling with Java command line compiler 'java'.
Starting process 'command 'java''. Working directory: /jobs/genie.virgo/virgo-master/workspace/web/org.eclipse.virgo.web.war.deployer Command: java -cp /opt/public/hipp/homes/genie.virgo/.gradle/caches/modules-2/files-2.1/org.eclipse.jdt.core.compiler/ecj/4.6.1/5555607add54eb79c5a0729134e663fe2e6300c2/ecj-4.6.1.jar org.eclipse.jdt.internal.compiler.batch.Main -warn:-unused @/jobs/genie.virgo/virgo-master/workspace/web/org.eclipse.virgo.web.war.deployer/build/tmp/compileTestJava/java-compiler-args.txt
Successfully started process 'command 'java''
Picked up JAVA_TOOL_OPTIONS: -Xmx2G -Djava.io.tmpdir=/tmp/genie.virgo -DforkCount=1
:web:org.eclipse.virgo.web.war.deployer:compileTestJava (Thread[Daemon worker,5,main]) completed. Took 0.611 secs.
:web:org.eclipse.virgo.web.war.deployer:processTestResources (Thread[Daemon worker,5,main]) started.
:web:org.eclipse.virgo.web.war.deployer:processTestResources
Putting task artifact state for task ':web:org.eclipse.virgo.web.war.deployer:processTestResources' into context took 0.004 secs.
Task :web:org.eclipse.virgo.web.war.deployer:processTestResources class loader hash: e1d5c4b3003235964bf4bb274716a6a0
Task :web:org.eclipse.virgo.web.war.deployer:processTestResources actions class loader hashes: [0c0afac576bb2de41200bc36bccb9200]
Executing task ':web:org.eclipse.virgo.web.war.deployer:processTestResources' (up-to-date check took 0.001 secs) due to:
  No history is available.
:web:org.eclipse.virgo.web.war.deployer:processTestResources (Thread[Daemon worker,5,main]) completed. Took 0.006 secs.
:web:org.eclipse.virgo.web.war.deployer:testClasses (Thread[Daemon worker,5,main]) started.
:web:org.eclipse.virgo.web.war.deployer:testClasses
Skipping task ':web:org.eclipse.virgo.web.war.deployer:testClasses' as it has no actions.
:web:org.eclipse.virgo.web.war.deployer:testClasses (Thread[Daemon worker,5,main]) completed. Took 0.0 secs.
:web:org.eclipse.virgo.web.war.deployer:test (Thread[Daemon worker,5,main]) started.
:web:org.eclipse.virgo.web.war.deployer:test
Putting task artifact state for task ':web:org.eclipse.virgo.web.war.deployer:test' into context took 0.002 secs.
Task :web:org.eclipse.virgo.web.war.deployer:test class loader hash: e1d5c4b3003235964bf4bb274716a6a0
Task :web:org.eclipse.virgo.web.war.deployer:test actions class loader hashes: [e1d5c4b3003235964bf4bb274716a6a0, 0c0afac576bb2de41200bc36bccb9200]
Executing task ':web:org.eclipse.virgo.web.war.deployer:test' (up-to-date check took 0.026 secs) due to:
  No history is available.
Starting process 'Gradle Test Executor 115'. Working directory: /jobs/genie.virgo/virgo-master/workspace/web/org.eclipse.virgo.web.war.deployer Command: /opt/public/common/java/oracle/jdk1.8.0_192_x64/bin/java -Djava.security.manager=worker.org.gradle.process.internal.worker.child.BootstrapSecurityManager -Djdk.management.heapdump.allowAnyFileSuffix=true -javaagent:build/tmp/expandedArchives/org.jacoco.agent-0.8.1.jar_8cthkl45n2xyfgevaovgvpys6/jacocoagent.jar=destfile=build/jacoco/test.exec,append=true,inclnolocationclasses=false,dumponexit=true,output=file,jmx=false -Dfile.encoding=UTF-8 -Duser.country=US -Duser.language=en -Duser.variant -ea -cp /opt/public/hipp/homes/genie.virgo/.gradle/caches/3.5.1/workerMain/gradle-worker.jar worker.org.gradle.process.internal.worker.GradleWorkerMain 'Gradle Test Executor 115'
Successfully started process 'Gradle Test Executor 115'
Picked up JAVA_TOOL_OPTIONS: -Xmx2G -Djava.io.tmpdir=/tmp/genie.virgo -DforkCount=1
Initialized native services in: /opt/public/hipp/homes/genie.virgo/.gradle/native
Gradle Test Executor 115 started executing tests.
Gradle Test Executor 115 finished executing tests.
Finished generating test XML results (0.0 secs) into: /jobs/genie.virgo/virgo-master/workspace/web/org.eclipse.virgo.web.war.deployer/build/test-results/test
Generating HTML test report...
Finished generating test html results (0.002 secs) into: /jobs/genie.virgo/virgo-master/workspace/web/org.eclipse.virgo.web.war.deployer/build/reports/tests/test
:web:org.eclipse.virgo.web.war.deployer:test (Thread[Daemon worker,5,main]) completed. Took 1.1 secs.
:web:org.eclipse.virgo.web.war.deployer:check (Thread[Daemon worker,5,main]) started.
:web:org.eclipse.virgo.web.war.deployer:check
Skipping task ':web:org.eclipse.virgo.web.war.deployer:check' as it has no actions.
:web:org.eclipse.virgo.web.war.deployer:check (Thread[Daemon worker,5,main]) completed. Took 0.0 secs.
:web:org.eclipse.virgo.web.war.deployer:build (Thread[Daemon worker,5,main]) started.
:web:org.eclipse.virgo.web.war.deployer:build
Skipping task ':web:org.eclipse.virgo.web.war.deployer:build' as it has no actions.
:web:org.eclipse.virgo.web.war.deployer:build (Thread[Daemon worker,5,main]) completed. Took 0.0 secs.
:packaging:kernel:org.eclipse.virgo.kernel.smoketest:sourcesJar (Thread[Daemon worker,5,main]) started.
:packaging:kernel:org.eclipse.virgo.kernel.smoketest:sourcesJar
Putting task artifact state for task ':packaging:kernel:org.eclipse.virgo.kernel.smoketest:sourcesJar' into context took 0.003 secs.
file or directory '/jobs/genie.virgo/virgo-master/workspace/packaging/kernel/org.eclipse.virgo.kernel.smoketest/src/main/resources', not found
file or directory '/jobs/genie.virgo/virgo-master/workspace/packaging/kernel/org.eclipse.virgo.kernel.smoketest/src/main/java', not found
Task :packaging:kernel:org.eclipse.virgo.kernel.smoketest:sourcesJar class loader hash: e1d5c4b3003235964bf4bb274716a6a0
Task :packaging:kernel:org.eclipse.virgo.kernel.smoketest:sourcesJar actions class loader hashes: [0c0afac576bb2de41200bc36bccb9200]
file or directory '/jobs/genie.virgo/virgo-master/workspace/packaging/kernel/org.eclipse.virgo.kernel.smoketest/src/main/resources', not found
file or directory '/jobs/genie.virgo/virgo-master/workspace/packaging/kernel/org.eclipse.virgo.kernel.smoketest/src/main/java', not found
Executing task ':packaging:kernel:org.eclipse.virgo.kernel.smoketest:sourcesJar' (up-to-date check took 0.001 secs) due to:
  No history is available.
file or directory '/jobs/genie.virgo/virgo-master/workspace/packaging/kernel/org.eclipse.virgo.kernel.smoketest/src/main/resources', not found
file or directory '/jobs/genie.virgo/virgo-master/workspace/packaging/kernel/org.eclipse.virgo.kernel.smoketest/src/main/java', not found
:packaging:kernel:org.eclipse.virgo.kernel.smoketest:sourcesJar (Thread[Daemon worker,5,main]) completed. Took 0.007 secs.
:packaging:kernel:org.eclipse.virgo.kernel.smoketest:assemble (Thread[Daemon worker,5,main]) started.
:packaging:kernel:org.eclipse.virgo.kernel.smoketest:assemble
Skipping task ':packaging:kernel:org.eclipse.virgo.kernel.smoketest:assemble' as it has no actions.
:packaging:kernel:org.eclipse.virgo.kernel.smoketest:assemble (Thread[Daemon worker,5,main]) completed. Took 0.0 secs.
:packaging:kernel:org.eclipse.virgo.kernel.smoketest:findbugsMain (Thread[Daemon worker,5,main]) started.
:packaging:kernel:org.eclipse.virgo.kernel.smoketest:findbugsMain
Putting task artifact state for task ':packaging:kernel:org.eclipse.virgo.kernel.smoketest:findbugsMain' into context took 0.004 secs.
file or directory '/jobs/genie.virgo/virgo-master/workspace/packaging/kernel/org.eclipse.virgo.kernel.smoketest/build/classes/main', not found
file or directory '/jobs/genie.virgo/virgo-master/workspace/packaging/kernel/org.eclipse.virgo.kernel.smoketest/src/main/java', not found
Skipping task ':packaging:kernel:org.eclipse.virgo.kernel.smoketest:findbugsMain' as it has no source files and no previous output files.
:packaging:kernel:org.eclipse.virgo.kernel.smoketest:findbugsMain NO-SOURCE
:packaging:kernel:org.eclipse.virgo.kernel.smoketest:findbugsMain (Thread[Daemon worker,5,main]) completed. Took 0.004 secs.
:packaging:kernel:org.eclipse.virgo.kernel.smoketest:compileTestJava (Thread[Daemon worker,5,main]) started.
:packaging:kernel:org.eclipse.virgo.kernel.smoketest:compileTestJava
Putting task artifact state for task ':packaging:kernel:org.eclipse.virgo.kernel.smoketest:compileTestJava' into context took 0.0 secs.
file or directory '/jobs/genie.virgo/virgo-master/workspace/packaging/kernel/org.eclipse.virgo.kernel.smoketest/src/test/java', not found
Skipping task ':packaging:kernel:org.eclipse.virgo.kernel.smoketest:compileTestJava' as it has no source files and no previous output files.
:packaging:kernel:org.eclipse.virgo.kernel.smoketest:compileTestJava NO-SOURCE
:packaging:kernel:org.eclipse.virgo.kernel.smoketest:compileTestJava (Thread[Daemon worker,5,main]) completed. Took 0.001 secs.
:packaging:kernel:org.eclipse.virgo.kernel.smoketest:processTestResources (Thread[Daemon worker,5,main]) started.
:packaging:kernel:org.eclipse.virgo.kernel.smoketest:processTestResources
Putting task artifact state for task ':packaging:kernel:org.eclipse.virgo.kernel.smoketest:processTestResources' into context took 0.0 secs.
file or directory '/jobs/genie.virgo/virgo-master/workspace/packaging/kernel/org.eclipse.virgo.kernel.smoketest/src/test/resources', not found
Skipping task ':packaging:kernel:org.eclipse.virgo.kernel.smoketest:processTestResources' as it has no source files and no previous output files.
:packaging:kernel:org.eclipse.virgo.kernel.smoketest:processTestResources NO-SOURCE
:packaging:kernel:org.eclipse.virgo.kernel.smoketest:processTestResources (Thread[Daemon worker,5,main]) completed. Took 0.0 secs.
:packaging:kernel:org.eclipse.virgo.kernel.smoketest:testClasses (Thread[Daemon worker,5,main]) started.
:packaging:kernel:org.eclipse.virgo.kernel.smoketest:testClasses
Skipping task ':packaging:kernel:org.eclipse.virgo.kernel.smoketest:testClasses' as it has no actions.
:packaging:kernel:org.eclipse.virgo.kernel.smoketest:testClasses UP-TO-DATE
:packaging:kernel:org.eclipse.virgo.kernel.smoketest:testClasses (Thread[Daemon worker,5,main]) completed. Took 0.0 secs.
:packaging:kernel:org.eclipse.virgo.kernel.smoketest:test (Thread[Daemon worker,5,main]) started.
:packaging:kernel:org.eclipse.virgo.kernel.smoketest:test
Putting task artifact state for task ':packaging:kernel:org.eclipse.virgo.kernel.smoketest:test' into context took 0.001 secs.
file or directory '/jobs/genie.virgo/virgo-master/workspace/packaging/kernel/org.eclipse.virgo.kernel.smoketest/build/classes/test', not found
Skipping task ':packaging:kernel:org.eclipse.virgo.kernel.smoketest:test' as it has no source files and no previous output files.
:packaging:kernel:org.eclipse.virgo.kernel.smoketest:test NO-SOURCE
:packaging:kernel:org.eclipse.virgo.kernel.smoketest:test (Thread[Daemon worker,5,main]) completed. Took 0.001 secs.
:packaging:kernel:org.eclipse.virgo.kernel.smoketest:check (Thread[Daemon worker,5,main]) started.
:packaging:kernel:org.eclipse.virgo.kernel.smoketest:check
Skipping task ':packaging:kernel:org.eclipse.virgo.kernel.smoketest:check' as it has no actions.
:packaging:kernel:org.eclipse.virgo.kernel.smoketest:check UP-TO-DATE
:packaging:kernel:org.eclipse.virgo.kernel.smoketest:check (Thread[Daemon worker,5,main]) completed. Took 0.0 secs.
:packaging:kernel:org.eclipse.virgo.kernel.smoketest:build (Thread[Daemon worker,5,main]) started.
:packaging:kernel:org.eclipse.virgo.kernel.smoketest:build
Skipping task ':packaging:kernel:org.eclipse.virgo.kernel.smoketest:build' as it has no actions.
:packaging:kernel:org.eclipse.virgo.kernel.smoketest:build (Thread[Daemon worker,5,main]) completed. Took 0.0 secs.
:packaging:nano:org.eclipse.virgo.nano.smoketest:sourcesJar (Thread[Daemon worker,5,main]) started.
:packaging:nano:org.eclipse.virgo.nano.smoketest:sourcesJar
Putting task artifact state for task ':packaging:nano:org.eclipse.virgo.nano.smoketest:sourcesJar' into context took 0.0 secs.
file or directory '/jobs/genie.virgo/virgo-master/workspace/packaging/nano/org.eclipse.virgo.nano.smoketest/src/main/resources', not found
file or directory '/jobs/genie.virgo/virgo-master/workspace/packaging/nano/org.eclipse.virgo.nano.smoketest/src/main/java', not found
Task :packaging:nano:org.eclipse.virgo.nano.smoketest:sourcesJar class loader hash: e1d5c4b3003235964bf4bb274716a6a0
Task :packaging:nano:org.eclipse.virgo.nano.smoketest:sourcesJar actions class loader hashes: [0c0afac576bb2de41200bc36bccb9200]
file or directory '/jobs/genie.virgo/virgo-master/workspace/packaging/nano/org.eclipse.virgo.nano.smoketest/src/main/resources', not found
file or directory '/jobs/genie.virgo/virgo-master/workspace/packaging/nano/org.eclipse.virgo.nano.smoketest/src/main/java', not found
Executing task ':packaging:nano:org.eclipse.virgo.nano.smoketest:sourcesJar' (up-to-date check took 0.0 secs) due to:
  No history is available.
file or directory '/jobs/genie.virgo/virgo-master/workspace/packaging/nano/org.eclipse.virgo.nano.smoketest/src/main/resources', not found
file or directory '/jobs/genie.virgo/virgo-master/workspace/packaging/nano/org.eclipse.virgo.nano.smoketest/src/main/java', not found
:packaging:nano:org.eclipse.virgo.nano.smoketest:sourcesJar (Thread[Daemon worker,5,main]) completed. Took 0.002 secs.
:packaging:nano:org.eclipse.virgo.nano.smoketest:assemble (Thread[Daemon worker,5,main]) started.
:packaging:nano:org.eclipse.virgo.nano.smoketest:assemble
Skipping task ':packaging:nano:org.eclipse.virgo.nano.smoketest:assemble' as it has no actions.
:packaging:nano:org.eclipse.virgo.nano.smoketest:assemble (Thread[Daemon worker,5,main]) completed. Took 0.0 secs.
:packaging:nano:org.eclipse.virgo.nano.smoketest:findbugsMain (Thread[Daemon worker,5,main]) started.
:packaging:nano:org.eclipse.virgo.nano.smoketest:findbugsMain
Putting task artifact state for task ':packaging:nano:org.eclipse.virgo.nano.smoketest:findbugsMain' into context took 0.003 secs.
file or directory '/jobs/genie.virgo/virgo-master/workspace/packaging/nano/org.eclipse.virgo.nano.smoketest/build/classes/main', not found
file or directory '/jobs/genie.virgo/virgo-master/workspace/packaging/nano/org.eclipse.virgo.nano.smoketest/src/main/java', not found
Skipping task ':packaging:nano:org.eclipse.virgo.nano.smoketest:findbugsMain' as it has no source files and no previous output files.
:packaging:nano:org.eclipse.virgo.nano.smoketest:findbugsMain NO-SOURCE
:packaging:nano:org.eclipse.virgo.nano.smoketest:findbugsMain (Thread[Daemon worker,5,main]) completed. Took 0.004 secs.
:packaging:nano:org.eclipse.virgo.nano.smoketest:compileTestJava (Thread[Daemon worker,5,main]) started.
:packaging:nano:org.eclipse.virgo.nano.smoketest:compileTestJava
Putting task artifact state for task ':packaging:nano:org.eclipse.virgo.nano.smoketest:compileTestJava' into context took 0.0 secs.
file or directory '/jobs/genie.virgo/virgo-master/workspace/packaging/nano/org.eclipse.virgo.nano.smoketest/src/test/java', not found
Skipping task ':packaging:nano:org.eclipse.virgo.nano.smoketest:compileTestJava' as it has no source files and no previous output files.
:packaging:nano:org.eclipse.virgo.nano.smoketest:compileTestJava NO-SOURCE
:packaging:nano:org.eclipse.virgo.nano.smoketest:compileTestJava (Thread[Daemon worker,5,main]) completed. Took 0.0 secs.
:packaging:nano:org.eclipse.virgo.nano.smoketest:processTestResources (Thread[Daemon worker,5,main]) started.
:packaging:nano:org.eclipse.virgo.nano.smoketest:processTestResources
Putting task artifact state for task ':packaging:nano:org.eclipse.virgo.nano.smoketest:processTestResources' into context took 0.0 secs.
file or directory '/jobs/genie.virgo/virgo-master/workspace/packaging/nano/org.eclipse.virgo.nano.smoketest/src/test/resources', not found
Skipping task ':packaging:nano:org.eclipse.virgo.nano.smoketest:processTestResources' as it has no source files and no previous output files.
:packaging:nano:org.eclipse.virgo.nano.smoketest:processTestResources NO-SOURCE
:packaging:nano:org.eclipse.virgo.nano.smoketest:processTestResources (Thread[Daemon worker,5,main]) completed. Took 0.0 secs.
:packaging:nano:org.eclipse.virgo.nano.smoketest:testClasses (Thread[Daemon worker,5,main]) started.
:packaging:nano:org.eclipse.virgo.nano.smoketest:testClasses
Skipping task ':packaging:nano:org.eclipse.virgo.nano.smoketest:testClasses' as it has no actions.
:packaging:nano:org.eclipse.virgo.nano.smoketest:testClasses UP-TO-DATE
:packaging:nano:org.eclipse.virgo.nano.smoketest:testClasses (Thread[Daemon worker,5,main]) completed. Took 0.001 secs.
:packaging:nano:org.eclipse.virgo.nano.smoketest:test (Thread[Daemon worker,5,main]) started.
:packaging:nano:org.eclipse.virgo.nano.smoketest:test
Putting task artifact state for task ':packaging:nano:org.eclipse.virgo.nano.smoketest:test' into context took 0.0 secs.
file or directory '/jobs/genie.virgo/virgo-master/workspace/packaging/nano/org.eclipse.virgo.nano.smoketest/build/classes/test', not found
Skipping task ':packaging:nano:org.eclipse.virgo.nano.smoketest:test' as it has no source files and no previous output files.
:packaging:nano:org.eclipse.virgo.nano.smoketest:test NO-SOURCE
:packaging:nano:org.eclipse.virgo.nano.smoketest:test (Thread[Daemon worker,5,main]) completed. Took 0.0 secs.
:packaging:nano:org.eclipse.virgo.nano.smoketest:check (Thread[Daemon worker,5,main]) started.
:packaging:nano:org.eclipse.virgo.nano.smoketest:check
Skipping task ':packaging:nano:org.eclipse.virgo.nano.smoketest:check' as it has no actions.
:packaging:nano:org.eclipse.virgo.nano.smoketest:check UP-TO-DATE
:packaging:nano:org.eclipse.virgo.nano.smoketest:check (Thread[Daemon worker,5,main]) completed. Took 0.0 secs.
:packaging:nano:org.eclipse.virgo.nano.smoketest:build (Thread[Daemon worker,5,main]) started.
:packaging:nano:org.eclipse.virgo.nano.smoketest:build
Skipping task ':packaging:nano:org.eclipse.virgo.nano.smoketest:build' as it has no actions.
:packaging:nano:org.eclipse.virgo.nano.smoketest:build (Thread[Daemon worker,5,main]) completed. Took 0.0 secs.
:packaging:tomcat-server:org.eclipse.virgo.tomcat.smoketest:sourcesJar (Thread[Daemon worker,5,main]) started.
:packaging:tomcat-server:org.eclipse.virgo.tomcat.smoketest:sourcesJar
Putting task artifact state for task ':packaging:tomcat-server:org.eclipse.virgo.tomcat.smoketest:sourcesJar' into context took 0.001 secs.
file or directory '/jobs/genie.virgo/virgo-master/workspace/packaging/tomcat-server/org.eclipse.virgo.tomcat.smoketest/src/main/resources', not found
file or directory '/jobs/genie.virgo/virgo-master/workspace/packaging/tomcat-server/org.eclipse.virgo.tomcat.smoketest/src/main/java', not found
Task :packaging:tomcat-server:org.eclipse.virgo.tomcat.smoketest:sourcesJar class loader hash: e1d5c4b3003235964bf4bb274716a6a0
Task :packaging:tomcat-server:org.eclipse.virgo.tomcat.smoketest:sourcesJar actions class loader hashes: [0c0afac576bb2de41200bc36bccb9200]
file or directory '/jobs/genie.virgo/virgo-master/workspace/packaging/tomcat-server/org.eclipse.virgo.tomcat.smoketest/src/main/resources', not found
file or directory '/jobs/genie.virgo/virgo-master/workspace/packaging/tomcat-server/org.eclipse.virgo.tomcat.smoketest/src/main/java', not found
Executing task ':packaging:tomcat-server:org.eclipse.virgo.tomcat.smoketest:sourcesJar' (up-to-date check took 0.0 secs) due to:
  No history is available.
file or directory '/jobs/genie.virgo/virgo-master/workspace/packaging/tomcat-server/org.eclipse.virgo.tomcat.smoketest/src/main/resources', not found
file or directory '/jobs/genie.virgo/virgo-master/workspace/packaging/tomcat-server/org.eclipse.virgo.tomcat.smoketest/src/main/java', not found
:packaging:tomcat-server:org.eclipse.virgo.tomcat.smoketest:sourcesJar (Thread[Daemon worker,5,main]) completed. Took 0.002 secs.
:packaging:tomcat-server:org.eclipse.virgo.tomcat.smoketest:assemble (Thread[Daemon worker,5,main]) started.
:packaging:tomcat-server:org.eclipse.virgo.tomcat.smoketest:assemble
Skipping task ':packaging:tomcat-server:org.eclipse.virgo.tomcat.smoketest:assemble' as it has no actions.
:packaging:tomcat-server:org.eclipse.virgo.tomcat.smoketest:assemble (Thread[Daemon worker,5,main]) completed. Took 0.001 secs.
:packaging:tomcat-server:org.eclipse.virgo.tomcat.smoketest:findbugsMain (Thread[Daemon worker,5,main]) started.
:packaging:tomcat-server:org.eclipse.virgo.tomcat.smoketest:findbugsMain
Putting task artifact state for task ':packaging:tomcat-server:org.eclipse.virgo.tomcat.smoketest:findbugsMain' into context took 0.003 secs.
file or directory '/jobs/genie.virgo/virgo-master/workspace/packaging/tomcat-server/org.eclipse.virgo.tomcat.smoketest/build/classes/main', not found
file or directory '/jobs/genie.virgo/virgo-master/workspace/packaging/tomcat-server/org.eclipse.virgo.tomcat.smoketest/src/main/java', not found
Skipping task ':packaging:tomcat-server:org.eclipse.virgo.tomcat.smoketest:findbugsMain' as it has no source files and no previous output files.
:packaging:tomcat-server:org.eclipse.virgo.tomcat.smoketest:findbugsMain NO-SOURCE
:packaging:tomcat-server:org.eclipse.virgo.tomcat.smoketest:findbugsMain (Thread[Daemon worker,5,main]) completed. Took 0.004 secs.
:packaging:tomcat-server:org.eclipse.virgo.tomcat.smoketest:compileTestJava (Thread[Daemon worker,5,main]) started.
:packaging:tomcat-server:org.eclipse.virgo.tomcat.smoketest:compileTestJava
Putting task artifact state for task ':packaging:tomcat-server:org.eclipse.virgo.tomcat.smoketest:compileTestJava' into context took 0.0 secs.
file or directory '/jobs/genie.virgo/virgo-master/workspace/packaging/tomcat-server/org.eclipse.virgo.tomcat.smoketest/src/test/java', not found
Skipping task ':packaging:tomcat-server:org.eclipse.virgo.tomcat.smoketest:compileTestJava' as it has no source files and no previous output files.
:packaging:tomcat-server:org.eclipse.virgo.tomcat.smoketest:compileTestJava NO-SOURCE
:packaging:tomcat-server:org.eclipse.virgo.tomcat.smoketest:compileTestJava (Thread[Daemon worker,5,main]) completed. Took 0.0 secs.
:packaging:tomcat-server:org.eclipse.virgo.tomcat.smoketest:processTestResources (Thread[Daemon worker,5,main]) started.
:packaging:tomcat-server:org.eclipse.virgo.tomcat.smoketest:processTestResources
Putting task artifact state for task ':packaging:tomcat-server:org.eclipse.virgo.tomcat.smoketest:processTestResources' into context took 0.0 secs.
file or directory '/jobs/genie.virgo/virgo-master/workspace/packaging/tomcat-server/org.eclipse.virgo.tomcat.smoketest/src/test/resources', not found
Skipping task ':packaging:tomcat-server:org.eclipse.virgo.tomcat.smoketest:processTestResources' as it has no source files and no previous output files.
:packaging:tomcat-server:org.eclipse.virgo.tomcat.smoketest:processTestResources NO-SOURCE
:packaging:tomcat-server:org.eclipse.virgo.tomcat.smoketest:processTestResources (Thread[Daemon worker,5,main]) completed. Took 0.0 secs.
:packaging:tomcat-server:org.eclipse.virgo.tomcat.smoketest:testClasses (Thread[Daemon worker,5,main]) started.
:packaging:tomcat-server:org.eclipse.virgo.tomcat.smoketest:testClasses
Skipping task ':packaging:tomcat-server:org.eclipse.virgo.tomcat.smoketest:testClasses' as it has no actions.
:packaging:tomcat-server:org.eclipse.virgo.tomcat.smoketest:testClasses UP-TO-DATE
:packaging:tomcat-server:org.eclipse.virgo.tomcat.smoketest:testClasses (Thread[Daemon worker,5,main]) completed. Took 0.0 secs.
:packaging:tomcat-server:org.eclipse.virgo.tomcat.smoketest:test (Thread[Daemon worker,5,main]) started.
:packaging:tomcat-server:org.eclipse.virgo.tomcat.smoketest:test
Putting task artifact state for task ':packaging:tomcat-server:org.eclipse.virgo.tomcat.smoketest:test' into context took 0.0 secs.
file or directory '/jobs/genie.virgo/virgo-master/workspace/packaging/tomcat-server/org.eclipse.virgo.tomcat.smoketest/build/classes/test', not found
Skipping task ':packaging:tomcat-server:org.eclipse.virgo.tomcat.smoketest:test' as it has no source files and no previous output files.
:packaging:tomcat-server:org.eclipse.virgo.tomcat.smoketest:test NO-SOURCE
:packaging:tomcat-server:org.eclipse.virgo.tomcat.smoketest:test (Thread[Daemon worker,5,main]) completed. Took 0.0 secs.
:packaging:tomcat-server:org.eclipse.virgo.tomcat.smoketest:check (Thread[Daemon worker,5,main]) started.
:packaging:tomcat-server:org.eclipse.virgo.tomcat.smoketest:check
Skipping task ':packaging:tomcat-server:org.eclipse.virgo.tomcat.smoketest:check' as it has no actions.
:packaging:tomcat-server:org.eclipse.virgo.tomcat.smoketest:check UP-TO-DATE
:packaging:tomcat-server:org.eclipse.virgo.tomcat.smoketest:check (Thread[Daemon worker,5,main]) completed. Took 0.0 secs.
:packaging:tomcat-server:org.eclipse.virgo.tomcat.smoketest:build (Thread[Daemon worker,5,main]) started.
:packaging:tomcat-server:org.eclipse.virgo.tomcat.smoketest:build
Skipping task ':packaging:tomcat-server:org.eclipse.virgo.tomcat.smoketest:build' as it has no actions.
:packaging:tomcat-server:org.eclipse.virgo.tomcat.smoketest:build (Thread[Daemon worker,5,main]) completed. Took 0.001 secs.

FAILURE: Build failed with an exception.

* What went wrong:
Execution failed for task ':downloadVirgoBuildTools'.
> Error while expanding /opt/public/hipp/homes/genie.virgo/.tooling/virgo/virgo-build-tools-1.4.1.RELEASE/virgo-tools.zip
  java.util.zip.ZipException: archive is not a ZIP archive

* Try:
Run with --debug option to get more log output.

* Exception is:
org.gradle.api.tasks.TaskExecutionException: Execution failed for task ':downloadVirgoBuildTools'.
	at org.gradle.api.internal.tasks.execution.ExecuteActionsTaskExecuter.executeActions(ExecuteActionsTaskExecuter.java:98)
	at org.gradle.api.internal.tasks.execution.ExecuteActionsTaskExecuter.execute(ExecuteActionsTaskExecuter.java:68)
	at org.gradle.api.internal.tasks.execution.SkipUpToDateTaskExecuter.execute(SkipUpToDateTaskExecuter.java:62)
	at org.gradle.api.internal.tasks.execution.ValidatingTaskExecuter.execute(ValidatingTaskExecuter.java:58)
	at org.gradle.api.internal.tasks.execution.SkipEmptySourceFilesTaskExecuter.execute(SkipEmptySourceFilesTaskExecuter.java:88)
	at org.gradle.api.internal.tasks.execution.ResolveTaskArtifactStateTaskExecuter.execute(ResolveTaskArtifactStateTaskExecuter.java:46)
	at org.gradle.api.internal.tasks.execution.SkipTaskWithNoActionsExecuter.execute(SkipTaskWithNoActionsExecuter.java:51)
	at org.gradle.api.internal.tasks.execution.SkipOnlyIfTaskExecuter.execute(SkipOnlyIfTaskExecuter.java:54)
	at org.gradle.api.internal.tasks.execution.ExecuteAtMostOnceTaskExecuter.execute(ExecuteAtMostOnceTaskExecuter.java:43)
	at org.gradle.api.internal.tasks.execution.CatchExceptionTaskExecuter.execute(CatchExceptionTaskExecuter.java:34)
	at org.gradle.execution.taskgraph.DefaultTaskGraphExecuter$EventFiringTaskWorker$1.execute(DefaultTaskGraphExecuter.java:236)
	at org.gradle.execution.taskgraph.DefaultTaskGraphExecuter$EventFiringTaskWorker$1.execute(DefaultTaskGraphExecuter.java:228)
	at org.gradle.internal.Transformers$4.transform(Transformers.java:169)
	at org.gradle.internal.progress.DefaultBuildOperationExecutor.run(DefaultBuildOperationExecutor.java:106)
	at org.gradle.internal.progress.DefaultBuildOperationExecutor.run(DefaultBuildOperationExecutor.java:61)
	at org.gradle.execution.taskgraph.DefaultTaskGraphExecuter$EventFiringTaskWorker.execute(DefaultTaskGraphExecuter.java:228)
	at org.gradle.execution.taskgraph.DefaultTaskGraphExecuter$EventFiringTaskWorker.execute(DefaultTaskGraphExecuter.java:215)
	at org.gradle.execution.taskgraph.AbstractTaskPlanExecutor$TaskExecutorWorker.processTask(AbstractTaskPlanExecutor.java:77)
	at org.gradle.execution.taskgraph.AbstractTaskPlanExecutor$TaskExecutorWorker.run(AbstractTaskPlanExecutor.java:58)
	at org.gradle.execution.taskgraph.DefaultTaskPlanExecutor.process(DefaultTaskPlanExecutor.java:32)
	at org.gradle.execution.taskgraph.DefaultTaskGraphExecuter.execute(DefaultTaskGraphExecuter.java:113)
	at org.gradle.execution.SelectedTaskExecutionAction.execute(SelectedTaskExecutionAction.java:37)
	at org.gradle.execution.DefaultBuildExecuter.execute(DefaultBuildExecuter.java:37)
	at org.gradle.execution.DefaultBuildExecuter.access$000(DefaultBuildExecuter.java:23)
	at org.gradle.execution.DefaultBuildExecuter$1.proceed(DefaultBuildExecuter.java:43)
	at org.gradle.execution.DryRunBuildExecutionAction.execute(DryRunBuildExecutionAction.java:32)
	at org.gradle.execution.DefaultBuildExecuter.execute(DefaultBuildExecuter.java:37)
	at org.gradle.execution.DefaultBuildExecuter.execute(DefaultBuildExecuter.java:30)
	at org.gradle.initialization.DefaultGradleLauncher$RunTasksAction.execute(DefaultGradleLauncher.java:230)
	at org.gradle.initialization.DefaultGradleLauncher$RunTasksAction.execute(DefaultGradleLauncher.java:227)
	at org.gradle.internal.Transformers$4.transform(Transformers.java:169)
	at org.gradle.internal.progress.DefaultBuildOperationExecutor.run(DefaultBuildOperationExecutor.java:106)
	at org.gradle.internal.progress.DefaultBuildOperationExecutor.run(DefaultBuildOperationExecutor.java:56)
	at org.gradle.initialization.DefaultGradleLauncher.doBuildStages(DefaultGradleLauncher.java:161)
	at org.gradle.initialization.DefaultGradleLauncher.doBuild(DefaultGradleLauncher.java:112)
	at org.gradle.initialization.DefaultGradleLauncher.run(DefaultGradleLauncher.java:95)
	at org.gradle.launcher.exec.GradleBuildController.run(GradleBuildController.java:66)
	at org.gradle.tooling.internal.provider.ExecuteBuildActionRunner.run(ExecuteBuildActionRunner.java:28)
	at org.gradle.launcher.exec.ChainingBuildActionRunner.run(ChainingBuildActionRunner.java:35)
	at org.gradle.launcher.exec.InProcessBuildActionExecuter.execute(InProcessBuildActionExecuter.java:41)
	at org.gradle.launcher.exec.InProcessBuildActionExecuter.execute(InProcessBuildActionExecuter.java:26)
	at org.gradle.tooling.internal.provider.ContinuousBuildActionExecuter.execute(ContinuousBuildActionExecuter.java:75)
	at org.gradle.tooling.internal.provider.ContinuousBuildActionExecuter.execute(ContinuousBuildActionExecuter.java:49)
	at org.gradle.tooling.internal.provider.ServicesSetupBuildActionExecuter.execute(ServicesSetupBuildActionExecuter.java:49)
	at org.gradle.tooling.internal.provider.ServicesSetupBuildActionExecuter.execute(ServicesSetupBuildActionExecuter.java:31)
	at org.gradle.launcher.daemon.server.exec.ExecuteBuild.doBuild(ExecuteBuild.java:67)
	at org.gradle.launcher.daemon.server.exec.BuildCommandOnly.execute(BuildCommandOnly.java:36)
	at org.gradle.launcher.daemon.server.api.DaemonCommandExecution.proceed(DaemonCommandExecution.java:120)
	at org.gradle.launcher.daemon.server.exec.WatchForDisconnection.execute(WatchForDisconnection.java:37)
	at org.gradle.launcher.daemon.server.api.DaemonCommandExecution.proceed(DaemonCommandExecution.java:120)
	at org.gradle.launcher.daemon.server.exec.ResetDeprecationLogger.execute(ResetDeprecationLogger.java:26)
	at org.gradle.launcher.daemon.server.api.DaemonCommandExecution.proceed(DaemonCommandExecution.java:120)
	at org.gradle.launcher.daemon.server.exec.RequestStopIfSingleUsedDaemon.execute(RequestStopIfSingleUsedDaemon.java:34)
	at org.gradle.launcher.daemon.server.api.DaemonCommandExecution.proceed(DaemonCommandExecution.java:120)
	at org.gradle.launcher.daemon.server.exec.ForwardClientInput$2.call(ForwardClientInput.java:74)
	at org.gradle.launcher.daemon.server.exec.ForwardClientInput$2.call(ForwardClientInput.java:72)
	at org.gradle.util.Swapper.swap(Swapper.java:38)
	at org.gradle.launcher.daemon.server.exec.ForwardClientInput.execute(ForwardClientInput.java:72)
	at org.gradle.launcher.daemon.server.api.DaemonCommandExecution.proceed(DaemonCommandExecution.java:120)
	at org.gradle.launcher.daemon.server.exec.LogAndCheckHealth.execute(LogAndCheckHealth.java:55)
	at org.gradle.launcher.daemon.server.api.DaemonCommandExecution.proceed(DaemonCommandExecution.java:120)
	at org.gradle.launcher.daemon.server.exec.LogToClient.doBuild(LogToClient.java:60)
	at org.gradle.launcher.daemon.server.exec.BuildCommandOnly.execute(BuildCommandOnly.java:36)
	at org.gradle.launcher.daemon.server.api.DaemonCommandExecution.proceed(DaemonCommandExecution.java:120)
	at org.gradle.launcher.daemon.server.exec.EstablishBuildEnvironment.doBuild(EstablishBuildEnvironment.java:72)
	at org.gradle.launcher.daemon.server.exec.BuildCommandOnly.execute(BuildCommandOnly.java:36)
	at org.gradle.launcher.daemon.server.api.DaemonCommandExecution.proceed(DaemonCommandExecution.java:120)
	at org.gradle.launcher.daemon.server.exec.StartBuildOrRespondWithBusy$1.run(StartBuildOrRespondWithBusy.java:50)
	at org.gradle.launcher.daemon.server.DaemonStateCoordinator$1.run(DaemonStateCoordinator.java:297)
	at org.gradle.internal.concurrent.ExecutorPolicy$CatchAndRecordFailures.onExecute(ExecutorPolicy.java:63)
	at org.gradle.internal.concurrent.StoppableExecutorImpl$1.run(StoppableExecutorImpl.java:46)
Caused by: : Error while expanding /opt/public/hipp/homes/genie.virgo/.tooling/virgo/virgo-build-tools-1.4.1.RELEASE/virgo-tools.zip
java.util.zip.ZipException: archive is not a ZIP archive
	at org.apache.tools.ant.taskdefs.Expand.expandFile(Expand.java:206)
	at org.apache.tools.ant.taskdefs.Expand.execute(Expand.java:148)
	at org.apache.tools.ant.UnknownElement.execute(UnknownElement.java:293)
	at org.apache.tools.ant.dispatch.DispatchUtils.execute(DispatchUtils.java:106)
	at org.gradle.api.internal.project.ant.BasicAntBuilder.nodeCompleted(BasicAntBuilder.java:78)
	at org.gradle.api.internal.project.ant.BasicAntBuilder.doInvokeMethod(BasicAntBuilder.java:103)
	at virgobuild.VirgoToolsPlugin.downloadVirgoBuildToolsUnprotected(VirgoToolsPlugin.groovy:165)
	at virgobuild.VirgoToolsPlugin$downloadVirgoBuildToolsUnprotected$0.callStatic(Unknown Source)
	at virgobuild.VirgoToolsPlugin.downloadVirgoBuildTools(VirgoToolsPlugin.groovy:151)
	at org.gradle.internal.metaobject.BeanDynamicObject$MetaClassAdapter.invokeMethod(BeanDynamicObject.java:464)
	at org.gradle.internal.metaobject.BeanDynamicObject.invokeMethod(BeanDynamicObject.java:176)
	at org.gradle.internal.metaobject.ConfigureDelegate.invokeMethod(ConfigureDelegate.java:80)
	at virgobuild.VirgoToolsPlugin$_addTaskDownloadVirgoBuildTools_closure6$_closure7.doCall(VirgoToolsPlugin.groovy:141)
	at org.gradle.api.internal.AbstractTask$ClosureTaskAction.execute(AbstractTask.java:656)
	at org.gradle.api.internal.AbstractTask$ClosureTaskAction.execute(AbstractTask.java:637)
	at org.gradle.api.internal.tasks.execution.ExecuteActionsTaskExecuter$1.execute(ExecuteActionsTaskExecuter.java:115)
	at org.gradle.api.internal.tasks.execution.ExecuteActionsTaskExecuter$1.execute(ExecuteActionsTaskExecuter.java:109)
	at org.gradle.internal.Transformers$4.transform(Transformers.java:169)
	at org.gradle.internal.progress.DefaultBuildOperationExecutor.run(DefaultBuildOperationExecutor.java:106)
	at org.gradle.internal.progress.DefaultBuildOperationExecutor.run(DefaultBuildOperationExecutor.java:56)
	at org.gradle.api.internal.tasks.execution.ExecuteActionsTaskExecuter.executeAction(ExecuteActionsTaskExecuter.java:109)
	at org.gradle.api.internal.tasks.execution.ExecuteActionsTaskExecuter.executeActions(ExecuteActionsTaskExecuter.java:90)
	... 70 more
Caused by: java.util.zip.ZipException: archive is not a ZIP archive
	at org.apache.tools.zip.ZipFile.positionAtEndOfCentralDirectoryRecord(ZipFile.java:771)
	at org.apache.tools.zip.ZipFile.positionAtCentralDirectory(ZipFile.java:707)
	at org.apache.tools.zip.ZipFile.populateFromCentralDirectory(ZipFile.java:452)
	at org.apache.tools.zip.ZipFile.<init>(ZipFile.java:214)
	at org.apache.tools.ant.taskdefs.Expand.expandFile(Expand.java:184)
	... 91 more


BUILD FAILED

Total time: 13 mins 49.057 secs
Stopped 1 worker daemon(s).
Received result Failure[value=org.gradle.initialization.ReportedException: org.gradle.internal.exceptions.LocationAwareException: Execution failed for task ':downloadVirgoBuildTools'.] from daemon DaemonInfo{pid=20284, address=[a4bf7207-70b5-4424-8d27-8821d7fd2cca port:57186, addresses:[/0:0:0:0:0:0:0:1, /127.0.0.1]], state=Busy, lastBusy=1566020253095, context=DefaultDaemonContext[uid=37413d1b-6dd4-4f63-88d5-7e8bf0284f47,javaHome=/opt/public/common/java/oracle/jdk1.8.0_192_x64,daemonRegistryDir=/opt/public/hipp/homes/genie.virgo/.gradle/daemon,pid=20284,idleTimeout=10800000,daemonOpts=-XX:MaxPermSize=256m,-XX:+HeapDumpOnOutOfMemoryError,-Xmx1024m,-Dfile.encoding=UTF-8,-Djava.io.tmpdir=/tmp/genie.virgo,-Duser.country=US,-Duser.language=en,-Duser.variant]} (build should be done).
Build step 'Invoke Gradle script' changed build result to FAILURE
Build step 'Invoke Gradle script' marked build as failure
[FINDBUGS] Skipping publisher since build result is FAILURE
Sending e-mails to: fwaibel@datenkollektiv.de dmarthaler@gmx.net
Recording test results
Archiving artifacts
Started calculate disk usage of build
Finished Calculation of disk usage of build in 0 seconds
Started calculate disk usage of workspace
Finished Calculation of disk usage of workspace in 0 seconds
Finished: FAILURE