FailedConsole Output

Started by timer
Building in workspace /home/hudson/genie.virgo/.jenkins/jobs/bundlor-development/workspace
No credentials specified
 > /usr/local/bin/git rev-parse --is-inside-work-tree # timeout=10
Fetching changes from the remote Git repository
 > /usr/local/bin/git config remote.origin.url git://git.eclipse.org/gitroot/virgo/org.eclipse.virgo.bundlor.git # timeout=10
Fetching upstream changes from git://git.eclipse.org/gitroot/virgo/org.eclipse.virgo.bundlor.git
 > /usr/local/bin/git --version # timeout=10
 > /usr/local/bin/git fetch --tags --progress git://git.eclipse.org/gitroot/virgo/org.eclipse.virgo.bundlor.git +refs/heads/*:refs/remotes/origin/*
 > /usr/local/bin/git rev-parse origin/development^{commit} # timeout=10
Checking out Revision 9a4b60aabf2df7bcd386a0bda0a0c630e3edba92 (origin/development)
 > /usr/local/bin/git config core.sparsecheckout # timeout=10
 > /usr/local/bin/git checkout -f 9a4b60aabf2df7bcd386a0bda0a0c630e3edba92
Commit message: "535704 Bump JaCoCo Plugin Version to 0.8.1"
 > /usr/local/bin/git rev-list --no-walk 9a4b60aabf2df7bcd386a0bda0a0c630e3edba92 # timeout=10
[Gradle] - Launching build.
[workspace] $ /home/hudson/genie.virgo/.jenkins/jobs/bundlor-development/workspace/gradlew -Dci.build=true -Dci.build.signjars=true --stacktrace clean build javadoc sourcesJar javadocJar bundlorJarDist bundlorCommandlineDist publishBundlorPublicationToBuildEclipseOrgRepository publishBundlorPluginMarkerMavenPublicationToBuildEclipseOrgRepository publishToMavenLocal
Picked up JAVA_TOOL_OPTIONS: -Xmx2G -Djava.io.tmpdir=/tmp/genie.virgo -DforkCount=1
Starting a Gradle Daemon (subsequent builds will be faster)
Download https://plugins.gradle.org/m2/gradle/plugin/org/eclipse/virgo/bundlor/bundlor-plugin/0.2/bundlor-plugin-0.2.pom
Download https://plugins.gradle.org/m2/gradle/plugin/org/eclipse/virgo/bundlor/bundlor-plugin/0.2/bundlor-plugin-0.2.jar
Generating JAR file 'gradle-api-3.5.jar'
Generating JAR file 'gradle-test-kit-3.5.jar'
:clean
:org.eclipse.virgo.bundlor:clean
:org.eclipse.virgo.bundlor.ant:clean
:org.eclipse.virgo.bundlor.blint:clean
:org.eclipse.virgo.bundlor.commandline:clean
:org.eclipse.virgo.bundlor.gradle:clean
:org.eclipse.virgo.bundlor.maven:clean
:assemble UP-TO-DATE
:check UP-TO-DATE
:build UP-TO-DATE
:org.eclipse.virgo.bundlor:addProjectVersionToGradlePropertiesTask
:org.eclipse.virgo.bundlor:compileJava
Download https://repo1.maven.org/maven2/org/ow2/asm/asm-all/5.1/asm-all-5.1.pom
Download https://repo1.maven.org/maven2/org/ow2/asm/asm-parent/5.1/asm-parent-5.1.pom
Download https://repo1.maven.org/maven2/org/eclipse/virgo/util/org.eclipse.virgo.util.common/3.5.0.RELEASE/org.eclipse.virgo.util.common-3.5.0.RELEASE.pom
Download https://repo1.maven.org/maven2/org/eclipse/virgo/util/org.eclipse.virgo.util.math/3.5.0.RELEASE/org.eclipse.virgo.util.math-3.5.0.RELEASE.pom
Download https://repo1.maven.org/maven2/org/eclipse/virgo/util/org.eclipse.virgo.util.osgi/3.5.0.RELEASE/org.eclipse.virgo.util.osgi-3.5.0.RELEASE.pom
Download https://repo1.maven.org/maven2/org/eclipse/virgo/util/org.eclipse.virgo.util.osgi.manifest/3.5.0.RELEASE/org.eclipse.virgo.util.osgi.manifest-3.5.0.RELEASE.pom
Download https://repo1.maven.org/maven2/org/eclipse/virgo/util/org.eclipse.virgo.util.parser.manifest/3.5.0.RELEASE/org.eclipse.virgo.util.parser.manifest-3.5.0.RELEASE.pom
Download https://repo1.maven.org/maven2/org/ow2/asm/asm-all/5.1/asm-all-5.1.jar
Download https://repo1.maven.org/maven2/org/eclipse/virgo/util/org.eclipse.virgo.util.common/3.5.0.RELEASE/org.eclipse.virgo.util.common-3.5.0.RELEASE.jar
Download https://repo1.maven.org/maven2/org/eclipse/virgo/util/org.eclipse.virgo.util.math/3.5.0.RELEASE/org.eclipse.virgo.util.math-3.5.0.RELEASE.jar
Download https://repo1.maven.org/maven2/org/eclipse/virgo/util/org.eclipse.virgo.util.osgi/3.5.0.RELEASE/org.eclipse.virgo.util.osgi-3.5.0.RELEASE.jar
Download https://repo1.maven.org/maven2/org/eclipse/virgo/util/org.eclipse.virgo.util.osgi.manifest/3.5.0.RELEASE/org.eclipse.virgo.util.osgi.manifest-3.5.0.RELEASE.jar
Download https://repo1.maven.org/maven2/org/eclipse/virgo/util/org.eclipse.virgo.util.parser.manifest/3.5.0.RELEASE/org.eclipse.virgo.util.parser.manifest-3.5.0.RELEASE.jar
The executable property on ForkOptions has been deprecated and is scheduled to be removed in Gradle 5.0. Please use javaHome instead.
	at org.gradle.api.tasks.compile.ForkOptions.setExecutable(ForkOptions.java:64)
	at sun.reflect.NativeMethodAccessorImpl.invoke0(Native Method)
	at sun.reflect.NativeMethodAccessorImpl.invoke(NativeMethodAccessorImpl.java:62)
	at sun.reflect.DelegatingMethodAccessorImpl.invoke(DelegatingMethodAccessorImpl.java:43)
	at java.lang.reflect.Method.invoke(Method.java:498)
	at org.codehaus.groovy.reflection.CachedMethod.invoke(CachedMethod.java:93)
	at groovy.lang.MetaMethod.doMethodInvoke(MetaMethod.java:325)
	at groovy.lang.MetaClassImpl.setProperty(MetaClassImpl.java:2730)
	at groovy.lang.MetaClassImpl.setProperty(MetaClassImpl.java:3775)
	at org.codehaus.groovy.runtime.InvokerHelper.setProperty(InvokerHelper.java:201)
	at groovy.lang.Closure.setPropertyTryThese(Closure.java:379)
	at groovy.lang.Closure.setPropertyDelegateFirst(Closure.java:369)
	at groovy.lang.Closure.setProperty(Closure.java:350)
	at org.codehaus.groovy.runtime.ScriptBytecodeAdapter.setGroovyObjectProperty(ScriptBytecodeAdapter.java:532)
	at build_4k47fl7c6itlqhicm7rafqgnk$_run_closure2$_closure9$_closure23$_closure24.doCall(/jobs/genie.virgo/bundlor-development/workspace/build.gradle:52)
	at sun.reflect.NativeMethodAccessorImpl.invoke0(Native Method)
	at sun.reflect.NativeMethodAccessorImpl.invoke(NativeMethodAccessorImpl.java:62)
	at sun.reflect.DelegatingMethodAccessorImpl.invoke(DelegatingMethodAccessorImpl.java:43)
	at java.lang.reflect.Method.invoke(Method.java:498)
	at org.codehaus.groovy.reflection.CachedMethod.invoke(CachedMethod.java:93)
	at groovy.lang.MetaMethod.doMethodInvoke(MetaMethod.java:325)
	at org.codehaus.groovy.runtime.metaclass.ClosureMetaClass.invokeMethod(ClosureMetaClass.java:294)
	at groovy.lang.MetaClassImpl.invokeMethod(MetaClassImpl.java:1027)
	at groovy.lang.Closure.call(Closure.java:414)
	at groovy.lang.Closure.call(Closure.java:430)
	at org.codehaus.groovy.runtime.DefaultGroovyMethods.with(DefaultGroovyMethods.java:242)
	at org.codehaus.groovy.runtime.dgm$757.invoke(Unknown Source)
	at org.codehaus.groovy.runtime.callsite.PojoMetaMethodSite$PojoMetaMethodSiteNoUnwrapNoCoerce.invoke(PojoMetaMethodSite.java:274)
	at org.codehaus.groovy.runtime.callsite.PojoMetaMethodSite.call(PojoMetaMethodSite.java:56)
	at org.codehaus.groovy.runtime.callsite.CallSiteArray.defaultCall(CallSiteArray.java:48)
	at org.codehaus.groovy.runtime.callsite.AbstractCallSite.call(AbstractCallSite.java:113)
	at org.codehaus.groovy.runtime.callsite.AbstractCallSite.call(AbstractCallSite.java:125)
	at build_4k47fl7c6itlqhicm7rafqgnk$_run_closure2$_closure9$_closure23.doCall(/jobs/genie.virgo/bundlor-development/workspace/build.gradle:51)
	at sun.reflect.NativeMethodAccessorImpl.invoke0(Native Method)
	at sun.reflect.NativeMethodAccessorImpl.invoke(NativeMethodAccessorImpl.java:62)
	at sun.reflect.DelegatingMethodAccessorImpl.invoke(DelegatingMethodAccessorImpl.java:43)
	at java.lang.reflect.Method.invoke(Method.java:498)
	at org.codehaus.groovy.reflection.CachedMethod.invoke(CachedMethod.java:93)
	at groovy.lang.MetaMethod.doMethodInvoke(MetaMethod.java:325)
	at org.codehaus.groovy.runtime.metaclass.ClosureMetaClass.invokeMethod(ClosureMetaClass.java:294)
	at groovy.lang.MetaClassImpl.invokeMethod(MetaClassImpl.java:1027)
	at groovy.lang.Closure.call(Closure.java:414)
	at groovy.lang.Closure.call(Closure.java:430)
	at org.gradle.api.internal.AbstractTask$ClosureTaskAction.execute(AbstractTask.java:656)
	at org.gradle.api.internal.AbstractTask$ClosureTaskAction.execute(AbstractTask.java:637)
	at org.gradle.api.internal.tasks.execution.ExecuteActionsTaskExecuter$1.execute(ExecuteActionsTaskExecuter.java:115)
	at org.gradle.api.internal.tasks.execution.ExecuteActionsTaskExecuter$1.execute(ExecuteActionsTaskExecuter.java:109)
	at org.gradle.internal.Transformers$4.transform(Transformers.java:169)
	at org.gradle.internal.progress.DefaultBuildOperationExecutor.run(DefaultBuildOperationExecutor.java:106)
	at org.gradle.internal.progress.DefaultBuildOperationExecutor.run(DefaultBuildOperationExecutor.java:56)
	at org.gradle.api.internal.tasks.execution.ExecuteActionsTaskExecuter.executeAction(ExecuteActionsTaskExecuter.java:109)
	at org.gradle.api.internal.tasks.execution.ExecuteActionsTaskExecuter.executeActions(ExecuteActionsTaskExecuter.java:90)
	at org.gradle.api.internal.tasks.execution.ExecuteActionsTaskExecuter.execute(ExecuteActionsTaskExecuter.java:68)
	at org.gradle.api.internal.tasks.execution.SkipUpToDateTaskExecuter.execute(SkipUpToDateTaskExecuter.java:62)
	at org.gradle.api.internal.tasks.execution.ValidatingTaskExecuter.execute(ValidatingTaskExecuter.java:58)
	at org.gradle.api.internal.tasks.execution.SkipEmptySourceFilesTaskExecuter.execute(SkipEmptySourceFilesTaskExecuter.java:88)
	at org.gradle.api.internal.tasks.execution.ResolveTaskArtifactStateTaskExecuter.execute(ResolveTaskArtifactStateTaskExecuter.java:46)
	at org.gradle.api.internal.tasks.execution.SkipTaskWithNoActionsExecuter.execute(SkipTaskWithNoActionsExecuter.java:51)
	at org.gradle.api.internal.tasks.execution.SkipOnlyIfTaskExecuter.execute(SkipOnlyIfTaskExecuter.java:54)
	at org.gradle.api.internal.tasks.execution.ExecuteAtMostOnceTaskExecuter.execute(ExecuteAtMostOnceTaskExecuter.java:43)
	at org.gradle.api.internal.tasks.execution.CatchExceptionTaskExecuter.execute(CatchExceptionTaskExecuter.java:34)
	at org.gradle.execution.taskgraph.DefaultTaskGraphExecuter$EventFiringTaskWorker$1.execute(DefaultTaskGraphExecuter.java:236)
	at org.gradle.execution.taskgraph.DefaultTaskGraphExecuter$EventFiringTaskWorker$1.execute(DefaultTaskGraphExecuter.java:228)
	at org.gradle.internal.Transformers$4.transform(Transformers.java:169)
	at org.gradle.internal.progress.DefaultBuildOperationExecutor.run(DefaultBuildOperationExecutor.java:106)
	at org.gradle.internal.progress.DefaultBuildOperationExecutor.run(DefaultBuildOperationExecutor.java:61)
	at org.gradle.execution.taskgraph.DefaultTaskGraphExecuter$EventFiringTaskWorker.execute(DefaultTaskGraphExecuter.java:228)
	at org.gradle.execution.taskgraph.DefaultTaskGraphExecuter$EventFiringTaskWorker.execute(DefaultTaskGraphExecuter.java:215)
	at org.gradle.execution.taskgraph.AbstractTaskPlanExecutor$TaskExecutorWorker.processTask(AbstractTaskPlanExecutor.java:77)
	at org.gradle.execution.taskgraph.AbstractTaskPlanExecutor$TaskExecutorWorker.run(AbstractTaskPlanExecutor.java:58)
	at org.gradle.execution.taskgraph.DefaultTaskPlanExecutor.process(DefaultTaskPlanExecutor.java:32)
	at org.gradle.execution.taskgraph.DefaultTaskGraphExecuter.execute(DefaultTaskGraphExecuter.java:113)
	at org.gradle.execution.SelectedTaskExecutionAction.execute(SelectedTaskExecutionAction.java:37)
	at org.gradle.execution.DefaultBuildExecuter.execute(DefaultBuildExecuter.java:37)
	at org.gradle.execution.DefaultBuildExecuter.access$000(DefaultBuildExecuter.java:23)
	at org.gradle.execution.DefaultBuildExecuter$1.proceed(DefaultBuildExecuter.java:43)
	at org.gradle.execution.DryRunBuildExecutionAction.execute(DryRunBuildExecutionAction.java:32)
	at org.gradle.execution.DefaultBuildExecuter.execute(DefaultBuildExecuter.java:37)
	at org.gradle.execution.DefaultBuildExecuter.execute(DefaultBuildExecuter.java:30)
	at org.gradle.initialization.DefaultGradleLauncher$RunTasksAction.execute(DefaultGradleLauncher.java:230)
	at org.gradle.initialization.DefaultGradleLauncher$RunTasksAction.execute(DefaultGradleLauncher.java:227)
	at org.gradle.internal.Transformers$4.transform(Transformers.java:169)
	at org.gradle.internal.progress.DefaultBuildOperationExecutor.run(DefaultBuildOperationExecutor.java:106)
	at org.gradle.internal.progress.DefaultBuildOperationExecutor.run(DefaultBuildOperationExecutor.java:56)
	at org.gradle.initialization.DefaultGradleLauncher.doBuildStages(DefaultGradleLauncher.java:161)
	at org.gradle.initialization.DefaultGradleLauncher.doBuild(DefaultGradleLauncher.java:112)
	at org.gradle.initialization.DefaultGradleLauncher.run(DefaultGradleLauncher.java:95)
	at org.gradle.launcher.exec.GradleBuildController.run(GradleBuildController.java:66)
	at org.gradle.tooling.internal.provider.ExecuteBuildActionRunner.run(ExecuteBuildActionRunner.java:28)
	at org.gradle.launcher.exec.ChainingBuildActionRunner.run(ChainingBuildActionRunner.java:35)
	at org.gradle.launcher.exec.InProcessBuildActionExecuter.execute(InProcessBuildActionExecuter.java:41)
	at org.gradle.launcher.exec.InProcessBuildActionExecuter.execute(InProcessBuildActionExecuter.java:26)
	at org.gradle.tooling.internal.provider.ContinuousBuildActionExecuter.execute(ContinuousBuildActionExecuter.java:75)
	at org.gradle.tooling.internal.provider.ContinuousBuildActionExecuter.execute(ContinuousBuildActionExecuter.java:49)
	at org.gradle.tooling.internal.provider.ServicesSetupBuildActionExecuter.execute(ServicesSetupBuildActionExecuter.java:49)
	at org.gradle.tooling.internal.provider.ServicesSetupBuildActionExecuter.execute(ServicesSetupBuildActionExecuter.java:31)
	at org.gradle.launcher.daemon.server.exec.ExecuteBuild.doBuild(ExecuteBuild.java:67)
	at org.gradle.launcher.daemon.server.exec.BuildCommandOnly.execute(BuildCommandOnly.java:36)
	at org.gradle.launcher.daemon.server.api.DaemonCommandExecution.proceed(DaemonCommandExecution.java:120)
	at org.gradle.launcher.daemon.server.exec.WatchForDisconnection.execute(WatchForDisconnection.java:37)
	at org.gradle.launcher.daemon.server.api.DaemonCommandExecution.proceed(DaemonCommandExecution.java:120)
	at org.gradle.launcher.daemon.server.exec.ResetDeprecationLogger.execute(ResetDeprecationLogger.java:26)
	at org.gradle.launcher.daemon.server.api.DaemonCommandExecution.proceed(DaemonCommandExecution.java:120)
	at org.gradle.launcher.daemon.server.exec.RequestStopIfSingleUsedDaemon.execute(RequestStopIfSingleUsedDaemon.java:34)
	at org.gradle.launcher.daemon.server.api.DaemonCommandExecution.proceed(DaemonCommandExecution.java:120)
	at org.gradle.launcher.daemon.server.exec.ForwardClientInput$2.call(ForwardClientInput.java:74)
	at org.gradle.launcher.daemon.server.exec.ForwardClientInput$2.call(ForwardClientInput.java:72)
	at org.gradle.util.Swapper.swap(Swapper.java:38)
	at org.gradle.launcher.daemon.server.exec.ForwardClientInput.execute(ForwardClientInput.java:72)
	at org.gradle.launcher.daemon.server.api.DaemonCommandExecution.proceed(DaemonCommandExecution.java:120)
	at org.gradle.launcher.daemon.server.exec.LogAndCheckHealth.execute(LogAndCheckHealth.java:55)
	at org.gradle.launcher.daemon.server.api.DaemonCommandExecution.proceed(DaemonCommandExecution.java:120)
	at org.gradle.launcher.daemon.server.exec.LogToClient.doBuild(LogToClient.java:60)
	at org.gradle.launcher.daemon.server.exec.BuildCommandOnly.execute(BuildCommandOnly.java:36)
	at org.gradle.launcher.daemon.server.api.DaemonCommandExecution.proceed(DaemonCommandExecution.java:120)
	at org.gradle.launcher.daemon.server.exec.EstablishBuildEnvironment.doBuild(EstablishBuildEnvironment.java:72)
	at org.gradle.launcher.daemon.server.exec.BuildCommandOnly.execute(BuildCommandOnly.java:36)
	at org.gradle.launcher.daemon.server.api.DaemonCommandExecution.proceed(DaemonCommandExecution.java:120)
	at org.gradle.launcher.daemon.server.exec.StartBuildOrRespondWithBusy$1.run(StartBuildOrRespondWithBusy.java:50)
	at org.gradle.launcher.daemon.server.DaemonStateCoordinator$1.run(DaemonStateCoordinator.java:297)
	at org.gradle.internal.concurrent.ExecutorPolicy$CatchAndRecordFailures.onExecute(ExecutorPolicy.java:63)
	at org.gradle.internal.concurrent.StoppableExecutorImpl$1.run(StoppableExecutorImpl.java:46)
	at java.util.concurrent.ThreadPoolExecutor.runWorker(ThreadPoolExecutor.java:1149)
	at java.util.concurrent.ThreadPoolExecutor$Worker.run(ThreadPoolExecutor.java:624)
	at java.lang.Thread.run(Thread.java:748)
Download https://repo1.maven.org/maven2/org/eclipse/jdt/core/compiler/ecj/4.5.1/ecj-4.5.1.pom
Download https://repo1.maven.org/maven2/org/eclipse/jdt/core/compiler/ecj/4.5.1/ecj-4.5.1.jar
Picked up JAVA_TOOL_OPTIONS: -Xmx2G -Djava.io.tmpdir=/tmp/genie.virgo -DforkCount=1
:org.eclipse.virgo.bundlor:processResources
:org.eclipse.virgo.bundlor:classes
|--> Embedding: org.eclipse.virgo.util.common-3.5.0.RELEASE.jar
|--> Embedding: org.eclipse.virgo.util.math-3.5.0.RELEASE.jar
|--> Embedding: org.eclipse.virgo.util.osgi-3.5.0.RELEASE.jar
|--> Embedding: org.eclipse.virgo.util.osgi.manifest-3.5.0.RELEASE.jar
|--> Embedding: org.eclipse.virgo.util.parser.manifest-3.5.0.RELEASE.jar
:org.eclipse.virgo.bundlor:mergeClassesAndResources
:org.eclipse.virgo.bundlor:bundlor
Download https://repo1.maven.org/maven2/org/eclipse/virgo/bundlor/org.eclipse.virgo.bundlor/1.1.2.RELEASE/org.eclipse.virgo.bundlor-1.1.2.RELEASE.pom
Download https://repo1.maven.org/maven2/org/eclipse/virgo/bundlor/org.eclipse.virgo.bundlor.ant/1.1.2.RELEASE/org.eclipse.virgo.bundlor.ant-1.1.2.RELEASE.pom
Download https://repo1.maven.org/maven2/org/eclipse/virgo/bundlor/org.eclipse.virgo.bundlor.blint/1.1.2.RELEASE/org.eclipse.virgo.bundlor.blint-1.1.2.RELEASE.pom
Download http://build.eclipse.org/rt/virgo/maven/bundles/release/org/objectweb/asm/com.springsource.org.objectweb.asm/3.1.0/com.springsource.org.objectweb.asm-3.1.0.pom
[Fatal Error] com.springsource.org.objectweb.asm-3.1.0.pom:2:3: The markup in the document preceding the root element must be well-formed.
Download http://repository.springsource.com/maven/bundles/external/org/objectweb/asm/com.springsource.org.objectweb.asm/3.1.0/com.springsource.org.objectweb.asm-3.1.0.pom
Download http://build.eclipse.org/rt/virgo/maven/bundles/release/org/objectweb/asm/com.springsource.org.objectweb.asm.tree/3.1.0/com.springsource.org.objectweb.asm.tree-3.1.0.pom
[Fatal Error] com.springsource.org.objectweb.asm.tree-3.1.0.pom:2:3: The markup in the document preceding the root element must be well-formed.
Download http://repository.springsource.com/maven/bundles/external/org/objectweb/asm/com.springsource.org.objectweb.asm.tree/3.1.0/com.springsource.org.objectweb.asm.tree-3.1.0.pom
Download http://build.eclipse.org/rt/virgo/maven/bundles/release/org/objectweb/asm/com.springsource.org.objectweb.asm.commons/3.1.0/com.springsource.org.objectweb.asm.commons-3.1.0.pom
[Fatal Error] com.springsource.org.objectweb.asm.commons-3.1.0.pom:2:3: The markup in the document preceding the root element must be well-formed.
Download http://repository.springsource.com/maven/bundles/external/org/objectweb/asm/com.springsource.org.objectweb.asm.commons/3.1.0/com.springsource.org.objectweb.asm.commons-3.1.0.pom
Download http://build.eclipse.org/rt/virgo/maven/bundles/release/org/apache/ant/com.springsource.org.apache.tools.ant/1.7.0/com.springsource.org.apache.tools.ant-1.7.0.pom
[Fatal Error] com.springsource.org.apache.tools.ant-1.7.0.pom:2:3: The markup in the document preceding the root element must be well-formed.
Download http://repository.springsource.com/maven/bundles/external/org/apache/ant/com.springsource.org.apache.tools.ant/1.7.0/com.springsource.org.apache.tools.ant-1.7.0.pom
Download https://repo1.maven.org/maven2/org/osgi/org.osgi.compendium/4.1.0/org.osgi.compendium-4.1.0.pom
Download http://build.eclipse.org/rt/virgo/maven/bundles/release/org/slf4j/com.springsource.slf4j.api/1.6.1/com.springsource.slf4j.api-1.6.1.pom
[Fatal Error] com.springsource.slf4j.api-1.6.1.pom:2:3: The markup in the document preceding the root element must be well-formed.
Download http://repository.springsource.com/maven/bundles/external/org/slf4j/com.springsource.slf4j.api/1.6.1/com.springsource.slf4j.api-1.6.1.pom
Download http://build.eclipse.org/rt/virgo/maven/bundles/release/org/slf4j/com.springsource.slf4j.nop/1.6.1/com.springsource.slf4j.nop-1.6.1.pom
[Fatal Error] com.springsource.slf4j.nop-1.6.1.pom:2:3: The markup in the document preceding the root element must be well-formed.
Download http://repository.springsource.com/maven/bundles/external/org/slf4j/com.springsource.slf4j.nop/1.6.1/com.springsource.slf4j.nop-1.6.1.pom
Download https://repo1.maven.org/maven2/org/eclipse/virgo/bundlor/org.eclipse.virgo.bundlor/1.1.2.RELEASE/org.eclipse.virgo.bundlor-1.1.2.RELEASE.jar
Download https://repo1.maven.org/maven2/org/eclipse/virgo/bundlor/org.eclipse.virgo.bundlor.ant/1.1.2.RELEASE/org.eclipse.virgo.bundlor.ant-1.1.2.RELEASE.jar
Download https://repo1.maven.org/maven2/org/eclipse/virgo/bundlor/org.eclipse.virgo.bundlor.blint/1.1.2.RELEASE/org.eclipse.virgo.bundlor.blint-1.1.2.RELEASE.jar
Download http://repository.springsource.com/maven/bundles/external/org/objectweb/asm/com.springsource.org.objectweb.asm/3.1.0/com.springsource.org.objectweb.asm-3.1.0.jar
Download http://repository.springsource.com/maven/bundles/external/org/objectweb/asm/com.springsource.org.objectweb.asm.tree/3.1.0/com.springsource.org.objectweb.asm.tree-3.1.0.jar
Download http://repository.springsource.com/maven/bundles/external/org/objectweb/asm/com.springsource.org.objectweb.asm.commons/3.1.0/com.springsource.org.objectweb.asm.commons-3.1.0.jar
Download http://repository.springsource.com/maven/bundles/external/org/apache/ant/com.springsource.org.apache.tools.ant/1.7.0/com.springsource.org.apache.tools.ant-1.7.0.jar
Download https://repo1.maven.org/maven2/org/osgi/org.osgi.compendium/4.1.0/org.osgi.compendium-4.1.0.jar
Download http://repository.springsource.com/maven/bundles/external/org/slf4j/com.springsource.slf4j.api/1.6.1/com.springsource.slf4j.api-1.6.1.jar
Download http://repository.springsource.com/maven/bundles/external/org/slf4j/com.springsource.slf4j.nop/1.6.1/com.springsource.slf4j.nop-1.6.1.jar
:org.eclipse.virgo.bundlor:jar
|--> Signing Jar File: /jobs/genie.virgo/bundlor-development/workspace/org.eclipse.virgo.bundlor/build/libs/org.eclipse.virgo.bundlor-1.2.0.D-20191213073307.jar
  % Total    % Received % Xferd  Average Speed   Time    Time     Time  Current
                                 Dload  Upload   Total   Spent    Left  Speed

  0     0    0     0    0     0      0      0 --:--:-- --:--:-- --:--:--     0
100  321k    0     0  100  321k      0   319k  0:00:01  0:00:01 --:--:--  319k
 49  673k    2 10569  100  321k   6950   211k  0:00:51  0:00:01  0:00:50  211k
100  673k  100  352k  100  321k   229k   208k  0:00:01  0:00:01 --:--:--  229k
:org.eclipse.virgo.bundlor:assemble
:org.eclipse.virgo.bundlor:findbugsMain
Download https://repo1.maven.org/maven2/com/google/code/findbugs/findbugs/3.0.1/findbugs-3.0.1.pom
Download https://repo1.maven.org/maven2/com/google/code/findbugs/bcel-findbugs/6.0/bcel-findbugs-6.0.pom
Download https://repo1.maven.org/maven2/com/google/code/findbugs/jFormatString/2.0.1/jFormatString-2.0.1.pom
Download https://repo1.maven.org/maven2/org/ow2/asm/asm-debug-all/5.0.2/asm-debug-all-5.0.2.pom
Download https://repo1.maven.org/maven2/org/ow2/asm/asm-parent/5.0.2/asm-parent-5.0.2.pom
Download https://repo1.maven.org/maven2/org/ow2/asm/asm-commons/5.0.2/asm-commons-5.0.2.pom
Download https://repo1.maven.org/maven2/com/apple/AppleJavaExtensions/1.4/AppleJavaExtensions-1.4.pom
Download https://repo1.maven.org/maven2/org/ow2/asm/asm-tree/5.0.2/asm-tree-5.0.2.pom
Download https://repo1.maven.org/maven2/org/ow2/asm/asm/5.0.2/asm-5.0.2.pom
Download https://repo1.maven.org/maven2/com/google/code/findbugs/findbugs/3.0.1/findbugs-3.0.1.jar
Download https://repo1.maven.org/maven2/com/google/code/findbugs/bcel-findbugs/6.0/bcel-findbugs-6.0.jar
Download https://repo1.maven.org/maven2/com/google/code/findbugs/jFormatString/2.0.1/jFormatString-2.0.1.jar
Download https://repo1.maven.org/maven2/org/ow2/asm/asm-debug-all/5.0.2/asm-debug-all-5.0.2.jar
Download https://repo1.maven.org/maven2/org/ow2/asm/asm-commons/5.0.2/asm-commons-5.0.2.jar
Download https://repo1.maven.org/maven2/com/apple/AppleJavaExtensions/1.4/AppleJavaExtensions-1.4.jar
Download https://repo1.maven.org/maven2/org/ow2/asm/asm-tree/5.0.2/asm-tree-5.0.2.jar
Download https://repo1.maven.org/maven2/org/ow2/asm/asm/5.0.2/asm-5.0.2.jar

Scanning archives (0 / 245)
Scanning archives (1 / 245)
Scanning archives (2 / 245)
Scanning archives (3 / 245)
Scanning archives (4 / 245)
Scanning archives (5 / 245)
Scanning archives (6 / 245)
Scanning archives (7 / 245)
Scanning archives (8 / 245)
Scanning archives (9 / 245)
Scanning archives (10 / 245)
Scanning archives (11 / 245)
Scanning archives (12 / 245)
Scanning archives (13 / 245)
Scanning archives (14 / 245)
Scanning archives (15 / 245)
Scanning archives (16 / 245)
Scanning archives (17 / 245)
Scanning archives (18 / 245)
Scanning archives (19 / 245)
Scanning archives (20 / 245)
Scanning archives (21 / 245)
Scanning archives (22 / 245)
Scanning archives (23 / 245)
Scanning archives (24 / 245)
Scanning archives (25 / 245)
Scanning archives (26 / 245)
Scanning archives (27 / 245)
Scanning archives (28 / 245)
Scanning archives (29 / 245)
Scanning archives (30 / 245)
Scanning archives (31 / 245)
Scanning archives (32 / 245)
Scanning archives (33 / 245)
Scanning archives (34 / 245)
Scanning archives (35 / 245)
Scanning archives (36 / 245)
Scanning archives (37 / 245)
Scanning archives (38 / 245)
Scanning archives (39 / 245)
Scanning archives (40 / 245)
Scanning archives (41 / 245)
Scanning archives (42 / 245)
Scanning archives (43 / 245)
Scanning archives (44 / 245)
Scanning archives (45 / 245)
Scanning archives (46 / 245)
Scanning archives (47 / 245)
Scanning archives (48 / 245)
Scanning archives (49 / 245)
Scanning archives (50 / 245)
Scanning archives (51 / 245)
Scanning archives (52 / 245)
Scanning archives (53 / 245)
Scanning archives (54 / 245)
Scanning archives (55 / 245)
Scanning archives (56 / 245)
Scanning archives (57 / 245)
Scanning archives (58 / 245)
Scanning archives (59 / 245)
Scanning archives (60 / 245)
Scanning archives (61 / 245)
Scanning archives (62 / 245)
Scanning archives (63 / 245)
Scanning archives (64 / 245)
Scanning archives (65 / 245)
Scanning archives (66 / 245)
Scanning archives (67 / 245)
Scanning archives (68 / 245)
Scanning archives (69 / 245)
Scanning archives (70 / 245)
Scanning archives (71 / 245)
Scanning archives (72 / 245)
Scanning archives (73 / 245)
Scanning archives (74 / 245)
Scanning archives (75 / 245)
Scanning archives (76 / 245)
Scanning archives (77 / 245)
Scanning archives (78 / 245)
Scanning archives (79 / 245)
Scanning archives (80 / 245)
Scanning archives (81 / 245)
Scanning archives (82 / 245)
Scanning archives (83 / 245)
Scanning archives (84 / 245)
Scanning archives (85 / 245)
Scanning archives (86 / 245)
Scanning archives (87 / 245)
Scanning archives (88 / 245)
Scanning archives (89 / 245)
Scanning archives (90 / 245)
Scanning archives (91 / 245)
Scanning archives (92 / 245)
Scanning archives (93 / 245)
Scanning archives (94 / 245)
Scanning archives (95 / 245)
Scanning archives (96 / 245)
Scanning archives (97 / 245)
Scanning archives (98 / 245)
Scanning archives (99 / 245)
Scanning archives (100 / 245)
Scanning archives (101 / 245)
Scanning archives (102 / 245)
Scanning archives (103 / 245)
Scanning archives (104 / 245)
Scanning archives (105 / 245)
Scanning archives (106 / 245)
Scanning archives (107 / 245)
Scanning archives (108 / 245)
Scanning archives (109 / 245)
Scanning archives (110 / 245)
Scanning archives (111 / 245)
Scanning archives (112 / 245)
Scanning archives (113 / 245)
Scanning archives (114 / 245)
Scanning archives (115 / 245)
Scanning archives (116 / 245)
Scanning archives (117 / 245)
Scanning archives (118 / 245)
Scanning archives (119 / 245)
Scanning archives (120 / 245)
Scanning archives (121 / 245)
Scanning archives (122 / 245)
Scanning archives (123 / 245)
Scanning archives (124 / 245)
Scanning archives (125 / 245)
Scanning archives (126 / 245)
Scanning archives (127 / 245)
Scanning archives (128 / 245)
Scanning archives (129 / 245)
Scanning archives (130 / 245)
Scanning archives (131 / 245)
Scanning archives (132 / 245)
Scanning archives (133 / 245)
Scanning archives (134 / 245)
Scanning archives (135 / 245)
Scanning archives (136 / 245)
Scanning archives (137 / 245)
Scanning archives (138 / 245)
Scanning archives (139 / 245)
Scanning archives (140 / 245)
Scanning archives (141 / 245)
Scanning archives (142 / 245)
Scanning archives (143 / 245)
Scanning archives (144 / 245)
Scanning archives (145 / 245)
Scanning archives (146 / 245)
Scanning archives (147 / 245)
Scanning archives (148 / 245)
Scanning archives (149 / 245)
Scanning archives (150 / 245)
Scanning archives (151 / 245)
Scanning archives (152 / 245)
Scanning archives (153 / 245)
Scanning archives (154 / 245)
Scanning archives (155 / 245)
Scanning archives (156 / 245)
Scanning archives (157 / 245)
Scanning archives (158 / 245)
Scanning archives (159 / 245)
Scanning archives (160 / 245)
Scanning archives (161 / 245)
Scanning archives (162 / 245)
Scanning archives (163 / 245)
Scanning archives (164 / 245)
Scanning archives (165 / 245)
Scanning archives (166 / 245)
Scanning archives (167 / 245)
Scanning archives (168 / 245)
Scanning archives (169 / 245)
Scanning archives (170 / 245)
Scanning archives (171 / 245)
Scanning archives (172 / 245)
Scanning archives (173 / 245)
Scanning archives (174 / 245)
Scanning archives (175 / 245)
Scanning archives (176 / 245)
Scanning archives (177 / 245)
Scanning archives (178 / 245)
Scanning archives (179 / 245)
Scanning archives (180 / 245)
Scanning archives (181 / 245)
Scanning archives (182 / 245)
Scanning archives (183 / 245)
Scanning archives (184 / 245)
Scanning archives (185 / 245)
Scanning archives (186 / 245)
Scanning archives (187 / 245)
Scanning archives (188 / 245)
Scanning archives (189 / 245)
Scanning archives (190 / 245)
Scanning archives (191 / 245)
Scanning archives (192 / 245)
Scanning archives (193 / 245)
Scanning archives (194 / 245)
Scanning archives (195 / 245)
Scanning archives (196 / 245)
Scanning archives (197 / 245)
Scanning archives (198 / 245)
Scanning archives (199 / 245)
Scanning archives (200 / 245)
Scanning archives (201 / 245)
Scanning archives (202 / 245)
Scanning archives (203 / 245)
Scanning archives (204 / 245)
Scanning archives (205 / 245)
Scanning archives (206 / 245)
Scanning archives (207 / 245)
Scanning archives (208 / 245)
Scanning archives (209 / 245)
Scanning archives (210 / 245)
Scanning archives (211 / 245)
Scanning archives (212 / 245)
Scanning archives (213 / 245)
Scanning archives (214 / 245)
Scanning archives (215 / 245)
Scanning archives (216 / 245)
Scanning archives (217 / 245)
Scanning archives (218 / 245)
Scanning archives (219 / 245)
Scanning archives (220 / 245)
Scanning archives (221 / 245)
Scanning archives (222 / 245)
Scanning archives (223 / 245)
Scanning archives (224 / 245)
Scanning archives (225 / 245)
Scanning archives (226 / 245)
Scanning archives (227 / 245)
Scanning archives (228 / 245)
Scanning archives (229 / 245)
Scanning archives (230 / 245)
Scanning archives (231 / 245)
Scanning archives (232 / 245)
Scanning archives (233 / 245)
Scanning archives (234 / 245)
Scanning archives (235 / 245)
Scanning archives (236 / 245)
Scanning archives (237 / 245)
Scanning archives (238 / 245)
Scanning archives (239 / 245)
Scanning archives (240 / 245)
Scanning archives (241 / 245)
Scanning archives (242 / 245)
Scanning archives (243 / 245)
Scanning archives (244 / 245)
Scanning archives (245 / 245)

2 analysis passes to perform

Pass 1: Analyzing classes (0 / 422) - 00% complete
Pass 1: Analyzing classes (1 / 422) - 00% complete
Pass 1: Analyzing classes (2 / 422) - 00% complete
Pass 1: Analyzing classes (3 / 422) - 00% complete
Pass 1: Analyzing classes (4 / 422) - 00% complete
Pass 1: Analyzing classes (5 / 422) - 01% complete
Pass 1: Analyzing classes (6 / 422) - 01% complete
Pass 1: Analyzing classes (7 / 422) - 01% complete
Pass 1: Analyzing classes (8 / 422) - 01% complete
Pass 1: Analyzing classes (9 / 422) - 02% complete
Pass 1: Analyzing classes (10 / 422) - 02% complete
Pass 1: Analyzing classes (11 / 422) - 02% complete
Pass 1: Analyzing classes (12 / 422) - 02% complete
Pass 1: Analyzing classes (13 / 422) - 03% complete
Pass 1: Analyzing classes (14 / 422) - 03% complete
Pass 1: Analyzing classes (15 / 422) - 03% complete
Pass 1: Analyzing classes (16 / 422) - 03% complete
Pass 1: Analyzing classes (17 / 422) - 04% complete
Pass 1: Analyzing classes (18 / 422) - 04% complete
Pass 1: Analyzing classes (19 / 422) - 04% complete
Pass 1: Analyzing classes (20 / 422) - 04% complete
Pass 1: Analyzing classes (21 / 422) - 04% complete
Pass 1: Analyzing classes (22 / 422) - 05% complete
Pass 1: Analyzing classes (23 / 422) - 05% complete
Pass 1: Analyzing classes (24 / 422) - 05% complete
Pass 1: Analyzing classes (25 / 422) - 05% complete
Pass 1: Analyzing classes (26 / 422) - 06% complete
Pass 1: Analyzing classes (27 / 422) - 06% complete
Pass 1: Analyzing classes (28 / 422) - 06% complete
Pass 1: Analyzing classes (29 / 422) - 06% complete
Pass 1: Analyzing classes (30 / 422) - 07% complete
Pass 1: Analyzing classes (31 / 422) - 07% complete
Pass 1: Analyzing classes (32 / 422) - 07% complete
Pass 1: Analyzing classes (33 / 422) - 07% complete
Pass 1: Analyzing classes (34 / 422) - 08% complete
Pass 1: Analyzing classes (35 / 422) - 08% complete
Pass 1: Analyzing classes (36 / 422) - 08% complete
Pass 1: Analyzing classes (37 / 422) - 08% complete
Pass 1: Analyzing classes (38 / 422) - 09% complete
Pass 1: Analyzing classes (39 / 422) - 09% complete
Pass 1: Analyzing classes (40 / 422) - 09% complete
Pass 1: Analyzing classes (41 / 422) - 09% complete
Pass 1: Analyzing classes (42 / 422) - 09% complete
Pass 1: Analyzing classes (43 / 422) - 10% complete
Pass 1: Analyzing classes (44 / 422) - 10% complete
Pass 1: Analyzing classes (45 / 422) - 10% complete
Pass 1: Analyzing classes (46 / 422) - 10% complete
Pass 1: Analyzing classes (47 / 422) - 11% complete
Pass 1: Analyzing classes (48 / 422) - 11% complete
Pass 1: Analyzing classes (49 / 422) - 11% complete
Pass 1: Analyzing classes (50 / 422) - 11% complete
Pass 1: Analyzing classes (51 / 422) - 12% complete
Pass 1: Analyzing classes (52 / 422) - 12% complete
Pass 1: Analyzing classes (53 / 422) - 12% complete
Pass 1: Analyzing classes (54 / 422) - 12% complete
Pass 1: Analyzing classes (55 / 422) - 13% complete
Pass 1: Analyzing classes (56 / 422) - 13% complete
Pass 1: Analyzing classes (57 / 422) - 13% complete
Pass 1: Analyzing classes (58 / 422) - 13% complete
Pass 1: Analyzing classes (59 / 422) - 13% complete
Pass 1: Analyzing classes (60 / 422) - 14% complete
Pass 1: Analyzing classes (61 / 422) - 14% complete
Pass 1: Analyzing classes (62 / 422) - 14% complete
Pass 1: Analyzing classes (63 / 422) - 14% complete
Pass 1: Analyzing classes (64 / 422) - 15% complete
Pass 1: Analyzing classes (65 / 422) - 15% complete
Pass 1: Analyzing classes (66 / 422) - 15% complete
Pass 1: Analyzing classes (67 / 422) - 15% complete
Pass 1: Analyzing classes (68 / 422) - 16% complete
Pass 1: Analyzing classes (69 / 422) - 16% complete
Pass 1: Analyzing classes (70 / 422) - 16% complete
Pass 1: Analyzing classes (71 / 422) - 16% complete
Pass 1: Analyzing classes (72 / 422) - 17% complete
Pass 1: Analyzing classes (73 / 422) - 17% complete
Pass 1: Analyzing classes (74 / 422) - 17% complete
Pass 1: Analyzing classes (75 / 422) - 17% complete
Pass 1: Analyzing classes (76 / 422) - 18% complete
Pass 1: Analyzing classes (77 / 422) - 18% complete
Pass 1: Analyzing classes (78 / 422) - 18% complete
Pass 1: Analyzing classes (79 / 422) - 18% complete
Pass 1: Analyzing classes (80 / 422) - 18% complete
Pass 1: Analyzing classes (81 / 422) - 19% complete
Pass 1: Analyzing classes (82 / 422) - 19% complete
Pass 1: Analyzing classes (83 / 422) - 19% complete
Pass 1: Analyzing classes (84 / 422) - 19% complete
Pass 1: Analyzing classes (85 / 422) - 20% complete
Pass 1: Analyzing classes (86 / 422) - 20% complete
Pass 1: Analyzing classes (87 / 422) - 20% complete
Pass 1: Analyzing classes (88 / 422) - 20% complete
Pass 1: Analyzing classes (89 / 422) - 21% complete
Pass 1: Analyzing classes (90 / 422) - 21% complete
Pass 1: Analyzing classes (91 / 422) - 21% complete
Pass 1: Analyzing classes (92 / 422) - 21% complete
Pass 1: Analyzing classes (93 / 422) - 22% complete
Pass 1: Analyzing classes (94 / 422) - 22% complete
Pass 1: Analyzing classes (95 / 422) - 22% complete
Pass 1: Analyzing classes (96 / 422) - 22% complete
Pass 1: Analyzing classes (97 / 422) - 22% complete
Pass 1: Analyzing classes (98 / 422) - 23% complete
Pass 1: Analyzing classes (99 / 422) - 23% complete
Pass 1: Analyzing classes (100 / 422) - 23% complete
Pass 1: Analyzing classes (101 / 422) - 23% complete
Pass 1: Analyzing classes (102 / 422) - 24% complete
Pass 1: Analyzing classes (103 / 422) - 24% complete
Pass 1: Analyzing classes (104 / 422) - 24% complete
Pass 1: Analyzing classes (105 / 422) - 24% complete
Pass 1: Analyzing classes (106 / 422) - 25% complete
Pass 1: Analyzing classes (107 / 422) - 25% complete
Pass 1: Analyzing classes (108 / 422) - 25% complete
Pass 1: Analyzing classes (109 / 422) - 25% complete
Pass 1: Analyzing classes (110 / 422) - 26% complete
Pass 1: Analyzing classes (111 / 422) - 26% complete
Pass 1: Analyzing classes (112 / 422) - 26% complete
Pass 1: Analyzing classes (113 / 422) - 26% complete
Pass 1: Analyzing classes (114 / 422) - 27% complete
Pass 1: Analyzing classes (115 / 422) - 27% complete
Pass 1: Analyzing classes (116 / 422) - 27% complete
Pass 1: Analyzing classes (117 / 422) - 27% complete
Pass 1: Analyzing classes (118 / 422) - 27% complete
Pass 1: Analyzing classes (119 / 422) - 28% complete
Pass 1: Analyzing classes (120 / 422) - 28% complete
Pass 1: Analyzing classes (121 / 422) - 28% complete
Pass 1: Analyzing classes (122 / 422) - 28% complete
Pass 1: Analyzing classes (123 / 422) - 29% complete
Pass 1: Analyzing classes (124 / 422) - 29% complete
Pass 1: Analyzing classes (125 / 422) - 29% complete
Pass 1: Analyzing classes (126 / 422) - 29% complete
Pass 1: Analyzing classes (127 / 422) - 30% complete
Pass 1: Analyzing classes (128 / 422) - 30% complete
Pass 1: Analyzing classes (129 / 422) - 30% complete
Pass 1: Analyzing classes (130 / 422) - 30% complete
Pass 1: Analyzing classes (131 / 422) - 31% complete
Pass 1: Analyzing classes (132 / 422) - 31% complete
Pass 1: Analyzing classes (133 / 422) - 31% complete
Pass 1: Analyzing classes (134 / 422) - 31% complete
Pass 1: Analyzing classes (135 / 422) - 31% complete
Pass 1: Analyzing classes (136 / 422) - 32% complete
Pass 1: Analyzing classes (137 / 422) - 32% complete
Pass 1: Analyzing classes (138 / 422) - 32% complete
Pass 1: Analyzing classes (139 / 422) - 32% complete
Pass 1: Analyzing classes (140 / 422) - 33% complete
Pass 1: Analyzing classes (141 / 422) - 33% complete
Pass 1: Analyzing classes (142 / 422) - 33% complete
Pass 1: Analyzing classes (143 / 422) - 33% complete
Pass 1: Analyzing classes (144 / 422) - 34% complete
Pass 1: Analyzing classes (145 / 422) - 34% complete
Pass 1: Analyzing classes (146 / 422) - 34% complete
Pass 1: Analyzing classes (147 / 422) - 34% complete
Pass 1: Analyzing classes (148 / 422) - 35% complete
Pass 1: Analyzing classes (149 / 422) - 35% complete
Pass 1: Analyzing classes (150 / 422) - 35% complete
Pass 1: Analyzing classes (151 / 422) - 35% complete
Pass 1: Analyzing classes (152 / 422) - 36% complete
Pass 1: Analyzing classes (153 / 422) - 36% complete
Pass 1: Analyzing classes (154 / 422) - 36% complete
Pass 1: Analyzing classes (155 / 422) - 36% complete
Pass 1: Analyzing classes (156 / 422) - 36% complete
Pass 1: Analyzing classes (157 / 422) - 37% complete
Pass 1: Analyzing classes (158 / 422) - 37% complete
Pass 1: Analyzing classes (159 / 422) - 37% complete
Pass 1: Analyzing classes (160 / 422) - 37% complete
Pass 1: Analyzing classes (161 / 422) - 38% complete
Pass 1: Analyzing classes (162 / 422) - 38% complete
Pass 1: Analyzing classes (163 / 422) - 38% complete
Pass 1: Analyzing classes (164 / 422) - 38% complete
Pass 1: Analyzing classes (165 / 422) - 39% complete
Pass 1: Analyzing classes (166 / 422) - 39% complete
Pass 1: Analyzing classes (167 / 422) - 39% complete
Pass 1: Analyzing classes (168 / 422) - 39% complete
Pass 1: Analyzing classes (169 / 422) - 40% complete
Pass 1: Analyzing classes (170 / 422) - 40% complete
Pass 1: Analyzing classes (171 / 422) - 40% complete
Pass 1: Analyzing classes (172 / 422) - 40% complete
Pass 1: Analyzing classes (173 / 422) - 40% complete
Pass 1: Analyzing classes (174 / 422) - 41% complete
Pass 1: Analyzing classes (175 / 422) - 41% complete
Pass 1: Analyzing classes (176 / 422) - 41% complete
Pass 1: Analyzing classes (177 / 422) - 41% complete
Pass 1: Analyzing classes (178 / 422) - 42% complete
Pass 1: Analyzing classes (179 / 422) - 42% complete
Pass 1: Analyzing classes (180 / 422) - 42% complete
Pass 1: Analyzing classes (181 / 422) - 42% complete
Pass 1: Analyzing classes (182 / 422) - 43% complete
Pass 1: Analyzing classes (183 / 422) - 43% complete
Pass 1: Analyzing classes (184 / 422) - 43% complete
Pass 1: Analyzing classes (185 / 422) - 43% complete
Pass 1: Analyzing classes (186 / 422) - 44% complete
Pass 1: Analyzing classes (187 / 422) - 44% complete
Pass 1: Analyzing classes (188 / 422) - 44% complete
Pass 1: Analyzing classes (189 / 422) - 44% complete
Pass 1: Analyzing classes (190 / 422) - 45% complete
Pass 1: Analyzing classes (191 / 422) - 45% complete
Pass 1: Analyzing classes (192 / 422) - 45% complete
Pass 1: Analyzing classes (193 / 422) - 45% complete
Pass 1: Analyzing classes (194 / 422) - 45% complete
Pass 1: Analyzing classes (195 / 422) - 46% complete
Pass 1: Analyzing classes (196 / 422) - 46% complete
Pass 1: Analyzing classes (197 / 422) - 46% complete
Pass 1: Analyzing classes (198 / 422) - 46% complete
Pass 1: Analyzing classes (199 / 422) - 47% complete
Pass 1: Analyzing classes (200 / 422) - 47% complete
Pass 1: Analyzing classes (201 / 422) - 47% complete
Pass 1: Analyzing classes (202 / 422) - 47% complete
Pass 1: Analyzing classes (203 / 422) - 48% complete
Pass 1: Analyzing classes (204 / 422) - 48% complete
Pass 1: Analyzing classes (205 / 422) - 48% complete
Pass 1: Analyzing classes (206 / 422) - 48% complete
Pass 1: Analyzing classes (207 / 422) - 49% complete
Pass 1: Analyzing classes (208 / 422) - 49% complete
Pass 1: Analyzing classes (209 / 422) - 49% complete
Pass 1: Analyzing classes (210 / 422) - 49% complete
Pass 1: Analyzing classes (211 / 422) - 50% complete
Pass 1: Analyzing classes (212 / 422) - 50% complete
Pass 1: Analyzing classes (213 / 422) - 50% complete
Pass 1: Analyzing classes (214 / 422) - 50% complete
Pass 1: Analyzing classes (215 / 422) - 50% complete
Pass 1: Analyzing classes (216 / 422) - 51% complete
Pass 1: Analyzing classes (217 / 422) - 51% complete
Pass 1: Analyzing classes (218 / 422) - 51% complete
Pass 1: Analyzing classes (219 / 422) - 51% complete
Pass 1: Analyzing classes (220 / 422) - 52% complete
Pass 1: Analyzing classes (221 / 422) - 52% complete
Pass 1: Analyzing classes (222 / 422) - 52% complete
Pass 1: Analyzing classes (223 / 422) - 52% complete
Pass 1: Analyzing classes (224 / 422) - 53% complete
Pass 1: Analyzing classes (225 / 422) - 53% complete
Pass 1: Analyzing classes (226 / 422) - 53% complete
Pass 1: Analyzing classes (227 / 422) - 53% complete
Pass 1: Analyzing classes (228 / 422) - 54% complete
Pass 1: Analyzing classes (229 / 422) - 54% complete
Pass 1: Analyzing classes (230 / 422) - 54% complete
Pass 1: Analyzing classes (231 / 422) - 54% complete
Pass 1: Analyzing classes (232 / 422) - 54% complete
Pass 1: Analyzing classes (233 / 422) - 55% complete
Pass 1: Analyzing classes (234 / 422) - 55% complete
Pass 1: Analyzing classes (235 / 422) - 55% complete
Pass 1: Analyzing classes (236 / 422) - 55% complete
Pass 1: Analyzing classes (237 / 422) - 56% complete
Pass 1: Analyzing classes (238 / 422) - 56% complete
Pass 1: Analyzing classes (239 / 422) - 56% complete
Pass 1: Analyzing classes (240 / 422) - 56% complete
Pass 1: Analyzing classes (241 / 422) - 57% complete
Pass 1: Analyzing classes (242 / 422) - 57% complete
Pass 1: Analyzing classes (243 / 422) - 57% complete
Pass 1: Analyzing classes (244 / 422) - 57% complete
Pass 1: Analyzing classes (245 / 422) - 58% complete
Pass 1: Analyzing classes (246 / 422) - 58% complete
Pass 1: Analyzing classes (247 / 422) - 58% complete
Pass 1: Analyzing classes (248 / 422) - 58% complete
Pass 1: Analyzing classes (249 / 422) - 59% complete
Pass 1: Analyzing classes (250 / 422) - 59% complete
Pass 1: Analyzing classes (251 / 422) - 59% complete
Pass 1: Analyzing classes (252 / 422) - 59% complete
Pass 1: Analyzing classes (253 / 422) - 59% complete
Pass 1: Analyzing classes (254 / 422) - 60% complete
Pass 1: Analyzing classes (255 / 422) - 60% complete
Pass 1: Analyzing classes (256 / 422) - 60% complete
Pass 1: Analyzing classes (257 / 422) - 60% complete
Pass 1: Analyzing classes (258 / 422) - 61% complete
Pass 1: Analyzing classes (259 / 422) - 61% complete
Pass 1: Analyzing classes (260 / 422) - 61% complete
Pass 1: Analyzing classes (261 / 422) - 61% complete
Pass 1: Analyzing classes (262 / 422) - 62% complete
Pass 1: Analyzing classes (263 / 422) - 62% complete
Pass 1: Analyzing classes (264 / 422) - 62% complete
Pass 1: Analyzing classes (265 / 422) - 62% complete
Pass 1: Analyzing classes (266 / 422) - 63% complete
Pass 1: Analyzing classes (267 / 422) - 63% complete
Pass 1: Analyzing classes (268 / 422) - 63% complete
Pass 1: Analyzing classes (269 / 422) - 63% complete
Pass 1: Analyzing classes (270 / 422) - 63% complete
Pass 1: Analyzing classes (271 / 422) - 64% complete
Pass 1: Analyzing classes (272 / 422) - 64% complete
Pass 1: Analyzing classes (273 / 422) - 64% complete
Pass 1: Analyzing classes (274 / 422) - 64% complete
Pass 1: Analyzing classes (275 / 422) - 65% complete
Pass 1: Analyzing classes (276 / 422) - 65% complete
Pass 1: Analyzing classes (277 / 422) - 65% complete
Pass 1: Analyzing classes (278 / 422) - 65% complete
Pass 1: Analyzing classes (279 / 422) - 66% complete
Pass 1: Analyzing classes (280 / 422) - 66% complete
Pass 1: Analyzing classes (281 / 422) - 66% complete
Pass 1: Analyzing classes (282 / 422) - 66% complete
Pass 1: Analyzing classes (283 / 422) - 67% complete
Pass 1: Analyzing classes (284 / 422) - 67% complete
Pass 1: Analyzing classes (285 / 422) - 67% complete
Pass 1: Analyzing classes (286 / 422) - 67% complete
Pass 1: Analyzing classes (287 / 422) - 68% complete
Pass 1: Analyzing classes (288 / 422) - 68% complete
Pass 1: Analyzing classes (289 / 422) - 68% complete
Pass 1: Analyzing classes (290 / 422) - 68% complete
Pass 1: Analyzing classes (291 / 422) - 68% complete
Pass 1: Analyzing classes (292 / 422) - 69% complete
Pass 1: Analyzing classes (293 / 422) - 69% complete
Pass 1: Analyzing classes (294 / 422) - 69% complete
Pass 1: Analyzing classes (295 / 422) - 69% complete
Pass 1: Analyzing classes (296 / 422) - 70% complete
Pass 1: Analyzing classes (297 / 422) - 70% complete
Pass 1: Analyzing classes (298 / 422) - 70% complete
Pass 1: Analyzing classes (299 / 422) - 70% complete
Pass 1: Analyzing classes (300 / 422) - 71% complete
Pass 1: Analyzing classes (301 / 422) - 71% complete
Pass 1: Analyzing classes (302 / 422) - 71% complete
Pass 1: Analyzing classes (303 / 422) - 71% complete
Pass 1: Analyzing classes (304 / 422) - 72% complete
Pass 1: Analyzing classes (305 / 422) - 72% complete
Pass 1: Analyzing classes (306 / 422) - 72% complete
Pass 1: Analyzing classes (307 / 422) - 72% complete
Pass 1: Analyzing classes (308 / 422) - 72% complete
Pass 1: Analyzing classes (309 / 422) - 73% complete
Pass 1: Analyzing classes (310 / 422) - 73% complete
Pass 1: Analyzing classes (311 / 422) - 73% complete
Pass 1: Analyzing classes (312 / 422) - 73% complete
Pass 1: Analyzing classes (313 / 422) - 74% complete
Pass 1: Analyzing classes (314 / 422) - 74% complete
Pass 1: Analyzing classes (315 / 422) - 74% complete
Pass 1: Analyzing classes (316 / 422) - 74% complete
Pass 1: Analyzing classes (317 / 422) - 75% complete
Pass 1: Analyzing classes (318 / 422) - 75% complete
Pass 1: Analyzing classes (319 / 422) - 75% complete
Pass 1: Analyzing classes (320 / 422) - 75% complete
Pass 1: Analyzing classes (321 / 422) - 76% complete
Pass 1: Analyzing classes (322 / 422) - 76% complete
Pass 1: Analyzing classes (323 / 422) - 76% complete
Pass 1: Analyzing classes (324 / 422) - 76% complete
Pass 1: Analyzing classes (325 / 422) - 77% complete
Pass 1: Analyzing classes (326 / 422) - 77% complete
Pass 1: Analyzing classes (327 / 422) - 77% complete
Pass 1: Analyzing classes (328 / 422) - 77% complete
Pass 1: Analyzing classes (329 / 422) - 77% complete
Pass 1: Analyzing classes (330 / 422) - 78% complete
Pass 1: Analyzing classes (331 / 422) - 78% complete
Pass 1: Analyzing classes (332 / 422) - 78% complete
Pass 1: Analyzing classes (333 / 422) - 78% complete
Pass 1: Analyzing classes (334 / 422) - 79% complete
Pass 1: Analyzing classes (335 / 422) - 79% complete
Pass 1: Analyzing classes (336 / 422) - 79% complete
Pass 1: Analyzing classes (337 / 422) - 79% complete
Pass 1: Analyzing classes (338 / 422) - 80% complete
Pass 1: Analyzing classes (339 / 422) - 80% complete
Pass 1: Analyzing classes (340 / 422) - 80% complete
Pass 1: Analyzing classes (341 / 422) - 80% complete
Pass 1: Analyzing classes (342 / 422) - 81% complete
Pass 1: Analyzing classes (343 / 422) - 81% complete
Pass 1: Analyzing classes (344 / 422) - 81% complete
Pass 1: Analyzing classes (345 / 422) - 81% complete
Pass 1: Analyzing classes (346 / 422) - 81% complete
Pass 1: Analyzing classes (347 / 422) - 82% complete
Pass 1: Analyzing classes (348 / 422) - 82% complete
Pass 1: Analyzing classes (349 / 422) - 82% complete
Pass 1: Analyzing classes (350 / 422) - 82% complete
Pass 1: Analyzing classes (351 / 422) - 83% complete
Pass 1: Analyzing classes (352 / 422) - 83% complete
Pass 1: Analyzing classes (353 / 422) - 83% complete
Pass 1: Analyzing classes (354 / 422) - 83% complete
Pass 1: Analyzing classes (355 / 422) - 84% complete
Pass 1: Analyzing classes (356 / 422) - 84% complete
Pass 1: Analyzing classes (357 / 422) - 84% complete
Pass 1: Analyzing classes (358 / 422) - 84% complete
Pass 1: Analyzing classes (359 / 422) - 85% complete
Pass 1: Analyzing classes (360 / 422) - 85% complete
Pass 1: Analyzing classes (361 / 422) - 85% complete
Pass 1: Analyzing classes (362 / 422) - 85% complete
Pass 1: Analyzing classes (363 / 422) - 86% complete
Pass 1: Analyzing classes (364 / 422) - 86% complete
Pass 1: Analyzing classes (365 / 422) - 86% complete
Pass 1: Analyzing classes (366 / 422) - 86% complete
Pass 1: Analyzing classes (367 / 422) - 86% complete
Pass 1: Analyzing classes (368 / 422) - 87% complete
Pass 1: Analyzing classes (369 / 422) - 87% complete
Pass 1: Analyzing classes (370 / 422) - 87% complete
Pass 1: Analyzing classes (371 / 422) - 87% complete
Pass 1: Analyzing classes (372 / 422) - 88% complete
Pass 1: Analyzing classes (373 / 422) - 88% complete
Pass 1: Analyzing classes (374 / 422) - 88% complete
Pass 1: Analyzing classes (375 / 422) - 88% complete
Pass 1: Analyzing classes (376 / 422) - 89% complete
Pass 1: Analyzing classes (377 / 422) - 89% complete
Pass 1: Analyzing classes (378 / 422) - 89% complete
Pass 1: Analyzing classes (379 / 422) - 89% complete
Pass 1: Analyzing classes (380 / 422) - 90% complete
Pass 1: Analyzing classes (381 / 422) - 90% complete
Pass 1: Analyzing classes (382 / 422) - 90% complete
Pass 1: Analyzing classes (383 / 422) - 90% complete
Pass 1: Analyzing classes (384 / 422) - 90% complete
Pass 1: Analyzing classes (385 / 422) - 91% complete
Pass 1: Analyzing classes (386 / 422) - 91% complete
Pass 1: Analyzing classes (387 / 422) - 91% complete
Pass 1: Analyzing classes (388 / 422) - 91% complete
Pass 1: Analyzing classes (389 / 422) - 92% complete
Pass 1: Analyzing classes (390 / 422) - 92% complete
Pass 1: Analyzing classes (391 / 422) - 92% complete
Pass 1: Analyzing classes (392 / 422) - 92% complete
Pass 1: Analyzing classes (393 / 422) - 93% complete
Pass 1: Analyzing classes (394 / 422) - 93% complete
Pass 1: Analyzing classes (395 / 422) - 93% complete
Pass 1: Analyzing classes (396 / 422) - 93% complete
Pass 1: Analyzing classes (397 / 422) - 94% complete
Pass 1: Analyzing classes (398 / 422) - 94% complete
Pass 1: Analyzing classes (399 / 422) - 94% complete
Pass 1: Analyzing classes (400 / 422) - 94% complete
Pass 1: Analyzing classes (401 / 422) - 95% complete
Pass 1: Analyzing classes (402 / 422) - 95% complete
Pass 1: Analyzing classes (403 / 422) - 95% complete
Pass 1: Analyzing classes (404 / 422) - 95% complete
Pass 1: Analyzing classes (405 / 422) - 95% complete
Pass 1: Analyzing classes (406 / 422) - 96% complete
Pass 1: Analyzing classes (407 / 422) - 96% complete
Pass 1: Analyzing classes (408 / 422) - 96% complete
Pass 1: Analyzing classes (409 / 422) - 96% complete
Pass 1: Analyzing classes (410 / 422) - 97% complete
Pass 1: Analyzing classes (411 / 422) - 97% complete
Pass 1: Analyzing classes (412 / 422) - 97% complete
Pass 1: Analyzing classes (413 / 422) - 97% complete
Pass 1: Analyzing classes (414 / 422) - 98% complete
Pass 1: Analyzing classes (415 / 422) - 98% complete
Pass 1: Analyzing classes (416 / 422) - 98% complete
Pass 1: Analyzing classes (417 / 422) - 98% complete
Pass 1: Analyzing classes (418 / 422) - 99% complete
Pass 1: Analyzing classes (419 / 422) - 99% complete
Pass 1: Analyzing classes (420 / 422) - 99% complete
Pass 1: Analyzing classes (421 / 422) - 99% complete
Pass 1: Analyzing classes (422 / 422) - 100% complete

Pass 2: Analyzing classes (0 / 235) - 00% complete
Pass 2: Analyzing classes (1 / 235) - 00% complete
Pass 2: Analyzing classes (2 / 235) - 00% complete
Pass 2: Analyzing classes (3 / 235) - 01% complete
Pass 2: Analyzing classes (4 / 235) - 01% complete
Pass 2: Analyzing classes (5 / 235) - 02% complete
Pass 2: Analyzing classes (6 / 235) - 02% complete
Pass 2: Analyzing classes (7 / 235) - 02% complete
Pass 2: Analyzing classes (8 / 235) - 03% complete
Pass 2: Analyzing classes (9 / 235) - 03% complete
Pass 2: Analyzing classes (10 / 235) - 04% complete
Pass 2: Analyzing classes (11 / 235) - 04% complete
Pass 2: Analyzing classes (12 / 235) - 05% complete
Pass 2: Analyzing classes (13 / 235) - 05% complete
Pass 2: Analyzing classes (14 / 235) - 05% complete
Pass 2: Analyzing classes (15 / 235) - 06% complete
Pass 2: Analyzing classes (16 / 235) - 06% complete
Pass 2: Analyzing classes (17 / 235) - 07% complete
Pass 2: Analyzing classes (18 / 235) - 07% complete
Pass 2: Analyzing classes (19 / 235) - 08% complete
Pass 2: Analyzing classes (20 / 235) - 08% complete
Pass 2: Analyzing classes (21 / 235) - 08% complete
Pass 2: Analyzing classes (22 / 235) - 09% complete
Pass 2: Analyzing classes (23 / 235) - 09% complete
Pass 2: Analyzing classes (24 / 235) - 10% complete
Pass 2: Analyzing classes (25 / 235) - 10% complete
Pass 2: Analyzing classes (26 / 235) - 11% complete
Pass 2: Analyzing classes (27 / 235) - 11% complete
Pass 2: Analyzing classes (28 / 235) - 11% complete
Pass 2: Analyzing classes (29 / 235) - 12% complete
Pass 2: Analyzing classes (30 / 235) - 12% complete
Pass 2: Analyzing classes (31 / 235) - 13% complete
Pass 2: Analyzing classes (32 / 235) - 13% complete
Pass 2: Analyzing classes (33 / 235) - 14% complete
Pass 2: Analyzing classes (34 / 235) - 14% complete
Pass 2: Analyzing classes (35 / 235) - 14% complete
Pass 2: Analyzing classes (36 / 235) - 15% complete
Pass 2: Analyzing classes (37 / 235) - 15% complete
Pass 2: Analyzing classes (38 / 235) - 16% complete
Pass 2: Analyzing classes (39 / 235) - 16% complete
Pass 2: Analyzing classes (40 / 235) - 17% complete
Pass 2: Analyzing classes (41 / 235) - 17% complete
Pass 2: Analyzing classes (42 / 235) - 17% complete
Pass 2: Analyzing classes (43 / 235) - 18% complete
Pass 2: Analyzing classes (44 / 235) - 18% complete
Pass 2: Analyzing classes (45 / 235) - 19% complete
Pass 2: Analyzing classes (46 / 235) - 19% complete
Pass 2: Analyzing classes (47 / 235) - 20% complete
Pass 2: Analyzing classes (48 / 235) - 20% complete
Pass 2: Analyzing classes (49 / 235) - 20% complete
Pass 2: Analyzing classes (50 / 235) - 21% complete
Pass 2: Analyzing classes (51 / 235) - 21% complete
Pass 2: Analyzing classes (52 / 235) - 22% complete
Pass 2: Analyzing classes (53 / 235) - 22% complete
Pass 2: Analyzing classes (54 / 235) - 22% complete
Pass 2: Analyzing classes (55 / 235) - 23% complete
Pass 2: Analyzing classes (56 / 235) - 23% complete
Pass 2: Analyzing classes (57 / 235) - 24% complete
Pass 2: Analyzing classes (58 / 235) - 24% complete
Pass 2: Analyzing classes (59 / 235) - 25% complete
Pass 2: Analyzing classes (60 / 235) - 25% complete
Pass 2: Analyzing classes (61 / 235) - 25% complete
Pass 2: Analyzing classes (62 / 235) - 26% complete
Pass 2: Analyzing classes (63 / 235) - 26% complete
Pass 2: Analyzing classes (64 / 235) - 27% complete
Pass 2: Analyzing classes (65 / 235) - 27% complete
Pass 2: Analyzing classes (66 / 235) - 28% complete
Pass 2: Analyzing classes (67 / 235) - 28% complete
Pass 2: Analyzing classes (68 / 235) - 28% complete
Pass 2: Analyzing classes (69 / 235) - 29% complete
Pass 2: Analyzing classes (70 / 235) - 29% complete
Pass 2: Analyzing classes (71 / 235) - 30% complete
Pass 2: Analyzing classes (72 / 235) - 30% complete
Pass 2: Analyzing classes (73 / 235) - 31% complete
Pass 2: Analyzing classes (74 / 235) - 31% complete
Pass 2: Analyzing classes (75 / 235) - 31% complete
Pass 2: Analyzing classes (76 / 235) - 32% complete
Pass 2: Analyzing classes (77 / 235) - 32% complete
Pass 2: Analyzing classes (78 / 235) - 33% complete
Pass 2: Analyzing classes (79 / 235) - 33% complete
Pass 2: Analyzing classes (80 / 235) - 34% complete
Pass 2: Analyzing classes (81 / 235) - 34% complete
Pass 2: Analyzing classes (82 / 235) - 34% complete
Pass 2: Analyzing classes (83 / 235) - 35% complete
Pass 2: Analyzing classes (84 / 235) - 35% complete
Pass 2: Analyzing classes (85 / 235) - 36% complete
Pass 2: Analyzing classes (86 / 235) - 36% complete
Pass 2: Analyzing classes (87 / 235) - 37% complete
Pass 2: Analyzing classes (88 / 235) - 37% complete
Pass 2: Analyzing classes (89 / 235) - 37% complete
Pass 2: Analyzing classes (90 / 235) - 38% complete
Pass 2: Analyzing classes (91 / 235) - 38% complete
Pass 2: Analyzing classes (92 / 235) - 39% complete
Pass 2: Analyzing classes (93 / 235) - 39% complete
Pass 2: Analyzing classes (94 / 235) - 40% complete
Pass 2: Analyzing classes (95 / 235) - 40% complete
Pass 2: Analyzing classes (96 / 235) - 40% complete
Pass 2: Analyzing classes (97 / 235) - 41% complete
Pass 2: Analyzing classes (98 / 235) - 41% complete
Pass 2: Analyzing classes (99 / 235) - 42% complete
Pass 2: Analyzing classes (100 / 235) - 42% complete
Pass 2: Analyzing classes (101 / 235) - 42% complete
Pass 2: Analyzing classes (102 / 235) - 43% complete
Pass 2: Analyzing classes (103 / 235) - 43% complete
Pass 2: Analyzing classes (104 / 235) - 44% complete
Pass 2: Analyzing classes (105 / 235) - 44% complete
Pass 2: Analyzing classes (106 / 235) - 45% complete
Pass 2: Analyzing classes (107 / 235) - 45% complete
Pass 2: Analyzing classes (108 / 235) - 45% complete
Pass 2: Analyzing classes (109 / 235) - 46% complete
Pass 2: Analyzing classes (110 / 235) - 46% complete
Pass 2: Analyzing classes (111 / 235) - 47% complete
Pass 2: Analyzing classes (112 / 235) - 47% complete
Pass 2: Analyzing classes (113 / 235) - 48% complete
Pass 2: Analyzing classes (114 / 235) - 48% complete
Pass 2: Analyzing classes (115 / 235) - 48% complete
Pass 2: Analyzing classes (116 / 235) - 49% complete
Pass 2: Analyzing classes (117 / 235) - 49% complete
Pass 2: Analyzing classes (118 / 235) - 50% complete
Pass 2: Analyzing classes (119 / 235) - 50% complete
Pass 2: Analyzing classes (120 / 235) - 51% complete
Pass 2: Analyzing classes (121 / 235) - 51% complete
Pass 2: Analyzing classes (122 / 235) - 51% complete
Pass 2: Analyzing classes (123 / 235) - 52% complete
Pass 2: Analyzing classes (124 / 235) - 52% complete
Pass 2: Analyzing classes (125 / 235) - 53% complete
Pass 2: Analyzing classes (126 / 235) - 53% complete
Pass 2: Analyzing classes (127 / 235) - 54% complete
Pass 2: Analyzing classes (128 / 235) - 54% complete
Pass 2: Analyzing classes (129 / 235) - 54% complete
Pass 2: Analyzing classes (130 / 235) - 55% complete
Pass 2: Analyzing classes (131 / 235) - 55% complete
Pass 2: Analyzing classes (132 / 235) - 56% complete
Pass 2: Analyzing classes (133 / 235) - 56% complete
Pass 2: Analyzing classes (134 / 235) - 57% complete
Pass 2: Analyzing classes (135 / 235) - 57% complete
Pass 2: Analyzing classes (136 / 235) - 57% complete
Pass 2: Analyzing classes (137 / 235) - 58% complete
Pass 2: Analyzing classes (138 / 235) - 58% complete
Pass 2: Analyzing classes (139 / 235) - 59% complete
Pass 2: Analyzing classes (140 / 235) - 59% complete
Pass 2: Analyzing classes (141 / 235) - 60% complete
Pass 2: Analyzing classes (142 / 235) - 60% complete
Pass 2: Analyzing classes (143 / 235) - 60% complete
Pass 2: Analyzing classes (144 / 235) - 61% complete
Pass 2: Analyzing classes (145 / 235) - 61% complete
Pass 2: Analyzing classes (146 / 235) - 62% complete
Pass 2: Analyzing classes (147 / 235) - 62% complete
Pass 2: Analyzing classes (148 / 235) - 62% complete
Pass 2: Analyzing classes (149 / 235) - 63% complete
Pass 2: Analyzing classes (150 / 235) - 63% complete
Pass 2: Analyzing classes (151 / 235) - 64% complete
Pass 2: Analyzing classes (152 / 235) - 64% complete
Pass 2: Analyzing classes (153 / 235) - 65% complete
Pass 2: Analyzing classes (154 / 235) - 65% complete
Pass 2: Analyzing classes (155 / 235) - 65% complete
Pass 2: Analyzing classes (156 / 235) - 66% complete
Pass 2: Analyzing classes (157 / 235) - 66% complete
Pass 2: Analyzing classes (158 / 235) - 67% complete
Pass 2: Analyzing classes (159 / 235) - 67% complete
Pass 2: Analyzing classes (160 / 235) - 68% complete
Pass 2: Analyzing classes (161 / 235) - 68% complete
Pass 2: Analyzing classes (162 / 235) - 68% complete
Pass 2: Analyzing classes (163 / 235) - 69% complete
Pass 2: Analyzing classes (164 / 235) - 69% complete
Pass 2: Analyzing classes (165 / 235) - 70% complete
Pass 2: Analyzing classes (166 / 235) - 70% complete
Pass 2: Analyzing classes (167 / 235) - 71% complete
Pass 2: Analyzing classes (168 / 235) - 71% complete
Pass 2: Analyzing classes (169 / 235) - 71% complete
Pass 2: Analyzing classes (170 / 235) - 72% complete
Pass 2: Analyzing classes (171 / 235) - 72% complete
Pass 2: Analyzing classes (172 / 235) - 73% complete
Pass 2: Analyzing classes (173 / 235) - 73% complete
Pass 2: Analyzing classes (174 / 235) - 74% complete
Pass 2: Analyzing classes (175 / 235) - 74% complete
Pass 2: Analyzing classes (176 / 235) - 74% complete
Pass 2: Analyzing classes (177 / 235) - 75% complete
Pass 2: Analyzing classes (178 / 235) - 75% complete
Pass 2: Analyzing classes (179 / 235) - 76% complete
Pass 2: Analyzing classes (180 / 235) - 76% complete
Pass 2: Analyzing classes (181 / 235) - 77% complete
Pass 2: Analyzing classes (182 / 235) - 77% complete
Pass 2: Analyzing classes (183 / 235) - 77% complete
Pass 2: Analyzing classes (184 / 235) - 78% complete
Pass 2: Analyzing classes (185 / 235) - 78% complete
Pass 2: Analyzing classes (186 / 235) - 79% complete
Pass 2: Analyzing classes (187 / 235) - 79% complete
Pass 2: Analyzing classes (188 / 235) - 80% complete
Pass 2: Analyzing classes (189 / 235) - 80% complete
Pass 2: Analyzing classes (190 / 235) - 80% complete
Pass 2: Analyzing classes (191 / 235) - 81% complete
Pass 2: Analyzing classes (192 / 235) - 81% complete
Pass 2: Analyzing classes (193 / 235) - 82% complete
Pass 2: Analyzing classes (194 / 235) - 82% complete
Pass 2: Analyzing classes (195 / 235) - 82% complete
Pass 2: Analyzing classes (196 / 235) - 83% complete
Pass 2: Analyzing classes (197 / 235) - 83% complete
Pass 2: Analyzing classes (198 / 235) - 84% complete
Pass 2: Analyzing classes (199 / 235) - 84% complete
Pass 2: Analyzing classes (200 / 235) - 85% complete
Pass 2: Analyzing classes (201 / 235) - 85% complete
Pass 2: Analyzing classes (202 / 235) - 85% complete
Pass 2: Analyzing classes (203 / 235) - 86% complete
Pass 2: Analyzing classes (204 / 235) - 86% complete
Pass 2: Analyzing classes (205 / 235) - 87% complete
Pass 2: Analyzing classes (206 / 235) - 87% complete
Pass 2: Analyzing classes (207 / 235) - 88% complete
Pass 2: Analyzing classes (208 / 235) - 88% complete
Pass 2: Analyzing classes (209 / 235) - 88% complete
Pass 2: Analyzing classes (210 / 235) - 89% complete
Pass 2: Analyzing classes (211 / 235) - 89% complete
Pass 2: Analyzing classes (212 / 235) - 90% complete
Pass 2: Analyzing classes (213 / 235) - 90% complete
Pass 2: Analyzing classes (214 / 235) - 91% complete
Pass 2: Analyzing classes (215 / 235) - 91% complete
Pass 2: Analyzing classes (216 / 235) - 91% complete
Pass 2: Analyzing classes (217 / 235) - 92% complete
Pass 2: Analyzing classes (218 / 235) - 92% complete
Pass 2: Analyzing classes (219 / 235) - 93% complete
Pass 2: Analyzing classes (220 / 235) - 93% complete
Pass 2: Analyzing classes (221 / 235) - 94% complete
Pass 2: Analyzing classes (222 / 235) - 94% complete
Pass 2: Analyzing classes (223 / 235) - 94% complete
Pass 2: Analyzing classes (224 / 235) - 95% complete
Pass 2: Analyzing classes (225 / 235) - 95% complete
Pass 2: Analyzing classes (226 / 235) - 96% complete
Pass 2: Analyzing classes (227 / 235) - 96% complete
Pass 2: Analyzing classes (228 / 235) - 97% complete
Pass 2: Analyzing classes (229 / 235) - 97% complete
Pass 2: Analyzing classes (230 / 235) - 97% complete
Pass 2: Analyzing classes (231 / 235) - 98% complete
Pass 2: Analyzing classes (232 / 235) - 98% complete
Pass 2: Analyzing classes (233 / 235) - 99% complete
Pass 2: Analyzing classes (234 / 235) - 99% complete
Pass 2: Analyzing classes (235 / 235) - 100% complete
Done with analysis
The following errors occurred during analysis:
  Cannot open codebase filesystem:/jobs/genie.virgo/bundlor-development/workspace/org.eclipse.virgo.bundlor/build/classes/main/META-INF/INDEX.LIST
    java.io.IOException: Wrong magic bytes of 4a617249 for zip file /jobs/genie.virgo/bundlor-development/workspace/org.eclipse.virgo.bundlor/build/classes/main/META-INF/INDEX.LIST of 252 bytes
      At edu.umd.cs.findbugs.classfile.impl.ZipFileCodeBase.<init>(ZipFileCodeBase.java:87)
      At edu.umd.cs.findbugs.classfile.impl.ZipCodeBaseFactory.makeZipCodeBase(ZipCodeBaseFactory.java:39)
      At edu.umd.cs.findbugs.classfile.impl.ClassFactory.createFilesystemCodeBase(ClassFactory.java:121)
      At edu.umd.cs.findbugs.classfile.impl.FilesystemCodeBaseLocator.openCodeBase(FilesystemCodeBaseLocator.java:77)
      At edu.umd.cs.findbugs.classfile.impl.ClassPathBuilder.processWorkList(ClassPathBuilder.java:607)
      At edu.umd.cs.findbugs.classfile.impl.ClassPathBuilder.build(ClassPathBuilder.java:226)
      At edu.umd.cs.findbugs.FindBugs2.buildClassPath(FindBugs2.java:677)
      At edu.umd.cs.findbugs.FindBugs2.execute(FindBugs2.java:218)
      At org.gradle.api.plugins.quality.internal.findbugs.FindBugsExecuter.runFindbugs(FindBugsExecuter.java:39)
      At sun.reflect.NativeMethodAccessorImpl.invoke0(Native Method)
      At sun.reflect.NativeMethodAccessorImpl.invoke(NativeMethodAccessorImpl.java:62)
      At sun.reflect.DelegatingMethodAccessorImpl.invoke(DelegatingMethodAccessorImpl.java:43)
      At java.lang.reflect.Method.invoke(Method.java:498)
      At org.gradle.process.internal.worker.request.WorkerAction.run(WorkerAction.java:88)
      At org.gradle.process.internal.worker.request.WorkerAction.runThenStop(WorkerAction.java:72)
      At sun.reflect.NativeMethodAccessorImpl.invoke0(Native Method)
      At sun.reflect.NativeMethodAccessorImpl.invoke(NativeMethodAccessorImpl.java:62)
      At sun.reflect.DelegatingMethodAccessorImpl.invoke(DelegatingMethodAccessorImpl.java:43)
      At java.lang.reflect.Method.invoke(Method.java:498)
      At org.gradle.internal.dispatch.ReflectionDispatch.dispatch(ReflectionDispatch.java:35)
      At org.gradle.internal.dispatch.ReflectionDispatch.dispatch(ReflectionDispatch.java:24)
      At org.gradle.internal.remote.internal.hub.MessageHubBackedObjectConnection$DispatchWrapper.dispatch(MessageHubBackedObjectConnection.java:147)
      At org.gradle.internal.remote.internal.hub.MessageHubBackedObjectConnection$DispatchWrapper.dispatch(MessageHubBackedObjectConnection.java:129)
      At org.gradle.internal.remote.internal.hub.MessageHub$Handler.run(MessageHub.java:404)
      At org.gradle.internal.concurrent.ExecutorPolicy$CatchAndRecordFailures.onExecute(ExecutorPolicy.java:63)
      At org.gradle.internal.concurrent.StoppableExecutorImpl$1.run(StoppableExecutorImpl.java:46)
      At java.util.concurrent.ThreadPoolExecutor.runWorker(ThreadPoolExecutor.java:1149)
      At java.util.concurrent.ThreadPoolExecutor$Worker.run(ThreadPoolExecutor.java:624)
      At java.lang.Thread.run(Thread.java:748)
  Cannot open codebase filesystem:/jobs/genie.virgo/bundlor-development/workspace/org.eclipse.virgo.bundlor/build/classes/main/META-INF/MANIFEST.MF
    java.io.IOException: Wrong magic bytes of 4d616e69 for zip file /jobs/genie.virgo/bundlor-development/workspace/org.eclipse.virgo.bundlor/build/classes/main/META-INF/MANIFEST.MF of 550 bytes
      At edu.umd.cs.findbugs.classfile.impl.ZipFileCodeBase.<init>(ZipFileCodeBase.java:87)
      At edu.umd.cs.findbugs.classfile.impl.ZipCodeBaseFactory.makeZipCodeBase(ZipCodeBaseFactory.java:39)
      At edu.umd.cs.findbugs.classfile.impl.ClassFactory.createFilesystemCodeBase(ClassFactory.java:121)
      At edu.umd.cs.findbugs.classfile.impl.FilesystemCodeBaseLocator.openCodeBase(FilesystemCodeBaseLocator.java:77)
      At edu.umd.cs.findbugs.classfile.impl.ClassPathBuilder.processWorkList(ClassPathBuilder.java:607)
      At edu.umd.cs.findbugs.classfile.impl.ClassPathBuilder.build(ClassPathBuilder.java:226)
      At edu.umd.cs.findbugs.FindBugs2.buildClassPath(FindBugs2.java:677)
      At edu.umd.cs.findbugs.FindBugs2.execute(FindBugs2.java:218)
      At org.gradle.api.plugins.quality.internal.findbugs.FindBugsExecuter.runFindbugs(FindBugsExecuter.java:39)
      At sun.reflect.NativeMethodAccessorImpl.invoke0(Native Method)
      At sun.reflect.NativeMethodAccessorImpl.invoke(NativeMethodAccessorImpl.java:62)
      At sun.reflect.DelegatingMethodAccessorImpl.invoke(DelegatingMethodAccessorImpl.java:43)
      At java.lang.reflect.Method.invoke(Method.java:498)
      At org.gradle.process.internal.worker.request.WorkerAction.run(WorkerAction.java:88)
      At org.gradle.process.internal.worker.request.WorkerAction.runThenStop(WorkerAction.java:72)
      At sun.reflect.NativeMethodAccessorImpl.invoke0(Native Method)
      At sun.reflect.NativeMethodAccessorImpl.invoke(NativeMethodAccessorImpl.java:62)
      At sun.reflect.DelegatingMethodAccessorImpl.invoke(DelegatingMethodAccessorImpl.java:43)
      At java.lang.reflect.Method.invoke(Method.java:498)
      At org.gradle.internal.dispatch.ReflectionDispatch.dispatch(ReflectionDispatch.java:35)
      At org.gradle.internal.dispatch.ReflectionDispatch.dispatch(ReflectionDispatch.java:24)
      At org.gradle.internal.remote.internal.hub.MessageHubBackedObjectConnection$DispatchWrapper.dispatch(MessageHubBackedObjectConnection.java:147)
      At org.gradle.internal.remote.internal.hub.MessageHubBackedObjectConnection$DispatchWrapper.dispatch(MessageHubBackedObjectConnection.java:129)
      At org.gradle.internal.remote.internal.hub.MessageHub$Handler.run(MessageHub.java:404)
      At org.gradle.internal.concurrent.ExecutorPolicy$CatchAndRecordFailures.onExecute(ExecutorPolicy.java:63)
      At org.gradle.internal.concurrent.StoppableExecutorImpl$1.run(StoppableExecutorImpl.java:46)
      At java.util.concurrent.ThreadPoolExecutor.runWorker(ThreadPoolExecutor.java:1149)
      At java.util.concurrent.ThreadPoolExecutor$Worker.run(ThreadPoolExecutor.java:624)
      At java.lang.Thread.run(Thread.java:748)
  Cannot open codebase filesystem:/jobs/genie.virgo/bundlor-development/workspace/org.eclipse.virgo.bundlor/build/classes/main/about.html
    java.io.IOException: Wrong magic bytes of 3c21444f for zip file /jobs/genie.virgo/bundlor-development/workspace/org.eclipse.virgo.bundlor/build/classes/main/about.html of 1433 bytes
      At edu.umd.cs.findbugs.classfile.impl.ZipFileCodeBase.<init>(ZipFileCodeBase.java:87)
      At edu.umd.cs.findbugs.classfile.impl.ZipCodeBaseFactory.makeZipCodeBase(ZipCodeBaseFactory.java:39)
      At edu.umd.cs.findbugs.classfile.impl.ClassFactory.createFilesystemCodeBase(ClassFactory.java:121)
      At edu.umd.cs.findbugs.classfile.impl.FilesystemCodeBaseLocator.openCodeBase(FilesystemCodeBaseLocator.java:77)
      At edu.umd.cs.findbugs.classfile.impl.ClassPathBuilder.processWorkList(ClassPathBuilder.java:607)
      At edu.umd.cs.findbugs.classfile.impl.ClassPathBuilder.build(ClassPathBuilder.java:226)
      At edu.umd.cs.findbugs.FindBugs2.buildClassPath(FindBugs2.java:677)
      At edu.umd.cs.findbugs.FindBugs2.execute(FindBugs2.java:218)
      At org.gradle.api.plugins.quality.internal.findbugs.FindBugsExecuter.runFindbugs(FindBugsExecuter.java:39)
      At sun.reflect.NativeMethodAccessorImpl.invoke0(Native Method)
      At sun.reflect.NativeMethodAccessorImpl.invoke(NativeMethodAccessorImpl.java:62)
      At sun.reflect.DelegatingMethodAccessorImpl.invoke(DelegatingMethodAccessorImpl.java:43)
      At java.lang.reflect.Method.invoke(Method.java:498)
      At org.gradle.process.internal.worker.request.WorkerAction.run(WorkerAction.java:88)
      At org.gradle.process.internal.worker.request.WorkerAction.runThenStop(WorkerAction.java:72)
      At sun.reflect.NativeMethodAccessorImpl.invoke0(Native Method)
      At sun.reflect.NativeMethodAccessorImpl.invoke(NativeMethodAccessorImpl.java:62)
      At sun.reflect.DelegatingMethodAccessorImpl.invoke(DelegatingMethodAccessorImpl.java:43)
      At java.lang.reflect.Method.invoke(Method.java:498)
      At org.gradle.internal.dispatch.ReflectionDispatch.dispatch(ReflectionDispatch.java:35)
      At org.gradle.internal.dispatch.ReflectionDispatch.dispatch(ReflectionDispatch.java:24)
      At org.gradle.internal.remote.internal.hub.MessageHubBackedObjectConnection$DispatchWrapper.dispatch(MessageHubBackedObjectConnection.java:147)
      At org.gradle.internal.remote.internal.hub.MessageHubBackedObjectConnection$DispatchWrapper.dispatch(MessageHubBackedObjectConnection.java:129)
      At org.gradle.internal.remote.internal.hub.MessageHub$Handler.run(MessageHub.java:404)
      At org.gradle.internal.concurrent.ExecutorPolicy$CatchAndRecordFailures.onExecute(ExecutorPolicy.java:63)
      At org.gradle.internal.concurrent.StoppableExecutorImpl$1.run(StoppableExecutorImpl.java:46)
      At java.util.concurrent.ThreadPoolExecutor.runWorker(ThreadPoolExecutor.java:1149)
      At java.util.concurrent.ThreadPoolExecutor$Worker.run(ThreadPoolExecutor.java:624)
      At java.lang.Thread.run(Thread.java:748)

:org.eclipse.virgo.bundlor:copyTestBundles
Download https://repo1.maven.org/maven2/org/apache/wicket/wicket-ioc/1.3.3/wicket-ioc-1.3.3.pom
Download https://repo1.maven.org/maven2/org/apache/wicket/wicket-jdk14/1.3.3/wicket-jdk14-1.3.3.pom
Download https://repo1.maven.org/maven2/org/apache/wicket/wicket-parent/1.3.3/wicket-parent-1.3.3.pom
Download https://repo1.maven.org/maven2/org/apache/wicket/wicket-ioc/1.3.3/wicket-ioc-1.3.3.jar
:org.eclipse.virgo.bundlor:compileTestJava
Download http://build.eclipse.org/rt/virgo/maven/bundles/release/junit/junit/4.7/junit-4.7.pom
[Fatal Error] junit-4.7.pom:2:3: The markup in the document preceding the root element must be well-formed.
:org.eclipse.virgo.bundlor:compileTestJava FAILED

FAILURE: Build failed with an exception.

* What went wrong:
Could not resolve all dependencies for configuration ':org.eclipse.virgo.bundlor:testCompileClasspath'.
> Could not resolve junit:junit:4.7.
  Required by:
      project :org.eclipse.virgo.bundlor
   > Could not resolve junit:junit:4.7.
      > Could not get resource 'https://repo1.maven.org/maven2/junit/junit/4.7/junit-4.7.pom'.
         > Could not GET 'https://repo1.maven.org/maven2/junit/junit/4.7/junit-4.7.pom'.
            > Connect to repo1.maven.org:443 [repo1.maven.org/151.101.124.209] failed: Connection timed out (Connection timed out)
   > Could not resolve junit:junit:4.7.
      > Could not parse POM http://build.eclipse.org/rt/virgo/maven/bundles/release/junit/junit/4.7/junit-4.7.pom
         > The markup in the document preceding the root element must be well-formed.

* Try:
Run with --info or --debug option to get more log output.

* Exception is:
org.gradle.api.artifacts.ResolveException: Could not resolve all dependencies for configuration ':org.eclipse.virgo.bundlor:testCompileClasspath'.
	at org.gradle.api.internal.artifacts.ivyservice.DefaultLenientConfiguration.rethrowFailure(DefaultLenientConfiguration.java:192)
	at org.gradle.api.internal.artifacts.ivyservice.DefaultLenientConfiguration$1.collectFiles(DefaultLenientConfiguration.java:141)
	at org.gradle.api.internal.artifacts.configurations.DefaultConfiguration$ConfigurationFileCollection.getFiles(DefaultConfiguration.java:810)
	at org.gradle.api.internal.artifacts.configurations.DefaultConfiguration.getFiles(DefaultConfiguration.java:376)
	at org.gradle.api.internal.artifacts.configurations.DefaultConfiguration_Decorated.getFiles(Unknown Source)
	at org.gradle.api.internal.file.AbstractFileCollection.iterator(AbstractFileCollection.java:68)
	at org.gradle.api.internal.changedetection.state.AbstractFileCollectionSnapshotter$FileCollectionVisitorImpl.visitCollection(AbstractFileCollectionSnapshotter.java:133)
	at org.gradle.api.internal.file.AbstractFileCollection.visitRootElements(AbstractFileCollection.java:234)
	at org.gradle.api.internal.file.CompositeFileCollection.visitRootElements(CompositeFileCollection.java:185)
	at org.gradle.api.internal.changedetection.state.AbstractFileCollectionSnapshotter.snapshot(AbstractFileCollectionSnapshotter.java:71)
	at org.gradle.api.internal.changedetection.rules.AbstractNamedFileSnapshotTaskStateChanges.buildSnapshots(AbstractNamedFileSnapshotTaskStateChanges.java:88)
	at org.gradle.api.internal.changedetection.rules.AbstractNamedFileSnapshotTaskStateChanges.<init>(AbstractNamedFileSnapshotTaskStateChanges.java:55)
	at org.gradle.api.internal.changedetection.rules.InputFilesTaskStateChanges.<init>(InputFilesTaskStateChanges.java:28)
	at org.gradle.api.internal.changedetection.rules.TaskUpToDateState.<init>(TaskUpToDateState.java:56)
	at org.gradle.api.internal.changedetection.changes.DefaultTaskArtifactStateRepository$TaskArtifactStateImpl.getStates(DefaultTaskArtifactStateRepository.java:170)
	at org.gradle.api.internal.changedetection.changes.DefaultTaskArtifactStateRepository$TaskArtifactStateImpl.isUpToDate(DefaultTaskArtifactStateRepository.java:85)
	at org.gradle.api.internal.tasks.execution.SkipUpToDateTaskExecuter.execute(SkipUpToDateTaskExecuter.java:51)
	at org.gradle.api.internal.tasks.execution.ValidatingTaskExecuter.execute(ValidatingTaskExecuter.java:58)
	at org.gradle.api.internal.tasks.execution.SkipEmptySourceFilesTaskExecuter.execute(SkipEmptySourceFilesTaskExecuter.java:88)
	at org.gradle.api.internal.tasks.execution.ResolveTaskArtifactStateTaskExecuter.execute(ResolveTaskArtifactStateTaskExecuter.java:46)
	at org.gradle.api.internal.tasks.execution.SkipTaskWithNoActionsExecuter.execute(SkipTaskWithNoActionsExecuter.java:51)
	at org.gradle.api.internal.tasks.execution.SkipOnlyIfTaskExecuter.execute(SkipOnlyIfTaskExecuter.java:54)
	at org.gradle.api.internal.tasks.execution.ExecuteAtMostOnceTaskExecuter.execute(ExecuteAtMostOnceTaskExecuter.java:43)
	at org.gradle.api.internal.tasks.execution.CatchExceptionTaskExecuter.execute(CatchExceptionTaskExecuter.java:34)
	at org.gradle.execution.taskgraph.DefaultTaskGraphExecuter$EventFiringTaskWorker$1.execute(DefaultTaskGraphExecuter.java:236)
	at org.gradle.execution.taskgraph.DefaultTaskGraphExecuter$EventFiringTaskWorker$1.execute(DefaultTaskGraphExecuter.java:228)
	at org.gradle.internal.Transformers$4.transform(Transformers.java:169)
	at org.gradle.internal.progress.DefaultBuildOperationExecutor.run(DefaultBuildOperationExecutor.java:106)
	at org.gradle.internal.progress.DefaultBuildOperationExecutor.run(DefaultBuildOperationExecutor.java:61)
	at org.gradle.execution.taskgraph.DefaultTaskGraphExecuter$EventFiringTaskWorker.execute(DefaultTaskGraphExecuter.java:228)
	at org.gradle.execution.taskgraph.DefaultTaskGraphExecuter$EventFiringTaskWorker.execute(DefaultTaskGraphExecuter.java:215)
	at org.gradle.execution.taskgraph.AbstractTaskPlanExecutor$TaskExecutorWorker.processTask(AbstractTaskPlanExecutor.java:77)
	at org.gradle.execution.taskgraph.AbstractTaskPlanExecutor$TaskExecutorWorker.run(AbstractTaskPlanExecutor.java:58)
	at org.gradle.execution.taskgraph.DefaultTaskPlanExecutor.process(DefaultTaskPlanExecutor.java:32)
	at org.gradle.execution.taskgraph.DefaultTaskGraphExecuter.execute(DefaultTaskGraphExecuter.java:113)
	at org.gradle.execution.SelectedTaskExecutionAction.execute(SelectedTaskExecutionAction.java:37)
	at org.gradle.execution.DefaultBuildExecuter.execute(DefaultBuildExecuter.java:37)
	at org.gradle.execution.DefaultBuildExecuter.access$000(DefaultBuildExecuter.java:23)
	at org.gradle.execution.DefaultBuildExecuter$1.proceed(DefaultBuildExecuter.java:43)
	at org.gradle.execution.DryRunBuildExecutionAction.execute(DryRunBuildExecutionAction.java:32)
	at org.gradle.execution.DefaultBuildExecuter.execute(DefaultBuildExecuter.java:37)
	at org.gradle.execution.DefaultBuildExecuter.execute(DefaultBuildExecuter.java:30)
	at org.gradle.initialization.DefaultGradleLauncher$RunTasksAction.execute(DefaultGradleLauncher.java:230)
	at org.gradle.initialization.DefaultGradleLauncher$RunTasksAction.execute(DefaultGradleLauncher.java:227)
	at org.gradle.internal.Transformers$4.transform(Transformers.java:169)
	at org.gradle.internal.progress.DefaultBuildOperationExecutor.run(DefaultBuildOperationExecutor.java:106)
	at org.gradle.internal.progress.DefaultBuildOperationExecutor.run(DefaultBuildOperationExecutor.java:56)
	at org.gradle.initialization.DefaultGradleLauncher.doBuildStages(DefaultGradleLauncher.java:161)
	at org.gradle.initialization.DefaultGradleLauncher.doBuild(DefaultGradleLauncher.java:112)
	at org.gradle.initialization.DefaultGradleLauncher.run(DefaultGradleLauncher.java:95)
	at org.gradle.launcher.exec.GradleBuildController.run(GradleBuildController.java:66)
	at org.gradle.tooling.internal.provider.ExecuteBuildActionRunner.run(ExecuteBuildActionRunner.java:28)
	at org.gradle.launcher.exec.ChainingBuildActionRunner.run(ChainingBuildActionRunner.java:35)
	at org.gradle.launcher.exec.InProcessBuildActionExecuter.execute(InProcessBuildActionExecuter.java:41)
	at org.gradle.launcher.exec.InProcessBuildActionExecuter.execute(InProcessBuildActionExecuter.java:26)
	at org.gradle.tooling.internal.provider.ContinuousBuildActionExecuter.execute(ContinuousBuildActionExecuter.java:75)
	at org.gradle.tooling.internal.provider.ContinuousBuildActionExecuter.execute(ContinuousBuildActionExecuter.java:49)
	at org.gradle.tooling.internal.provider.ServicesSetupBuildActionExecuter.execute(ServicesSetupBuildActionExecuter.java:49)
	at org.gradle.tooling.internal.provider.ServicesSetupBuildActionExecuter.execute(ServicesSetupBuildActionExecuter.java:31)
	at org.gradle.launcher.daemon.server.exec.ExecuteBuild.doBuild(ExecuteBuild.java:67)
	at org.gradle.launcher.daemon.server.exec.BuildCommandOnly.execute(BuildCommandOnly.java:36)
	at org.gradle.launcher.daemon.server.api.DaemonCommandExecution.proceed(DaemonCommandExecution.java:120)
	at org.gradle.launcher.daemon.server.exec.WatchForDisconnection.execute(WatchForDisconnection.java:37)
	at org.gradle.launcher.daemon.server.api.DaemonCommandExecution.proceed(DaemonCommandExecution.java:120)
	at org.gradle.launcher.daemon.server.exec.ResetDeprecationLogger.execute(ResetDeprecationLogger.java:26)
	at org.gradle.launcher.daemon.server.api.DaemonCommandExecution.proceed(DaemonCommandExecution.java:120)
	at org.gradle.launcher.daemon.server.exec.RequestStopIfSingleUsedDaemon.execute(RequestStopIfSingleUsedDaemon.java:34)
	at org.gradle.launcher.daemon.server.api.DaemonCommandExecution.proceed(DaemonCommandExecution.java:120)
	at org.gradle.launcher.daemon.server.exec.ForwardClientInput$2.call(ForwardClientInput.java:74)
	at org.gradle.launcher.daemon.server.exec.ForwardClientInput$2.call(ForwardClientInput.java:72)
	at org.gradle.util.Swapper.swap(Swapper.java:38)
	at org.gradle.launcher.daemon.server.exec.ForwardClientInput.execute(ForwardClientInput.java:72)
	at org.gradle.launcher.daemon.server.api.DaemonCommandExecution.proceed(DaemonCommandExecution.java:120)
	at org.gradle.launcher.daemon.server.exec.LogAndCheckHealth.execute(LogAndCheckHealth.java:55)
	at org.gradle.launcher.daemon.server.api.DaemonCommandExecution.proceed(DaemonCommandExecution.java:120)
	at org.gradle.launcher.daemon.server.exec.LogToClient.doBuild(LogToClient.java:60)
	at org.gradle.launcher.daemon.server.exec.BuildCommandOnly.execute(BuildCommandOnly.java:36)
	at org.gradle.launcher.daemon.server.api.DaemonCommandExecution.proceed(DaemonCommandExecution.java:120)
	at org.gradle.launcher.daemon.server.exec.EstablishBuildEnvironment.doBuild(EstablishBuildEnvironment.java:72)
	at org.gradle.launcher.daemon.server.exec.BuildCommandOnly.execute(BuildCommandOnly.java:36)
	at org.gradle.launcher.daemon.server.api.DaemonCommandExecution.proceed(DaemonCommandExecution.java:120)
	at org.gradle.launcher.daemon.server.exec.StartBuildOrRespondWithBusy$1.run(StartBuildOrRespondWithBusy.java:50)
	at org.gradle.launcher.daemon.server.DaemonStateCoordinator$1.run(DaemonStateCoordinator.java:297)
	at org.gradle.internal.concurrent.ExecutorPolicy$CatchAndRecordFailures.onExecute(ExecutorPolicy.java:63)
	at org.gradle.internal.concurrent.StoppableExecutorImpl$1.run(StoppableExecutorImpl.java:46)
Caused by: org.gradle.internal.resolve.ModuleVersionResolveException: Could not resolve junit:junit:4.7.
Required by:
    project :org.eclipse.virgo.bundlor
	at org.gradle.api.internal.artifacts.ivyservice.ivyresolve.RepositoryChainComponentMetaDataResolver.resolveModule(RepositoryChainComponentMetaDataResolver.java:83)
	at org.gradle.api.internal.artifacts.ivyservice.ivyresolve.RepositoryChainComponentMetaDataResolver.resolve(RepositoryChainComponentMetaDataResolver.java:59)
	at org.gradle.api.internal.artifacts.ivyservice.resolveengine.ComponentResolversChain$ComponentMetaDataResolverChain.resolve(ComponentResolversChain.java:85)
	at org.gradle.api.internal.artifacts.ivyservice.clientmodule.ClientModuleResolver.resolve(ClientModuleResolver.java:45)
	at org.gradle.api.internal.artifacts.ivyservice.resolveengine.graph.DependencyGraphBuilder$ModuleVersionResolveState.resolve(DependencyGraphBuilder.java:661)
	at org.gradle.api.internal.artifacts.ivyservice.resolveengine.graph.DependencyGraphBuilder$ModuleVersionResolveState.getMetaData(DependencyGraphBuilder.java:672)
	at org.gradle.api.internal.artifacts.ivyservice.resolveengine.graph.DependencyGraphBuilder$DependencyEdge.calculateTargetConfigurations(DependencyGraphBuilder.java:297)
	at org.gradle.api.internal.artifacts.ivyservice.resolveengine.graph.DependencyGraphBuilder$DependencyEdge.attachToTargetConfigurations(DependencyGraphBuilder.java:270)
	at org.gradle.api.internal.artifacts.ivyservice.resolveengine.graph.DependencyGraphBuilder.traverseGraph(DependencyGraphBuilder.java:167)
	at org.gradle.api.internal.artifacts.ivyservice.resolveengine.graph.DependencyGraphBuilder.resolve(DependencyGraphBuilder.java:104)
	at org.gradle.api.internal.artifacts.ivyservice.resolveengine.DefaultArtifactDependencyResolver.resolve(DefaultArtifactDependencyResolver.java:92)
	at org.gradle.api.internal.artifacts.ivyservice.CacheLockingArtifactDependencyResolver$1.run(CacheLockingArtifactDependencyResolver.java:45)
	at org.gradle.internal.Factories$1.create(Factories.java:25)
	at org.gradle.cache.internal.DefaultCacheAccess.useCache(DefaultCacheAccess.java:189)
	at org.gradle.cache.internal.DefaultCacheAccess.useCache(DefaultCacheAccess.java:175)
	at org.gradle.cache.internal.DefaultPersistentDirectoryStore.useCache(DefaultPersistentDirectoryStore.java:134)
	at org.gradle.cache.internal.DefaultCacheFactory$ReferenceTrackingCache.useCache(DefaultCacheFactory.java:199)
	at org.gradle.api.internal.artifacts.ivyservice.DefaultCacheLockingManager.useCache(DefaultCacheLockingManager.java:65)
	at org.gradle.api.internal.artifacts.ivyservice.CacheLockingArtifactDependencyResolver.resolve(CacheLockingArtifactDependencyResolver.java:43)
	at org.gradle.api.internal.artifacts.ivyservice.DefaultConfigurationResolver.resolveGraph(DefaultConfigurationResolver.java:134)
	at org.gradle.api.internal.artifacts.ivyservice.ShortCircuitEmptyConfigurationResolver.resolveGraph(ShortCircuitEmptyConfigurationResolver.java:74)
	at org.gradle.api.internal.artifacts.ivyservice.ErrorHandlingConfigurationResolver.resolveGraph(ErrorHandlingConfigurationResolver.java:67)
	at org.gradle.api.internal.artifacts.configurations.DefaultConfiguration$4.execute(DefaultConfiguration.java:463)
	at org.gradle.api.internal.artifacts.configurations.DefaultConfiguration$4.execute(DefaultConfiguration.java:455)
	at org.gradle.internal.Transformers$4.transform(Transformers.java:169)
	at org.gradle.internal.progress.DefaultBuildOperationExecutor.run(DefaultBuildOperationExecutor.java:106)
	at org.gradle.internal.progress.DefaultBuildOperationExecutor.run(DefaultBuildOperationExecutor.java:56)
	at org.gradle.api.internal.artifacts.configurations.DefaultConfiguration.resolveGraphIfRequired(DefaultConfiguration.java:455)
	at org.gradle.api.internal.artifacts.configurations.DefaultConfiguration.resolveToStateOrLater(DefaultConfiguration.java:431)
	at org.gradle.api.internal.artifacts.configurations.DefaultConfiguration.access$1400(DefaultConfiguration.java:109)
	at org.gradle.api.internal.artifacts.configurations.DefaultConfiguration$ConfigurationFileCollection.getSelectedArtifacts(DefaultConfiguration.java:816)
	... 83 more
Caused by: org.gradle.internal.resolve.ModuleVersionResolveException: Could not resolve junit:junit:4.7.
	at org.gradle.api.internal.artifacts.ivyservice.ivyresolve.ErrorHandlingModuleComponentRepository$ErrorHandlingModuleComponentRepositoryAccess.resolveComponentMetaData(ErrorHandlingModuleComponentRepository.java:96)
	at org.gradle.api.internal.artifacts.ivyservice.ivyresolve.ComponentMetaDataResolveState.process(ComponentMetaDataResolveState.java:66)
	at org.gradle.api.internal.artifacts.ivyservice.ivyresolve.ComponentMetaDataResolveState.resolve(ComponentMetaDataResolveState.java:58)
	at org.gradle.api.internal.artifacts.ivyservice.ivyresolve.RepositoryChainComponentMetaDataResolver.findBestMatch(RepositoryChainComponentMetaDataResolver.java:116)
	at org.gradle.api.internal.artifacts.ivyservice.ivyresolve.RepositoryChainComponentMetaDataResolver.findBestMatch(RepositoryChainComponentMetaDataResolver.java:99)
	at org.gradle.api.internal.artifacts.ivyservice.ivyresolve.RepositoryChainComponentMetaDataResolver.resolveModule(RepositoryChainComponentMetaDataResolver.java:72)
	... 113 more
Caused by: org.gradle.api.resources.ResourceException: Could not get resource 'https://repo1.maven.org/maven2/junit/junit/4.7/junit-4.7.pom'.
	at org.gradle.internal.resource.ResourceExceptions.failure(ResourceExceptions.java:69)
	at org.gradle.internal.resource.ResourceExceptions.getFailed(ResourceExceptions.java:52)
	at org.gradle.api.internal.artifacts.repositories.resolver.DefaultExternalResourceArtifactResolver.downloadStaticResource(DefaultExternalResourceArtifactResolver.java:106)
	at org.gradle.api.internal.artifacts.repositories.resolver.DefaultExternalResourceArtifactResolver.resolveArtifact(DefaultExternalResourceArtifactResolver.java:65)
	at org.gradle.api.internal.artifacts.repositories.resolver.ExternalResourceResolver.parseMetaDataFromArtifact(ExternalResourceResolver.java:201)
	at org.gradle.api.internal.artifacts.repositories.resolver.ExternalResourceResolver.resolveStaticDependency(ExternalResourceResolver.java:178)
	at org.gradle.api.internal.artifacts.repositories.resolver.MavenResolver.doResolveComponentMetaData(MavenResolver.java:116)
	at org.gradle.api.internal.artifacts.repositories.resolver.ExternalResourceResolver$RemoteRepositoryAccess.resolveComponentMetaData(ExternalResourceResolver.java:458)
	at org.gradle.api.internal.artifacts.ivyservice.ivyresolve.CacheLockReleasingModuleComponentsRepository$LockReleasingRepositoryAccess$2.run(CacheLockReleasingModuleComponentsRepository.java:78)
	at org.gradle.internal.Factories$1.create(Factories.java:25)
	at org.gradle.cache.internal.DefaultCacheAccess.longRunningOperation(DefaultCacheAccess.java:250)
	at org.gradle.cache.internal.DefaultCacheAccess.longRunningOperation(DefaultCacheAccess.java:322)
	at org.gradle.cache.internal.DefaultPersistentDirectoryStore.longRunningOperation(DefaultPersistentDirectoryStore.java:144)
	at org.gradle.cache.internal.DefaultCacheFactory$ReferenceTrackingCache.longRunningOperation(DefaultCacheFactory.java:184)
	at org.gradle.api.internal.artifacts.ivyservice.DefaultCacheLockingManager.longRunningOperation(DefaultCacheLockingManager.java:50)
	at org.gradle.api.internal.artifacts.ivyservice.ivyresolve.CacheLockReleasingModuleComponentsRepository$LockReleasingRepositoryAccess.resolveComponentMetaData(CacheLockReleasingModuleComponentsRepository.java:76)
	at org.gradle.api.internal.artifacts.ivyservice.ivyresolve.CachingModuleComponentRepository$ResolveAndCacheRepositoryAccess.resolveComponentMetaData(CachingModuleComponentRepository.java:315)
	at org.gradle.api.internal.artifacts.ivyservice.ivyresolve.BaseModuleComponentRepositoryAccess.resolveComponentMetaData(BaseModuleComponentRepositoryAccess.java:49)
	at org.gradle.api.internal.artifacts.ivyservice.ivyresolve.memcache.InMemoryCachedModuleComponentRepository$CachedAccess.resolveComponentMetaData(InMemoryCachedModuleComponentRepository.java:82)
	at org.gradle.api.internal.artifacts.ivyservice.ivyresolve.ErrorHandlingModuleComponentRepository$ErrorHandlingModuleComponentRepositoryAccess.resolveComponentMetaData(ErrorHandlingModuleComponentRepository.java:94)
	... 118 more
Caused by: org.gradle.internal.resource.transport.http.HttpRequestException: Could not GET 'https://repo1.maven.org/maven2/junit/junit/4.7/junit-4.7.pom'.
	at org.gradle.internal.resource.transport.http.HttpClientHelper.performRequest(HttpClientHelper.java:82)
	at org.gradle.internal.resource.transport.http.HttpClientHelper.performRawGet(HttpClientHelper.java:66)
	at org.gradle.internal.resource.transport.http.HttpClientHelper.performGet(HttpClientHelper.java:70)
	at org.gradle.internal.resource.transport.http.HttpResourceAccessor.openResource(HttpResourceAccessor.java:43)
	at org.gradle.internal.resource.transport.http.HttpResourceAccessor.openResource(HttpResourceAccessor.java:29)
	at org.gradle.internal.resource.transfer.DefaultExternalResourceConnector.openResource(DefaultExternalResourceConnector.java:56)
	at org.gradle.internal.resource.transfer.ProgressLoggingExternalResourceAccessor.openResource(ProgressLoggingExternalResourceAccessor.java:36)
	at org.gradle.internal.resource.transport.DefaultExternalResourceRepository.getResource(DefaultExternalResourceRepository.java:67)
	at org.gradle.internal.resource.transfer.DefaultCacheAwareExternalResourceAccessor.getResource(DefaultCacheAwareExternalResourceAccessor.java:82)
	at org.gradle.api.internal.artifacts.repositories.resolver.DefaultExternalResourceArtifactResolver.downloadStaticResource(DefaultExternalResourceArtifactResolver.java:97)
	... 135 more
Caused by: org.apache.http.conn.HttpHostConnectException: Connect to repo1.maven.org:443 [repo1.maven.org/151.101.124.209] failed: Connection timed out (Connection timed out)
	at org.apache.http.impl.conn.DefaultHttpClientConnectionOperator.connect(DefaultHttpClientConnectionOperator.java:151)
	at org.apache.http.impl.conn.PoolingHttpClientConnectionManager.connect(PoolingHttpClientConnectionManager.java:353)
	at org.apache.http.impl.execchain.MainClientExec.establishRoute(MainClientExec.java:380)
	at org.apache.http.impl.execchain.MainClientExec.execute(MainClientExec.java:236)
	at org.apache.http.impl.execchain.ProtocolExec.execute(ProtocolExec.java:184)
	at org.apache.http.impl.execchain.RetryExec.execute(RetryExec.java:88)
	at org.apache.http.impl.execchain.RedirectExec.execute(RedirectExec.java:110)
	at org.apache.http.impl.client.InternalHttpClient.doExecute(InternalHttpClient.java:184)
	at org.apache.http.impl.client.CloseableHttpClient.execute(CloseableHttpClient.java:82)
	at org.gradle.internal.resource.transport.http.HttpClientHelper.performHttpRequest(HttpClientHelper.java:113)
	at org.gradle.internal.resource.transport.http.HttpClientHelper.executeGetOrHead(HttpClientHelper.java:89)
	at org.gradle.internal.resource.transport.http.HttpClientHelper.performRequest(HttpClientHelper.java:80)
	... 144 more
Caused by: java.net.ConnectException: Connection timed out (Connection timed out)
	at org.apache.http.conn.ssl.SSLConnectionSocketFactory.connectSocket(SSLConnectionSocketFactory.java:337)
	at org.apache.http.impl.conn.DefaultHttpClientConnectionOperator.connect(DefaultHttpClientConnectionOperator.java:134)
	... 155 more


BUILD FAILED

Total time: 3 mins 14.251 secs
Build step 'Invoke Gradle script' changed build result to FAILURE
Build step 'Invoke Gradle script' marked build as failure
[FINDBUGS] Skipping publisher since build result is FAILURE
Sending e-mails to: fwaibel@datenkollektiv.de dmarthaler@gmx.net
Recording test results
ERROR: Step ‘Publish JUnit test result report’ failed: No test report files were found. Configuration error?
Archiving artifacts
Started calculate disk usage of build
Finished Calculation of disk usage of build in 0 seconds
Started calculate disk usage of workspace
Finished Calculation of disk usage of workspace in 0 seconds
Finished: FAILURE