FailedConsole Output

Skipping 257 KB.. Full Log
xec] BUILD SUCCESSFUL
     [exec] Total time: 1 second
     [echo] exec-ant for target 'jar' gave return code 0
   [subant] Leaving directory: /jobs/genie.virgo/virgo.web.3.6.snapshot/workspace/org.eclipse.virgo.web.enterprise.catalina.fragment.webbeans
   [subant] Entering directory: /jobs/genie.virgo/virgo.web.3.6.snapshot/workspace/org.eclipse.virgo.web.enterprise.openejb.fragment.webbeans

exec-ant:
     [echo] exec-ant for target 'jar' executing in directory '/jobs/genie.virgo/virgo.web.3.6.snapshot/workspace/org.eclipse.virgo.web.enterprise.openejb.fragment.webbeans'
     [exec] Buildfile: /jobs/genie.virgo/virgo.web.3.6.snapshot/workspace/org.eclipse.virgo.web.enterprise.openejb.fragment.webbeans/build.xml
     [exec] 
     [exec] ivy.init:
     [exec] 
     [exec] ivy.file.exists:
     [exec] 
     [exec] resolve.init:
     [exec] 
     [exec] resolve.compile:
     [exec] [ivy:cachepath] :: Ivy 2.1.0 - 20090925235825 :: http://ant.apache.org/ivy/ ::
     [exec] [ivy:cachepath] :: loading settings :: file = /jobs/genie.virgo/virgo.web.3.6.snapshot/workspace/virgo-build/common/ivysettings.xml
     [exec] 
     [exec] compile.init:
     [exec] 
     [exec] jar.init:
     [exec] 
     [exec] jar:
     [exec]     [mkdir] Created dir: /jobs/genie.virgo/virgo.web.3.6.snapshot/workspace/org.eclipse.virgo.web.enterprise.openejb.fragment.webbeans/target/artifacts
     [exec]     [mkdir] Created dir: /jobs/genie.virgo/virgo.web.3.6.snapshot/workspace/org.eclipse.virgo.web.enterprise.openejb.fragment.webbeans/target/classes
     [exec]      [copy] Copying 3 files to /jobs/genie.virgo/virgo.web.3.6.snapshot/workspace/org.eclipse.virgo.web.enterprise.openejb.fragment.webbeans/target/classes
     [exec] 
     [exec] ivy.init:
     [exec] 
     [exec] bundlor.init:
     [exec] 
     [exec] bundlor:
     [exec]       [jar] Building jar: /jobs/genie.virgo/virgo.web.3.6.snapshot/workspace/org.eclipse.virgo.web.enterprise.openejb.fragment.webbeans/target/artifacts/org.eclipse.virgo.web.enterprise.openejb.fragment.webbeans.jar
     [exec]       [jar] Building MANIFEST-only jar: /jobs/genie.virgo/virgo.web.3.6.snapshot/workspace/org.eclipse.virgo.web.enterprise.openejb.fragment.webbeans/target/artifacts/org.eclipse.virgo.web.enterprise.openejb.fragment.webbeans-sources.jar
     [exec] :: delivering :: org.eclipse.virgo.web#org.eclipse.virgo.web.enterprise.openejb.fragment.webbeans;working@hipp6 :: 3.6.5.CI-2017-05-21_01-40-35 :: integration :: Sun May 21 05:40:36 EDT 2017
     [exec] 	delivering ivy file to /jobs/genie.virgo/virgo.web.3.6.snapshot/workspace/org.eclipse.virgo.web.enterprise.openejb.fragment.webbeans/target/artifacts/ivy.xml
     [exec] :: publishing :: org.eclipse.virgo.web#org.eclipse.virgo.web.enterprise.openejb.fragment.webbeans
     [exec] 	published org.eclipse.virgo.web.enterprise.openejb.fragment.webbeans to /opt/public/hipp/homes/genie.virgo/virgo-build-cache/integration-repo/org.eclipse.virgo.web/org.eclipse.virgo.web.enterprise.openejb.fragment.webbeans/3.6.5.CI-2017-05-21_01-40-35.part/org.eclipse.virgo.web.enterprise.openejb.fragment.webbeans-3.6.5.CI-2017-05-21_01-40-35.jar
     [exec] 	published org.eclipse.virgo.web.enterprise.openejb.fragment.webbeans-sources to /opt/public/hipp/homes/genie.virgo/virgo-build-cache/integration-repo/org.eclipse.virgo.web/org.eclipse.virgo.web.enterprise.openejb.fragment.webbeans/3.6.5.CI-2017-05-21_01-40-35.part/org.eclipse.virgo.web.enterprise.openejb.fragment.webbeans-sources-3.6.5.CI-2017-05-21_01-40-35.jar
     [exec] 	published ivy to /opt/public/hipp/homes/genie.virgo/virgo-build-cache/integration-repo/org.eclipse.virgo.web/org.eclipse.virgo.web.enterprise.openejb.fragment.webbeans/3.6.5.CI-2017-05-21_01-40-35.part/ivy-3.6.5.CI-2017-05-21_01-40-35.xml
     [exec] 	publish commited: moved /opt/public/hipp/homes/genie.virgo/virgo-build-cache/integration-repo/org.eclipse.virgo.web/org.eclipse.virgo.web.enterprise.openejb.fragment.webbeans/3.6.5.CI-2017-05-21_01-40-35.part 
     [exec] 		to /opt/public/hipp/homes/genie.virgo/virgo-build-cache/integration-repo/org.eclipse.virgo.web/org.eclipse.virgo.web.enterprise.openejb.fragment.webbeans/3.6.5.CI-2017-05-21_01-40-35
     [exec] 
     [exec] BUILD SUCCESSFUL
     [exec] Total time: 1 second
     [echo] exec-ant for target 'jar' gave return code 0
   [subant] Leaving directory: /jobs/genie.virgo/virgo.web.3.6.snapshot/workspace/org.eclipse.virgo.web.enterprise.openejb.fragment.webbeans
   [subant] Entering directory: /jobs/genie.virgo/virgo.web.3.6.snapshot/workspace/org.eclipse.virgo.web.tomcat
Trying to override old definition of task dist-jar
Trying to override old definition of task src-jar

exec-ant:
     [echo] exec-ant for target 'jar' executing in directory '/jobs/genie.virgo/virgo.web.3.6.snapshot/workspace/org.eclipse.virgo.web.tomcat'
     [exec] Buildfile: /jobs/genie.virgo/virgo.web.3.6.snapshot/workspace/org.eclipse.virgo.web.tomcat/build.xml
     [exec] Trying to override old definition of task dist-jar
     [exec] Trying to override old definition of task src-jar
     [exec] 
     [exec] ivy.init:
     [exec] 
     [exec] ivy.file.exists:
     [exec] 
     [exec] resolve.init:
     [exec] 
     [exec] resolve.compile:
     [exec] [ivy:cachepath] :: Ivy 2.1.0 - 20090925235825 :: http://ant.apache.org/ivy/ ::
     [exec] [ivy:cachepath] :: loading settings :: file = /jobs/genie.virgo/virgo.web.3.6.snapshot/workspace/virgo-build/common/ivysettings.xml
     [exec] [ivy:cachepath] downloading /opt/public/hipp/homes/genie.virgo/virgo-build-cache/integration-repo/org.eclipse.virgo.web/org.eclipse.virgo.web.tomcat.support/3.6.5.CI-2017-05-21_01-40-35/org.eclipse.virgo.web.tomcat.support-sources-3.6.5.CI-2017-05-21_01-40-35.jar ...
     [exec] [ivy:cachepath] .. (8kB)
     [exec] [ivy:cachepath] .. (0kB)
     [exec] [ivy:cachepath] 	[SUCCESSFUL ] org.eclipse.virgo.web#org.eclipse.virgo.web.tomcat.support;3.6.5.CI-2017-05-21_01-40-35!org.eclipse.virgo.web.tomcat.support-sources.jar(src) (7ms)
     [exec] [ivy:cachepath] downloading /opt/public/hipp/homes/genie.virgo/virgo-build-cache/integration-repo/org.eclipse.virgo.web/org.eclipse.virgo.web.tomcat.support/3.6.5.CI-2017-05-21_01-40-35/org.eclipse.virgo.web.tomcat.support-3.6.5.CI-2017-05-21_01-40-35.jar ...
     [exec] [ivy:cachepath] .. (23kB)
     [exec] [ivy:cachepath] .. (0kB)
     [exec] [ivy:cachepath] 	[SUCCESSFUL ] org.eclipse.virgo.web#org.eclipse.virgo.web.tomcat.support;3.6.5.CI-2017-05-21_01-40-35!org.eclipse.virgo.web.tomcat.support.jar (8ms)
     [exec] [ivy:cachepath] downloading /opt/public/hipp/homes/genie.virgo/virgo-build-cache/integration-repo/org.eclipse.virgo.web/org.eclipse.virgo.web.servlet.adapter/3.6.5.CI-2017-05-21_01-40-35/org.eclipse.virgo.web.servlet.adapter-3.6.5.CI-2017-05-21_01-40-35.jar ...
     [exec] [ivy:cachepath] .. (1kB)
     [exec] [ivy:cachepath] .. (0kB)
     [exec] [ivy:cachepath] 	[SUCCESSFUL ] org.eclipse.virgo.web#org.eclipse.virgo.web.servlet.adapter;3.6.5.CI-2017-05-21_01-40-35!org.eclipse.virgo.web.servlet.adapter.jar (6ms)
     [exec] [ivy:cachepath] downloading /opt/public/hipp/homes/genie.virgo/virgo-build-cache/integration-repo/org.eclipse.virgo.web/org.eclipse.virgo.web.servlet.adapter/3.6.5.CI-2017-05-21_01-40-35/org.eclipse.virgo.web.servlet.adapter-sources-3.6.5.CI-2017-05-21_01-40-35.jar ...
     [exec] [ivy:cachepath] .. (0kB)
     [exec] [ivy:cachepath] .. (0kB)
     [exec] [ivy:cachepath] 	[SUCCESSFUL ] org.eclipse.virgo.web#org.eclipse.virgo.web.servlet.adapter;3.6.5.CI-2017-05-21_01-40-35!org.eclipse.virgo.web.servlet.adapter-sources.jar(src) (5ms)
     [exec] [ivy:cachepath] downloading /opt/public/hipp/homes/genie.virgo/virgo-build-cache/integration-repo/org.eclipse.virgo.web/org.eclipse.virgo.web.spring.integration/3.6.5.CI-2017-05-21_01-40-35/org.eclipse.virgo.web.spring.integration-3.6.5.CI-2017-05-21_01-40-35.jar ...
     [exec] [ivy:cachepath] .. (1kB)
     [exec] [ivy:cachepath] .. (0kB)
     [exec] [ivy:cachepath] 	[SUCCESSFUL ] org.eclipse.virgo.web#org.eclipse.virgo.web.spring.integration;3.6.5.CI-2017-05-21_01-40-35!org.eclipse.virgo.web.spring.integration.jar (6ms)
     [exec] [ivy:cachepath] downloading /opt/public/hipp/homes/genie.virgo/virgo-build-cache/integration-repo/org.eclipse.virgo.web/org.eclipse.virgo.web.spring.integration/3.6.5.CI-2017-05-21_01-40-35/org.eclipse.virgo.web.spring.integration-sources-3.6.5.CI-2017-05-21_01-40-35.jar ...
     [exec] [ivy:cachepath] .. (0kB)
     [exec] [ivy:cachepath] .. (0kB)
     [exec] [ivy:cachepath] 	[SUCCESSFUL ] org.eclipse.virgo.web#org.eclipse.virgo.web.spring.integration;3.6.5.CI-2017-05-21_01-40-35!org.eclipse.virgo.web.spring.integration-sources.jar(src) (5ms)
     [exec] [ivy:cachepath] downloading http://build.eclipse.org/rt/virgo/ivy/bundles/release/org.eclipse.virgo.kernel/org.eclipse.virgo.kernel.agent.dm/3.6.4.RELEASE/org.eclipse.virgo.kernel.agent.dm-sources-3.6.4.RELEASE.jar ...
     [exec] [ivy:cachepath] .. (10kB)
     [exec] [ivy:cachepath] .. (0kB)
     [exec] [ivy:cachepath] 	[SUCCESSFUL ] org.eclipse.virgo.kernel#org.eclipse.virgo.kernel.agent.dm;3.6.4.RELEASE!org.eclipse.virgo.kernel.agent.dm-sources.jar(src) (46ms)
     [exec] [ivy:cachepath] downloading http://build.eclipse.org/rt/virgo/ivy/bundles/release/org.eclipse.virgo.kernel/org.eclipse.virgo.kernel.agent.dm/3.6.4.RELEASE/org.eclipse.virgo.kernel.agent.dm-3.6.4.RELEASE.jar ...
     [exec] [ivy:cachepath] .. (25kB)
     [exec] [ivy:cachepath] .. (0kB)
     [exec] [ivy:cachepath] 	[SUCCESSFUL ] org.eclipse.virgo.kernel#org.eclipse.virgo.kernel.agent.dm;3.6.4.RELEASE!org.eclipse.virgo.kernel.agent.dm.jar (40ms)
     [exec] [ivy:cachepath] downloading http://build.eclipse.org/rt/virgo/ivy/bundles/release/org.eclipse.virgo.kernel/org.eclipse.virgo.kernel.dmfragment/3.6.4.RELEASE/org.eclipse.virgo.kernel.dmfragment-sources-3.6.4.RELEASE.jar ...
     [exec] [ivy:cachepath] .. (14kB)
     [exec] [ivy:cachepath] .. (0kB)
     [exec] [ivy:cachepath] 	[SUCCESSFUL ] org.eclipse.virgo.kernel#org.eclipse.virgo.kernel.dmfragment;3.6.4.RELEASE!org.eclipse.virgo.kernel.dmfragment-sources.jar(src) (70ms)
     [exec] [ivy:cachepath] downloading http://build.eclipse.org/rt/virgo/ivy/bundles/release/org.eclipse.virgo.kernel/org.eclipse.virgo.kernel.dmfragment/3.6.4.RELEASE/org.eclipse.virgo.kernel.dmfragment-3.6.4.RELEASE.jar ...
     [exec] [ivy:cachepath] ... (27kB)
     [exec] [ivy:cachepath] .. (0kB)
     [exec] [ivy:cachepath] 	[SUCCESSFUL ] org.eclipse.virgo.kernel#org.eclipse.virgo.kernel.dmfragment;3.6.4.RELEASE!org.eclipse.virgo.kernel.dmfragment.jar (42ms)
     [exec] [ivy:cachepath] downloading http://build.eclipse.org/rt/virgo/ivy/bundles/release/org.eclipse.virgo.kernel/org.eclipse.virgo.kernel.kerneldmfragment/3.6.4.RELEASE/org.eclipse.virgo.kernel.kerneldmfragment-3.6.4.RELEASE.jar ...
     [exec] [ivy:cachepath] .. (1kB)
     [exec] [ivy:cachepath] .. (0kB)
     [exec] [ivy:cachepath] 	[SUCCESSFUL ] org.eclipse.virgo.kernel#org.eclipse.virgo.kernel.kerneldmfragment;3.6.4.RELEASE!org.eclipse.virgo.kernel.kerneldmfragment.jar (36ms)
     [exec] [ivy:cachepath] downloading http://build.eclipse.org/rt/virgo/ivy/bundles/release/org.eclipse.virgo.kernel/org.eclipse.virgo.kernel.kerneldmfragment/3.6.4.RELEASE/org.eclipse.virgo.kernel.kerneldmfragment-sources-3.6.4.RELEASE.jar ...
     [exec] [ivy:cachepath] .. (0kB)
     [exec] [ivy:cachepath] .. (0kB)
     [exec] [ivy:cachepath] 	[SUCCESSFUL ] org.eclipse.virgo.kernel#org.eclipse.virgo.kernel.kerneldmfragment;3.6.4.RELEASE!org.eclipse.virgo.kernel.kerneldmfragment-sources.jar(src) (28ms)
     [exec] [ivy:cachepath] downloading http://build.eclipse.org/rt/virgo/ivy/bundles/release/org.eclipse.virgo.kernel/org.eclipse.virgo.kernel.model/3.6.4.RELEASE/org.eclipse.virgo.kernel.model-sources-3.6.4.RELEASE.jar ...
     [exec] [ivy:cachepath] .... (42kB)
     [exec] [ivy:cachepath] .. (0kB)
     [exec] [ivy:cachepath] 	[SUCCESSFUL ] org.eclipse.virgo.kernel#org.eclipse.virgo.kernel.model;3.6.4.RELEASE!org.eclipse.virgo.kernel.model-sources.jar(src) (37ms)
     [exec] [ivy:cachepath] downloading http://build.eclipse.org/rt/virgo/ivy/bundles/release/org.eclipse.virgo.kernel/org.eclipse.virgo.kernel.model/3.6.4.RELEASE/org.eclipse.virgo.kernel.model-3.6.4.RELEASE.jar ...
     [exec] [ivy:cachepath] ........ (79kB)
     [exec] [ivy:cachepath] .. (0kB)
     [exec] [ivy:cachepath] 	[SUCCESSFUL ] org.eclipse.virgo.kernel#org.eclipse.virgo.kernel.model;3.6.4.RELEASE!org.eclipse.virgo.kernel.model.jar (48ms)
     [exec] [ivy:cachepath] downloading http://build.eclipse.org/rt/virgo/ivy/bundles/release/org.eclipse.virgo.kernel/org.eclipse.virgo.kernel.userregionfactory/3.6.4.RELEASE/org.eclipse.virgo.kernel.userregionfactory-3.6.4.RELEASE.jar ...
     [exec] [ivy:cachepath] .. (14kB)
     [exec] [ivy:cachepath] .. (0kB)
     [exec] [ivy:cachepath] 	[SUCCESSFUL ] org.eclipse.virgo.kernel#org.eclipse.virgo.kernel.userregionfactory;3.6.4.RELEASE!org.eclipse.virgo.kernel.userregionfactory.jar (53ms)
     [exec] [ivy:cachepath] downloading http://build.eclipse.org/rt/virgo/ivy/bundles/release/org.eclipse.virgo.kernel/org.eclipse.virgo.kernel.userregionfactory/3.6.4.RELEASE/org.eclipse.virgo.kernel.userregionfactory-sources-3.6.4.RELEASE.jar ...
     [exec] [ivy:cachepath] .. (8kB)
     [exec] [ivy:cachepath] .. (0kB)
     [exec] [ivy:cachepath] 	[SUCCESSFUL ] org.eclipse.virgo.kernel#org.eclipse.virgo.kernel.userregionfactory;3.6.4.RELEASE!org.eclipse.virgo.kernel.userregionfactory-sources.jar(src) (36ms)
     [exec] [ivy:cachepath] downloading http://build.eclipse.org/rt/virgo/ivy/bundles/release/org.eclipse.virgo.util/org.eclipse.virgo.util.parser.launcher/3.6.4.RELEASE/org.eclipse.virgo.util.parser.launcher-3.6.4.RELEASE.jar ...
     [exec] [ivy:cachepath] .. (7kB)
     [exec] [ivy:cachepath] .. (0kB)
     [exec] [ivy:cachepath] 	[SUCCESSFUL ] org.eclipse.virgo.util#org.eclipse.virgo.util.parser.launcher;3.6.4.RELEASE!org.eclipse.virgo.util.parser.launcher.jar (42ms)
     [exec] [ivy:cachepath] downloading http://build.eclipse.org/rt/virgo/ivy/bundles/release/org.eclipse.virgo.util/org.eclipse.virgo.util.parser.launcher/3.6.4.RELEASE/org.eclipse.virgo.util.parser.launcher-sources-3.6.4.RELEASE.jar ...
     [exec] [ivy:cachepath] .. (5kB)
     [exec] [ivy:cachepath] .. (0kB)
     [exec] [ivy:cachepath] 	[SUCCESSFUL ] org.eclipse.virgo.util#org.eclipse.virgo.util.parser.launcher;3.6.4.RELEASE!org.eclipse.virgo.util.parser.launcher-sources.jar(src) (38ms)
     [exec] 
     [exec] jar:
     [exec]     [mkdir] Created dir: /jobs/genie.virgo/virgo.web.3.6.snapshot/workspace/org.eclipse.virgo.web.tomcat/target/artifacts
     [exec]      [copy] Copying 2 files to /jobs/genie.virgo/virgo.web.3.6.snapshot/workspace/org.eclipse.virgo.web.tomcat/target/artifacts
     [exec] :: delivering :: org.eclipse.virgo.web#org.eclipse.virgo.web.tomcat;working@hipp6 :: 3.6.5.CI-2017-05-21_01-40-35 :: integration :: Sun May 21 05:40:36 EDT 2017
     [exec] 	delivering ivy file to /jobs/genie.virgo/virgo.web.3.6.snapshot/workspace/org.eclipse.virgo.web.tomcat/target/artifacts/ivy.xml
     [exec] :: publishing :: org.eclipse.virgo.web#org.eclipse.virgo.web.tomcat
     [exec] 	published org.eclipse.virgo.web.tomcat to /opt/public/hipp/homes/genie.virgo/virgo-build-cache/integration-repo/org.eclipse.virgo.web/org.eclipse.virgo.web.tomcat/3.6.5.CI-2017-05-21_01-40-35.part/org.eclipse.virgo.web.tomcat-3.6.5.CI-2017-05-21_01-40-35.plan
     [exec] 	published org.eclipse.virgo.web to /opt/public/hipp/homes/genie.virgo/virgo-build-cache/integration-repo/org.eclipse.virgo.web/org.eclipse.virgo.web.tomcat/3.6.5.CI-2017-05-21_01-40-35.part/org.eclipse.virgo.web-3.6.5.CI-2017-05-21_01-40-35.properties
     [exec] 	published ivy to /opt/public/hipp/homes/genie.virgo/virgo-build-cache/integration-repo/org.eclipse.virgo.web/org.eclipse.virgo.web.tomcat/3.6.5.CI-2017-05-21_01-40-35.part/ivy-3.6.5.CI-2017-05-21_01-40-35.xml
     [exec] 	publish commited: moved /opt/public/hipp/homes/genie.virgo/virgo-build-cache/integration-repo/org.eclipse.virgo.web/org.eclipse.virgo.web.tomcat/3.6.5.CI-2017-05-21_01-40-35.part 
     [exec] 		to /opt/public/hipp/homes/genie.virgo/virgo-build-cache/integration-repo/org.eclipse.virgo.web/org.eclipse.virgo.web.tomcat/3.6.5.CI-2017-05-21_01-40-35
     [exec] 
     [exec] BUILD SUCCESSFUL
     [exec] Total time: 5 seconds
     [echo] exec-ant for target 'jar' gave return code 0
   [subant] Leaving directory: /jobs/genie.virgo/virgo.web.3.6.snapshot/workspace/org.eclipse.virgo.web.tomcat
   [subant] Entering directory: /jobs/genie.virgo/virgo.web.3.6.snapshot/workspace/org.eclipse.virgo.web.enterprise.openejb.jpa.integration

exec-ant:
     [echo] exec-ant for target 'jar' executing in directory '/jobs/genie.virgo/virgo.web.3.6.snapshot/workspace/org.eclipse.virgo.web.enterprise.openejb.jpa.integration'
     [exec] Buildfile: /jobs/genie.virgo/virgo.web.3.6.snapshot/workspace/org.eclipse.virgo.web.enterprise.openejb.jpa.integration/build.xml
     [exec] 
     [exec] ivy.init:
     [exec] 
     [exec] ivy.file.exists:
     [exec] 
     [exec] resolve.init:
     [exec] 
     [exec] resolve.compile:
     [exec] [ivy:cachepath] :: Ivy 2.1.0 - 20090925235825 :: http://ant.apache.org/ivy/ ::
     [exec] [ivy:cachepath] :: loading settings :: file = /jobs/genie.virgo/virgo.web.3.6.snapshot/workspace/virgo-build/common/ivysettings.xml
     [exec] [ivy:cachepath] downloading http://repository.springsource.com/ivy/bundles/external/org.hibernate/com.springsource.org.hibernate/4.1.0.Final/license-4.1.0.Final.txt ...
     [exec] [ivy:cachepath] ..... (25kB)
     [exec] [ivy:cachepath] .. (0kB)
     [exec] [ivy:cachepath] 	[SUCCESSFUL ] org.hibernate#com.springsource.org.hibernate;4.1.0.Final!license.txt(license) (585ms)
     [exec] [ivy:cachepath] downloading http://repository.springsource.com/ivy/bundles/external/org.hibernate/com.springsource.org.hibernate/4.1.0.Final/com.springsource.org.hibernate-sources-4.1.0.Final.jar ...
     [exec] [ivy:cachepath] .............................................................................................................................................................................................................................................................................................................................................................................................................................................. (3747kB)
     [exec] [ivy:cachepath] .. (0kB)
     [exec] [ivy:cachepath] 	[SUCCESSFUL ] org.hibernate#com.springsource.org.hibernate;4.1.0.Final!com.springsource.org.hibernate-sources.jar(src) (1421ms)
     [exec] [ivy:cachepath] downloading http://repository.springsource.com/ivy/bundles/external/org.hibernate/com.springsource.org.hibernate/4.1.0.Final/com.springsource.org.hibernate-4.1.0.Final.jar ...
     [exec] [ivy:cachepath] ....................................................................................................................................................................................................................................................................................................................................................................................................................................................................................................................................................................................................
     [exec] [ivy:cachepath] ...................................................................................................................................................................................................................................................................................... (4264kB)
     [exec] [ivy:cachepath] .. (0kB)
     [exec] [ivy:cachepath] 	[SUCCESSFUL ] org.hibernate#com.springsource.org.hibernate;4.1.0.Final!com.springsource.org.hibernate.jar (2437ms)
     [exec] [ivy:cachepath] downloading http://repository.springsource.com/ivy/bundles/external/org.antlr/com.springsource.antlr/2.7.7/com.springsource.antlr-sources-2.7.7.jar ...
     [exec] [ivy:cachepath] .............................................................................. (430kB)
     [exec] [ivy:cachepath] .. (0kB)
     [exec] [ivy:cachepath] 	[SUCCESSFUL ] org.antlr#com.springsource.antlr;2.7.7!com.springsource.antlr-sources.jar(src) (962ms)
     [exec] [ivy:cachepath] downloading http://repository.springsource.com/ivy/bundles/external/org.antlr/com.springsource.antlr/2.7.7/license-2.7.7.txt ...
     [exec] [ivy:cachepath] .. (1kB)
     [exec] [ivy:cachepath] .. (0kB)
     [exec] [ivy:cachepath] 	[SUCCESSFUL ] org.antlr#com.springsource.antlr;2.7.7!license.txt(license) (392ms)
     [exec] [ivy:cachepath] downloading http://repository.springsource.com/ivy/bundles/external/org.antlr/com.springsource.antlr/2.7.7/com.springsource.antlr-2.7.7.jar ...
     [exec] [ivy:cachepath] ................................................................. (435kB)
     [exec] [ivy:cachepath] .. (0kB)
     [exec] [ivy:cachepath] 	[SUCCESSFUL ] org.antlr#com.springsource.antlr;2.7.7!com.springsource.antlr.jar (1023ms)
     [exec] [ivy:cachepath] downloading http://repository.springsource.com/ivy/bundles/external/org.apache.commons/com.springsource.org.apache.commons.collections/3.2.1/notice-3.2.1.txt ...
     [exec] [ivy:cachepath] .. (0kB)
     [exec] [ivy:cachepath] .. (0kB)
     [exec] [ivy:cachepath] 	[SUCCESSFUL ] org.apache.commons#com.springsource.org.apache.commons.collections;3.2.1!notice.txt(notice) (425ms)
     [exec] [ivy:cachepath] downloading http://repository.springsource.com/ivy/bundles/external/org.apache.commons/com.springsource.org.apache.commons.collections/3.2.1/license-3.2.1.txt ...
     [exec] [ivy:cachepath] .. (11kB)
     [exec] [ivy:cachepath] .. (0kB)
     [exec] [ivy:cachepath] 	[SUCCESSFUL ] org.apache.commons#com.springsource.org.apache.commons.collections;3.2.1!license.txt(license) (658ms)
     [exec] [ivy:cachepath] downloading http://repository.springsource.com/ivy/bundles/external/org.apache.commons/com.springsource.org.apache.commons.collections/3.2.1/com.springsource.org.apache.commons.collections-sources-3.2.1.jar ...
     [exec] [ivy:cachepath] .......................................................................................... (612kB)
     [exec] [ivy:cachepath] .. (0kB)
     [exec] [ivy:cachepath] 	[SUCCESSFUL ] org.apache.commons#com.springsource.org.apache.commons.collections;3.2.1!com.springsource.org.apache.commons.collections-sources.jar(src) (757ms)
     [exec] [ivy:cachepath] downloading http://repository.springsource.com/ivy/bundles/external/org.apache.commons/com.springsource.org.apache.commons.collections/3.2.1/com.springsource.org.apache.commons.collections-3.2.1.jar ...
     [exec] [ivy:cachepath] ................................................................................ (569kB)
     [exec] [ivy:cachepath] .. (0kB)
     [exec] [ivy:cachepath] 	[SUCCESSFUL ] org.apache.commons#com.springsource.org.apache.commons.collections;3.2.1!com.springsource.org.apache.commons.collections.jar (1186ms)
     [exec] [ivy:cachepath] downloading http://repository.springsource.com/ivy/bundles/external/org.dom4j/com.springsource.org.dom4j/1.6.1/license-1.6.1.txt ...
     [exec] [ivy:cachepath] .. (1kB)
     [exec] [ivy:cachepath] .. (0kB)
     [exec] [ivy:cachepath] 	[SUCCESSFUL ] org.dom4j#com.springsource.org.dom4j;1.6.1!license.txt(license) (1284ms)
     [exec] [ivy:cachepath] downloading http://repository.springsource.com/ivy/bundles/external/org.dom4j/com.springsource.org.dom4j/1.6.1/com.springsource.org.dom4j-1.6.1.jar ...
     [exec] [ivy:cachepath] ................................... (307kB)
     [exec] [ivy:cachepath] .. (0kB)
     [exec] [ivy:cachepath] 	[SUCCESSFUL ] org.dom4j#com.springsource.org.dom4j;1.6.1!com.springsource.org.dom4j.jar (1041ms)
     [exec] [ivy:cachepath] downloading http://repository.springsource.com/ivy/bundles/external/org.dom4j/com.springsource.org.dom4j/1.6.1/com.springsource.org.dom4j-sources-1.6.1.jar ...
     [exec] [ivy:cachepath] ........................................................... (422kB)
     [exec] [ivy:cachepath] .. (0kB)
     [exec] [ivy:cachepath] 	[SUCCESSFUL ] org.dom4j#com.springsource.org.dom4j;1.6.1!com.springsource.org.dom4j-sources.jar(src) (1190ms)
     [exec] [ivy:cachepath] downloading http://repository.springsource.com/ivy/bundles/external/javax.xml.stream/com.springsource.javax.xml.stream/1.0.1/com.springsource.javax.xml.stream-sources-1.0.1.jar ...
     [exec] [ivy:cachepath] ....... (41kB)
     [exec] [ivy:cachepath] .. (0kB)
     [exec] [ivy:cachepath] 	[SUCCESSFUL ] javax.xml.stream#com.springsource.javax.xml.stream;1.0.1!com.springsource.javax.xml.stream-sources.jar(src) (889ms)
     [exec] [ivy:cachepath] downloading http://repository.springsource.com/ivy/bundles/external/javax.xml.stream/com.springsource.javax.xml.stream/1.0.1/license-1.0.1.txt ...
     [exec] [ivy:cachepath] ... (15kB)
     [exec] [ivy:cachepath] .. (0kB)
     [exec] [ivy:cachepath] 	[SUCCESSFUL ] javax.xml.stream#com.springsource.javax.xml.stream;1.0.1!license.txt(license) (535ms)
     [exec] [ivy:cachepath] downloading http://repository.springsource.com/ivy/bundles/external/javax.xml.stream/com.springsource.javax.xml.stream/1.0.1/com.springsource.javax.xml.stream-1.0.1.jar ...
     [exec] [ivy:cachepath] .... (26kB)
     [exec] [ivy:cachepath] .. (0kB)
     [exec] [ivy:cachepath] 	[SUCCESSFUL ] javax.xml.stream#com.springsource.javax.xml.stream;1.0.1!com.springsource.javax.xml.stream.jar (775ms)
     [exec] [ivy:cachepath] downloading http://repository.springsource.com/ivy/bundles/external/org.jboss.javassist/com.springsource.javassist/3.15.0.GA/com.springsource.javassist-3.15.0.GA.jar ...
     [exec] [ivy:cachepath] ................................................................................ (639kB)
     [exec] [ivy:cachepath] .. (0kB)
     [exec] [ivy:cachepath] 	[SUCCESSFUL ] org.jboss.javassist#com.springsource.javassist;3.15.0.GA!com.springsource.javassist.jar (1077ms)
     [exec] [ivy:cachepath] downloading http://repository.springsource.com/ivy/bundles/external/org.jboss.javassist/com.springsource.javassist/3.15.0.GA/license-3.15.0.GA.txt ...
     [exec] [ivy:cachepath] ..... (25kB)
     [exec] [ivy:cachepath] .. (0kB)
     [exec] [ivy:cachepath] 	[SUCCESSFUL ] org.jboss.javassist#com.springsource.javassist;3.15.0.GA!license.txt(license) (414ms)
     [exec] [ivy:cachepath] downloading http://repository.springsource.com/ivy/bundles/external/org.jboss.javassist/com.springsource.javassist/3.15.0.GA/com.springsource.javassist-sources-3.15.0.GA.jar ...
     [exec] [ivy:cachepath] ................................................................. (487kB)
     [exec] [ivy:cachepath] .. (0kB)
     [exec] [ivy:cachepath] 	[SUCCESSFUL ] org.jboss.javassist#com.springsource.javassist;3.15.0.GA!com.springsource.javassist-sources.jar(src) (1825ms)
     [exec] [ivy:cachepath] downloading http://repository.springsource.com/ivy/bundles/external/org.hibernate.common/com.springsource.org.hibernate.annotations.common/4.0.1.Final/com.springsource.org.hibernate.annotations.common-sources-4.0.1.Final.jar ...
     [exec] [ivy:cachepath] ............. (62kB)
     [exec] [ivy:cachepath] .. (0kB)
     [exec] [ivy:cachepath] 	[SUCCESSFUL ] org.hibernate.common#com.springsource.org.hibernate.annotations.common;4.0.1.Final!com.springsource.org.hibernate.annotations.common-sources.jar(src) (485ms)
     [exec] [ivy:cachepath] downloading http://repository.springsource.com/ivy/bundles/external/org.hibernate.common/com.springsource.org.hibernate.annotations.common/4.0.1.Final/license-4.0.1.Final.txt ...
     [exec] [ivy:cachepath] .... (25kB)
     [exec] [ivy:cachepath] .. (0kB)
     [exec] [ivy:cachepath] 	[SUCCESSFUL ] org.hibernate.common#com.springsource.org.hibernate.annotations.common;4.0.1.Final!license.txt(license) (647ms)
     [exec] [ivy:cachepath] downloading http://repository.springsource.com/ivy/bundles/external/org.hibernate.common/com.springsource.org.hibernate.annotations.common/4.0.1.Final/com.springsource.org.hibernate.annotations.common-4.0.1.Final.jar ...
     [exec] [ivy:cachepath] ............ (80kB)
     [exec] [ivy:cachepath] .. (0kB)
     [exec] [ivy:cachepath] 	[SUCCESSFUL ] org.hibernate.common#com.springsource.org.hibernate.annotations.common;4.0.1.Final!com.springsource.org.hibernate.annotations.common.jar (537ms)
     [exec] [ivy:cachepath] downloading http://repository.springsource.com/ivy/bundles/external/org.jboss.logging/com.springsource.org.jboss.logging/3.1.0.CR2/license-3.1.0.CR2.txt ...
     [exec] [ivy:cachepath] ... (25kB)
     [exec] [ivy:cachepath] .. (0kB)
     [exec] [ivy:cachepath] 	[SUCCESSFUL ] org.jboss.logging#com.springsource.org.jboss.logging;3.1.0.CR2!license.txt(license) (802ms)
     [exec] [ivy:cachepath] downloading http://repository.springsource.com/ivy/bundles/external/org.jboss.logging/com.springsource.org.jboss.logging/3.1.0.CR2/com.springsource.org.jboss.logging-sources-3.1.0.CR2.jar ...
     [exec] [ivy:cachepath] ........ (55kB)
     [exec] [ivy:cachepath] .. (0kB)
     [exec] [ivy:cachepath] 	[SUCCESSFUL ] org.jboss.logging#com.springsource.org.jboss.logging;3.1.0.CR2!com.springsource.org.jboss.logging-sources.jar(src) (452ms)
     [exec] [ivy:cachepath] downloading http://repository.springsource.com/ivy/bundles/external/org.jboss.logging/com.springsource.org.jboss.logging/3.1.0.CR2/com.springsource.org.jboss.logging-3.1.0.CR2.jar ...
     [exec] [ivy:cachepath] .......... (59kB)
     [exec] [ivy:cachepath] .. (0kB)
     [exec] [ivy:cachepath] 	[SUCCESSFUL ] org.jboss.logging#com.springsource.org.jboss.logging;3.1.0.CR2!com.springsource.org.jboss.logging.jar (578ms)
     [exec] [ivy:cachepath] downloading http://repository.springsource.com/ivy/bundles/external/org.apache.ant/com.springsource.org.apache.tools.ant/1.8.1/com.springsource.org.apache.tools.ant-1.8.1.jar ...
     [exec] [ivy:cachepath] .................................................................................................................................................................. (1304kB)
     [exec] [ivy:cachepath] .. (0kB)
     [exec] [ivy:cachepath] 	[SUCCESSFUL ] org.apache.ant#com.springsource.org.apache.tools.ant;1.8.1!com.springsource.org.apache.tools.ant.jar (944ms)
     [exec] [ivy:cachepath] downloading http://repository.springsource.com/ivy/bundles/external/org.apache.ant/com.springsource.org.apache.tools.ant/1.8.1/com.springsource.org.apache.tools.ant-sources-1.8.1.jar ...
     [exec] [ivy:cachepath] ....................................................................................................................................................................................................................................... (1908kB)
     [exec] [ivy:cachepath] .. (0kB)
     [exec] [ivy:cachepath] 	[SUCCESSFUL ] org.apache.ant#com.springsource.org.apache.tools.ant;1.8.1!com.springsource.org.apache.tools.ant-sources.jar(src) (1411ms)
     [exec] [ivy:cachepath] downloading http://repository.springsource.com/ivy/bundles/external/org.apache.ant/com.springsource.org.apache.tools.ant/1.8.1/license-1.8.1.txt ...
     [exec] [ivy:cachepath] ... (14kB)
     [exec] [ivy:cachepath] .. (0kB)
     [exec] [ivy:cachepath] 	[SUCCESSFUL ] org.apache.ant#com.springsource.org.apache.tools.ant;1.8.1!license.txt(license) (1208ms)
     [exec] [ivy:cachepath] downloading http://repository.springsource.com/ivy/bundles/external/org.apache.ant/com.springsource.org.apache.tools.ant/1.8.1/notice-1.8.1.txt ...
     [exec] [ivy:cachepath] .. (1kB)
     [exec] [ivy:cachepath] .. (0kB)
     [exec] [ivy:cachepath] 	[SUCCESSFUL ] org.apache.ant#com.springsource.org.apache.tools.ant;1.8.1!notice.txt(license) (901ms)
     [exec] [ivy:cachepath] downloading http://repository.springsource.com/ivy/bundles/external/org.apache.xmlcommons/com.springsource.org.apache.xmlcommons/1.3.3/license-1.3.3.txt ...
     [exec] [ivy:cachepath] .. (10kB)
     [exec] [ivy:cachepath] .. (0kB)
     [exec] [ivy:cachepath] 	[SUCCESSFUL ] org.apache.xmlcommons#com.springsource.org.apache.xmlcommons;1.3.3!license.txt(license) (3226ms)
     [exec] [ivy:cachepath] downloading http://repository.springsource.com/ivy/bundles/external/org.apache.xmlcommons/com.springsource.org.apache.xmlcommons/1.3.3/com.springsource.org.apache.xmlcommons-1.3.3.jar ...
     [exec] [ivy:cachepath] ........................... (195kB)
     [exec] [ivy:cachepath] .. (0kB)
     [exec] [ivy:cachepath] 	[SUCCESSFUL ] org.apache.xmlcommons#com.springsource.org.apache.xmlcommons;1.3.3!com.springsource.org.apache.xmlcommons.jar (818ms)
     [exec] [ivy:cachepath] downloading http://repository.springsource.com/ivy/bundles/external/org.apache.log4j/com.springsource.org.apache.log4j/1.2.16/com.springsource.org.apache.log4j-sources-1.2.16.jar ...
     [exec] [ivy:cachepath] ........................................................ (460kB)
     [exec] [ivy:cachepath] .. (0kB)
     [exec] [ivy:cachepath] 	[SUCCESSFUL ] org.apache.log4j#com.springsource.org.apache.log4j;1.2.16!com.springsource.org.apache.log4j-sources.jar(src) (915ms)
     [exec] [ivy:cachepath] downloading http://repository.springsource.com/ivy/bundles/external/org.apache.log4j/com.springsource.org.apache.log4j/1.2.16/license-1.2.16.txt ...
     [exec] [ivy:cachepath] .. (11kB)
     [exec] [ivy:cachepath] .. (0kB)
     [exec] [ivy:cachepath] 	[SUCCESSFUL ] org.apache.log4j#com.springsource.org.apache.log4j;1.2.16!license.txt(license) (626ms)
     [exec] [ivy:cachepath] downloading http://repository.springsource.com/ivy/bundles/external/org.apache.log4j/com.springsource.org.apache.log4j/1.2.16/com.springsource.org.apache.log4j-1.2.16.jar ...
     [exec] [ivy:cachepath] ............................................................................. (469kB)
     [exec] [ivy:cachepath] .. (0kB)
     [exec] [ivy:cachepath] 	[SUCCESSFUL ] org.apache.log4j#com.springsource.org.apache.log4j;1.2.16!com.springsource.org.apache.log4j.jar (1251ms)
     [exec] [ivy:cachepath] downloading http://repository.springsource.com/ivy/bundles/external/org.jboss.logmanager/com.springsource.org.jboss.logmanager/1.2.0.GA/com.springsource.org.jboss.logmanager-sources-1.2.0.GA.jar ...
     [exec] [ivy:cachepath] ................ (113kB)
     [exec] [ivy:cachepath] .. (0kB)
     [exec] [ivy:cachepath] 	[SUCCESSFUL ] org.jboss.logmanager#com.springsource.org.jboss.logmanager;1.2.0.GA!com.springsource.org.jboss.logmanager-sources.jar(src) (543ms)
     [exec] [ivy:cachepath] downloading http://repository.springsource.com/ivy/bundles/external/org.jboss.logmanager/com.springsource.org.jboss.logmanager/1.2.0.GA/license-1.2.0.GA.txt ...
     [exec] [ivy:cachepath] .... (23kB)
     [exec] [ivy:cachepath] .. (0kB)
     [exec] [ivy:cachepath] 	[SUCCESSFUL ] org.jboss.logmanager#com.springsource.org.jboss.logmanager;1.2.0.GA!license.txt(license) (760ms)
     [exec] [ivy:cachepath] downloading http://repository.springsource.com/ivy/bundles/external/org.jboss.logmanager/com.springsource.org.jboss.logmanager/1.2.0.GA/com.springsource.org.jboss.logmanager-1.2.0.GA.jar ...
     [exec] [ivy:cachepath] .............................. (181kB)
     [exec] [ivy:cachepath] .. (0kB)
     [exec] [ivy:cachepath] 	[SUCCESSFUL ] org.jboss.logmanager#com.springsource.org.jboss.logmanager;1.2.0.GA!com.springsource.org.jboss.logmanager.jar (586ms)
     [exec] [ivy:cachepath] downloading http://repository.springsource.com/ivy/bundles/external/org.slf4j/com.springsource.slf4j.api/1.6.1/license-1.6.1.txt ...
     [exec] [ivy:cachepath] .. (1kB)
     [exec] [ivy:cachepath] .. (0kB)
     [exec] [ivy:cachepath] 	[SUCCESSFUL ] org.slf4j#com.springsource.slf4j.api;1.6.1!license.txt(license) (401ms)
     [exec] [ivy:cachepath] downloading http://repository.springsource.com/ivy/bundles/external/org.slf4j/com.springsource.slf4j.api/1.6.1/com.springsource.slf4j.api-1.6.1.jar ...
     [exec] [ivy:cachepath] .... (25kB)
     [exec] [ivy:cachepath] .. (0kB)
     [exec] [ivy:cachepath] 	[SUCCESSFUL ] org.slf4j#com.springsource.slf4j.api;1.6.1!com.springsource.slf4j.api.jar (613ms)
     [exec] [ivy:cachepath] downloading http://repository.springsource.com/ivy/bundles/external/org.slf4j/com.springsource.slf4j.api/1.6.1/com.springsource.slf4j.api-sources-1.6.1.jar ...
     [exec] [ivy:cachepath] ........ (43kB)
     [exec] [ivy:cachepath] .. (0kB)
     [exec] [ivy:cachepath] 	[SUCCESSFUL ] org.slf4j#com.springsource.slf4j.api;1.6.1!com.springsource.slf4j.api-sources.jar(src) (1269ms)
     [exec] 
     [exec] compile.init:
     [exec] 
     [exec] jar.init:
     [exec] 
     [exec] jar:
     [exec]     [mkdir] Created dir: /jobs/genie.virgo/virgo.web.3.6.snapshot/workspace/org.eclipse.virgo.web.enterprise.openejb.jpa.integration/target/artifacts
     [exec]     [mkdir] Created dir: /jobs/genie.virgo/virgo.web.3.6.snapshot/workspace/org.eclipse.virgo.web.enterprise.openejb.jpa.integration/target/classes
     [exec]   [s:javac] Compiling 3 source files to /jobs/genie.virgo/virgo.web.3.6.snapshot/workspace/org.eclipse.virgo.web.enterprise.openejb.jpa.integration/target/classes
     [exec]   [s:javac] ----------
     [exec]   [s:javac] 1. WARNING in /jobs/genie.virgo/virgo.web.3.6.snapshot/workspace/org.eclipse.virgo.web.enterprise.openejb.jpa.integration/src/main/java/org/eclipse/virgo/web/enterprise/openejb/hibernate/OpenEJBJtaPlatform.java (at line 12)
     [exec]   [s:javac] 	public class OpenEJBJtaPlatform extends AbstractJtaPlatform {
     [exec]   [s:javac] 	             ^^^^^^^^^^^^^^^^^^
     [exec]   [s:javac] The serializable class OpenEJBJtaPlatform does not declare a static final serialVersionUID field of type long
     [exec]   [s:javac] ----------
     [exec]   [s:javac] 1 problem (1 warning)
     [exec]      [copy] Copying 1 file to /jobs/genie.virgo/virgo.web.3.6.snapshot/workspace/org.eclipse.virgo.web.enterprise.openejb.jpa.integration/target/classes
     [exec] 
     [exec] ivy.init:
     [exec] 
     [exec] bundlor.init:
     [exec] 
     [exec] bundlor:
     [exec]       [jar] Building jar: /jobs/genie.virgo/virgo.web.3.6.snapshot/workspace/org.eclipse.virgo.web.enterprise.openejb.jpa.integration/target/artifacts/org.eclipse.virgo.web.enterprise.openejb.jpa.integration.jar
     [exec]       [jar] Building jar: /jobs/genie.virgo/virgo.web.3.6.snapshot/workspace/org.eclipse.virgo.web.enterprise.openejb.jpa.integration/target/artifacts/org.eclipse.virgo.web.enterprise.openejb.jpa.integration-sources.jar
     [exec] :: delivering :: org.eclipse.virgo.web#org.eclipse.virgo.web.enterprise.openejb.jpa.integration;working@hipp6 :: 3.6.5.CI-2017-05-21_01-40-35 :: integration :: Sun May 21 05:40:36 EDT 2017
     [exec] 	delivering ivy file to /jobs/genie.virgo/virgo.web.3.6.snapshot/workspace/org.eclipse.virgo.web.enterprise.openejb.jpa.integration/target/artifacts/ivy.xml
     [exec] :: publishing :: org.eclipse.virgo.web#org.eclipse.virgo.web.enterprise.openejb.jpa.integration
     [exec] 	published org.eclipse.virgo.web.enterprise.openejb.jpa.integration to /opt/public/hipp/homes/genie.virgo/virgo-build-cache/integration-repo/org.eclipse.virgo.web/org.eclipse.virgo.web.enterprise.openejb.jpa.integration/3.6.5.CI-2017-05-21_01-40-35.part/org.eclipse.virgo.web.enterprise.openejb.jpa.integration-3.6.5.CI-2017-05-21_01-40-35.jar
     [exec] 	published org.eclipse.virgo.web.enterprise.openejb.jpa.integration-sources to /opt/public/hipp/homes/genie.virgo/virgo-build-cache/integration-repo/org.eclipse.virgo.web/org.eclipse.virgo.web.enterprise.openejb.jpa.integration/3.6.5.CI-2017-05-21_01-40-35.part/org.eclipse.virgo.web.enterprise.openejb.jpa.integration-sources-3.6.5.CI-2017-05-21_01-40-35.jar
     [exec] 	published ivy to /opt/public/hipp/homes/genie.virgo/virgo-build-cache/integration-repo/org.eclipse.virgo.web/org.eclipse.virgo.web.enterprise.openejb.jpa.integration/3.6.5.CI-2017-05-21_01-40-35.part/ivy-3.6.5.CI-2017-05-21_01-40-35.xml
     [exec] 	publish commited: moved /opt/public/hipp/homes/genie.virgo/virgo-build-cache/integration-repo/org.eclipse.virgo.web/org.eclipse.virgo.web.enterprise.openejb.jpa.integration/3.6.5.CI-2017-05-21_01-40-35.part 
     [exec] 		to /opt/public/hipp/homes/genie.virgo/virgo-build-cache/integration-repo/org.eclipse.virgo.web/org.eclipse.virgo.web.enterprise.openejb.jpa.integration/3.6.5.CI-2017-05-21_01-40-35
     [exec] 
     [exec] BUILD SUCCESSFUL
     [exec] Total time: 52 seconds
     [echo] exec-ant for target 'jar' gave return code 0
   [subant] Leaving directory: /jobs/genie.virgo/virgo.web.3.6.snapshot/workspace/org.eclipse.virgo.web.enterprise.openejb.jpa.integration

test.pre:
    [mkdir] Created dir: /jobs/genie.virgo/virgo.web.3.6.snapshot/workspace/build-web/target/test-results/xml

test.do:
   [subant] Entering directory: /jobs/genie.virgo/virgo.web.3.6.snapshot/workspace/org.eclipse.virgo.web.dm

exec-ant:
     [echo] exec-ant for target 'test.do' executing in directory '/jobs/genie.virgo/virgo.web.3.6.snapshot/workspace/org.eclipse.virgo.web.dm'
     [exec] Buildfile: /jobs/genie.virgo/virgo.web.3.6.snapshot/workspace/org.eclipse.virgo.web.dm/build.xml
     [exec] 
     [exec] ivy.init:
     [exec] 
     [exec] ivy.file.exists:
     [exec] 
     [exec] resolve.init:
     [exec] 
     [exec] resolve.compile:
     [exec] [ivy:cachepath] :: Ivy 2.1.0 - 20090925235825 :: http://ant.apache.org/ivy/ ::
     [exec] [ivy:cachepath] :: loading settings :: file = /jobs/genie.virgo/virgo.web.3.6.snapshot/workspace/virgo-build/common/ivysettings.xml
     [exec] 
     [exec] resolve.test:
     [exec] [ivy:cachepath] downloading http://repository.springsource.com/ivy/bundles/external/org.junit/com.springsource.org.junit/4.7.0/com.springsource.org.junit-sources-4.7.0.jar ...
     [exec] [ivy:cachepath] ................... (125kB)
     [exec] [ivy:cachepath] .. (0kB)
     [exec] [ivy:cachepath] 	[SUCCESSFUL ] org.junit#com.springsource.org.junit;4.7.0!com.springsource.org.junit-sources.jar(src) (1353ms)
     [exec] [ivy:cachepath] downloading http://repository.springsource.com/ivy/bundles/external/org.junit/com.springsource.org.junit/4.7.0/com.springsource.org.junit-4.7.0.jar ...
     [exec] [ivy:cachepath] .......................................... (231kB)
     [exec] [ivy:cachepath] .. (0kB)
     [exec] [ivy:cachepath] 	[SUCCESSFUL ] org.junit#com.springsource.org.junit;4.7.0!com.springsource.org.junit.jar (1010ms)
     [exec] [ivy:cachepath] downloading http://repository.springsource.com/ivy/bundles/external/org.junit/com.springsource.org.junit/4.7.0/license-4.7.0.txt ...
     [exec] [ivy:cachepath] .. (11kB)
     [exec] [ivy:cachepath] .. (0kB)
     [exec] [ivy:cachepath] 	[SUCCESSFUL ] org.junit#com.springsource.org.junit;4.7.0!license.txt(license) (1367ms)
     [exec] [ivy:cachepath] downloading http://repository.springsource.com/ivy/bundles/external/org.easymock/com.springsource.org.easymock/2.3.0/com.springsource.org.easymock-2.3.0.jar ...
     [exec] [ivy:cachepath] ............ (69kB)
     [exec] [ivy:cachepath] .. (0kB)
     [exec] [ivy:cachepath] 	[SUCCESSFUL ] org.easymock#com.springsource.org.easymock;2.3.0!com.springsource.org.easymock.jar (962ms)
     [exec] [ivy:cachepath] downloading http://repository.springsource.com/ivy/bundles/external/org.easymock/com.springsource.org.easymock/2.3.0/com.springsource.org.easymock-sources-2.3.0.jar ...
     [exec] [ivy:cachepath] .......... (46kB)
     [exec] [ivy:cachepath] .. (0kB)
     [exec] [ivy:cachepath] 	[SUCCESSFUL ] org.easymock#com.springsource.org.easymock;2.3.0!com.springsource.org.easymock-sources.jar(src) (804ms)
     [exec] [ivy:cachepath] downloading http://repository.springsource.com/ivy/bundles/external/org.easymock/com.springsource.org.easymock/2.3.0/license-2.3.0.txt ...
     [exec] [ivy:cachepath] .. (1kB)
     [exec] [ivy:cachepath] .. (0kB)
     [exec] [ivy:cachepath] 	[SUCCESSFUL ] org.easymock#com.springsource.org.easymock;2.3.0!license.txt(license) (655ms)
     [exec] 
     [exec] resolve.aspects:
     [exec] 
     [exec] compile.init:
     [exec] 
     [exec] test.init:
     [exec]    [delete] Deleting: /jobs/genie.virgo/virgo.web.3.6.snapshot/workspace/user-ivy.properties
     [exec]    [delete] Deleting: /jobs/genie.virgo/virgo.web.3.6.snapshot/workspace/org.eclipse.virgo.web.dm/tmp.file
     [exec] 
     [exec] test.do:
     [exec]     [mkdir] Created dir: /jobs/genie.virgo/virgo.web.3.6.snapshot/workspace/org.eclipse.virgo.web.dm/target/test-classes
     [exec]   [s:javac] Compiling 1 source file to /jobs/genie.virgo/virgo.web.3.6.snapshot/workspace/org.eclipse.virgo.web.dm/target/test-classes
     [exec]      [iajc] warning at /opt/public/hipp/homes/genie.virgo/virgo-build-cache/ivy-cache/repository/org.eclipse.virgo.medic/org.eclipse.virgo.medic/3.6.4.RELEASE/org.eclipse.virgo.medic-3.6.4.RELEASE.jar!org/eclipse/virgo/medic/log/EntryExitTrace.class:53::0 advice defined in org.eclipse.virgo.medic.log.EntryExitTrace has not been applied [Xlint:adviceDidNotMatch]
     [exec]      [iajc] warning at /opt/public/hipp/homes/genie.virgo/virgo-build-cache/ivy-cache/repository/org.eclipse.virgo.medic/org.eclipse.virgo.medic/3.6.4.RELEASE/org.eclipse.virgo.medic-3.6.4.RELEASE.jar!org/eclipse/virgo/medic/log/EntryExitTrace.class:58::0 advice defined in org.eclipse.virgo.medic.log.EntryExitTrace has not been applied [Xlint:adviceDidNotMatch]
     [exec]      [iajc] warning at /opt/public/hipp/homes/genie.virgo/virgo-build-cache/ivy-cache/repository/org.eclipse.virgo.medic/org.eclipse.virgo.medic/3.6.4.RELEASE/org.eclipse.virgo.medic-3.6.4.RELEASE.jar!org/eclipse/virgo/medic/log/EntryExitTrace.class:63::0 advice defined in org.eclipse.virgo.medic.log.EntryExitTrace has not been applied [Xlint:adviceDidNotMatch]
     [exec]     [junit] Testsuite: org.eclipse.virgo.web.dm.ServerOsgiBundleXmlWebApplicationContextTests
     [exec]     [junit] Tests run: 2, Failures: 0, Errors: 0, Time elapsed: 0.558 sec
     [exec]     [junit] 
     [exec]     [junit] ------------- Standard Output ---------------
     [exec]     [junit] 01:46:11.994 [main] DEBUG o.s.w.c.s.StandardServletEnvironment - Initializing new StandardServletEnvironment
     [exec]     [junit] 01:46:12.000 [main] DEBUG o.s.w.c.s.StandardServletEnvironment - Adding [servletConfigInitParams] PropertySource with lowest search precedence
     [exec]     [junit] 01:46:12.000 [main] DEBUG o.s.w.c.s.StandardServletEnvironment - Adding [servletContextInitParams] PropertySource with lowest search precedence
     [exec]     [junit] 01:46:12.004 [main] DEBUG o.s.w.c.s.StandardServletEnvironment - Adding [jndiProperties] PropertySource with lowest search precedence
     [exec]     [junit] 01:46:12.004 [main] DEBUG o.s.w.c.s.StandardServletEnvironment - Adding [systemProperties] PropertySource with lowest search precedence
     [exec]     [junit] 01:46:12.006 [main] DEBUG o.s.w.c.s.StandardServletEnvironment - Adding [systemEnvironment] PropertySource with lowest search precedence
     [exec]     [junit] 01:46:12.006 [main] DEBUG o.s.w.c.s.StandardServletEnvironment - Initialized StandardServletEnvironment with PropertySources [servletConfigInitParams,servletContextInitParams,jndiProperties,systemProperties,systemEnvironment]
     [exec]     [junit] 01:46:12.128 [main] DEBUG o.e.v.w.d.ServerOsgiBundleXmlWebApplicationContext - Using the BundleContext stored in the ServletContext as 'osgi-bundlecontext'.
     [exec]     [junit] 01:46:12.163 [main] DEBUG o.s.w.c.s.StandardServletEnvironment - Initializing new StandardServletEnvironment
     [exec]     [junit] 01:46:12.163 [main] DEBUG o.s.w.c.s.StandardServletEnvironment - Adding [servletConfigInitParams] PropertySource with lowest search precedence
     [exec]     [junit] 01:46:12.163 [main] DEBUG o.s.w.c.s.StandardServletEnvironment - Adding [servletContextInitParams] PropertySource with lowest search precedence
     [exec]     [junit] 01:46:12.163 [main] DEBUG o.s.w.c.s.StandardServletEnvironment - Adding [jndiProperties] PropertySource with lowest search precedence
     [exec]     [junit] 01:46:12.163 [main] DEBUG o.s.w.c.s.StandardServletEnvironment - Adding [systemProperties] PropertySource with lowest search precedence
     [exec]     [junit] 01:46:12.163 [main] DEBUG o.s.w.c.s.StandardServletEnvironment - Adding [systemEnvironment] PropertySource with lowest search precedence
     [exec]     [junit] 01:46:12.163 [main] DEBUG o.s.w.c.s.StandardServletEnvironment - Initialized StandardServletEnvironment with PropertySources [servletConfigInitParams,servletContextInitParams,jndiProperties,systemProperties,systemEnvironment]
     [exec]     [junit] 01:46:12.163 [main] DEBUG o.e.v.w.d.ServerOsgiBundleXmlWebApplicationContext - Creating an ServerOsgiBundleXmlWebApplicationContext with parent [EasyMock for interface org.eclipse.gemini.blueprint.context.ConfigurableOsgiBundleApplicationContext].
     [exec]     [junit] 01:46:12.164 [main] DEBUG o.e.v.w.d.ServerOsgiBundleXmlWebApplicationContext - Using the parent ApplicationContext's BundleContext
     [exec]     [junit] ------------- ---------------- ---------------
     [exec]     [junit] ------------- Standard Error -----------------
     [exec]     [junit] SLF4J: Class path contains multiple SLF4J bindings.
     [exec]     [junit] SLF4J: Found binding in [jar:file:/opt/public/hipp/homes/genie.virgo/virgo-build-cache/ivy-cache/repository/org.eclipse.virgo.mirrored/ch.qos.logback.slf4j/1.0.7.v20121108-1250/ch.qos.logback.slf4j-1.0.7.v20121108-1250.jar!/org/slf4j/impl/StaticLoggerBinder.class]
     [exec]     [junit] SLF4J: Found binding in [jar:file:/opt/public/hipp/homes/genie.virgo/virgo-build-cache/ivy-cache/repository/org.eclipse.virgo.mirrored/org.slf4j.nop/1.7.2.v201212060727/org.slf4j.nop-1.7.2.v201212060727.jar!/org/slf4j/impl/StaticLoggerBinder.class]
     [exec]     [junit] SLF4J: See http://www.slf4j.org/codes.html#multiple_bindings for an explanation.
     [exec]     [junit] SLF4J: Actual binding is of type [ch.qos.logback.classic.util.ContextSelectorStaticBinder]
     [exec]     [junit] ------------- ---------------- ---------------
     [exec] 
     [exec] BUILD SUCCESSFUL
     [exec] Total time: 14 seconds
     [echo] exec-ant for target 'test.do' gave return code 0
   [subant] Leaving directory: /jobs/genie.virgo/virgo.web.3.6.snapshot/workspace/org.eclipse.virgo.web.dm
   [subant] Entering directory: /jobs/genie.virgo/virgo.web.3.6.snapshot/workspace/org.eclipse.virgo.web.core

exec-ant:
     [echo] exec-ant for target 'test.do' executing in directory '/jobs/genie.virgo/virgo.web.3.6.snapshot/workspace/org.eclipse.virgo.web.core'
     [exec] Buildfile: /jobs/genie.virgo/virgo.web.3.6.snapshot/workspace/org.eclipse.virgo.web.core/build.xml
     [exec] 
     [exec] ivy.init:
     [exec] 
     [exec] ivy.file.exists:
     [exec] 
     [exec] resolve.init:
     [exec] 
     [exec] resolve.compile:
     [exec] [ivy:cachepath] :: Ivy 2.1.0 - 20090925235825 :: http://ant.apache.org/ivy/ ::
     [exec] [ivy:cachepath] :: loading settings :: file = /jobs/genie.virgo/virgo.web.3.6.snapshot/workspace/virgo-build/common/ivysettings.xml
     [exec] 
     [exec] resolve.test:
     [exec] [ivy:cachepath] downloading http://build.eclipse.org/rt/virgo/ivy/bundles/release/org.eclipse.virgo.test/org.eclipse.virgo.test.stubs/3.6.4.RELEASE/org.eclipse.virgo.test.stubs-3.6.4.RELEASE.jar ...
     [exec] [ivy:cachepath] ....... (67kB)
     [exec] [ivy:cachepath] .. (0kB)
     [exec] [ivy:cachepath] 	[SUCCESSFUL ] org.eclipse.virgo.test#org.eclipse.virgo.test.stubs;3.6.4.RELEASE!org.eclipse.virgo.test.stubs.jar (60ms)
     [exec] [ivy:cachepath] downloading http://build.eclipse.org/rt/virgo/ivy/bundles/release/org.eclipse.virgo.test/org.eclipse.virgo.test.stubs/3.6.4.RELEASE/org.eclipse.virgo.test.stubs-sources-3.6.4.RELEASE.jar ...
     [exec] [ivy:cachepath] .. (40kB)
     [exec] [ivy:cachepath] .. (0kB)
     [exec] [ivy:cachepath] 	[SUCCESSFUL ] org.eclipse.virgo.test#org.eclipse.virgo.test.stubs;3.6.4.RELEASE!org.eclipse.virgo.test.stubs-sources.jar(src) (51ms)
     [exec] [ivy:cachepath] downloading http://repository.springsource.com/ivy/bundles/release/org.springframework/org.springframework.test/3.1.0.RELEASE/org.springframework.test-sources-3.1.0.RELEASE.jar ...
     [exec] [ivy:cachepath] ........................................ (224kB)
     [exec] [ivy:cachepath] .. (0kB)
     [exec] [ivy:cachepath] 	[SUCCESSFUL ] org.springframework#org.springframework.test;3.1.0.RELEASE!org.springframework.test-sources.jar(src) (1460ms)
     [exec] [ivy:cachepath] downloading http://repository.springsource.com/ivy/bundles/release/org.springframework/org.springframework.test/3.1.0.RELEASE/notice-3.1.0.RELEASE.txt ...
     [exec] [ivy:cachepath] .. (0kB)
     [exec] [ivy:cachepath] .. (0kB)
     [exec] [ivy:cachepath] 	[SUCCESSFUL ] org.springframework#org.springframework.test;3.1.0.RELEASE!notice.txt(notice) (1087ms)
     [exec] [ivy:cachepath] downloading http://repository.springsource.com/ivy/bundles/release/org.springframework/org.springframework.test/3.1.0.RELEASE/license-3.1.0.RELEASE.txt ...
     [exec] [ivy:cachepath] ... (14kB)
     [exec] [ivy:cachepath] .. (0kB)
     [exec] [ivy:cachepath] 	[SUCCESSFUL ] org.springframework#org.springframework.test;3.1.0.RELEASE!license.txt(license) (1088ms)
     [exec] [ivy:cachepath] downloading http://repository.springsource.com/ivy/bundles/release/org.springframework/org.springframework.test/3.1.0.RELEASE/org.springframework.test-3.1.0.RELEASE.jar ...
     [exec] [ivy:cachepath] ................................. (224kB)
     [exec] [ivy:cachepath] .. (0kB)
     [exec] [ivy:cachepath] 	[SUCCESSFUL ] org.springframework#org.springframework.test;3.1.0.RELEASE!org.springframework.test.jar (831ms)
     [exec] [ivy:cachepath] downloading http://build.eclipse.org/rt/virgo/ivy/bundles/release/org.eclipse.virgo.kernel/org.eclipse.virgo.kernel.stubs/3.6.4.RELEASE/org.eclipse.virgo.kernel.stubs-3.6.4.RELEASE.jar ...
     [exec] [ivy:cachepath] .. (7kB)
     [exec] [ivy:cachepath] .. (0kB)
     [exec] [ivy:cachepath] 	[SUCCESSFUL ] org.eclipse.virgo.kernel#org.eclipse.virgo.kernel.stubs;3.6.4.RELEASE!org.eclipse.virgo.kernel.stubs.jar (67ms)
     [exec] [ivy:cachepath] downloading http://build.eclipse.org/rt/virgo/ivy/bundles/release/org.eclipse.virgo.kernel/org.eclipse.virgo.kernel.stubs/3.6.4.RELEASE/org.eclipse.virgo.kernel.stubs-sources-3.6.4.RELEASE.jar ...
     [exec] [ivy:cachepath] .. (5kB)
     [exec] [ivy:cachepath] .. (0kB)
     [exec] [ivy:cachepath] 	[SUCCESSFUL ] org.eclipse.virgo.kernel#org.eclipse.virgo.kernel.stubs;3.6.4.RELEASE!org.eclipse.virgo.kernel.stubs-sources.jar(src) (57ms)
     [exec] 
     [exec] resolve.aspects:
     [exec] 
     [exec] compile.init:
     [exec] 
     [exec] test.init:
     [exec]    [delete] Deleting: /jobs/genie.virgo/virgo.web.3.6.snapshot/workspace/user-ivy.properties
     [exec]    [delete] Deleting: /jobs/genie.virgo/virgo.web.3.6.snapshot/workspace/org.eclipse.virgo.web.core/tmp.file
     [exec] 
     [exec] test.do:
     [exec]     [mkdir] Created dir: /jobs/genie.virgo/virgo.web.3.6.snapshot/workspace/org.eclipse.virgo.web.core/target/test-classes
     [exec]   [s:javac] Compiling 8 source files to /jobs/genie.virgo/virgo.web.3.6.snapshot/workspace/org.eclipse.virgo.web.core/target/test-classes
     [exec]      [iajc] warning at /opt/public/hipp/homes/genie.virgo/virgo-build-cache/ivy-cache/repository/org.eclipse.virgo.medic/org.eclipse.virgo.medic/3.6.4.RELEASE/org.eclipse.virgo.medic-3.6.4.RELEASE.jar!org/eclipse/virgo/medic/log/EntryExitTrace.class:53::0 advice defined in org.eclipse.virgo.medic.log.EntryExitTrace has not been applied [Xlint:adviceDidNotMatch]
     [exec]      [iajc] warning at /opt/public/hipp/homes/genie.virgo/virgo-build-cache/ivy-cache/repository/org.eclipse.virgo.medic/org.eclipse.virgo.medic/3.6.4.RELEASE/org.eclipse.virgo.medic-3.6.4.RELEASE.jar!org/eclipse/virgo/medic/log/EntryExitTrace.class:58::0 advice defined in org.eclipse.virgo.medic.log.EntryExitTrace has not been applied [Xlint:adviceDidNotMatch]
     [exec]      [iajc] warning at /opt/public/hipp/homes/genie.virgo/virgo-build-cache/ivy-cache/repository/org.eclipse.virgo.medic/org.eclipse.virgo.medic/3.6.4.RELEASE/org.eclipse.virgo.medic-3.6.4.RELEASE.jar!org/eclipse/virgo/medic/log/EntryExitTrace.class:63::0 advice defined in org.eclipse.virgo.medic.log.EntryExitTrace has not been applied [Xlint:adviceDidNotMatch]
     [exec]      [iajc] warning at /opt/public/hipp/homes/genie.virgo/virgo-build-cache/ivy-cache/repository/org.eclipse.virgo.medic/org.eclipse.virgo.medic/3.6.4.RELEASE/org.eclipse.virgo.medic-3.6.4.RELEASE.jar!org/eclipse/virgo/medic/log/EntryExitTrace.class:71::0 advice defined in org.eclipse.virgo.medic.log.EntryExitTrace has not been applied [Xlint:adviceDidNotMatch]
     [exec]      [iajc] warning at /opt/public/hipp/homes/genie.virgo/virgo-build-cache/ivy-cache/repository/org.eclipse.virgo.medic/org.eclipse.virgo.medic/3.6.4.RELEASE/org.eclipse.virgo.medic-3.6.4.RELEASE.jar!org/eclipse/virgo/medic/log/EntryExitTrace.class:76::0 advice defined in org.eclipse.virgo.medic.log.EntryExitTrace has not been applied [Xlint:adviceDidNotMatch]
     [exec]      [iajc] warning at /opt/public/hipp/homes/genie.virgo/virgo-build-cache/ivy-cache/repository/org.eclipse.virgo.medic/org.eclipse.virgo.medic/3.6.4.RELEASE/org.eclipse.virgo.medic-3.6.4.RELEASE.jar!org/eclipse/virgo/medic/log/EntryExitTrace.class:81::0 advice defined in org.eclipse.virgo.medic.log.EntryExitTrace has not been applied [Xlint:adviceDidNotMatch]
     [exec]      [iajc] warning at /opt/public/hipp/homes/genie.virgo/virgo-build-cache/ivy-cache/repository/org.eclipse.virgo.util/org.eclipse.virgo.util.jmx/3.6.4.RELEASE/org.eclipse.virgo.util.jmx-3.6.4.RELEASE.jar!org/eclipse/virgo/util/jmx/ExceptionCleaner.class:48::0 advice defined in org.eclipse.virgo.util.jmx.ExceptionCleaner has not been applied [Xlint:adviceDidNotMatch]
     [exec]      [iajc] warning at /opt/public/hipp/homes/genie.virgo/virgo-build-cache/ivy-cache/repository/org.eclipse.virgo.nano/org.eclipse.virgo.nano.core/3.6.4.RELEASE/org.eclipse.virgo.nano.core-3.6.4.RELEASE.jar!org/eclipse/virgo/nano/serviceability/enforcement/NonNullAssertionEnforcer.class:56::0 advice defined in org.eclipse.virgo.nano.serviceability.enforcement.NonNullAssertionEnforcer has not been applied [Xlint:adviceDidNotMatch]
     [exec]      [iajc] warning at /opt/public/hipp/homes/genie.virgo/virgo-build-cache/ivy-cache/repository/org.eclipse.virgo.nano/org.eclipse.virgo.nano.core/3.6.4.RELEASE/org.eclipse.virgo.nano.core-3.6.4.RELEASE.jar!org/eclipse/virgo/nano/serviceability/enforcement/NonNullAssertionEnforcer.class:60::0 advice defined in org.eclipse.virgo.nano.serviceability.enforcement.NonNullAssertionEnforcer has not been applied [Xlint:adviceDidNotMatch]
     [exec]     [junit] Testsuite: org.eclipse.virgo.web.core.internal.WebArtifactIdentityDeterminerTests
     [exec]     [junit] Tests run: 5, Failures: 0, Errors: 0, Time elapsed: 0.378 sec
     [exec]     [junit] 
     [exec]     [junit] ------------- Standard Output ---------------
     [exec]     [junit] 01:46:26.793 [main] DEBUG o.e.virgo.nano.serviceability.Assert - > public static transient void org.eclipse.virgo.nano.serviceability.Assert.notNull(java.lang.Object, java.lang.String, java.lang.Object[])
     [exec]     [junit] 01:46:26.796 [main] DEBUG o.e.virgo.nano.serviceability.Assert - < public static transient void org.eclipse.virgo.nano.serviceability.Assert.notNull(java.lang.Object, java.lang.String, java.lang.Object[])
     [exec]     [junit] 01:46:26.796 [main] DEBUG o.e.virgo.nano.serviceability.Assert - > public static transient void org.eclipse.virgo.nano.serviceability.Assert.notNull(java.lang.Object, java.lang.String, java.lang.Object[])
     [exec]     [junit] 01:46:26.796 [main] DEBUG o.e.virgo.nano.serviceability.Assert - < public static transient void org.eclipse.virgo.nano.serviceability.Assert.notNull(java.lang.Object, java.lang.String, java.lang.Object[])
     [exec]     [junit] 01:46:26.796 [main] DEBUG o.e.virgo.nano.serviceability.Assert - > public static transient void org.eclipse.virgo.nano.serviceability.Assert.notNull(java.lang.Object, java.lang.String, java.lang.Object[])
     [exec]     [junit] 01:46:26.796 [main] DEBUG o.e.virgo.nano.serviceability.Assert - < public static transient void org.eclipse.virgo.nano.serviceability.Assert.notNull(java.lang.Object, java.lang.String, java.lang.Object[])
     [exec]     [junit] 01:46:26.798 [main] DEBUG o.e.virgo.nano.serviceability.Assert - > public static transient void org.eclipse.virgo.nano.serviceability.Assert.notNull(java.lang.Object, java.lang.String, java.lang.Object[])
     [exec]     [junit] 01:46:26.798 [main] DEBUG o.e.virgo.nano.serviceability.Assert - < public static transient void org.eclipse.virgo.nano.serviceability.Assert.notNull(java.lang.Object, java.lang.String, java.lang.Object[])
     [exec]     [junit] 01:46:26.798 [main] DEBUG o.e.virgo.nano.serviceability.Assert - > public static transient void org.eclipse.virgo.nano.serviceability.Assert.notNull(java.lang.Object, java.lang.String, java.lang.Object[])
     [exec]     [junit] 01:46:26.798 [main] DEBUG o.e.virgo.nano.serviceability.Assert - < public static transient void org.eclipse.virgo.nano.serviceability.Assert.notNull(java.lang.Object, java.lang.String, java.lang.Object[])
     [exec]     [junit] 01:46:26.798 [main] DEBUG o.e.virgo.nano.serviceability.Assert - > public static transient void org.eclipse.virgo.nano.serviceability.Assert.notNull(java.lang.Object, java.lang.String, java.lang.Object[])
     [exec]     [junit] 01:46:26.798 [main] DEBUG o.e.virgo.nano.serviceability.Assert - < public static transient void org.eclipse.virgo.nano.serviceability.Assert.notNull(java.lang.Object, java.lang.String, java.lang.Object[])
     [exec]     [junit] 01:46:26.799 [main] DEBUG o.e.virgo.nano.serviceability.Assert - > public static transient void org.eclipse.virgo.nano.serviceability.Assert.notNull(java.lang.Object, java.lang.String, java.lang.Object[])
     [exec]     [junit] 01:46:26.799 [main] DEBUG o.e.virgo.nano.serviceability.Assert - < public static transient void org.eclipse.virgo.nano.serviceability.Assert.notNull(java.lang.Object, java.lang.String, java.lang.Object[])
     [exec]     [junit] 01:46:26.799 [main] DEBUG o.e.virgo.nano.serviceability.Assert - > public static transient void org.eclipse.virgo.nano.serviceability.Assert.notNull(java.lang.Object, java.lang.String, java.lang.Object[])
     [exec]     [junit] 01:46:26.799 [main] DEBUG o.e.virgo.nano.serviceability.Assert - < public static transient void org.eclipse.virgo.nano.serviceability.Assert.notNull(java.lang.Object, java.lang.String, java.lang.Object[])
     [exec]     [junit] 01:46:26.799 [main] DEBUG o.e.virgo.nano.serviceability.Assert - > public static transient void org.eclipse.virgo.nano.serviceability.Assert.notNull(java.lang.Object, java.lang.String, java.lang.Object[])
     [exec]     [junit] 01:46:26.799 [main] DEBUG o.e.virgo.nano.serviceability.Assert - < public static transient void org.eclipse.virgo.nano.serviceability.Assert.notNull(java.lang.Object, java.lang.String, java.lang.Object[])
     [exec]     [junit] ------------- ---------------- ---------------
     [exec]     [junit] ------------- Standard Error -----------------
     [exec]     [junit] SLF4J: Class path contains multiple SLF4J bindings.
     [exec]     [junit] SLF4J: Found binding in [jar:file:/opt/public/hipp/homes/genie.virgo/virgo-build-cache/ivy-cache/repository/org.eclipse.virgo.mirrored/ch.qos.logback.slf4j/1.0.7.v20121108-1250/ch.qos.logback.slf4j-1.0.7.v20121108-1250.jar!/org/slf4j/impl/StaticLoggerBinder.class]
     [exec]     [junit] SLF4J: Found binding in [jar:file:/opt/public/hipp/homes/genie.virgo/virgo-build-cache/ivy-cache/repository/org.eclipse.virgo.mirrored/org.slf4j.nop/1.7.2.v201212060727/org.slf4j.nop-1.7.2.v201212060727.jar!/org/slf4j/impl/StaticLoggerBinder.class]
     [exec]     [junit] SLF4J: See http://www.slf4j.org/codes.html#multiple_bindings for an explanation.
     [exec]     [junit] SLF4J: Actual binding is of type [ch.qos.logback.classic.util.ContextSelectorStaticBinder]
     [exec]     [junit] ------------- ---------------- ---------------
     [exec]     [junit] Testsuite: org.eclipse.virgo.web.core.internal.WebBundleLifecycleListenerTests
     [exec]     [junit] Tests run: 4, Failures: 0, Errors: 0, Time elapsed: 0.094 sec
     [exec]     [junit] 
     [exec]     [junit] Testsuite: org.eclipse.virgo.web.core.internal.WebBundleTransformerTests
     [exec]     [junit] Tests run: 9, Failures: 0, Errors: 0, Time elapsed: 0.044 sec
     [exec]     [junit] 
     [exec] 
     [exec] BUILD SUCCESSFUL
     [exec] Total time: 14 seconds
     [echo] exec-ant for target 'test.do' gave return code 0
   [subant] Leaving directory: /jobs/genie.virgo/virgo.web.3.6.snapshot/workspace/org.eclipse.virgo.web.core
   [subant] Entering directory: /jobs/genie.virgo/virgo.web.3.6.snapshot/workspace/org.eclipse.virgo.web.tomcat.support

exec-ant:
     [echo] exec-ant for target 'test.do' executing in directory '/jobs/genie.virgo/virgo.web.3.6.snapshot/workspace/org.eclipse.virgo.web.tomcat.support'
     [exec] Buildfile: /jobs/genie.virgo/virgo.web.3.6.snapshot/workspace/org.eclipse.virgo.web.tomcat.support/build.xml
     [exec] 
     [exec] ivy.init:
     [exec] 
     [exec] ivy.file.exists:
     [exec] 
     [exec] resolve.init:
     [exec] 
     [exec] resolve.compile:
     [exec] [ivy:cachepath] :: Ivy 2.1.0 - 20090925235825 :: http://ant.apache.org/ivy/ ::
     [exec] [ivy:cachepath] :: loading settings :: file = /jobs/genie.virgo/virgo.web.3.6.snapshot/workspace/virgo-build/common/ivysettings.xml
     [exec] 
     [exec] resolve.test:
     [exec] [ivy:cachepath] downloading http://build.eclipse.org/rt/virgo/ivy/bundles/release/org.eclipse.virgo.medic/org.eclipse.virgo.medic.test/3.6.4.RELEASE/org.eclipse.virgo.medic.test-sources-3.6.4.RELEASE.jar ...
     [exec] [ivy:cachepath] .. (4kB)
     [exec] [ivy:cachepath] .. (0kB)
     [exec] [ivy:cachepath] 	[SUCCESSFUL ] org.eclipse.virgo.medic#org.eclipse.virgo.medic.test;3.6.4.RELEASE!org.eclipse.virgo.medic.test-sources.jar(src) (1224ms)
     [exec] [ivy:cachepath] downloading http://build.eclipse.org/rt/virgo/ivy/bundles/release/org.eclipse.virgo.medic/org.eclipse.virgo.medic.test/3.6.4.RELEASE/org.eclipse.virgo.medic.test-3.6.4.RELEASE.jar ...
     [exec] [ivy:cachepath] .. (4kB)
     [exec] [ivy:cachepath] .. (0kB)
     [exec] [ivy:cachepath] 	[SUCCESSFUL ] org.eclipse.virgo.medic#org.eclipse.virgo.medic.test;3.6.4.RELEASE!org.eclipse.virgo.medic.test.jar (260ms)
     [exec] 
     [exec] resolve.aspects:
     [exec] 
     [exec] compile.init:
     [exec] 
     [exec] test.init:
     [exec]    [delete] Deleting: /jobs/genie.virgo/virgo.web.3.6.snapshot/workspace/user-ivy.properties
     [exec]    [delete] Deleting: /jobs/genie.virgo/virgo.web.3.6.snapshot/workspace/org.eclipse.virgo.web.tomcat.support/tmp.file
     [exec] 
     [exec] test.do:
     [exec] 
     [exec] BUILD SUCCESSFUL
     [exec] Total time: 5 seconds
     [echo] exec-ant for target 'test.do' gave return code 0
   [subant] Leaving directory: /jobs/genie.virgo/virgo.web.3.6.snapshot/workspace/org.eclipse.virgo.web.tomcat.support
   [subant] Entering directory: /jobs/genie.virgo/virgo.web.3.6.snapshot/workspace/org.eclipse.virgo.web.war.deployer

exec-ant:
     [echo] exec-ant for target 'test.do' executing in directory '/jobs/genie.virgo/virgo.web.3.6.snapshot/workspace/org.eclipse.virgo.web.war.deployer'
     [exec] Buildfile: /jobs/genie.virgo/virgo.web.3.6.snapshot/workspace/org.eclipse.virgo.web.war.deployer/build.xml
     [exec] 
     [exec] ivy.init:
     [exec] 
     [exec] ivy.file.exists:
     [exec] 
     [exec] resolve.init:
     [exec] 
     [exec] resolve.compile:
     [exec] [ivy:cachepath] :: Ivy 2.1.0 - 20090925235825 :: http://ant.apache.org/ivy/ ::
     [exec] [ivy:cachepath] :: loading settings :: file = /jobs/genie.virgo/virgo.web.3.6.snapshot/workspace/virgo-build/common/ivysettings.xml
     [exec] 
     [exec] resolve.test:
     [exec] 
     [exec] compile.init:
     [exec] 
     [exec] test.init:
     [exec]    [delete] Deleting: /jobs/genie.virgo/virgo.web.3.6.snapshot/workspace/user-ivy.properties
     [exec]    [delete] Deleting: /jobs/genie.virgo/virgo.web.3.6.snapshot/workspace/org.eclipse.virgo.web.war.deployer/tmp.file
     [exec] 
     [exec] test.do:
     [exec]     [mkdir] Created dir: /jobs/genie.virgo/virgo.web.3.6.snapshot/workspace/org.eclipse.virgo.web.war.deployer/target/test-classes
     [exec]   [s:javac] Compiling 1 source file to /jobs/genie.virgo/virgo.web.3.6.snapshot/workspace/org.eclipse.virgo.web.war.deployer/target/test-classes
     [exec]      [copy] Copying 1 file to /jobs/genie.virgo/virgo.web.3.6.snapshot/workspace/org.eclipse.virgo.web.war.deployer/target/test-classes
     [exec]     [junit] Testsuite: org.eclipse.virgo.web.war.deployer.WebBundleUtilsTest
     [exec]     [junit] Tests run: 1, Failures: 0, Errors: 0, Time elapsed: 0.06 sec
     [exec]     [junit] 
     [exec] 
     [exec] BUILD SUCCESSFUL
     [exec] Total time: 3 seconds
     [echo] exec-ant for target 'test.do' gave return code 0
   [subant] Leaving directory: /jobs/genie.virgo/virgo.web.3.6.snapshot/workspace/org.eclipse.virgo.web.war.deployer
   [subant] Entering directory: /jobs/genie.virgo/virgo.web.3.6.snapshot/workspace/org.eclipse.virgo.web.enterprise.appdeployer

exec-ant:
     [echo] exec-ant for target 'test.do' executing in directory '/jobs/genie.virgo/virgo.web.3.6.snapshot/workspace/org.eclipse.virgo.web.enterprise.appdeployer'
     [exec] Buildfile: /jobs/genie.virgo/virgo.web.3.6.snapshot/workspace/org.eclipse.virgo.web.enterprise.appdeployer/build.xml
     [exec] 
     [exec] ivy.init:
     [exec] 
     [exec] ivy.file.exists:
     [exec] 
     [exec] resolve.init:
     [exec] 
     [exec] resolve.compile:
     [exec] [ivy:cachepath] :: Ivy 2.1.0 - 20090925235825 :: http://ant.apache.org/ivy/ ::
     [exec] [ivy:cachepath] :: loading settings :: file = /jobs/genie.virgo/virgo.web.3.6.snapshot/workspace/virgo-build/common/ivysettings.xml
     [exec] 
     [exec] resolve.test:
     [exec] 
     [exec] compile.init:
     [exec] 
     [exec] test.init:
     [exec]    [delete] Deleting: /jobs/genie.virgo/virgo.web.3.6.snapshot/workspace/user-ivy.properties
     [exec]    [delete] Deleting: /jobs/genie.virgo/virgo.web.3.6.snapshot/workspace/org.eclipse.virgo.web.enterprise.appdeployer/tmp.file
     [exec] 
     [exec] test.do:
     [exec] 
     [exec] BUILD SUCCESSFUL
     [exec] Total time: 1 second
     [echo] exec-ant for target 'test.do' gave return code 0
   [subant] Leaving directory: /jobs/genie.virgo/virgo.web.3.6.snapshot/workspace/org.eclipse.virgo.web.enterprise.appdeployer
   [subant] Entering directory: /jobs/genie.virgo/virgo.web.3.6.snapshot/workspace/org.eclipse.virgo.web.enterprise.applistener

exec-ant:
     [echo] exec-ant for target 'test.do' executing in directory '/jobs/genie.virgo/virgo.web.3.6.snapshot/workspace/org.eclipse.virgo.web.enterprise.applistener'
     [exec] Buildfile: /jobs/genie.virgo/virgo.web.3.6.snapshot/workspace/org.eclipse.virgo.web.enterprise.applistener/build.xml
     [exec] 
     [exec] ivy.init:
     [exec] 
     [exec] ivy.file.exists:
     [exec] 
     [exec] resolve.init:
     [exec] 
     [exec] resolve.compile:
     [exec] [ivy:cachepath] :: Ivy 2.1.0 - 20090925235825 :: http://ant.apache.org/ivy/ ::
     [exec] [ivy:cachepath] :: loading settings :: file = /jobs/genie.virgo/virgo.web.3.6.snapshot/workspace/virgo-build/common/ivysettings.xml
     [exec] 
     [exec] resolve.test:
     [exec] 
     [exec] compile.init:
     [exec] 
     [exec] test.init:
     [exec]    [delete] Deleting: /jobs/genie.virgo/virgo.web.3.6.snapshot/workspace/user-ivy.properties
     [exec]    [delete] Deleting: /jobs/genie.virgo/virgo.web.3.6.snapshot/workspace/org.eclipse.virgo.web.enterprise.applistener/tmp.file
     [exec] 
     [exec] test.do:
     [exec] 
     [exec] BUILD SUCCESSFUL
     [exec] Total time: 1 second
     [echo] exec-ant for target 'test.do' gave return code 0
   [subant] Leaving directory: /jobs/genie.virgo/virgo.web.3.6.snapshot/workspace/org.eclipse.virgo.web.enterprise.applistener
   [subant] Entering directory: /jobs/genie.virgo/virgo.web.3.6.snapshot/workspace/org.eclipse.virgo.web.enterprise.jsf.support

exec-ant:
     [echo] exec-ant for target 'test.do' executing in directory '/jobs/genie.virgo/virgo.web.3.6.snapshot/workspace/org.eclipse.virgo.web.enterprise.jsf.support'
     [exec] Buildfile: /jobs/genie.virgo/virgo.web.3.6.snapshot/workspace/org.eclipse.virgo.web.enterprise.jsf.support/build.xml
     [exec] 
     [exec] ivy.init:
     [exec] 
     [exec] ivy.file.exists:
     [exec] 
     [exec] resolve.init:
     [exec] 
     [exec] resolve.compile:
     [exec] [ivy:cachepath] :: Ivy 2.1.0 - 20090925235825 :: http://ant.apache.org/ivy/ ::
     [exec] [ivy:cachepath] :: loading settings :: file = /jobs/genie.virgo/virgo.web.3.6.snapshot/workspace/virgo-build/common/ivysettings.xml
     [exec] 
     [exec] resolve.test:
     [exec] 
     [exec] compile.init:
     [exec] 
     [exec] test.init:
     [exec]    [delete] Deleting: /jobs/genie.virgo/virgo.web.3.6.snapshot/workspace/user-ivy.properties
     [exec]    [delete] Deleting: /jobs/genie.virgo/virgo.web.3.6.snapshot/workspace/org.eclipse.virgo.web.enterprise.jsf.support/tmp.file
     [exec] 
     [exec] test.do:
     [exec] 
     [exec] BUILD SUCCESSFUL
     [exec] Total time: 1 second
     [echo] exec-ant for target 'test.do' gave return code 0
   [subant] Leaving directory: /jobs/genie.virgo/virgo.web.3.6.snapshot/workspace/org.eclipse.virgo.web.enterprise.jsf.support
   [subant] Entering directory: /jobs/genie.virgo/virgo.web.3.6.snapshot/workspace/org.eclipse.virgo.web.enterprise.openejb.initialiser

exec-ant:
     [echo] exec-ant for target 'test.do' executing in directory '/jobs/genie.virgo/virgo.web.3.6.snapshot/workspace/org.eclipse.virgo.web.enterprise.openejb.initialiser'
     [exec] Buildfile: /jobs/genie.virgo/virgo.web.3.6.snapshot/workspace/org.eclipse.virgo.web.enterprise.openejb.initialiser/build.xml
     [exec] 
     [exec] ivy.init:
     [exec] 
     [exec] ivy.file.exists:
     [exec] 
     [exec] resolve.init:
     [exec] 
     [exec] resolve.compile:
     [exec] [ivy:cachepath] :: Ivy 2.1.0 - 20090925235825 :: http://ant.apache.org/ivy/ ::
     [exec] [ivy:cachepath] :: loading settings :: file = /jobs/genie.virgo/virgo.web.3.6.snapshot/workspace/virgo-build/common/ivysettings.xml
     [exec] 
     [exec] resolve.test:
     [exec] 
     [exec] compile.init:
     [exec] 
     [exec] test.init:
     [exec]    [delete] Deleting: /jobs/genie.virgo/virgo.web.3.6.snapshot/workspace/user-ivy.properties
     [exec]    [delete] Deleting: /jobs/genie.virgo/virgo.web.3.6.snapshot/workspace/org.eclipse.virgo.web.enterprise.openejb.initialiser/tmp.file
     [exec] 
     [exec] test.do:
     [exec] 
     [exec] BUILD SUCCESSFUL
     [exec] Total time: 1 second
     [echo] exec-ant for target 'test.do' gave return code 0
   [subant] Leaving directory: /jobs/genie.virgo/virgo.web.3.6.snapshot/workspace/org.eclipse.virgo.web.enterprise.openejb.initialiser
   [subant] Entering directory: /jobs/genie.virgo/virgo.web.3.6.snapshot/workspace/org.eclipse.virgo.web.enterprise.openejb.tomcat.factory

exec-ant:
     [echo] exec-ant for target 'test.do' executing in directory '/jobs/genie.virgo/virgo.web.3.6.snapshot/workspace/org.eclipse.virgo.web.enterprise.openejb.tomcat.factory'
     [exec] Buildfile: /jobs/genie.virgo/virgo.web.3.6.snapshot/workspace/org.eclipse.virgo.web.enterprise.openejb.tomcat.factory/build.xml
     [exec] 
     [exec] ivy.init:
     [exec] 
     [exec] ivy.file.exists:
     [exec] 
     [exec] resolve.init:
     [exec] 
     [exec] resolve.compile:
     [exec] [ivy:cachepath] :: Ivy 2.1.0 - 20090925235825 :: http://ant.apache.org/ivy/ ::
     [exec] [ivy:cachepath] :: loading settings :: file = /jobs/genie.virgo/virgo.web.3.6.snapshot/workspace/virgo-build/common/ivysettings.xml
     [exec] 
     [exec] resolve.test:
     [exec] 
     [exec] compile.init:
     [exec] 
     [exec] test.init:
     [exec]    [delete] Deleting: /jobs/genie.virgo/virgo.web.3.6.snapshot/workspace/user-ivy.properties
     [exec]    [delete] Deleting: /jobs/genie.virgo/virgo.web.3.6.snapshot/workspace/org.eclipse.virgo.web.enterprise.openejb.tomcat.factory/tmp.file
     [exec] 
     [exec] test.do:
     [exec]     [mkdir] Created dir: /jobs/genie.virgo/virgo.web.3.6.snapshot/workspace/org.eclipse.virgo.web.enterprise.openejb.tomcat.factory/target/test-classes
     [exec]   [s:javac] Compiling 1 source file to /jobs/genie.virgo/virgo.web.3.6.snapshot/workspace/org.eclipse.virgo.web.enterprise.openejb.tomcat.factory/target/test-classes
     [exec]     [junit] Testsuite: org.eclipse.virgo.web.enterprise.openejb.tomcat.factory.TomcatResourceFactoryTest
     [exec]     [junit] Tests run: 1, Failures: 0, Errors: 0, Time elapsed: 0.189 sec
     [exec]     [junit] 
     [exec] 
     [exec] BUILD SUCCESSFUL
     [exec] Total time: 2 seconds
     [echo] exec-ant for target 'test.do' gave return code 0
   [subant] Leaving directory: /jobs/genie.virgo/virgo.web.3.6.snapshot/workspace/org.eclipse.virgo.web.enterprise.openejb.tomcat.factory
   [subant] Entering directory: /jobs/genie.virgo/virgo.web.3.6.snapshot/workspace/org.eclipse.virgo.web.enterprise.openwebbeans.initialiser

exec-ant:
     [echo] exec-ant for target 'test.do' executing in directory '/jobs/genie.virgo/virgo.web.3.6.snapshot/workspace/org.eclipse.virgo.web.enterprise.openwebbeans.initialiser'
     [exec] Buildfile: /jobs/genie.virgo/virgo.web.3.6.snapshot/workspace/org.eclipse.virgo.web.enterprise.openwebbeans.initialiser/build.xml
     [exec] 
     [exec] ivy.init:
     [exec] 
     [exec] ivy.file.exists:
     [exec] 
     [exec] resolve.init:
     [exec] 
     [exec] resolve.compile:
     [exec] [ivy:cachepath] :: Ivy 2.1.0 - 20090925235825 :: http://ant.apache.org/ivy/ ::
     [exec] [ivy:cachepath] :: loading settings :: file = /jobs/genie.virgo/virgo.web.3.6.snapshot/workspace/virgo-build/common/ivysettings.xml
     [exec] 
     [exec] resolve.test:
     [exec] 
     [exec] compile.init:
     [exec] 
     [exec] test.init:
     [exec]    [delete] Deleting: /jobs/genie.virgo/virgo.web.3.6.snapshot/workspace/user-ivy.properties
     [exec]    [delete] Deleting: /jobs/genie.virgo/virgo.web.3.6.snapshot/workspace/org.eclipse.virgo.web.enterprise.openwebbeans.initialiser/tmp.file
     [exec] 
     [exec] test.do:
     [exec] 
     [exec] BUILD SUCCESSFUL
     [exec] Total time: 1 second
     [echo] exec-ant for target 'test.do' gave return code 0
   [subant] Leaving directory: /jobs/genie.virgo/virgo.web.3.6.snapshot/workspace/org.eclipse.virgo.web.enterprise.openwebbeans.initialiser
   [subant] Entering directory: /jobs/genie.virgo/virgo.web.3.6.snapshot/workspace/org.eclipse.virgo.web.enterprise.services.accessor

exec-ant:
     [echo] exec-ant for target 'test.do' executing in directory '/jobs/genie.virgo/virgo.web.3.6.snapshot/workspace/org.eclipse.virgo.web.enterprise.services.accessor'
     [exec] Buildfile: /jobs/genie.virgo/virgo.web.3.6.snapshot/workspace/org.eclipse.virgo.web.enterprise.services.accessor/build.xml
     [exec] 
     [exec] ivy.init:
     [exec] 
     [exec] ivy.file.exists:
     [exec] 
     [exec] resolve.init:
     [exec] 
     [exec] resolve.compile:
     [exec] [ivy:cachepath] :: Ivy 2.1.0 - 20090925235825 :: http://ant.apache.org/ivy/ ::
     [exec] [ivy:cachepath] :: loading settings :: file = /jobs/genie.virgo/virgo.web.3.6.snapshot/workspace/virgo-build/common/ivysettings.xml
     [exec] 
     [exec] resolve.test:
     [exec] 
     [exec] compile.init:
     [exec] 
     [exec] test.init:
     [exec]    [delete] Deleting: /jobs/genie.virgo/virgo.web.3.6.snapshot/workspace/user-ivy.properties
     [exec]    [delete] Deleting: /jobs/genie.virgo/virgo.web.3.6.snapshot/workspace/org.eclipse.virgo.web.enterprise.services.accessor/tmp.file
     [exec] 
     [exec] test.do:
     [exec]     [mkdir] Created dir: /jobs/genie.virgo/virgo.web.3.6.snapshot/workspace/org.eclipse.virgo.web.enterprise.services.accessor/target/test-classes
     [exec]   [s:javac] Compiling 6 source files to /jobs/genie.virgo/virgo.web.3.6.snapshot/workspace/org.eclipse.virgo.web.enterprise.services.accessor/target/test-classes
     [exec]   [s:javac] ----------
     [exec]   [s:javac] 1. WARNING in /jobs/genie.virgo/virgo.web.3.6.snapshot/workspace/org.eclipse.virgo.web.enterprise.services.accessor/src/test/java/org/eclipse/virgo/web/enterprise/services/accessor/WebAppBundleClassLoaderDelegateHookTest.java (at line 148)
     [exec]   [s:javac] 	private final class ClassLoaderExt1 extends ClassLoader {
     [exec]   [s:javac] 	                    ^^^^^^^^^^^^^^^
     [exec]   [s:javac] The type WebAppBundleClassLoaderDelegateHookTest.ClassLoaderExt1 is never used locally
     [exec]   [s:javac] ----------
     [exec]   [s:javac] ----------
     [exec]   [s:javac] 2. WARNING in /jobs/genie.virgo/virgo.web.3.6.snapshot/workspace/org.eclipse.virgo.web.enterprise.services.accessor/src/test/java/org/eclipse/virgo/web/enterprise/services/accessor/WebAppBundleClassloaderCustomizerTest.java (at line 94)
     [exec]   [s:javac] 	assertTrue(((List<ClassLoaderDelegateHook>) field.get(PluggableDelegatingClassLoaderDelegateHook.getInstance())).contains(webAppBundleClassloaderCustomizer.getWebAppBundleClassLoaderDelegateHook()));
     [exec]   [s:javac] 	           ^^^^^^^^^^^^^^^^^^^^^^^^^^^^^^^^^^^^^^^^^^^^^^^^^^^^^^^^^^^^^^^^^^^^^^^^^^^^^^^^^^^^^^^^^^^^^^^^^^^^^
     [exec]   [s:javac] Type safety: Unchecked cast from Object to List<ClassLoaderDelegateHook>
     [exec]   [s:javac] ----------
     [exec]   [s:javac] 3. WARNING in /jobs/genie.virgo/virgo.web.3.6.snapshot/workspace/org.eclipse.virgo.web.enterprise.services.accessor/src/test/java/org/eclipse/virgo/web/enterprise/services/accessor/WebAppBundleClassloaderCustomizerTest.java (at line 98)
     [exec]   [s:javac] 	assertTrue(((Map<Bundle, Set<String>>) field2.get(webAppBundleClassloaderCustomizer.getWebAppBundleClassLoaderDelegateHook())).containsKey(webBundle));
     [exec]   [s:javac] 	           ^^^^^^^^^^^^^^^^^^^^^^^^^^^^^^^^^^^^^^^^^^^^^^^^^^^^^^^^^^^^^^^^^^^^^^^^^^^^^^^^^^^^^^^^^^^^^^^^^^^^^^^^^^^^^^^^^^^
     [exec]   [s:javac] Type safety: Unchecked cast from Object to Map<Bundle,Set<String>>
     [exec]   [s:javac] ----------
     [exec]   [s:javac] 4. WARNING in /jobs/genie.virgo/virgo.web.3.6.snapshot/workspace/org.eclipse.virgo.web.enterprise.services.accessor/src/test/java/org/eclipse/virgo/web/enterprise/services/accessor/WebAppBundleClassloaderCustomizerTest.java (at line 104)
     [exec]   [s:javac] 	assertTrue(((List<ClassLoaderDelegateHook>) field.get(PluggableDelegatingClassLoaderDelegateHook.getInstance())).isEmpty());
     [exec]   [s:javac] 	           ^^^^^^^^^^^^^^^^^^^^^^^^^^^^^^^^^^^^^^^^^^^^^^^^^^^^^^^^^^^^^^^^^^^^^^^^^^^^^^^^^^^^^^^^^^^^^^^^^^^^^
     [exec]   [s:javac] Type safety: Unchecked cast from Object to List<ClassLoaderDelegateHook>
     [exec]   [s:javac] ----------
     [exec]   [s:javac] 4 problems (4 warnings)
     [exec]     [junit] Testsuite: org.eclipse.virgo.web.enterprise.services.accessor.ServicesAccessorCommandProviderTest
     [exec]     [junit] Tests run: 3, Failures: 0, Errors: 0, Time elapsed: 0.122 sec
     [exec]     [junit] 
     [exec]     [junit] ------------- Standard Error -----------------
     [exec]     [junit] SLF4J: Failed to load class "org.slf4j.impl.StaticLoggerBinder".
     [exec]     [junit] SLF4J: Defaulting to no-operation (NOP) logger implementation
     [exec]     [junit] SLF4J: See http://www.slf4j.org/codes.html#StaticLoggerBinder for further details.
     [exec]     [junit] ------------- ---------------- ---------------
     [exec]     [junit] Testsuite: org.eclipse.virgo.web.enterprise.services.accessor.VirgoEEBundleComparableTest
     [exec]     [junit] Tests run: 6, Failures: 0, Errors: 0, Time elapsed: 0.024 sec
     [exec]     [junit] 
     [exec]     [junit] Testsuite: org.eclipse.virgo.web.enterprise.services.accessor.WebAppBundleClassLoaderDelegateHookTest
     [exec]     [junit] Tests run: 3, Failures: 0, Errors: 0, Time elapsed: 0.044 sec
     [exec]     [junit] 
     [exec]     [junit] Testsuite: org.eclipse.virgo.web.enterprise.services.accessor.WebAppBundleClassloaderCustomizerTest
     [exec]     [junit] Tests run: 1, Failures: 0, Errors: 0, Time elapsed: 0.048 sec
     [exec]     [junit] 
     [exec]     [junit] Testsuite: org.eclipse.virgo.web.enterprise.services.accessor.WebAppBundleTrackerCustomizerTest
     [exec]     [junit] Tests run: 1, Failures: 0, Errors: 0, Time elapsed: 0.015 sec
     [exec]     [junit] 
     [exec] 
     [exec] BUILD SUCCESSFUL
     [exec] Total time: 4 seconds
     [echo] exec-ant for target 'test.do' gave return code 0
   [subant] Leaving directory: /jobs/genie.virgo/virgo.web.3.6.snapshot/workspace/org.eclipse.virgo.web.enterprise.services.accessor
   [subant] Entering directory: /jobs/genie.virgo/virgo.web.3.6.snapshot/workspace/org.eclipse.virgo.web.enterprise.security

exec-ant:
     [echo] exec-ant for target 'test.do' executing in directory '/jobs/genie.virgo/virgo.web.3.6.snapshot/workspace/org.eclipse.virgo.web.enterprise.security'
     [exec] Buildfile: /jobs/genie.virgo/virgo.web.3.6.snapshot/workspace/org.eclipse.virgo.web.enterprise.security/build.xml
     [exec] 
     [exec] ivy.init:
     [exec] 
     [exec] ivy.file.exists:
     [exec] 
     [exec] resolve.init:
     [exec] 
     [exec] resolve.compile:
     [exec] [ivy:cachepath] :: Ivy 2.1.0 - 20090925235825 :: http://ant.apache.org/ivy/ ::
     [exec] [ivy:cachepath] :: loading settings :: file = /jobs/genie.virgo/virgo.web.3.6.snapshot/workspace/virgo-build/common/ivysettings.xml
     [exec] 
     [exec] resolve.test:
     [exec] [ivy:cachepath] downloading http://build.eclipse.org/rt/virgo/ivy/bundles/release/org.eclipse.virgo.mirrored/javax.security.jacc/1.4.0.v201205031350/javax.security.jacc-1.4.0.v201205031350.jar ...
     [exec] [ivy:cachepath] ...... (44kB)
     [exec] [ivy:cachepath] .. (0kB)
     [exec] [ivy:cachepath] 	[SUCCESSFUL ] org.eclipse.virgo.mirrored#javax.security.jacc;1.4.0.v201205031350!javax.security.jacc.jar (74ms)
     [exec] 
     [exec] compile.init:
     [exec] 
     [exec] test.init:
     [exec]    [delete] Deleting: /jobs/genie.virgo/virgo.web.3.6.snapshot/workspace/user-ivy.properties
     [exec]    [delete] Deleting: /jobs/genie.virgo/virgo.web.3.6.snapshot/workspace/org.eclipse.virgo.web.enterprise.security/tmp.file
     [exec] 
     [exec] test.do:
     [exec]     [mkdir] Created dir: /jobs/genie.virgo/virgo.web.3.6.snapshot/workspace/org.eclipse.virgo.web.enterprise.security/target/test-classes
     [exec]   [s:javac] Compiling 1 source file to /jobs/genie.virgo/virgo.web.3.6.snapshot/workspace/org.eclipse.virgo.web.enterprise.security/target/test-classes
     [exec]   [s:javac] ----------
     [exec]   [s:javac] 1. WARNING in /jobs/genie.virgo/virgo.web.3.6.snapshot/workspace/org.eclipse.virgo.web.enterprise.security/src/test/java/org/eclipse/virgo/web/enterprise/security/StandardSecurityServiceTest.java (at line 195)
     [exec]   [s:javac] 	ThreadLocal<Wrapper> wrapperLocal = (ThreadLocal<Wrapper>) wrapper; 
     [exec]   [s:javac] 	                                    ^^^^^^^^^^^^^^^^^^^^^^^^^^^^^^
     [exec]   [s:javac] Type safety: Unchecked cast from Object to ThreadLocal<Wrapper>
     [exec]   [s:javac] ----------
     [exec]   [s:javac] 1 problem (1 warning)
     [exec]     [junit] Testsuite: org.eclipse.virgo.web.enterprise.security.StandardSecurityServiceTest
     [exec]     [junit] Tests run: 1, Failures: 0, Errors: 0, Time elapsed: 1.264 sec
     [exec]     [junit] 
     [exec] 
     [exec] BUILD SUCCESSFUL
     [exec] Total time: 4 seconds
     [echo] exec-ant for target 'test.do' gave return code 0
   [subant] Leaving directory: /jobs/genie.virgo/virgo.web.3.6.snapshot/workspace/org.eclipse.virgo.web.enterprise.security
   [subant] Entering directory: /jobs/genie.virgo/virgo.web.3.6.snapshot/workspace/org.eclipse.virgo.web.enterprise.security.valve

exec-ant:
     [echo] exec-ant for target 'test.do' executing in directory '/jobs/genie.virgo/virgo.web.3.6.snapshot/workspace/org.eclipse.virgo.web.enterprise.security.valve'
     [exec] Buildfile: /jobs/genie.virgo/virgo.web.3.6.snapshot/workspace/org.eclipse.virgo.web.enterprise.security.valve/build.xml
     [exec] 
     [exec] ivy.init:
     [exec] 
     [exec] ivy.file.exists:
     [exec] 
     [exec] resolve.init:
     [exec] 
     [exec] resolve.compile:
     [exec] [ivy:cachepath] :: Ivy 2.1.0 - 20090925235825 :: http://ant.apache.org/ivy/ ::
     [exec] [ivy:cachepath] :: loading settings :: file = /jobs/genie.virgo/virgo.web.3.6.snapshot/workspace/virgo-build/common/ivysettings.xml
     [exec] 
     [exec] resolve.test:
     [exec] 
     [exec] compile.init:
     [exec] 
     [exec] test.init:
     [exec]    [delete] Deleting: /jobs/genie.virgo/virgo.web.3.6.snapshot/workspace/user-ivy.properties
     [exec]    [delete] Deleting: /jobs/genie.virgo/virgo.web.3.6.snapshot/workspace/org.eclipse.virgo.web.enterprise.security.valve/tmp.file
     [exec] 
     [exec] test.do:
     [exec] 
     [exec] BUILD SUCCESSFUL
     [exec] Total time: 1 second
     [echo] exec-ant for target 'test.do' gave return code 0
   [subant] Leaving directory: /jobs/genie.virgo/virgo.web.3.6.snapshot/workspace/org.eclipse.virgo.web.enterprise.security.valve
   [subant] Entering directory: /jobs/genie.virgo/virgo.web.3.6.snapshot/workspace/org.eclipse.virgo.web.enterprise.security.openejb.classloading.hook

exec-ant:
     [echo] exec-ant for target 'test.do' executing in directory '/jobs/genie.virgo/virgo.web.3.6.snapshot/workspace/org.eclipse.virgo.web.enterprise.security.openejb.classloading.hook'
     [exec] Buildfile: /jobs/genie.virgo/virgo.web.3.6.snapshot/workspace/org.eclipse.virgo.web.enterprise.security.openejb.classloading.hook/build.xml
     [exec] 
     [exec] ivy.init:
     [exec] 
     [exec] ivy.file.exists:
     [exec] 
     [exec] resolve.init:
     [exec] 
     [exec] resolve.compile:
     [exec] [ivy:cachepath] :: Ivy 2.1.0 - 20090925235825 :: http://ant.apache.org/ivy/ ::
     [exec] [ivy:cachepath] :: loading settings :: file = /jobs/genie.virgo/virgo.web.3.6.snapshot/workspace/virgo-build/common/ivysettings.xml
     [exec] 
     [exec] resolve.test:
     [exec] 
     [exec] compile.init:
     [exec] 
     [exec] test.init:
     [exec]    [delete] Deleting: /jobs/genie.virgo/virgo.web.3.6.snapshot/workspace/user-ivy.properties
     [exec]    [delete] Deleting: /jobs/genie.virgo/virgo.web.3.6.snapshot/workspace/org.eclipse.virgo.web.enterprise.security.openejb.classloading.hook/tmp.file
     [exec] 
     [exec] test.do:
     [exec] 
     [exec] BUILD SUCCESSFUL
     [exec] Total time: 1 second
     [echo] exec-ant for target 'test.do' gave return code 0
   [subant] Leaving directory: /jobs/genie.virgo/virgo.web.3.6.snapshot/workspace/org.eclipse.virgo.web.enterprise.security.openejb.classloading.hook
   [subant] Entering directory: /jobs/genie.virgo/virgo.web.3.6.snapshot/workspace/org.eclipse.virgo.web.enterprise.persistence.openejb.classloading.hook

exec-ant:
     [echo] exec-ant for target 'test.do' executing in directory '/jobs/genie.virgo/virgo.web.3.6.snapshot/workspace/org.eclipse.virgo.web.enterprise.persistence.openejb.classloading.hook'
     [exec] Buildfile: /jobs/genie.virgo/virgo.web.3.6.snapshot/workspace/org.eclipse.virgo.web.enterprise.persistence.openejb.classloading.hook/build.xml
     [exec] 
     [exec] ivy.init:
     [exec] 
     [exec] ivy.file.exists:
     [exec] 
     [exec] resolve.init:
     [exec] 
     [exec] resolve.compile:
     [exec] [ivy:cachepath] :: Ivy 2.1.0 - 20090925235825 :: http://ant.apache.org/ivy/ ::
     [exec] [ivy:cachepath] :: loading settings :: file = /jobs/genie.virgo/virgo.web.3.6.snapshot/workspace/virgo-build/common/ivysettings.xml
     [exec] 
     [exec] resolve.test:
     [exec] 
     [exec] compile.init:
     [exec] 
     [exec] test.init:
     [exec]    [delete] Deleting: /jobs/genie.virgo/virgo.web.3.6.snapshot/workspace/user-ivy.properties
     [exec]    [delete] Deleting: /jobs/genie.virgo/virgo.web.3.6.snapshot/workspace/org.eclipse.virgo.web.enterprise.persistence.openejb.classloading.hook/tmp.file
     [exec] 
     [exec] test.do:
     [exec]     [mkdir] Created dir: /jobs/genie.virgo/virgo.web.3.6.snapshot/workspace/org.eclipse.virgo.web.enterprise.persistence.openejb.classloading.hook/target/test-classes
     [exec]   [s:javac] Compiling 4 source files to /jobs/genie.virgo/virgo.web.3.6.snapshot/workspace/org.eclipse.virgo.web.enterprise.persistence.openejb.classloading.hook/target/test-classes
     [exec]   [s:javac] ----------
     [exec]   [s:javac] 1. WARNING in /jobs/genie.virgo/virgo.web.3.6.snapshot/workspace/org.eclipse.virgo.web.enterprise.persistence.openejb.classloading.hook/src/test/java/org/eclipse/virgo/web/enterprise/persistence/openejb/classloading/hook/AppLoaderClasspathExtenderClassLoadingHookTests.java (at line 25)
     [exec]   [s:javac] 	import org.eclipse.osgi.baseadaptor.BaseData;
     [exec]   [s:javac] 	       ^^^^^^^^^^^^^^^^^^^^^^^^^^^^^^^^^^^^^
     [exec]   [s:javac] The import org.eclipse.osgi.baseadaptor.BaseData is never used
     [exec]   [s:javac] ----------
     [exec]   [s:javac] 2. WARNING in /jobs/genie.virgo/virgo.web.3.6.snapshot/workspace/org.eclipse.virgo.web.enterprise.persistence.openejb.classloading.hook/src/test/java/org/eclipse/virgo/web/enterprise/persistence/openejb/classloading/hook/AppLoaderClasspathExtenderClassLoadingHookTests.java (at line 29)
     [exec]   [s:javac] 	import org.eclipse.osgi.framework.adaptor.FrameworkAdaptor;
     [exec]   [s:javac] 	       ^^^^^^^^^^^^^^^^^^^^^^^^^^^^^^^^^^^^^^^^^^^^^^^^^^^
     [exec]   [s:javac] The import org.eclipse.osgi.framework.adaptor.FrameworkAdaptor is never used
     [exec]   [s:javac] ----------
     [exec]   [s:javac] 3. WARNING in /jobs/genie.virgo/virgo.web.3.6.snapshot/workspace/org.eclipse.virgo.web.enterprise.persistence.openejb.classloading.hook/src/test/java/org/eclipse/virgo/web/enterprise/persistence/openejb/classloading/hook/AppLoaderClasspathExtenderClassLoadingHookTests.java (at line 30)
     [exec]   [s:javac] 	import org.eclipse.osgi.framework.log.FrameworkLog;
     [exec]   [s:javac] 	       ^^^^^^^^^^^^^^^^^^^^^^^^^^^^^^^^^^^^^^^^^^^
     [exec]   [s:javac] The import org.eclipse.osgi.framework.log.FrameworkLog is never used
     [exec]   [s:javac] ----------
     [exec]   [s:javac] ----------
     [exec]   [s:javac] 4. WARNING in /jobs/genie.virgo/virgo.web.3.6.snapshot/workspace/org.eclipse.virgo.web.enterprise.persistence.openejb.classloading.hook/src/test/java/org/eclipse/virgo/web/enterprise/persistence/openejb/classloading/hook/BundleFileStub.java (at line 18)
     [exec]   [s:javac] 	import org.eclipse.osgi.baseadaptor.BaseData;
     [exec]   [s:javac] 	       ^^^^^^^^^^^^^^^^^^^^^^^^^^^^^^^^^^^^^
     [exec]   [s:javac] The import org.eclipse.osgi.baseadaptor.BaseData is never used
     [exec]   [s:javac] ----------
     [exec]   [s:javac] 4 problems (4 warnings)
     [exec]     [junit] Testsuite: org.eclipse.virgo.web.enterprise.persistence.openejb.classloading.hook.AppLoaderClasspathExtenderClassLoadingHookTests
     [exec]     [junit] Tests run: 18, Failures: 0, Errors: 0, Time elapsed: 0.117 sec
     [exec]     [junit] 
     [exec]     [junit] ------------- Standard Error -----------------
     [exec]     [junit] May 21, 2017 1:47:08 AM org.eclipse.virgo.web.enterprise.persistence.openejb.classloading.hook.AppLoaderClasspathExtenderClassLoadingHook addClassPathEntry
     [exec]     [junit] SEVERE: Property [osgi.configuration.area] is missing
     [exec]     [junit] org.eclipse.virgo.web.enterprise.persistence.openejb.classloading.hook.ClasspathExtenderClassLoadingHookException: Property [osgi.configuration.area] is missing
     [exec]     [junit] 	at org.eclipse.virgo.web.enterprise.persistence.openejb.classloading.hook.AppLoaderClasspathExtenderClassLoadingHook.findPersistenceIntegrationJar(AppLoaderClasspathExtenderClassLoadingHook.java:95)
     [exec]     [junit] 	at org.eclipse.virgo.web.enterprise.persistence.openejb.classloading.hook.AppLoaderClasspathExtenderClassLoadingHook.determinePersistenceIntegrationPath(AppLoaderClasspathExtenderClassLoadingHook.java:81)
     [exec]     [junit] 	at org.eclipse.virgo.web.enterprise.persistence.openejb.classloading.hook.AppLoaderClasspathExtenderClassLoadingHook.addClassPathEntry(AppLoaderClasspathExtenderClassLoadingHook.java:57)
     [exec]     [junit] 	at org.eclipse.virgo.web.enterprise.persistence.openejb.classloading.hook.AppLoaderClasspathExtenderClassLoadingHookTests.testAddClassPathEntryNegativeExceptionThrown(AppLoaderClasspathExtenderClassLoadingHookTests.java:106)
     [exec]     [junit] 	at sun.reflect.NativeMethodAccessorImpl.invoke0(Native Method)
     [exec]     [junit] 	at sun.reflect.NativeMethodAccessorImpl.invoke(NativeMethodAccessorImpl.java:39)
     [exec]     [junit] 	at sun.reflect.DelegatingMethodAccessorImpl.invoke(DelegatingMethodAccessorImpl.java:25)
     [exec]     [junit] 	at java.lang.reflect.Method.invoke(Method.java:597)
     [exec]     [junit] 	at org.junit.runners.model.FrameworkMethod$1.runReflectiveCall(FrameworkMethod.java:44)
     [exec]     [junit] 	at org.junit.internal.runners.model.ReflectiveCallable.run(ReflectiveCallable.java:15)
     [exec]     [junit] 	at org.junit.runners.model.FrameworkMethod.invokeExplosively(FrameworkMethod.java:41)
     [exec]     [junit] 	at org.junit.internal.runners.statements.InvokeMethod.evaluate(InvokeMethod.java:20)
     [exec]     [junit] 	at org.junit.internal.runners.statements.RunAfters.evaluate(RunAfters.java:31)
     [exec]     [junit] 	at org.junit.runners.BlockJUnit4ClassRunner.runChild(BlockJUnit4ClassRunner.java:76)
     [exec]     [junit] 	at org.junit.runners.BlockJUnit4ClassRunner.runChild(BlockJUnit4ClassRunner.java:50)
     [exec]     [junit] 	at org.junit.runners.ParentRunner$3.run(ParentRunner.java:193)
     [exec]     [junit] 	at org.junit.runners.ParentRunner$1.schedule(ParentRunner.java:52)
     [exec]     [junit] 	at org.junit.runners.ParentRunner.runChildren(ParentRunner.java:191)
     [exec]     [junit] 	at org.junit.runners.ParentRunner.access$000(ParentRunner.java:42)
     [exec]     [junit] 	at org.junit.runners.ParentRunner$2.evaluate(ParentRunner.java:184)
     [exec]     [junit] 	at org.junit.runners.ParentRunner.run(ParentRunner.java:236)
     [exec]     [junit] 	at junit.framework.JUnit4TestAdapter.run(JUnit4TestAdapter.java:39)
     [exec]     [junit] 	at org.apache.tools.ant.taskdefs.optional.junit.JUnitTestRunner.run(JUnitTestRunner.java:520)
     [exec]     [junit] 	at org.apache.tools.ant.taskdefs.optional.junit.JUnitTestRunner.launch(JUnitTestRunner.java:1060)
     [exec]     [junit] 	at org.apache.tools.ant.taskdefs.optional.junit.JUnitTestRunner.main(JUnitTestRunner.java:911)
     [exec]     [junit] May 21, 2017 1:47:08 AM org.eclipse.virgo.web.enterprise.persistence.openejb.classloading.hook.AppLoaderClasspathExtenderClassLoadingHook isAppBundle
     [exec]     [junit] SEVERE: Error checking if bundle [null] is application.
     [exec]     [junit] org.osgi.framework.BundleException: BaseData test exception
     [exec]     [junit] 	at org.eclipse.virgo.web.enterprise.persistence.openejb.classloading.hook.BaseDataStub.getManifest(BaseDataStub.java:30)
     [exec]     [junit] 	at org.eclipse.virgo.web.enterprise.persistence.openejb.classloading.hook.AppLoaderClasspathExtenderClassLoadingHook.isAppBundle(AppLoaderClasspathExtenderClassLoadingHook.java:139)
     [exec]     [junit] 	at org.eclipse.virgo.web.enterprise.persistence.openejb.classloading.hook.AppLoaderClasspathExtenderClassLoadingHookTests.checkForApp(AppLoaderClasspathExtenderClassLoadingHookTests.java:207)
     [exec]     [junit] 	at org.eclipse.virgo.web.enterprise.persistence.openejb.classloading.hook.AppLoaderClasspathExtenderClassLoadingHookTests.testIsAppBundleThrowsException(AppLoaderClasspathExtenderClassLoadingHookTests.java:194)
     [exec]     [junit] 	at sun.reflect.NativeMethodAccessorImpl.invoke0(Native Method)
     [exec]     [junit] 	at sun.reflect.NativeMethodAccessorImpl.invoke(NativeMethodAccessorImpl.java:39)
     [exec]     [junit] 	at sun.reflect.DelegatingMethodAccessorImpl.invoke(DelegatingMethodAccessorImpl.java:25)
     [exec]     [junit] 	at java.lang.reflect.Method.invoke(Method.java:597)
     [exec]     [junit] 	at org.junit.runners.model.FrameworkMethod$1.runReflectiveCall(FrameworkMethod.java:44)
     [exec]     [junit] 	at org.junit.internal.runners.model.ReflectiveCallable.run(ReflectiveCallable.java:15)
     [exec]     [junit] 	at org.junit.runners.model.FrameworkMethod.invokeExplosively(FrameworkMethod.java:41)
     [exec]     [junit] 	at org.junit.internal.runners.statements.InvokeMethod.evaluate(InvokeMethod.java:20)
     [exec]     [junit] 	at org.junit.internal.runners.statements.RunAfters.evaluate(RunAfters.java:31)
     [exec]     [junit] 	at org.junit.runners.BlockJUnit4ClassRunner.runChild(BlockJUnit4ClassRunner.java:76)
     [exec]     [junit] 	at org.junit.runners.BlockJUnit4ClassRunner.runChild(BlockJUnit4ClassRunner.java:50)
     [exec]     [junit] 	at org.junit.runners.ParentRunner$3.run(ParentRunner.java:193)
     [exec]     [junit] 	at org.junit.runners.ParentRunner$1.schedule(ParentRunner.java:52)
     [exec]     [junit] 	at org.junit.runners.ParentRunner.runChildren(ParentRunner.java:191)
     [exec]     [junit] 	at org.junit.runners.ParentRunner.access$000(ParentRunner.java:42)
     [exec]     [junit] 	at org.junit.runners.ParentRunner$2.evaluate(ParentRunner.java:184)
     [exec]     [junit] 	at org.junit.runners.ParentRunner.run(ParentRunner.java:236)
     [exec]     [junit] 	at junit.framework.JUnit4TestAdapter.run(JUnit4TestAdapter.java:39)
     [exec]     [junit] 	at org.apache.tools.ant.taskdefs.optional.junit.JUnitTestRunner.run(JUnitTestRunner.java:520)
     [exec]     [junit] 	at org.apache.tools.ant.taskdefs.optional.junit.JUnitTestRunner.launch(JUnitTestRunner.java:1060)
     [exec]     [junit] 	at org.apache.tools.ant.taskdefs.optional.junit.JUnitTestRunner.main(JUnitTestRunner.java:911)
     [exec]     [junit] ------------- ---------------- ---------------
     [exec] 
     [exec] BUILD SUCCESSFUL
     [exec] Total time: 2 seconds
     [echo] exec-ant for target 'test.do' gave return code 0
   [subant] Leaving directory: /jobs/genie.virgo/virgo.web.3.6.snapshot/workspace/org.eclipse.virgo.web.enterprise.persistence.openejb.classloading.hook
   [subant] Entering directory: /jobs/genie.virgo/virgo.web.3.6.snapshot/workspace/org.eclipse.virgo.web.enterprise.javax.persistence.extension

exec-ant:
     [echo] exec-ant for target 'test.do' executing in directory '/jobs/genie.virgo/virgo.web.3.6.snapshot/workspace/org.eclipse.virgo.web.enterprise.javax.persistence.extension'
     [exec] Buildfile: /jobs/genie.virgo/virgo.web.3.6.snapshot/workspace/org.eclipse.virgo.web.enterprise.javax.persistence.extension/build.xml
     [exec] 
     [exec] ivy.init:
     [exec] 
     [exec] ivy.file.exists:
     [exec] 
     [exec] resolve.init:
     [exec] 
     [exec] resolve.compile:
     [exec] [ivy:cachepath] :: Ivy 2.1.0 - 20090925235825 :: http://ant.apache.org/ivy/ ::
     [exec] [ivy:cachepath] :: loading settings :: file = /jobs/genie.virgo/virgo.web.3.6.snapshot/workspace/virgo-build/common/ivysettings.xml
     [exec] 
     [exec] resolve.test:
     [exec] 
     [exec] compile.init:
     [exec] 
     [exec] test.init:
     [exec]    [delete] Deleting: /jobs/genie.virgo/virgo.web.3.6.snapshot/workspace/user-ivy.properties
     [exec]    [delete] Deleting: /jobs/genie.virgo/virgo.web.3.6.snapshot/workspace/org.eclipse.virgo.web.enterprise.javax.persistence.extension/tmp.file
     [exec] 
     [exec] test.do:
     [exec]     [mkdir] Created dir: /jobs/genie.virgo/virgo.web.3.6.snapshot/workspace/org.eclipse.virgo.web.enterprise.javax.persistence.extension/target/test-classes
     [exec]   [s:javac] Compiling 3 source files to /jobs/genie.virgo/virgo.web.3.6.snapshot/workspace/org.eclipse.virgo.web.enterprise.javax.persistence.extension/target/test-classes
     [exec]   [s:javac] ----------
     [exec]   [s:javac] 1. WARNING in /jobs/genie.virgo/virgo.web.3.6.snapshot/workspace/org.eclipse.virgo.web.enterprise.javax.persistence.extension/src/test/java/org/eclipse/virgo/web/enterprise/javax/persistence/extension/TestPersistenceProvider.java (at line 25)
     [exec]   [s:javac] 	PersistenceUnitInfo arg0, Map arg1) {
     [exec]   [s:javac] 	                          ^^^
     [exec]   [s:javac] Map is a raw type. References to generic type Map<K,V> should be parameterized
     [exec]   [s:javac] ----------
     [exec]   [s:javac] 2. WARNING in /jobs/genie.virgo/virgo.web.3.6.snapshot/workspace/org.eclipse.virgo.web.enterprise.javax.persistence.extension/src/test/java/org/eclipse/virgo/web/enterprise/javax/persistence/extension/TestPersistenceProvider.java (at line 31)
     [exec]   [s:javac] 	public EntityManagerFactory createEntityManagerFactory(String arg0, Map arg1) {
     [exec]   [s:javac] 	                                                                    ^^^
     [exec]   [s:javac] Map is a raw type. References to generic type Map<K,V> should be parameterized
     [exec]   [s:javac] ----------
     [exec]   [s:javac] 2 problems (2 warnings)
     [exec]     [junit] Testsuite: org.eclipse.virgo.web.enterprise.javax.persistence.extension.CompositePersistenceProviderResolverTest
     [exec]     [junit] Tests run: 2, Failures: 0, Errors: 0, Time elapsed: 0.218 sec
     [exec]     [junit] 
     [exec]     [junit] Testsuite: org.eclipse.virgo.web.enterprise.javax.persistence.extension.DefaultPersistenceProviderResolverTest
     [exec]     [junit] Tests run: 3, Failures: 0, Errors: 0, Time elapsed: 0.021 sec
     [exec]     [junit] 
     [exec]     [junit] ------------- Standard Error -----------------
     [exec]     [junit] May 21, 2017 1:47:11 AM org.eclipse.virgo.web.enterprise.javax.persistence.extension.DefaultPersistenceProviderResolver log
     [exec]     [junit] WARNING: javax.persistence.spi::No valid providers found using:
     [exec]     [junit] May 21, 2017 1:47:11 AM org.eclipse.virgo.web.enterprise.javax.persistence.extension.DefaultPersistenceProviderResolver log
     [exec]     [junit] WARNING: javax.persistence.spi::com.sap.core.non.existent.PersistenceProvider - file:/jobs/genie.virgo/virgo.web.3.6.snapshot/workspace/org.eclipse.virgo.web.enterprise.javax.persistence.extension/target/test-classes/META-INF/services/javax.persistence.spi.PersistenceProvider
     [exec]     [junit] ------------- ---------------- ---------------
     [exec] 
     [exec] BUILD SUCCESSFUL
     [exec] Total time: 2 seconds
     [echo] exec-ant for target 'test.do' gave return code 0
   [subant] Leaving directory: /jobs/genie.virgo/virgo.web.3.6.snapshot/workspace/org.eclipse.virgo.web.enterprise.javax.persistence.extension
   [subant] Entering directory: /jobs/genie.virgo/virgo.web.3.6.snapshot/workspace/org.eclipse.virgo.web.enterprise.javax.persistence.provider.initializer

exec-ant:
     [echo] exec-ant for target 'test.do' executing in directory '/jobs/genie.virgo/virgo.web.3.6.snapshot/workspace/org.eclipse.virgo.web.enterprise.javax.persistence.provider.initializer'
     [exec] Buildfile: /jobs/genie.virgo/virgo.web.3.6.snapshot/workspace/org.eclipse.virgo.web.enterprise.javax.persistence.provider.initializer/build.xml
     [exec] 
     [exec] ivy.init:
     [exec] 
     [exec] ivy.file.exists:
     [exec] 
     [exec] resolve.init:
     [exec] 
     [exec] resolve.compile:
     [exec] [ivy:cachepath] :: Ivy 2.1.0 - 20090925235825 :: http://ant.apache.org/ivy/ ::
     [exec] [ivy:cachepath] :: loading settings :: file = /jobs/genie.virgo/virgo.web.3.6.snapshot/workspace/virgo-build/common/ivysettings.xml
     [exec] 
     [exec] resolve.test:
     [exec] 
     [exec] compile.init:
     [exec] 
     [exec] test.init:
     [exec]    [delete] Deleting: /jobs/genie.virgo/virgo.web.3.6.snapshot/workspace/user-ivy.properties
     [exec]    [delete] Deleting: /jobs/genie.virgo/virgo.web.3.6.snapshot/workspace/org.eclipse.virgo.web.enterprise.javax.persistence.provider.initializer/tmp.file
     [exec] 
     [exec] test.do:
     [exec]     [mkdir] Created dir: /jobs/genie.virgo/virgo.web.3.6.snapshot/workspace/org.eclipse.virgo.web.enterprise.javax.persistence.provider.initializer/target/test-classes
     [exec]   [s:javac] Compiling 1 source file to /jobs/genie.virgo/virgo.web.3.6.snapshot/workspace/org.eclipse.virgo.web.enterprise.javax.persistence.provider.initializer/target/test-classes
     [exec]     [junit] Testsuite: org.eclipse.virgo.web.enterprise.javax.persistence.provider.initializer.ActivatorTest
     [exec]     [junit] Tests run: 2, Failures: 0, Errors: 0, Time elapsed: 0.243 sec
     [exec]     [junit] 
     [exec]     [junit] ------------- Standard Error -----------------
     [exec]     [junit] SLF4J: Failed to load class "org.slf4j.impl.StaticLoggerBinder".
     [exec]     [junit] SLF4J: Defaulting to no-operation (NOP) logger implementation
     [exec]     [junit] SLF4J: See http://www.slf4j.org/codes.html#StaticLoggerBinder for further details.
     [exec]     [junit] ------------- ---------------- ---------------
     [exec] 
     [exec] BUILD SUCCESSFUL
     [exec] Total time: 2 seconds
     [echo] exec-ant for target 'test.do' gave return code 0
   [subant] Leaving directory: /jobs/genie.virgo/virgo.web.3.6.snapshot/workspace/org.eclipse.virgo.web.enterprise.javax.persistence.provider.initializer
   [subant] Entering directory: /jobs/genie.virgo/virgo.web.3.6.snapshot/workspace/org.eclipse.virgo.web.test

exec-ant:
     [echo] exec-ant for target 'test.do' executing in directory '/jobs/genie.virgo/virgo.web.3.6.snapshot/workspace/org.eclipse.virgo.web.test'
     [exec] Buildfile: /jobs/genie.virgo/virgo.web.3.6.snapshot/workspace/org.eclipse.virgo.web.test/build.xml
     [exec] 
     [exec] ivy.init:
     [exec] 
     [exec] ivy.file.exists:
     [exec] 
     [exec] resolve.init:
     [exec] 
     [exec] resolve.compile:
     [exec] [ivy:cachepath] :: Ivy 2.1.0 - 20090925235825 :: http://ant.apache.org/ivy/ ::
     [exec] [ivy:cachepath] :: loading settings :: file = /jobs/genie.virgo/virgo.web.3.6.snapshot/workspace/virgo-build/common/ivysettings.xml
     [exec] 
     [exec] common-common.resolve.test:
     [exec] [ivy:cachepath] downloading http://build.eclipse.org/rt/virgo/ivy/bundles/release/org.eclipse.virgo.mirrored/javax.activation/1.1.0.v201108011116/javax.activation-1.1.0.v201108011116.jar ...
     [exec] [ivy:cachepath] ...... (54kB)
     [exec] [ivy:cachepath] .. (0kB)
     [exec] [ivy:cachepath] 	[SUCCESSFUL ] org.eclipse.virgo.mirrored#javax.activation;1.1.0.v201108011116!javax.activation.jar (80ms)
     [exec] [ivy:cachepath] downloading http://repository.springsource.com/ivy/bundles/external/javax.servlet/com.springsource.javax.servlet.jsp.jstl/1.2.0.v20110728/license-1.2.0.v20110728.txt ...
     [exec] [ivy:cachepath] ... (15kB)
     [exec] [ivy:cachepath] .. (0kB)
     [exec] [ivy:cachepath] 	[SUCCESSFUL ] javax.servlet#com.springsource.javax.servlet.jsp.jstl;1.2.0.v20110728!license.txt(license) (786ms)
     [exec] [ivy:cachepath] downloading http://repository.springsource.com/ivy/bundles/external/javax.servlet/com.springsource.javax.servlet.jsp.jstl/1.2.0.v20110728/com.springsource.javax.servlet.jsp.jstl-1.2.0.v20110728.jar ...
     [exec] [ivy:cachepath] ................................................. (411kB)
     [exec] [ivy:cachepath] .. (0kB)
     [exec] [ivy:cachepath] 	[SUCCESSFUL ] javax.servlet#com.springsource.javax.servlet.jsp.jstl;1.2.0.v20110728!com.springsource.javax.servlet.jsp.jstl.jar (702ms)
     [exec] [ivy:cachepath] downloading http://repository.springsource.com/ivy/bundles/external/javax.servlet/com.springsource.javax.servlet.jsp.jstl/1.2.0.v20110728/com.springsource.javax.servlet.jsp.jstl-sources-1.2.0.v20110728.jar ...
     [exec] [ivy:cachepath] ................................................................................ (654kB)
     [exec] [ivy:cachepath] .. (0kB)
     [exec] [ivy:cachepath] 	[SUCCESSFUL ] javax.servlet#com.springsource.javax.servlet.jsp.jstl;1.2.0.v20110728!com.springsource.javax.servlet.jsp.jstl-sources.jar(src) (897ms)
     [exec] [ivy:cachepath] downloading http://repository.springsource.com/ivy/bundles/external/javax.portlet/com.springsource.javax.portlet/2.0.0.v20110525/com.springsource.javax.portlet-2.0.0.v20110525.jar ...
     [exec] [ivy:cachepath] ...... (47kB)
     [exec] [ivy:cachepath] .. (0kB)
     [exec] [ivy:cachepath] 	[SUCCESSFUL ] javax.portlet#com.springsource.javax.portlet;2.0.0.v20110525!com.springsource.javax.portlet.jar (456ms)
     [exec] [ivy:cachepath] downloading http://repository.springsource.com/ivy/bundles/external/javax.portlet/com.springsource.javax.portlet/2.0.0.v20110525/com.springsource.javax.portlet-sources-2.0.0.v20110525.jar ...
     [exec] [ivy:cachepath] ............. (126kB)
     [exec] [ivy:cachepath] .. (0kB)
     [exec] [ivy:cachepath] 	[SUCCESSFUL ] javax.portlet#com.springsource.javax.portlet;2.0.0.v20110525!com.springsource.javax.portlet-sources.jar(src) (1150ms)
     [exec] [ivy:cachepath] downloading http://repository.springsource.com/ivy/bundles/external/javax.portlet/com.springsource.javax.portlet/2.0.0.v20110525/license-2.0.0.v20110525.txt ...
     [exec] [ivy:cachepath] .. (11kB)
     [exec] [ivy:cachepath] .. (0kB)
     [exec] [ivy:cachepath] 	[SUCCESSFUL ] javax.portlet#com.springsource.javax.portlet;2.0.0.v20110525!license.txt(license) (1022ms)
     [exec] [ivy:cachepath] downloading http://repository.springsource.com/ivy/bundles/external/org.hsqldb/com.springsource.org.hsqldb/1.8.0.9/com.springsource.org.hsqldb-1.8.0.9.jar ...
     [exec] [ivy:cachepath] ........................................................................................... (689kB)
     [exec] [ivy:cachepath] .. (0kB)
     [exec] [ivy:cachepath] 	[SUCCESSFUL ] org.hsqldb#com.springsource.org.hsqldb;1.8.0.9!com.springsource.org.hsqldb.jar (1474ms)
     [exec] [ivy:cachepath] downloading http://repository.springsource.com/ivy/bundles/external/org.hsqldb/com.springsource.org.hsqldb/1.8.0.9/license-1.8.0.9.txt ...
     [exec] [ivy:cachepath] .. (3kB)
     [exec] [ivy:cachepath] .. (0kB)
     [exec] [ivy:cachepath] 	[SUCCESSFUL ] org.hsqldb#com.springsource.org.hsqldb;1.8.0.9!license.txt(license) (921ms)
     [exec] [ivy:cachepath] downloading http://repository.springsource.com/ivy/bundles/external/org.hsqldb/com.springsource.org.hsqldb/1.8.0.9/com.springsource.org.hsqldb-sources-1.8.0.9.jar ...
     [exec] [ivy:cachepath] ....................................................................................................................................................... (1314kB)
     [exec] [ivy:cachepath] .. (0kB)
     [exec] [ivy:cachepath] 	[SUCCESSFUL ] org.hsqldb#com.springsource.org.hsqldb;1.8.0.9!com.springsource.org.hsqldb-sources.jar(src) (1556ms)
     [exec] [ivy:cachepath] downloading http://build.eclipse.org/rt/virgo/ivy/bundles/release/org.eclipse.virgo.mirrored/org.slf4j.log4j/1.7.2.v20130115-1340/org.slf4j.log4j-1.7.2.v20130115-1340.jar ...
     [exec] [ivy:cachepath] .... (29kB)
     [exec] [ivy:cachepath] .. (0kB)
     [exec] [ivy:cachepath] 	[SUCCESSFUL ] org.eclipse.virgo.mirrored#org.slf4j.log4j;1.7.2.v20130115-1340!org.slf4j.log4j.jar (52ms)
     [exec] [ivy:cachepath] downloading http://build.eclipse.org/rt/virgo/ivy/bundles/release/org.eclipse.virgo.mirrored/org.slf4j.log4j/1.7.2.v20130115-1340/org.slf4j.log4j.source-1.7.2.v20130115-1340.jar ...
     [exec] [ivy:cachepath] ..... (36kB)
     [exec] [ivy:cachepath] .. (0kB)
     [exec] [ivy:cachepath] 	[SUCCESSFUL ] org.eclipse.virgo.mirrored#org.slf4j.log4j;1.7.2.v20130115-1340!org.slf4j.log4j.source.jar(src) (463ms)
     [exec] [ivy:cachepath] downloading http://repository.springsource.com/ivy/bundles/external/org.apache.taglibs/com.springsource.org.apache.taglibs.standard/1.1.2.v20110517/license-1.1.2.v20110517.txt ...
     [exec] [ivy:cachepath] .. (11kB)
     [exec] [ivy:cachepath] .. (0kB)
     [exec] [ivy:cachepath] 	[SUCCESSFUL ] org.apache.taglibs#com.springsource.org.apache.taglibs.standard;1.1.2.v20110517!license.txt(license) (1198ms)
     [exec] [ivy:cachepath] downloading http://repository.springsource.com/ivy/bundles/external/org.apache.taglibs/com.springsource.org.apache.taglibs.standard/1.1.2.v20110517/com.springsource.org.apache.taglibs.standard-sources-1.1.2.v20110517.jar ...
     [exec] [ivy:cachepath] ................................................... (409kB)
     [exec] [ivy:cachepath] .. (0kB)
     [exec] [ivy:cachepath] 	[SUCCESSFUL ] org.apache.taglibs#com.springsource.org.apache.taglibs.standard;1.1.2.v20110517!com.springsource.org.apache.taglibs.standard-sources.jar(src) (1227ms)
     [exec] [ivy:cachepath] downloading http://repository.springsource.com/ivy/bundles/external/org.apache.taglibs/com.springsource.org.apache.taglibs.standard/1.1.2.v20110517/com.springsource.org.apache.taglibs.standard-1.1.2.v20110517.jar ...
     [exec] [ivy:cachepath] .................................................... (389kB)
     [exec] [ivy:cachepath] .. (0kB)
     [exec] [ivy:cachepath] 	[SUCCESSFUL ] org.apache.taglibs#com.springsource.org.apache.taglibs.standard;1.1.2.v20110517!com.springsource.org.apache.taglibs.standard.jar (989ms)
     [exec] [ivy:cachepath] downloading http://repository.springsource.com/ivy/bundles/release/org.springframework/org.springframework.jdbc/3.1.0.RELEASE/org.springframework.jdbc-3.1.0.RELEASE.jar ...
     [exec] [ivy:cachepath] ......................................................... (392kB)
     [exec] [ivy:cachepath] .. (0kB)
     [exec] [ivy:cachepath] 	[SUCCESSFUL ] org.springframework#org.springframework.jdbc;3.1.0.RELEASE!org.springframework.jdbc.jar (688ms)
     [exec] [ivy:cachepath] downloading http://repository.springsource.com/ivy/bundles/release/org.springframework/org.springframework.jdbc/3.1.0.RELEASE/org.springframework.jdbc-sources-3.1.0.RELEASE.jar ...
     [exec] [ivy:cachepath] ................................................... (408kB)
     [exec] [ivy:cachepath] .. (0kB)
     [exec] [ivy:cachepath] 	[SUCCESSFUL ] org.springframework#org.springframework.jdbc;3.1.0.RELEASE!org.springframework.jdbc-sources.jar(src) (790ms)
     [exec] [ivy:cachepath] downloading http://repository.springsource.com/ivy/bundles/release/org.springframework/org.springframework.jdbc/3.1.0.RELEASE/notice-3.1.0.RELEASE.txt ...
     [exec] [ivy:cachepath] .. (0kB)
     [exec] [ivy:cachepath] .. (0kB)
     [exec] [ivy:cachepath] 	[SUCCESSFUL ] org.springframework#org.springframework.jdbc;3.1.0.RELEASE!notice.txt(notice) (404ms)
     [exec] [ivy:cachepath] downloading http://repository.springsource.com/ivy/bundles/release/org.springframework/org.springframework.jdbc/3.1.0.RELEASE/license-3.1.0.RELEASE.txt ...
     [exec] [ivy:cachepath] ... (14kB)
     [exec] [ivy:cachepath] .. (0kB)
     [exec] [ivy:cachepath] 	[SUCCESSFUL ] org.springframework#org.springframework.jdbc;3.1.0.RELEASE!license.txt(license) (630ms)
     [exec] [ivy:cachepath] downloading http://repository.springsource.com/ivy/bundles/release/org.springframework/org.springframework.aspects/3.1.0.RELEASE/license-3.1.0.RELEASE.txt ...
     [exec] [ivy:cachepath] ... (14kB)
     [exec] [ivy:cachepath] .. (0kB)
     [exec] [ivy:cachepath] 	[SUCCESSFUL ] org.springframework#org.springframework.aspects;3.1.0.RELEASE!license.txt(license) (550ms)
     [exec] [ivy:cachepath] downloading http://repository.springsource.com/ivy/bundles/release/org.springframework/org.springframework.aspects/3.1.0.RELEASE/org.springframework.aspects-3.1.0.RELEASE.jar ...
     [exec] [ivy:cachepath] ...... (49kB)
     [exec] [ivy:cachepath] .. (0kB)
     [exec] [ivy:cachepath] 	[SUCCESSFUL ] org.springframework#org.springframework.aspects;3.1.0.RELEASE!org.springframework.aspects.jar (453ms)
     [exec] [ivy:cachepath] downloading http://repository.springsource.com/ivy/bundles/release/org.springframework/org.springframework.aspects/3.1.0.RELEASE/org.springframework.aspects-sources-3.1.0.RELEASE.jar ...
     [exec] [ivy:cachepath] ..... (29kB)
     [exec] [ivy:cachepath] .. (0kB)
     [exec] [ivy:cachepath] 	[SUCCESSFUL ] org.springframework#org.springframework.aspects;3.1.0.RELEASE!org.springframework.aspects-sources.jar(src) (427ms)
     [exec] [ivy:cachepath] downloading http://repository.springsource.com/ivy/bundles/release/org.springframework/org.springframework.aspects/3.1.0.RELEASE/notice-3.1.0.RELEASE.txt ...
     [exec] [ivy:cachepath] .. (0kB)
     [exec] [ivy:cachepath] .. (0kB)
     [exec] [ivy:cachepath] 	[SUCCESSFUL ] org.springframework#org.springframework.aspects;3.1.0.RELEASE!notice.txt(notice) (516ms)
     [exec] [ivy:cachepath] downloading http://repository.springsource.com/ivy/bundles/external/com.dumbster/com.springsource.com.dumbster.smtp/1.6.0/com.springsource.com.dumbster.smtp-sources-1.6.0.jar ...
     [exec] [ivy:cachepath] .. (10kB)
     [exec] [ivy:cachepath] .. (0kB)
     [exec] [ivy:cachepath] 	[SUCCESSFUL ] com.dumbster#com.springsource.com.dumbster.smtp;1.6.0!com.springsource.com.dumbster.smtp-sources.jar(src) (564ms)
     [exec] [ivy:cachepath] downloading http://repository.springsource.com/ivy/bundles/external/com.dumbster/com.springsource.com.dumbster.smtp/1.6.0/license-1.6.0.txt ...
     [exec] [ivy:cachepath] .. (11kB)
     [exec] [ivy:cachepath] .. (0kB)
     [exec] [ivy:cachepath] 	[SUCCESSFUL ] com.dumbster#com.springsource.com.dumbster.smtp;1.6.0!license.txt(license) (442ms)
     [exec] [ivy:cachepath] downloading http://repository.springsource.com/ivy/bundles/external/com.dumbster/com.springsource.com.dumbster.smtp/1.6.0/com.springsource.com.dumbster.smtp-1.6.0.jar ...
     [exec] [ivy:cachepath] .. (7kB)
     [exec] [ivy:cachepath] .. (0kB)
     [exec] [ivy:cachepath] 	[SUCCESSFUL ] com.dumbster#com.springsource.com.dumbster.smtp;1.6.0!com.springsource.com.dumbster.smtp.jar (430ms)
     [exec] [ivy:cachepath] downloading http://build.eclipse.org/rt/virgo/ivy/bundles/release/org.eclipse.virgo.test/org.eclipse.virgo.test.framework/3.6.4.RELEASE/org.eclipse.virgo.test.framework-sources-3.6.4.RELEASE.jar ...
     [exec] [ivy:cachepath] .. (17kB)
     [exec] [ivy:cachepath] .. (0kB)
     [exec] [ivy:cachepath] 	[SUCCESSFUL ] org.eclipse.virgo.test#org.eclipse.virgo.test.framework;3.6.4.RELEASE!org.eclipse.virgo.test.framework-sources.jar(src) (56ms)
     [exec] [ivy:cachepath] downloading http://build.eclipse.org/rt/virgo/ivy/bundles/release/org.eclipse.virgo.test/org.eclipse.virgo.test.framework/3.6.4.RELEASE/org.eclipse.virgo.test.framework-3.6.4.RELEASE.jar ...
     [exec] [ivy:cachepath] ......................... (223kB)
     [exec] [ivy:cachepath] .. (0kB)
     [exec] [ivy:cachepath] 	[SUCCESSFUL ] org.eclipse.virgo.test#org.eclipse.virgo.test.framework;3.6.4.RELEASE!org.eclipse.virgo.test.framework.jar (67ms)
     [exec] [ivy:cachepath] downloading http://repository.springsource.com/ivy/libraries/release/org.springframework/org.springframework.spring-library/3.1.0.RELEASE/license-3.1.0.RELEASE.txt ...
     [exec] [ivy:cachepath] ... (14kB)
     [exec] [ivy:cachepath] .. (0kB)
     [exec] [ivy:cachepath] 	[SUCCESSFUL ] org.springframework#org.springframework.spring-library;3.1.0.RELEASE!license.txt(license) (520ms)
     [exec] [ivy:cachepath] downloading http://repository.springsource.com/ivy/libraries/release/org.springframework/org.springframework.spring-library/3.1.0.RELEASE/notice-3.1.0.RELEASE.txt ...
     [exec] [ivy:cachepath] .. (0kB)
     [exec] [ivy:cachepath] .. (0kB)
     [exec] [ivy:cachepath] 	[SUCCESSFUL ] org.springframework#org.springframework.spring-library;3.1.0.RELEASE!notice.txt(notice) (405ms)
     [exec] [ivy:cachepath] downloading http://repository.springsource.com/ivy/libraries/release/org.springframework/org.springframework.spring-library/3.1.0.RELEASE/org.springframework.spring-library-3.1.0.RELEASE.libd ...
     [exec] [ivy:cachepath] .. (1kB)
     [exec] [ivy:cachepath] .. (0kB)
     [exec] [ivy:cachepath] 	[SUCCESSFUL ] org.springframework#org.springframework.spring-library;3.1.0.RELEASE!org.springframework.spring-library.libd(library) (402ms)
     [exec] [ivy:cachepath] downloading http://build.eclipse.org/rt/virgo/ivy/bundles/release/org.eclipse.virgo.mirrored/javax.jms/1.1.0.v201205091237/javax.jms-1.1.0.v201205091237.jar ...
     [exec] [ivy:cachepath] ...... (46kB)
     [exec] [ivy:cachepath] .. (0kB)
     [exec] [ivy:cachepath] 	[SUCCESSFUL ] org.eclipse.virgo.mirrored#javax.jms;1.1.0.v201205091237!javax.jms.jar (79ms)
     [exec] [ivy:cachepath] downloading http://build.eclipse.org/rt/virgo/ivy/bundles/release/org.eclipse.virgo.mirrored/javax.jms/1.1.0.v201205091237/javax.jms.source-1.1.0.v201205091237.jar ...
     [exec] [ivy:cachepath] ........... (110kB)
     [exec] [ivy:cachepath] .. (0kB)
     [exec] [ivy:cachepath] 	[SUCCESSFUL ] org.eclipse.virgo.mirrored#javax.jms;1.1.0.v201205091237!javax.jms.source.jar(src) (41ms)
     [exec] [ivy:cachepath] downloading http://build.eclipse.org/rt/virgo/ivy/bundles/release/org.eclipse.virgo.nano/org.eclipse.virgo.nano.management/3.6.4.RELEASE/org.eclipse.virgo.nano.management-3.6.4.RELEASE.jar ...
     [exec] [ivy:cachepath] .. (8kB)
     [exec] [ivy:cachepath] .. (0kB)
     [exec] [ivy:cachepath] 	[SUCCESSFUL ] org.eclipse.virgo.nano#org.eclipse.virgo.nano.management;3.6.4.RELEASE!org.eclipse.virgo.nano.management.jar (46ms)
     [exec] [ivy:cachepath] downloading http://build.eclipse.org/rt/virgo/ivy/bundles/release/org.eclipse.virgo.nano/org.eclipse.virgo.nano.management/3.6.4.RELEASE/org.eclipse.virgo.nano.management-sources-3.6.4.RELEASE.jar ...
     [exec] [ivy:cachepath] .. (4kB)
     [exec] [ivy:cachepath] .. (0kB)
     [exec] [ivy:cachepath] 	[SUCCESSFUL ] org.eclipse.virgo.nano#org.eclipse.virgo.nano.management;3.6.4.RELEASE!org.eclipse.virgo.nano.management-sources.jar(src) (62ms)
     [exec] [ivy:cachepath] downloading http://build.eclipse.org/rt/virgo/ivy/bundles/release/org.eclipse.virgo.mirrored/org.eclipse.equinox.ds/1.4.0.v20120112-1400/org.eclipse.equinox.ds-1.4.0.v20120112-1400.jar ...
     [exec] [ivy:cachepath] ......................... (188kB)
     [exec] [ivy:cachepath] .. (0kB)
     [exec] [ivy:cachepath] 	[SUCCESSFUL ] org.eclipse.virgo.mirrored#org.eclipse.equinox.ds;1.4.0.v20120112-1400!org.eclipse.equinox.ds.jar (1716ms)
     [exec] [ivy:cachepath] downloading http://build.eclipse.org/rt/virgo/ivy/bundles/release/org.eclipse.virgo.mirrored/org.eclipse.equinox.ds/1.4.0.v20120112-1400/org.eclipse.equinox.ds.source-1.4.0.v20120112-1400.jar ...
     [exec] [ivy:cachepath] ................. (152kB)
     [exec] [ivy:cachepath] .. (0kB)
     [exec] [ivy:cachepath] 	[SUCCESSFUL ] org.eclipse.virgo.mirrored#org.eclipse.equinox.ds;1.4.0.v20120112-1400!org.eclipse.equinox.ds.source.jar(src) (152ms)
     [exec] [ivy:cachepath] downloading http://build.eclipse.org/rt/virgo/ivy/bundles/release/org.eclipse.virgo.mirrored/org.eclipse.equinox.util/1.0.300.v20111010-1614/org.eclipse.equinox.util.source-1.0.300.v20111010-1614.jar ...
     [exec] [ivy:cachepath] ......... (65kB)
     [exec] [ivy:cachepath] .. (0kB)
     [exec] [ivy:cachepath] 	[SUCCESSFUL ] org.eclipse.virgo.mirrored#org.eclipse.equinox.util;1.0.300.v20111010-1614!org.eclipse.equinox.util.source.jar(src) (243ms)
     [exec] [ivy:cachepath] downloading http://build.eclipse.org/rt/virgo/ivy/bundles/release/org.eclipse.virgo.mirrored/org.eclipse.equinox.util/1.0.300.v20111010-1614/org.eclipse.equinox.util-1.0.300.v20111010-1614.jar ...
     [exec] [ivy:cachepath] ..... (75kB)
     [exec] [ivy:cachepath] .. (0kB)
     [exec] [ivy:cachepath] 	[SUCCESSFUL ] org.eclipse.virgo.mirrored#org.eclipse.equinox.util;1.0.300.v20111010-1614!org.eclipse.equinox.util.jar (485ms)
     [exec] [ivy:cachepath] downloading http://build.eclipse.org/rt/virgo/ivy/bundles/release/org.eclipse.virgo.mirrored/javax.mail/1.4.0.v201005080615/javax.mail-1.4.0.v201005080615.jar ...
     [exec] [ivy:cachepath] ......................................... (313kB)
     [exec] [ivy:cachepath] .. (0kB)
     [exec] [ivy:cachepath] 	[SUCCESSFUL ] org.eclipse.virgo.mirrored#javax.mail;1.4.0.v201005080615!javax.mail.jar (2513ms)
     [exec] [ivy:cachepath] downloading http://build.eclipse.org/rt/virgo/ivy/bundles/release/org.eclipse.virgo.mirrored/javax.websocket/1.1.0.v201401130840/javax.websocket-1.1.0.v201401130840.jar ...
     [exec] [ivy:cachepath] ... (51kB)
     [exec] [ivy:cachepath] .. (0kB)
     [exec] [ivy:cachepath] 	[SUCCESSFUL ] org.eclipse.virgo.mirrored#javax.websocket;1.1.0.v201401130840!javax.websocket.jar (48ms)
     [exec] [ivy:cachepath] downloading http://build.eclipse.org/rt/virgo/ivy/bundles/release/org.eclipse.virgo.mirrored/javax.websocket/1.1.0.v201401130840/javax.websocket.source-1.1.0.v201401130840.jar ...
     [exec] [ivy:cachepath] ........ (46kB)
     [exec] [ivy:cachepath] .. (0kB)
     [exec] [ivy:cachepath] 	[SUCCESSFUL ] org.eclipse.virgo.mirrored#javax.websocket;1.1.0.v201401130840!javax.websocket.source.jar(src) (429ms)
     [exec] [ivy:cachepath] downloading http://build.eclipse.org/rt/virgo/ivy/bundles/release/org.eclipse.virgo.medic/org.eclipse.virgo.medic.logbackcorefragment/3.6.4.RELEASE/org.eclipse.virgo.medic.logbackcorefragment-3.6.4.RELEASE.jar ...
     [exec] [ivy:cachepath] .. (1kB)
     [exec] [ivy:cachepath] .. (0kB)
     [exec] [ivy:cachepath] 	[SUCCESSFUL ] org.eclipse.virgo.medic#org.eclipse.virgo.medic.logbackcorefragment;3.6.4.RELEASE!org.eclipse.virgo.medic.logbackcorefragment.jar (91ms)
     [exec] [ivy:cachepath] downloading http://build.eclipse.org/rt/virgo/ivy/bundles/release/org.eclipse.virgo.medic/org.eclipse.virgo.medic.logbackcorefragment/3.6.4.RELEASE/org.eclipse.virgo.medic.logbackcorefragment-sources-3.6.4.RELEASE.jar ...
     [exec] [ivy:cachepath] .. (0kB)
     [exec] [ivy:cachepath] .. (0kB)
     [exec] [ivy:cachepath] 	[SUCCESSFUL ] org.eclipse.virgo.medic#org.eclipse.virgo.medic.logbackcorefragment;3.6.4.RELEASE!org.eclipse.virgo.medic.logbackcorefragment-sources.jar(src) (34ms)
     [exec] [ivy:cachepath] downloading http://build.eclipse.org/rt/virgo/ivy/bundles/release/org.eclipse.virgo.medic/org.eclipse.virgo.medic.logbackclassicfragment/3.6.4.RELEASE/org.eclipse.virgo.medic.logbackclassicfragment-3.6.4.RELEASE.jar ...
     [exec] [ivy:cachepath] .. (1kB)
     [exec] [ivy:cachepath] .. (0kB)
     [exec] [ivy:cachepath] 	[SUCCESSFUL ] org.eclipse.virgo.medic#org.eclipse.virgo.medic.logbackclassicfragment;3.6.4.RELEASE!org.eclipse.virgo.medic.logbackclassicfragment.jar (32ms)
     [exec] [ivy:cachepath] downloading http://build.eclipse.org/rt/virgo/ivy/bundles/release/org.eclipse.virgo.medic/org.eclipse.virgo.medic.logbackclassicfragment/3.6.4.RELEASE/org.eclipse.virgo.medic.logbackclassicfragment-sources-3.6.4.RELEASE.jar ...
     [exec] [ivy:cachepath] .. (0kB)
     [exec] [ivy:cachepath] .. (0kB)
     [exec] [ivy:cachepath] 	[SUCCESSFUL ] org.eclipse.virgo.medic#org.eclipse.virgo.medic.logbackclassicfragment;3.6.4.RELEASE!org.eclipse.virgo.medic.logbackclassicfragment-sources.jar(src) (229ms)
     [exec] [ivy:cachepath] downloading http://repository.springsource.com/ivy/bundles/release/org.springframework.webflow.samples/swf-booking-mvc/2.0.8.RELEASE/swf-booking-mvc-2.0.8.RELEASE.war ...
     [exec] [ivy:cachepath] ...........................................................................................................................................................................................................................................................................................................................................................................................................................................................................................................................................................................................................................................................................................
     [exec] [ivy:cachepath] .............................................................................................................................................................................................................................................................................................................................................................................................................................................................................................................................................................................................................................................................................................................................................................................................................................................
     [exec] [ivy:cachepath] ...............................................................................................................................................................................................................................................................................................................................................................................................................................................................................................................................................................................................................................................................................................................................................................................................................................................
     [exec] [ivy:cachepath] ................................................................................................................................................................................................................................................................................................................................................................................................................................................................................................ (12371kB)
     [exec] [ivy:cachepath] .. (0kB)
     [exec] [ivy:cachepath] 	[SUCCESSFUL ] org.springframework.webflow.samples#swf-booking-mvc;2.0.8.RELEASE!swf-booking-mvc.war (6256ms)
     [exec] [ivy:cachepath] downloading http://repository.springsource.com/ivy/bundles/release/org.springframework.webflow.samples/swf-booking-mvc/2.0.8.RELEASE/swf-booking-mvc-sources-2.0.8.RELEASE.jar ...
     [exec] [ivy:cachepath] .. (8kB)
     [exec] [ivy:cachepath] .. (0kB)
     [exec] [ivy:cachepath] 	[SUCCESSFUL ] org.springframework.webflow.samples#swf-booking-mvc;2.0.8.RELEASE!swf-booking-mvc-sources.jar(src) (1309ms)
     [exec] [ivy:cachepath] downloading http://repository.springsource.com/ivy/bundles/release/org.springframework.webflow.samples/swf-booking-faces/2.0.8.RELEASE/swf-booking-faces-sources-2.0.8.RELEASE.jar ...
     [exec] [ivy:cachepath] .. (7kB)
     [exec] [ivy:cachepath] .. (0kB)
     [exec] [ivy:cachepath] 	[SUCCESSFUL ] org.springframework.webflow.samples#swf-booking-faces;2.0.8.RELEASE!swf-booking-faces-sources.jar(src) (1076ms)
     [exec] [ivy:cachepath] downloading http://repository.springsource.com/ivy/bundles/release/org.springframework.webflow.samples/swf-booking-faces/2.0.8.RELEASE/swf-booking-faces-2.0.8.RELEASE.war ...
     [exec] [ivy:cachepath] .........................................................................................................................................................................................................................................................................................................................................................
     [exec] [ivy:cachepath] ............................................................................................................................................................................................................................................................................................................................................................................
     [exec] [ivy:cachepath] ......................................................................................................
     [exec] [ivy:cachepath] ...................................................................................................................................................................................................................................................................................................................................................................................................................................................................................................................
     [exec] [ivy:cachepath] ....................................................................................................................................................................................................................................................................................................................................................................................................................................................................................................................................................................................................................................................................................................................................
     [exec] [ivy:cachepath] ......................................................................................................................................................................................................................................................................................................................................................................... (13160kB)
     [exec] [ivy:cachepath] .. (0kB)
     [exec] [ivy:cachepath] 	[SUCCESSFUL ] org.springframework.webflow.samples#swf-booking-faces;2.0.8.RELEASE!swf-booking-faces.war (9569ms)
     [exec] [ivy:cachepath] downloading http://repository.springsource.com/ivy/bundles/release/org.springframework/org.springframework.transaction/3.1.0.RELEASE/license-3.1.0.RELEASE.txt ...
     [exec] [ivy:cachepath] ... (14kB)
     [exec] [ivy:cachepath] .. (0kB)
     [exec] [ivy:cachepath] 	[SUCCESSFUL ] org.springframework#org.springframework.transaction;3.1.0.RELEASE!license.txt(license) (1298ms)
     [exec] [ivy:cachepath] downloading http://repository.springsource.com/ivy/bundles/release/org.springframework/org.springframework.transaction/3.1.0.RELEASE/org.springframework.transaction-sources-3.1.0.RELEASE.jar ...
     [exec] [ivy:cachepath] ................................. (272kB)
     [exec] [ivy:cachepath] .. (0kB)
     [exec] [ivy:cachepath] 	[SUCCESSFUL ] org.springframework#org.springframework.transaction;3.1.0.RELEASE!org.springframework.transaction-sources.jar(src) (1553ms)
     [exec] [ivy:cachepath] downloading http://repository.springsource.com/ivy/bundles/release/org.springframework/org.springframework.transaction/3.1.0.RELEASE/notice-3.1.0.RELEASE.txt ...
     [exec] [ivy:cachepath] .. (0kB)
     [exec] [ivy:cachepath] .. (0kB)
     [exec] [ivy:cachepath] 	[SUCCESSFUL ] org.springframework#org.springframework.transaction;3.1.0.RELEASE!notice.txt(notice) (1085ms)
     [exec] [ivy:cachepath] downloading http://repository.springsource.com/ivy/bundles/release/org.springframework/org.springframework.transaction/3.1.0.RELEASE/org.springframework.transaction-3.1.0.RELEASE.jar ...
     [exec] [ivy:cachepath] ................................................... (240kB)
     [exec] [ivy:cachepath] .. (0kB)
     [exec] [ivy:cachepath] 	[SUCCESSFUL ] org.springframework#org.springframework.transaction;3.1.0.RELEASE!org.springframework.transaction.jar (1191ms)
     [exec] [ivy:cachepath] downloading http://build.eclipse.org/rt/virgo/ivy/bundles/release/org.eclipse.virgo.test/org.eclipse.virgo.test.launcher/3.6.4.RELEASE/org.eclipse.virgo.test.launcher-3.6.4.RELEASE.jar ...
     [exec] [ivy:cachepath] .. (16kB)
     [exec] [ivy:cachepath] .. (0kB)
     [exec] [ivy:cachepath] 	[SUCCESSFUL ] org.eclipse.virgo.test#org.eclipse.virgo.test.launcher;3.6.4.RELEASE!org.eclipse.virgo.test.launcher.jar (47ms)
     [exec] [ivy:cachepath] downloading http://build.eclipse.org/rt/virgo/ivy/bundles/release/org.eclipse.virgo.test/org.eclipse.virgo.test.launcher/3.6.4.RELEASE/org.eclipse.virgo.test.launcher-sources-3.6.4.RELEASE.jar ...
     [exec] [ivy:cachepath] .. (9kB)
     [exec] [ivy:cachepath] .. (0kB)
     [exec] [ivy:cachepath] 	[SUCCESSFUL ] org.eclipse.virgo.test#org.eclipse.virgo.test.launcher;3.6.4.RELEASE!org.eclipse.virgo.test.launcher-sources.jar(src) (45ms)
     [exec] [ivy:cachepath] downloading http://repository.springsource.com/ivy/bundles/release/org.springframework/org.springframework.jms/3.1.0.RELEASE/org.springframework.jms-sources-3.1.0.RELEASE.jar ...
     [exec] [ivy:cachepath] ........................... (173kB)
     [exec] [ivy:cachepath] .. (0kB)
     [exec] [ivy:cachepath] 	[SUCCESSFUL ] org.springframework#org.springframework.jms;3.1.0.RELEASE!org.springframework.jms-sources.jar(src) (1345ms)
     [exec] [ivy:cachepath] downloading http://repository.springsource.com/ivy/bundles/release/org.springframework/org.springframework.jms/3.1.0.RELEASE/license-3.1.0.RELEASE.txt ...
     [exec] [ivy:cachepath] ... (14kB)
     [exec] [ivy:cachepath] .. (0kB)
     [exec] [ivy:cachepath] 	[SUCCESSFUL ] org.springframework#org.springframework.jms;3.1.0.RELEASE!license.txt(license) (1121ms)
     [exec] [ivy:cachepath] downloading http://repository.springsource.com/ivy/bundles/release/org.springframework/org.springframework.jms/3.1.0.RELEASE/notice-3.1.0.RELEASE.txt ...
     [exec] [ivy:cachepath] .. (0kB)
     [exec] [ivy:cachepath] .. (0kB)
     [exec] [ivy:cachepath] 	[SUCCESSFUL ] org.springframework#org.springframework.jms;3.1.0.RELEASE!notice.txt(notice) (1015ms)
     [exec] [ivy:cachepath] downloading http://repository.springsource.com/ivy/bundles/release/org.springframework/org.springframework.jms/3.1.0.RELEASE/org.springframework.jms-3.1.0.RELEASE.jar ...
     [exec] [ivy:cachepath] ................................ (194kB)
     [exec] [ivy:cachepath] .. (0kB)
     [exec] [ivy:cachepath] 	[SUCCESSFUL ] org.springframework#org.springframework.jms;3.1.0.RELEASE!org.springframework.jms.jar (990ms)
     [exec] [ivy:cachepath] downloading http://repository.springsource.com/ivy/bundles/release/org.springframework/org.springframework.orm/3.1.0.RELEASE/org.springframework.orm-3.1.0.RELEASE.jar ...
     [exec] [ivy:cachepath] .................................................. (369kB)
     [exec] [ivy:cachepath] .. (0kB)
     [exec] [ivy:cachepath] 	[SUCCESSFUL ] org.springframework#org.springframework.orm;3.1.0.RELEASE!org.springframework.orm.jar (662ms)
     [exec] [ivy:cachepath] downloading http://repository.springsource.com/ivy/bundles/release/org.springframework/org.springframework.orm/3.1.0.RELEASE/notice-3.1.0.RELEASE.txt ...
     [exec] [ivy:cachepath] .. (0kB)
     [exec] [ivy:cachepath] .. (0kB)
     [exec] [ivy:cachepath] 	[SUCCESSFUL ] org.springframework#org.springframework.orm;3.1.0.RELEASE!notice.txt(notice) (748ms)
     [exec] [ivy:cachepath] downloading http://repository.springsource.com/ivy/bundles/release/org.springframework/org.springframework.orm/3.1.0.RELEASE/org.springframework.orm-sources-3.1.0.RELEASE.jar ...
     [exec] [ivy:cachepath] ....................................... (320kB)
     [exec] [ivy:cachepath] .. (0kB)
     [exec] [ivy:cachepath] 	[SUCCESSFUL ] org.springframework#org.springframework.orm;3.1.0.RELEASE!org.springframework.orm-sources.jar(src) (835ms)
     [exec] [ivy:cachepath] downloading http://repository.springsource.com/ivy/bundles/release/org.springframework/org.springframework.orm/3.1.0.RELEASE/license-3.1.0.RELEASE.txt ...
     [exec] [ivy:cachepath] ... (14kB)
     [exec] [ivy:cachepath] .. (0kB)
     [exec] [ivy:cachepath] 	[SUCCESSFUL ] org.springframework#org.springframework.orm;3.1.0.RELEASE!license.txt(license) (564ms)
     [exec] [ivy:cachepath] downloading http://repository.springsource.com/ivy/bundles/release/org.springframework/org.springframework.web.portlet/3.1.0.RELEASE/license-3.1.0.RELEASE.txt ...
     [exec] [ivy:cachepath] ... (14kB)
     [exec] [ivy:cachepath] .. (0kB)
     [exec] [ivy:cachepath] 	[SUCCESSFUL ] org.springframework#org.springframework.web.portlet;3.1.0.RELEASE!license.txt(license) (565ms)
     [exec] [ivy:cachepath] downloading http://repository.springsource.com/ivy/bundles/release/org.springframework/org.springframework.web.portlet/3.1.0.RELEASE/org.springframework.web.portlet-sources-3.1.0.RELEASE.jar ...
     [exec] [ivy:cachepath] downloading http://repository.springsource.com/ivy/bundles/release/org.springframework/org.springframework.web.portlet/3.1.0.RELEASE/notice-3.1.0.RELEASE.txt ...
     [exec] [ivy:cachepath] .. (0kB)
     [exec] [ivy:cachepath] .. (0kB)
     [exec] [ivy:cachepath] 	[SUCCESSFUL ] org.springframework#org.springframework.web.portlet;3.1.0.RELEASE!notice.txt(notice) (1221ms)
     [exec] [ivy:cachepath] downloading http://repository.springsource.com/ivy/bundles/release/org.springframework/org.springframework.web.portlet/3.1.0.RELEASE/org.springframework.web.portlet-3.1.0.RELEASE.jar ...
     [exec] [ivy:cachepath] ................................ (186kB)
     [exec] [ivy:cachepath] .. (0kB)
     [exec] [ivy:cachepath] 	[SUCCESSFUL ] org.springframework#org.springframework.web.portlet;3.1.0.RELEASE!org.springframework.web.portlet.jar (1303ms)
     [exec] [ivy:cachepath] downloading http://repository.springsource.com/ivy/bundles/external/javax.servlet/com.springsource.javax.servlet/2.5.0/license-2.5.0.txt ...
     [exec] [ivy:cachepath] ... (15kB)
     [exec] [ivy:cachepath] .. (0kB)
     [exec] [ivy:cachepath] 	[SUCCESSFUL ] javax.servlet#com.springsource.javax.servlet;2.5.0!license.txt(license) (896ms)
     [exec] [ivy:cachepath] downloading http://repository.springsource.com/ivy/bundles/external/javax.servlet/com.springsource.javax.servlet/2.5.0/com.springsource.javax.servlet-sources-2.5.0.jar ...
     [exec] [ivy:cachepath] .................... (141kB)
     [exec] [ivy:cachepath] .. (0kB)
     [exec] [ivy:cachepath] 	[SUCCESSFUL ] javax.servlet#com.springsource.javax.servlet;2.5.0!com.springsource.javax.servlet-sources.jar(src) (797ms)
     [exec] [ivy:cachepath] downloading http://repository.springsource.com/ivy/bundles/external/javax.servlet/com.springsource.javax.servlet/2.5.0/com.springsource.javax.servlet-2.5.0.jar ...
     [exec] [ivy:cachepath] ............... (87kB)
     [exec] [ivy:cachepath] .. (0kB)
     [exec] [ivy:cachepath] 	[SUCCESSFUL ] javax.servlet#com.springsource.javax.servlet;2.5.0!com.springsource.javax.servlet.jar (534ms)
     [exec] [ivy:cachepath] downloading http://repository.springsource.com/ivy/bundles/external/javax.servlet/com.springsource.javax.servlet.jsp/2.1.0/com.springsource.javax.servlet.jsp-2.1.0.jar ...
     [exec] [ivy:cachepath] ........... (80kB)
     [exec] [ivy:cachepath] .. (0kB)
     [exec] [ivy:cachepath] 	[SUCCESSFUL ] javax.servlet#com.springsource.javax.servlet.jsp;2.1.0!com.springsource.javax.servlet.jsp.jar (792ms)
     [exec] [ivy:cachepath] downloading http://repository.springsource.com/ivy/bundles/external/javax.servlet/com.springsource.javax.servlet.jsp/2.1.0/com.springsource.javax.servlet.jsp-sources-2.1.0.jar ...
     [exec] [ivy:cachepath] .................. (132kB)
     [exec] [ivy:cachepath] .. (0kB)
     [exec] [ivy:cachepath] 	[SUCCESSFUL ] javax.servlet#com.springsource.javax.servlet.jsp;2.1.0!com.springsource.javax.servlet.jsp-sources.jar(src) (869ms)
     [exec] [ivy:cachepath] downloading http://repository.springsource.com/ivy/bundles/external/javax.servlet/com.springsource.javax.servlet.jsp/2.1.0/license-2.1.0.txt ...
     [exec] [ivy:cachepath] ... (15kB)
     [exec] [ivy:cachepath] .. (0kB)
     [exec] [ivy:cachepath] 	[SUCCESSFUL ] javax.servlet#com.springsource.javax.servlet.jsp;2.1.0!license.txt(license) (548ms)
     [exec] [ivy:cachepath] downloading http://repository.springsource.com/ivy/bundles/external/javax.el/com.springsource.javax.el/1.0.0/com.springsource.javax.el-sources-1.0.0.jar ...
     [exec] [ivy:cachepath] ............ (53kB)
     [exec] [ivy:cachepath] .. (0kB)
     [exec] [ivy:cachepath] 	[SUCCESSFUL ] javax.el#com.springsource.javax.el;1.0.0!com.springsource.javax.el-sources.jar(src) (826ms)
     [exec] [ivy:cachepath] downloading http://repository.springsource.com/ivy/bundles/external/javax.el/com.springsource.javax.el/1.0.0/license-1.0.0.txt ...
     [exec] [ivy:cachepath] ... (15kB)
     [exec] [ivy:cachepath] .. (0kB)
     [exec] [ivy:cachepath] 	[SUCCESSFUL ] javax.el#com.springsource.javax.el;1.0.0!license.txt(license) (590ms)
     [exec] [ivy:cachepath] downloading http://repository.springsource.com/ivy/bundles/external/javax.el/com.springsource.javax.el/1.0.0/com.springsource.javax.el-1.0.0.jar ...
     [exec] [ivy:cachepath] .... (29kB)
     [exec] [ivy:cachepath] .. (0kB)
     [exec] [ivy:cachepath] 	[SUCCESSFUL ] javax.el#com.springsource.javax.el;1.0.0!com.springsource.javax.el.jar (967ms)
     [exec] [ivy:cachepath] 
     [exec] [ivy:cachepath] :::: WARNINGS
     [exec] [ivy:cachepath] 		[FAILED     ] org.springframework#org.springframework.web.portlet;3.1.0.RELEASE!org.springframework.web.portlet-sources.jar(src): The HTTP response code for http://repository.springsource.com/ivy/bundles/release/org.springframework/org.springframework.web.portlet/3.1.0.RELEASE/org.springframework.web.portlet-sources-3.1.0.RELEASE.jar did not indicate a success. See log for more detail. (60170ms)
     [exec] [ivy:cachepath] 		[FAILED     ] org.springframework#org.springframework.web.portlet;3.1.0.RELEASE!org.springframework.web.portlet-sources.jar(src): The HTTP response code for http://repository.springsource.com/ivy/bundles/release/org.springframework/org.springframework.web.portlet/3.1.0.RELEASE/org.springframework.web.portlet-sources-3.1.0.RELEASE.jar did not indicate a success. See log for more detail. (60170ms)
     [exec] [ivy:cachepath] 	==== bundle-release-repository-s3.read.resolver: tried
     [exec] [ivy:cachepath] 	  http://repository.springsource.com/ivy/bundles/release/org.springframework/org.springframework.web.portlet/3.1.0.RELEASE/org.springframework.web.portlet-sources-3.1.0.RELEASE.jar
     [exec] [ivy:cachepath] 		::::::::::::::::::::::::::::::::::::::::::::::
     [exec] [ivy:cachepath] 		::              FAILED DOWNLOADS            ::
     [exec] [ivy:cachepath] 		:: ^ see resolution messages for details  ^ ::
     [exec] [ivy:cachepath] 		::::::::::::::::::::::::::::::::::::::::::::::
     [exec] [ivy:cachepath] 		:: org.springframework#org.springframework.web.portlet;3.1.0.RELEASE!org.springframework.web.portlet-sources.jar(src)
     [exec] [ivy:cachepath] 		::::::::::::::::::::::::::::::::::::::::::::::
     [exec] [ivy:cachepath] 
     [exec] [ivy:cachepath] :: USE VERBOSE OR DEBUG MESSAGE LEVEL FOR MORE DETAILS
     [exec] [ivy:cachepath] :: problems summary ::
     [exec] [ivy:cachepath] :::: ERRORS
     [exec] [ivy:cachepath] 	SERVER ERROR: Proxy Error url=http://repository.springsource.com/ivy/bundles/release/org.springframework/org.springframework.web.portlet/3.1.0.RELEASE/org.springframework.web.portlet-sources-3.1.0.RELEASE.jar
     [exec] 
     [exec] BUILD FAILED
     [exec] /jobs/genie.virgo/virgo.web.3.6.snapshot/workspace/virgo-build/common/common.xml:120: impossible to resolve dependencies:
     [exec] 	resolve failed - see output for details
     [exec] 
     [exec] Total time: 2 minutes 28 seconds
   [subant] Leaving directory: /jobs/genie.virgo/virgo.web.3.6.snapshot/workspace/org.eclipse.virgo.web.test

BUILD FAILED
/jobs/genie.virgo/virgo.web.3.6.snapshot/workspace/virgo-build/multi-bundle/quality.xml:46: The following error occurred while executing this line:
/jobs/genie.virgo/virgo.web.3.6.snapshot/workspace/virgo-build/multi-bundle/common.xml:184: The following error occurred while executing this line:
/jobs/genie.virgo/virgo.web.3.6.snapshot/workspace/virgo-build/common/common.xml:198: exec returned: 1

Total time: 9 minutes 8 seconds
[locks-and-latches] Releasing all the locks
[locks-and-latches] All the locks released
Recording test results
Sending e-mails to: milesg78@gmail.com fwaibel@eclipsesource.com
Finished: FAILURE