AbortedConsole Output

Skipping 2,002 KB.. Full Log
n] DEBUG o.e.virgo.nano.serviceability.Assert - > public static transient void org.eclipse.virgo.nano.serviceability.Assert.notNull(java.lang.Object, java.lang.String, java.lang.Object[])
     [exec]     [junit] 03:45:03.080 [main] DEBUG o.e.virgo.nano.serviceability.Assert - < public static transient void org.eclipse.virgo.nano.serviceability.Assert.notNull(java.lang.Object, java.lang.String, java.lang.Object[])
     [exec]     [junit] 03:45:03.080 [main] DEBUG o.e.virgo.nano.serviceability.Assert - > public static transient void org.eclipse.virgo.nano.serviceability.Assert.notNull(java.lang.Object, java.lang.String, java.lang.Object[])
     [exec]     [junit] 03:45:03.080 [main] DEBUG o.e.virgo.nano.serviceability.Assert - < public static transient void org.eclipse.virgo.nano.serviceability.Assert.notNull(java.lang.Object, java.lang.String, java.lang.Object[])
     [exec]     [junit] 03:45:03.080 [main] DEBUG o.e.virgo.nano.serviceability.Assert - > public static transient void org.eclipse.virgo.nano.serviceability.Assert.notNull(java.lang.Object, java.lang.String, java.lang.Object[])
     [exec]     [junit] 03:45:03.080 [main] DEBUG o.e.virgo.nano.serviceability.Assert - < public static transient void org.eclipse.virgo.nano.serviceability.Assert.notNull(java.lang.Object, java.lang.String, java.lang.Object[])
     [exec]     [junit] 03:45:03.080 [main] DEBUG o.e.virgo.nano.serviceability.Assert - > public static transient void org.eclipse.virgo.nano.serviceability.Assert.notNull(java.lang.Object, java.lang.String, java.lang.Object[])
     [exec]     [junit] 03:45:03.080 [main] DEBUG o.e.virgo.nano.serviceability.Assert - < public static transient void org.eclipse.virgo.nano.serviceability.Assert.notNull(java.lang.Object, java.lang.String, java.lang.Object[])
     [exec]     [junit] 03:45:03.080 [main] DEBUG o.e.virgo.nano.serviceability.Assert - > public static transient void org.eclipse.virgo.nano.serviceability.Assert.notNull(java.lang.Object, java.lang.String, java.lang.Object[])
     [exec]     [junit] 03:45:03.080 [main] DEBUG o.e.virgo.nano.serviceability.Assert - < public static transient void org.eclipse.virgo.nano.serviceability.Assert.notNull(java.lang.Object, java.lang.String, java.lang.Object[])
     [exec]     [junit] 03:45:03.080 [main] DEBUG o.e.virgo.nano.serviceability.Assert - > public static transient void org.eclipse.virgo.nano.serviceability.Assert.notNull(java.lang.Object, java.lang.String, java.lang.Object[])
     [exec]     [junit] 03:45:03.080 [main] DEBUG o.e.virgo.nano.serviceability.Assert - < public static transient void org.eclipse.virgo.nano.serviceability.Assert.notNull(java.lang.Object, java.lang.String, java.lang.Object[])
     [exec]     [junit] 03:45:03.080 [main] DEBUG o.e.virgo.nano.serviceability.Assert - > public static transient void org.eclipse.virgo.nano.serviceability.Assert.notNull(java.lang.Object, java.lang.String, java.lang.Object[])
     [exec]     [junit] 03:45:03.080 [main] DEBUG o.e.virgo.nano.serviceability.Assert - < public static transient void org.eclipse.virgo.nano.serviceability.Assert.notNull(java.lang.Object, java.lang.String, java.lang.Object[])
     [exec]     [junit] 03:45:03.080 [main] DEBUG o.e.virgo.nano.serviceability.Assert - > public static transient void org.eclipse.virgo.nano.serviceability.Assert.notNull(java.lang.Object, java.lang.String, java.lang.Object[])
     [exec]     [junit] 03:45:03.080 [main] DEBUG o.e.virgo.nano.serviceability.Assert - < public static transient void org.eclipse.virgo.nano.serviceability.Assert.notNull(java.lang.Object, java.lang.String, java.lang.Object[])
     [exec]     [junit] 03:45:03.080 [main] DEBUG o.e.virgo.nano.serviceability.Assert - > public static transient void org.eclipse.virgo.nano.serviceability.Assert.notNull(java.lang.Object, java.lang.String, java.lang.Object[])
     [exec]     [junit] 03:45:03.081 [main] DEBUG o.e.virgo.nano.serviceability.Assert - < public static transient void org.eclipse.virgo.nano.serviceability.Assert.notNull(java.lang.Object, java.lang.String, java.lang.Object[])
     [exec]     [junit] org.eclipse.virgo.nano.serviceability.Assert$FatalAssertionException: Argument [5] cannot be null
     [exec]     [junit] 	at org.eclipse.virgo.nano.serviceability.Assert.notNull(Assert.java:121) ~[org.eclipse.virgo.nano.core-3.6.4.RELEASE.jar:3.6.4.RELEASE]
     [exec]     [junit] 	at org.eclipse.virgo.nano.serviceability.enforcement.NonNullAssertionEnforcer.ajc$before$org_eclipse_virgo_nano_serviceability_enforcement_NonNullAssertionEnforcer$5$e9cfb671(NonNullAssertionEnforcer.aj:76) [org.eclipse.virgo.nano.core-3.6.4.RELEASE.jar:3.6.4.RELEASE]
     [exec]     [junit] 	at org.eclipse.virgo.kernel.model.internal.deployer.ModelInstallArtifactLifecycleListener.<init>(ModelInstallArtifactLifecycleListener.java:66) [org.eclipse.virgo.kernel.model.jar:na]
     [exec]     [junit] 	at org.eclipse.virgo.kernel.model.internal.deployer.ModelInstallArtifactLifecycleListenerTests.nullSpringContextAccessor(ModelInstallArtifactLifecycleListenerTests.java:85) [test-classes/:na]
     [exec]     [junit] 	at sun.reflect.NativeMethodAccessorImpl.invoke0(Native Method) ~[na:1.6.0_45]
     [exec]     [junit] 	at sun.reflect.NativeMethodAccessorImpl.invoke(NativeMethodAccessorImpl.java:39) ~[na:1.6.0_45]
     [exec]     [junit] 	at sun.reflect.DelegatingMethodAccessorImpl.invoke(DelegatingMethodAccessorImpl.java:25) ~[na:1.6.0_45]
     [exec]     [junit] 	at java.lang.reflect.Method.invoke(Method.java:597) ~[na:1.6.0_45]
     [exec]     [junit] 	at org.junit.runners.model.FrameworkMethod$1.runReflectiveCall(FrameworkMethod.java:44) [com.springsource.org.junit-4.7.0.jar:na]
     [exec]     [junit] 	at org.junit.internal.runners.model.ReflectiveCallable.run(ReflectiveCallable.java:15) [com.springsource.org.junit-4.7.0.jar:na]
     [exec]     [junit] 	at org.junit.runners.model.FrameworkMethod.invokeExplosively(FrameworkMethod.java:41) [com.springsource.org.junit-4.7.0.jar:na]
     [exec]     [junit] 	at org.junit.internal.runners.statements.InvokeMethod.evaluate(InvokeMethod.java:20) [com.springsource.org.junit-4.7.0.jar:na]
     [exec]     [junit] 	at org.junit.internal.runners.statements.ExpectException.evaluate(ExpectException.java:21) [com.springsource.org.junit-4.7.0.jar:na]
     [exec]     [junit] 	at org.junit.internal.runners.statements.RunBefores.evaluate(RunBefores.java:28) [com.springsource.org.junit-4.7.0.jar:na]
     [exec]     [junit] 	at org.junit.runners.BlockJUnit4ClassRunner.runChild(BlockJUnit4ClassRunner.java:76) [com.springsource.org.junit-4.7.0.jar:na]
     [exec]     [junit] 	at org.junit.runners.BlockJUnit4ClassRunner.runChild(BlockJUnit4ClassRunner.java:50) [com.springsource.org.junit-4.7.0.jar:na]
     [exec]     [junit] 	at org.junit.runners.ParentRunner$3.run(ParentRunner.java:193) [com.springsource.org.junit-4.7.0.jar:na]
     [exec]     [junit] 	at org.junit.runners.ParentRunner$1.schedule(ParentRunner.java:52) [com.springsource.org.junit-4.7.0.jar:na]
     [exec]     [junit] 	at org.junit.runners.ParentRunner.runChildren(ParentRunner.java:191) [com.springsource.org.junit-4.7.0.jar:na]
     [exec]     [junit] 	at org.junit.runners.ParentRunner.access$000(ParentRunner.java:42) [com.springsource.org.junit-4.7.0.jar:na]
     [exec]     [junit] 	at org.junit.runners.ParentRunner$2.evaluate(ParentRunner.java:184) [com.springsource.org.junit-4.7.0.jar:na]
     [exec]     [junit] 	at org.junit.runners.ParentRunner.run(ParentRunner.java:236) [com.springsource.org.junit-4.7.0.jar:na]
     [exec]     [junit] 	at junit.framework.JUnit4TestAdapter.run(JUnit4TestAdapter.java:39) [com.springsource.org.junit-4.7.0.jar:na]
     [exec]     [junit] 	at org.apache.tools.ant.taskdefs.optional.junit.JUnitTestRunner.run(JUnitTestRunner.java:520) [ant-junit.jar:na]
     [exec]     [junit] 	at org.apache.tools.ant.taskdefs.optional.junit.JUnitTestRunner.launch(JUnitTestRunner.java:1060) [ant-junit.jar:na]
     [exec]     [junit] 	at org.apache.tools.ant.taskdefs.optional.junit.JUnitTestRunner.main(JUnitTestRunner.java:884) [ant-junit.jar:na]
     [exec]     [junit] 03:45:03.081 [main] DEBUG o.e.virgo.nano.serviceability.Assert - > public static transient void org.eclipse.virgo.nano.serviceability.Assert.notNull(java.lang.Object, java.lang.String, java.lang.Object[])
     [exec]     [junit] 03:45:03.081 [main] DEBUG o.e.virgo.nano.serviceability.Assert - < public static transient void org.eclipse.virgo.nano.serviceability.Assert.notNull(java.lang.Object, java.lang.String, java.lang.Object[])
     [exec]     [junit] 03:45:03.081 [main] DEBUG o.e.virgo.nano.serviceability.Assert - > public static transient void org.eclipse.virgo.nano.serviceability.Assert.notNull(java.lang.Object, java.lang.String, java.lang.Object[])
     [exec]     [junit] 03:45:03.081 [main] DEBUG o.e.virgo.nano.serviceability.Assert - < public static transient void org.eclipse.virgo.nano.serviceability.Assert.notNull(java.lang.Object, java.lang.String, java.lang.Object[])
     [exec]     [junit] 03:45:03.081 [main] DEBUG o.e.virgo.nano.serviceability.Assert - > public static transient void org.eclipse.virgo.nano.serviceability.Assert.notNull(java.lang.Object, java.lang.String, java.lang.Object[])
     [exec]     [junit] 03:45:03.081 [main] DEBUG o.e.virgo.nano.serviceability.Assert - < public static transient void org.eclipse.virgo.nano.serviceability.Assert.notNull(java.lang.Object, java.lang.String, java.lang.Object[])
     [exec]     [junit] 03:45:03.082 [main] DEBUG o.e.virgo.nano.serviceability.Assert - > public static transient void org.eclipse.virgo.nano.serviceability.Assert.notNull(java.lang.Object, java.lang.String, java.lang.Object[])
     [exec]     [junit] 03:45:03.082 [main] DEBUG o.e.virgo.nano.serviceability.Assert - < public static transient void org.eclipse.virgo.nano.serviceability.Assert.notNull(java.lang.Object, java.lang.String, java.lang.Object[])
     [exec]     [junit] 03:45:03.082 [main] DEBUG o.e.virgo.nano.serviceability.Assert - > public static transient void org.eclipse.virgo.nano.serviceability.Assert.notNull(java.lang.Object, java.lang.String, java.lang.Object[])
     [exec]     [junit] 03:45:03.082 [main] DEBUG o.e.virgo.nano.serviceability.Assert - < public static transient void org.eclipse.virgo.nano.serviceability.Assert.notNull(java.lang.Object, java.lang.String, java.lang.Object[])
     [exec]     [junit] 03:45:03.082 [main] DEBUG o.e.v.k.m.i.d.ModelInstallArtifactLifecycleListener - > public void org.eclipse.virgo.kernel.model.internal.deployer.ModelInstallArtifactLifecycleListener.onInstalling(org.eclipse.virgo.kernel.install.artifact.InstallArtifact)
     [exec]     [junit] 03:45:03.082 [main] INFO  o.e.v.k.m.i.d.ModelInstallArtifactLifecycleListener - Processing installing event for bundle 'the-stub' version '0.0.0'
     [exec]     [junit] 03:45:03.082 [main] DEBUG o.e.virgo.nano.serviceability.Assert - > public static transient void org.eclipse.virgo.nano.serviceability.Assert.notNull(java.lang.Object, java.lang.String, java.lang.Object[])
     [exec]     [junit] 03:45:03.082 [main] DEBUG o.e.virgo.nano.serviceability.Assert - < public static transient void org.eclipse.virgo.nano.serviceability.Assert.notNull(java.lang.Object, java.lang.String, java.lang.Object[])
     [exec]     [junit] 03:45:03.082 [main] DEBUG o.e.virgo.nano.serviceability.Assert - > public static transient void org.eclipse.virgo.nano.serviceability.Assert.notNull(java.lang.Object, java.lang.String, java.lang.Object[])
     [exec]     [junit] 03:45:03.082 [main] DEBUG o.e.virgo.nano.serviceability.Assert - < public static transient void org.eclipse.virgo.nano.serviceability.Assert.notNull(java.lang.Object, java.lang.String, java.lang.Object[])
     [exec]     [junit] 03:45:03.082 [main] DEBUG o.e.virgo.nano.serviceability.Assert - > public static transient void org.eclipse.virgo.nano.serviceability.Assert.notNull(java.lang.Object, java.lang.String, java.lang.Object[])
     [exec]     [junit] 03:45:03.082 [main] DEBUG o.e.virgo.nano.serviceability.Assert - < public static transient void org.eclipse.virgo.nano.serviceability.Assert.notNull(java.lang.Object, java.lang.String, java.lang.Object[])
     [exec]     [junit] 03:45:03.082 [main] DEBUG o.e.virgo.nano.serviceability.Assert - > public static transient void org.eclipse.virgo.nano.serviceability.Assert.notNull(java.lang.Object, java.lang.String, java.lang.Object[])
     [exec]     [junit] 03:45:03.082 [main] DEBUG o.e.virgo.nano.serviceability.Assert - < public static transient void org.eclipse.virgo.nano.serviceability.Assert.notNull(java.lang.Object, java.lang.String, java.lang.Object[])
     [exec]     [junit] 03:45:03.082 [main] DEBUG o.e.virgo.nano.serviceability.Assert - > public static transient void org.eclipse.virgo.nano.serviceability.Assert.notNull(java.lang.Object, java.lang.String, java.lang.Object[])
     [exec]     [junit] 03:45:03.082 [main] DEBUG o.e.virgo.nano.serviceability.Assert - < public static transient void org.eclipse.virgo.nano.serviceability.Assert.notNull(java.lang.Object, java.lang.String, java.lang.Object[])
     [exec]     [junit] 03:45:03.082 [main] DEBUG o.e.virgo.nano.serviceability.Assert - > public static transient void org.eclipse.virgo.nano.serviceability.Assert.notNull(java.lang.Object, java.lang.String, java.lang.Object[])
     [exec]     [junit] 03:45:03.082 [main] DEBUG o.e.virgo.nano.serviceability.Assert - < public static transient void org.eclipse.virgo.nano.serviceability.Assert.notNull(java.lang.Object, java.lang.String, java.lang.Object[])
     [exec]     [junit] 03:45:03.082 [main] DEBUG o.e.virgo.nano.serviceability.Assert - > public static transient void org.eclipse.virgo.nano.serviceability.Assert.notNull(java.lang.Object, java.lang.String, java.lang.Object[])
     [exec]     [junit] 03:45:03.082 [main] DEBUG o.e.virgo.nano.serviceability.Assert - < public static transient void org.eclipse.virgo.nano.serviceability.Assert.notNull(java.lang.Object, java.lang.String, java.lang.Object[])
     [exec]     [junit] 03:45:03.083 [main] DEBUG o.e.v.k.m.i.d.ModelInstallArtifactLifecycleListener - < public void org.eclipse.virgo.kernel.model.internal.deployer.ModelInstallArtifactLifecycleListener.onInstalling(org.eclipse.virgo.kernel.install.artifact.InstallArtifact)
     [exec]     [junit] 03:45:03.083 [main] DEBUG o.e.v.k.m.i.d.ModelInstallArtifactLifecycleListener - > public void org.eclipse.virgo.kernel.model.internal.deployer.ModelInstallArtifactLifecycleListener.onUninstalled(org.eclipse.virgo.kernel.install.artifact.InstallArtifact)
     [exec]     [junit] 03:45:03.083 [main] INFO  o.e.v.k.m.i.d.ModelInstallArtifactLifecycleListener - Processing uninstalled event for bundle 'the-stub' version '0.0.0'
     [exec]     [junit] 03:45:03.083 [main] DEBUG o.e.v.k.m.i.d.ModelInstallArtifactLifecycleListener - < public void org.eclipse.virgo.kernel.model.internal.deployer.ModelInstallArtifactLifecycleListener.onUninstalled(org.eclipse.virgo.kernel.install.artifact.InstallArtifact)
     [exec]     [junit] 03:45:03.083 [main] DEBUG o.e.v.k.m.i.d.ModelInstallArtifactLifecycleListener - > public void org.eclipse.virgo.kernel.model.internal.deployer.ModelInstallArtifactLifecycleListener.onUninstalled(org.eclipse.virgo.kernel.install.artifact.InstallArtifact)
     [exec]     [junit] 03:45:03.083 [main] INFO  o.e.v.k.m.i.d.ModelInstallArtifactLifecycleListener - Processing uninstalled event for bundle 'the-stub' version '0.0.0'
     [exec]     [junit] 03:45:03.083 [main] DEBUG o.e.v.k.m.i.d.ModelInstallArtifactLifecycleListener - < public void org.eclipse.virgo.kernel.model.internal.deployer.ModelInstallArtifactLifecycleListener.onUninstalled(org.eclipse.virgo.kernel.install.artifact.InstallArtifact)
     [exec]     [junit] 03:45:03.083 [main] DEBUG o.e.virgo.nano.serviceability.Assert - > public static transient void org.eclipse.virgo.nano.serviceability.Assert.notNull(java.lang.Object, java.lang.String, java.lang.Object[])
     [exec]     [junit] 03:45:03.083 [main] DEBUG o.e.virgo.nano.serviceability.Assert - < public static transient void org.eclipse.virgo.nano.serviceability.Assert.notNull(java.lang.Object, java.lang.String, java.lang.Object[])
     [exec]     [junit] 03:45:03.083 [main] DEBUG o.e.virgo.nano.serviceability.Assert - > public static transient void org.eclipse.virgo.nano.serviceability.Assert.notNull(java.lang.Object, java.lang.String, java.lang.Object[])
     [exec]     [junit] 03:45:03.083 [main] DEBUG o.e.virgo.nano.serviceability.Assert - < public static transient void org.eclipse.virgo.nano.serviceability.Assert.notNull(java.lang.Object, java.lang.String, java.lang.Object[])
     [exec]     [junit] 03:45:03.083 [main] DEBUG o.e.virgo.nano.serviceability.Assert - > public static transient void org.eclipse.virgo.nano.serviceability.Assert.notNull(java.lang.Object, java.lang.String, java.lang.Object[])
     [exec]     [junit] 03:45:03.083 [main] DEBUG o.e.virgo.nano.serviceability.Assert - < public static transient void org.eclipse.virgo.nano.serviceability.Assert.notNull(java.lang.Object, java.lang.String, java.lang.Object[])
     [exec]     [junit] 03:45:03.083 [main] DEBUG o.e.virgo.nano.serviceability.Assert - > public static transient void org.eclipse.virgo.nano.serviceability.Assert.notNull(java.lang.Object, java.lang.String, java.lang.Object[])
     [exec]     [junit] 03:45:03.083 [main] DEBUG o.e.virgo.nano.serviceability.Assert - < public static transient void org.eclipse.virgo.nano.serviceability.Assert.notNull(java.lang.Object, java.lang.String, java.lang.Object[])
     [exec]     [junit] 03:45:03.084 [main] DEBUG o.e.virgo.nano.serviceability.Assert - > public static transient void org.eclipse.virgo.nano.serviceability.Assert.notNull(java.lang.Object, java.lang.String, java.lang.Object[])
     [exec]     [junit] 03:45:03.084 [main] DEBUG o.e.virgo.nano.serviceability.Assert - < public static transient void org.eclipse.virgo.nano.serviceability.Assert.notNull(java.lang.Object, java.lang.String, java.lang.Object[])
     [exec]     [junit] 03:45:03.084 [main] DEBUG o.e.v.k.m.i.d.ModelInstallArtifactLifecycleListener - > public void org.eclipse.virgo.kernel.model.internal.deployer.ModelInstallArtifactLifecycleListener.onInstalling(org.eclipse.virgo.kernel.install.artifact.InstallArtifact)
     [exec]     [junit] 03:45:03.084 [main] INFO  o.e.v.k.m.i.d.ModelInstallArtifactLifecycleListener - Processing installing event for bundle 'the-stub' version '0.0.0'
     [exec]     [junit] 03:45:03.084 [main] DEBUG o.e.virgo.nano.serviceability.Assert - > public static transient void org.eclipse.virgo.nano.serviceability.Assert.notNull(java.lang.Object, java.lang.String, java.lang.Object[])
     [exec]     [junit] 03:45:03.084 [main] DEBUG o.e.virgo.nano.serviceability.Assert - < public static transient void org.eclipse.virgo.nano.serviceability.Assert.notNull(java.lang.Object, java.lang.String, java.lang.Object[])
     [exec]     [junit] 03:45:03.084 [main] DEBUG o.e.virgo.nano.serviceability.Assert - > public static transient void org.eclipse.virgo.nano.serviceability.Assert.notNull(java.lang.Object, java.lang.String, java.lang.Object[])
     [exec]     [junit] 03:45:03.084 [main] DEBUG o.e.virgo.nano.serviceability.Assert - < public static transient void org.eclipse.virgo.nano.serviceability.Assert.notNull(java.lang.Object, java.lang.String, java.lang.Object[])
     [exec]     [junit] 03:45:03.084 [main] DEBUG o.e.virgo.nano.serviceability.Assert - > public static transient void org.eclipse.virgo.nano.serviceability.Assert.notNull(java.lang.Object, java.lang.String, java.lang.Object[])
     [exec]     [junit] 03:45:03.084 [main] DEBUG o.e.virgo.nano.serviceability.Assert - < public static transient void org.eclipse.virgo.nano.serviceability.Assert.notNull(java.lang.Object, java.lang.String, java.lang.Object[])
     [exec]     [junit] 03:45:03.084 [main] DEBUG o.e.virgo.nano.serviceability.Assert - > public static transient void org.eclipse.virgo.nano.serviceability.Assert.notNull(java.lang.Object, java.lang.String, java.lang.Object[])
     [exec]     [junit] 03:45:03.084 [main] DEBUG o.e.virgo.nano.serviceability.Assert - < public static transient void org.eclipse.virgo.nano.serviceability.Assert.notNull(java.lang.Object, java.lang.String, java.lang.Object[])
     [exec]     [junit] 03:45:03.084 [main] DEBUG o.e.virgo.nano.serviceability.Assert - > public static transient void org.eclipse.virgo.nano.serviceability.Assert.notNull(java.lang.Object, java.lang.String, java.lang.Object[])
     [exec]     [junit] 03:45:03.084 [main] DEBUG o.e.virgo.nano.serviceability.Assert - < public static transient void org.eclipse.virgo.nano.serviceability.Assert.notNull(java.lang.Object, java.lang.String, java.lang.Object[])
     [exec]     [junit] 03:45:03.084 [main] DEBUG o.e.virgo.nano.serviceability.Assert - > public static transient void org.eclipse.virgo.nano.serviceability.Assert.notNull(java.lang.Object, java.lang.String, java.lang.Object[])
     [exec]     [junit] 03:45:03.084 [main] DEBUG o.e.virgo.nano.serviceability.Assert - < public static transient void org.eclipse.virgo.nano.serviceability.Assert.notNull(java.lang.Object, java.lang.String, java.lang.Object[])
     [exec]     [junit] 03:45:03.084 [main] DEBUG o.e.virgo.nano.serviceability.Assert - > public static transient void org.eclipse.virgo.nano.serviceability.Assert.notNull(java.lang.Object, java.lang.String, java.lang.Object[])
     [exec]     [junit] 03:45:03.084 [main] DEBUG o.e.virgo.nano.serviceability.Assert - < public static transient void org.eclipse.virgo.nano.serviceability.Assert.notNull(java.lang.Object, java.lang.String, java.lang.Object[])
     [exec]     [junit] 03:45:03.084 [main] DEBUG o.e.v.k.m.i.d.ModelInstallArtifactLifecycleListener - < public void org.eclipse.virgo.kernel.model.internal.deployer.ModelInstallArtifactLifecycleListener.onInstalling(org.eclipse.virgo.kernel.install.artifact.InstallArtifact)
     [exec]     [junit] 03:45:03.084 [main] DEBUG o.e.v.k.m.i.d.ModelInstallArtifactLifecycleListener - > public void org.eclipse.virgo.kernel.model.internal.deployer.ModelInstallArtifactLifecycleListener.onInstalling(org.eclipse.virgo.kernel.install.artifact.InstallArtifact)
     [exec]     [junit] 03:45:03.084 [main] INFO  o.e.v.k.m.i.d.ModelInstallArtifactLifecycleListener - Processing installing event for bundle 'the-stub' version '0.0.0'
     [exec]     [junit] 03:45:03.084 [main] DEBUG o.e.virgo.nano.serviceability.Assert - > public static transient void org.eclipse.virgo.nano.serviceability.Assert.notNull(java.lang.Object, java.lang.String, java.lang.Object[])
     [exec]     [junit] 03:45:03.084 [main] DEBUG o.e.virgo.nano.serviceability.Assert - < public static transient void org.eclipse.virgo.nano.serviceability.Assert.notNull(java.lang.Object, java.lang.String, java.lang.Object[])
     [exec]     [junit] 03:45:03.085 [main] DEBUG o.e.virgo.nano.serviceability.Assert - > public static transient void org.eclipse.virgo.nano.serviceability.Assert.notNull(java.lang.Object, java.lang.String, java.lang.Object[])
     [exec]     [junit] 03:45:03.085 [main] DEBUG o.e.virgo.nano.serviceability.Assert - < public static transient void org.eclipse.virgo.nano.serviceability.Assert.notNull(java.lang.Object, java.lang.String, java.lang.Object[])
     [exec]     [junit] 03:45:03.085 [main] DEBUG o.e.virgo.nano.serviceability.Assert - > public static transient void org.eclipse.virgo.nano.serviceability.Assert.notNull(java.lang.Object, java.lang.String, java.lang.Object[])
     [exec]     [junit] 03:45:03.085 [main] DEBUG o.e.virgo.nano.serviceability.Assert - < public static transient void org.eclipse.virgo.nano.serviceability.Assert.notNull(java.lang.Object, java.lang.String, java.lang.Object[])
     [exec]     [junit] 03:45:03.085 [main] DEBUG o.e.virgo.nano.serviceability.Assert - > public static transient void org.eclipse.virgo.nano.serviceability.Assert.notNull(java.lang.Object, java.lang.String, java.lang.Object[])
     [exec]     [junit] 03:45:03.085 [main] DEBUG o.e.virgo.nano.serviceability.Assert - < public static transient void org.eclipse.virgo.nano.serviceability.Assert.notNull(java.lang.Object, java.lang.String, java.lang.Object[])
     [exec]     [junit] 03:45:03.085 [main] DEBUG o.e.virgo.nano.serviceability.Assert - > public static transient void org.eclipse.virgo.nano.serviceability.Assert.notNull(java.lang.Object, java.lang.String, java.lang.Object[])
     [exec]     [junit] 03:45:03.085 [main] DEBUG o.e.virgo.nano.serviceability.Assert - < public static transient void org.eclipse.virgo.nano.serviceability.Assert.notNull(java.lang.Object, java.lang.String, java.lang.Object[])
     [exec]     [junit] 03:45:03.085 [main] DEBUG o.e.virgo.nano.serviceability.Assert - > public static transient void org.eclipse.virgo.nano.serviceability.Assert.notNull(java.lang.Object, java.lang.String, java.lang.Object[])
     [exec]     [junit] 03:45:03.085 [main] DEBUG o.e.virgo.nano.serviceability.Assert - < public static transient void org.eclipse.virgo.nano.serviceability.Assert.notNull(java.lang.Object, java.lang.String, java.lang.Object[])
     [exec]     [junit] 03:45:03.085 [main] DEBUG o.e.virgo.nano.serviceability.Assert - > public static transient void org.eclipse.virgo.nano.serviceability.Assert.notNull(java.lang.Object, java.lang.String, java.lang.Object[])
     [exec]     [junit] 03:45:03.085 [main] DEBUG o.e.virgo.nano.serviceability.Assert - < public static transient void org.eclipse.virgo.nano.serviceability.Assert.notNull(java.lang.Object, java.lang.String, java.lang.Object[])
     [exec]     [junit] 03:45:03.085 [main] DEBUG o.e.v.k.m.i.d.ModelInstallArtifactLifecycleListener - < public void org.eclipse.virgo.kernel.model.internal.deployer.ModelInstallArtifactLifecycleListener.onInstalling(org.eclipse.virgo.kernel.install.artifact.InstallArtifact)
     [exec]     [junit] 03:45:03.085 [main] DEBUG o.e.v.k.m.i.d.ModelInstallArtifactLifecycleListener - > public void org.eclipse.virgo.kernel.model.internal.deployer.ModelInstallArtifactLifecycleListener.onInstalling(org.eclipse.virgo.kernel.install.artifact.InstallArtifact)
     [exec]     [junit] 03:45:03.085 [main] INFO  o.e.v.k.m.i.d.ModelInstallArtifactLifecycleListener - Processing installing event for plan 'the-stub' version '0.0.0'
     [exec]     [junit] 03:45:03.085 [main] DEBUG o.e.virgo.nano.serviceability.Assert - > public static transient void org.eclipse.virgo.nano.serviceability.Assert.notNull(java.lang.Object, java.lang.String, java.lang.Object[])
     [exec]     [junit] 03:45:03.085 [main] DEBUG o.e.virgo.nano.serviceability.Assert - < public static transient void org.eclipse.virgo.nano.serviceability.Assert.notNull(java.lang.Object, java.lang.String, java.lang.Object[])
     [exec]     [junit] 03:45:03.085 [main] DEBUG o.e.virgo.nano.serviceability.Assert - > public static transient void org.eclipse.virgo.nano.serviceability.Assert.notNull(java.lang.Object, java.lang.String, java.lang.Object[])
     [exec]     [junit] 03:45:03.085 [main] DEBUG o.e.virgo.nano.serviceability.Assert - < public static transient void org.eclipse.virgo.nano.serviceability.Assert.notNull(java.lang.Object, java.lang.String, java.lang.Object[])
     [exec]     [junit] 03:45:03.085 [main] DEBUG o.e.virgo.nano.serviceability.Assert - > public static transient void org.eclipse.virgo.nano.serviceability.Assert.notNull(java.lang.Object, java.lang.String, java.lang.Object[])
     [exec]     [junit] 03:45:03.085 [main] DEBUG o.e.virgo.nano.serviceability.Assert - < public static transient void org.eclipse.virgo.nano.serviceability.Assert.notNull(java.lang.Object, java.lang.String, java.lang.Object[])
     [exec]     [junit] 03:45:03.085 [main] DEBUG o.e.virgo.nano.serviceability.Assert - > public static transient void org.eclipse.virgo.nano.serviceability.Assert.notNull(java.lang.Object, java.lang.String, java.lang.Object[])
     [exec]     [junit] 03:45:03.085 [main] DEBUG o.e.virgo.nano.serviceability.Assert - < public static transient void org.eclipse.virgo.nano.serviceability.Assert.notNull(java.lang.Object, java.lang.String, java.lang.Object[])
     [exec]     [junit] 03:45:03.085 [main] DEBUG o.e.virgo.nano.serviceability.Assert - > public static transient void org.eclipse.virgo.nano.serviceability.Assert.notNull(java.lang.Object, java.lang.String, java.lang.Object[])
     [exec]     [junit] 03:45:03.085 [main] DEBUG o.e.virgo.nano.serviceability.Assert - < public static transient void org.eclipse.virgo.nano.serviceability.Assert.notNull(java.lang.Object, java.lang.String, java.lang.Object[])
     [exec]     [junit] 03:45:03.086 [main] DEBUG o.e.virgo.nano.serviceability.Assert - > public static transient void org.eclipse.virgo.nano.serviceability.Assert.notNull(java.lang.Object, java.lang.String, java.lang.Object[])
     [exec]     [junit] 03:45:03.086 [main] DEBUG o.e.virgo.nano.serviceability.Assert - < public static transient void org.eclipse.virgo.nano.serviceability.Assert.notNull(java.lang.Object, java.lang.String, java.lang.Object[])
     [exec]     [junit] 03:45:03.086 [main] DEBUG o.e.virgo.nano.serviceability.Assert - > public static transient void org.eclipse.virgo.nano.serviceability.Assert.notNull(java.lang.Object, java.lang.String, java.lang.Object[])
     [exec]     [junit] 03:45:03.086 [main] DEBUG o.e.virgo.nano.serviceability.Assert - < public static transient void org.eclipse.virgo.nano.serviceability.Assert.notNull(java.lang.Object, java.lang.String, java.lang.Object[])
     [exec]     [junit] 03:45:03.086 [main] DEBUG o.e.virgo.nano.serviceability.Assert - > public static transient void org.eclipse.virgo.nano.serviceability.Assert.notNull(java.lang.Object, java.lang.String, java.lang.Object[])
     [exec]     [junit] 03:45:03.086 [main] DEBUG o.e.virgo.nano.serviceability.Assert - < public static transient void org.eclipse.virgo.nano.serviceability.Assert.notNull(java.lang.Object, java.lang.String, java.lang.Object[])
     [exec]     [junit] 03:45:03.086 [main] DEBUG o.e.virgo.nano.serviceability.Assert - > public static transient void org.eclipse.virgo.nano.serviceability.Assert.notNull(java.lang.Object, java.lang.String, java.lang.Object[])
     [exec]     [junit] 03:45:03.086 [main] DEBUG o.e.virgo.nano.serviceability.Assert - < public static transient void org.eclipse.virgo.nano.serviceability.Assert.notNull(java.lang.Object, java.lang.String, java.lang.Object[])
     [exec]     [junit] 03:45:03.086 [main] DEBUG o.e.virgo.nano.serviceability.Assert - > public static transient void org.eclipse.virgo.nano.serviceability.Assert.notNull(java.lang.Object, java.lang.String, java.lang.Object[])
     [exec]     [junit] 03:45:03.086 [main] DEBUG o.e.virgo.nano.serviceability.Assert - < public static transient void org.eclipse.virgo.nano.serviceability.Assert.notNull(java.lang.Object, java.lang.String, java.lang.Object[])
     [exec]     [junit] 03:45:03.086 [main] DEBUG o.e.v.k.m.i.d.ModelInstallArtifactLifecycleListener - < public void org.eclipse.virgo.kernel.model.internal.deployer.ModelInstallArtifactLifecycleListener.onInstalling(org.eclipse.virgo.kernel.install.artifact.InstallArtifact)
     [exec]     [junit] 03:45:03.086 [main] DEBUG o.e.v.k.m.i.d.ModelInstallArtifactLifecycleListener - > public void org.eclipse.virgo.kernel.model.internal.deployer.ModelInstallArtifactLifecycleListener.onInstalling(org.eclipse.virgo.kernel.install.artifact.InstallArtifact)
     [exec]     [junit] 03:45:03.086 [main] INFO  o.e.v.k.m.i.d.ModelInstallArtifactLifecycleListener - Processing installing event for plan 'the-stub' version '0.0.0'
     [exec]     [junit] 03:45:03.086 [main] DEBUG o.e.virgo.nano.serviceability.Assert - > public static transient void org.eclipse.virgo.nano.serviceability.Assert.notNull(java.lang.Object, java.lang.String, java.lang.Object[])
     [exec]     [junit] 03:45:03.086 [main] DEBUG o.e.virgo.nano.serviceability.Assert - < public static transient void org.eclipse.virgo.nano.serviceability.Assert.notNull(java.lang.Object, java.lang.String, java.lang.Object[])
     [exec]     [junit] 03:45:03.086 [main] DEBUG o.e.virgo.nano.serviceability.Assert - > public static transient void org.eclipse.virgo.nano.serviceability.Assert.notNull(java.lang.Object, java.lang.String, java.lang.Object[])
     [exec]     [junit] 03:45:03.086 [main] DEBUG o.e.virgo.nano.serviceability.Assert - < public static transient void org.eclipse.virgo.nano.serviceability.Assert.notNull(java.lang.Object, java.lang.String, java.lang.Object[])
     [exec]     [junit] 03:45:03.086 [main] DEBUG o.e.virgo.nano.serviceability.Assert - > public static transient void org.eclipse.virgo.nano.serviceability.Assert.notNull(java.lang.Object, java.lang.String, java.lang.Object[])
     [exec]     [junit] 03:45:03.086 [main] DEBUG o.e.virgo.nano.serviceability.Assert - < public static transient void org.eclipse.virgo.nano.serviceability.Assert.notNull(java.lang.Object, java.lang.String, java.lang.Object[])
     [exec]     [junit] 03:45:03.086 [main] DEBUG o.e.virgo.nano.serviceability.Assert - > public static transient void org.eclipse.virgo.nano.serviceability.Assert.notNull(java.lang.Object, java.lang.String, java.lang.Object[])
     [exec]     [junit] 03:45:03.086 [main] DEBUG o.e.virgo.nano.serviceability.Assert - < public static transient void org.eclipse.virgo.nano.serviceability.Assert.notNull(java.lang.Object, java.lang.String, java.lang.Object[])
     [exec]     [junit] 03:45:03.086 [main] DEBUG o.e.virgo.nano.serviceability.Assert - > public static transient void org.eclipse.virgo.nano.serviceability.Assert.notNull(java.lang.Object, java.lang.String, java.lang.Object[])
     [exec]     [junit] 03:45:03.086 [main] DEBUG o.e.virgo.nano.serviceability.Assert - < public static transient void org.eclipse.virgo.nano.serviceability.Assert.notNull(java.lang.Object, java.lang.String, java.lang.Object[])
     [exec]     [junit] 03:45:03.086 [main] DEBUG o.e.virgo.nano.serviceability.Assert - > public static transient void org.eclipse.virgo.nano.serviceability.Assert.notNull(java.lang.Object, java.lang.String, java.lang.Object[])
     [exec]     [junit] 03:45:03.087 [main] DEBUG o.e.virgo.nano.serviceability.Assert - < public static transient void org.eclipse.virgo.nano.serviceability.Assert.notNull(java.lang.Object, java.lang.String, java.lang.Object[])
     [exec]     [junit] 03:45:03.087 [main] DEBUG o.e.virgo.nano.serviceability.Assert - > public static transient void org.eclipse.virgo.nano.serviceability.Assert.notNull(java.lang.Object, java.lang.String, java.lang.Object[])
     [exec]     [junit] 03:45:03.087 [main] DEBUG o.e.virgo.nano.serviceability.Assert - < public static transient void org.eclipse.virgo.nano.serviceability.Assert.notNull(java.lang.Object, java.lang.String, java.lang.Object[])
     [exec]     [junit] 03:45:03.087 [main] DEBUG o.e.virgo.nano.serviceability.Assert - > public static transient void org.eclipse.virgo.nano.serviceability.Assert.notNull(java.lang.Object, java.lang.String, java.lang.Object[])
     [exec]     [junit] 03:45:03.087 [main] DEBUG o.e.virgo.nano.serviceability.Assert - < public static transient void org.eclipse.virgo.nano.serviceability.Assert.notNull(java.lang.Object, java.lang.String, java.lang.Object[])
     [exec]     [junit] 03:45:03.087 [main] DEBUG o.e.virgo.nano.serviceability.Assert - > public static transient void org.eclipse.virgo.nano.serviceability.Assert.notNull(java.lang.Object, java.lang.String, java.lang.Object[])
     [exec]     [junit] 03:45:03.087 [main] DEBUG o.e.virgo.nano.serviceability.Assert - < public static transient void org.eclipse.virgo.nano.serviceability.Assert.notNull(java.lang.Object, java.lang.String, java.lang.Object[])
     [exec]     [junit] 03:45:03.087 [main] DEBUG o.e.virgo.nano.serviceability.Assert - > public static transient void org.eclipse.virgo.nano.serviceability.Assert.notNull(java.lang.Object, java.lang.String, java.lang.Object[])
     [exec]     [junit] 03:45:03.087 [main] DEBUG o.e.virgo.nano.serviceability.Assert - < public static transient void org.eclipse.virgo.nano.serviceability.Assert.notNull(java.lang.Object, java.lang.String, java.lang.Object[])
     [exec]     [junit] 03:45:03.087 [main] DEBUG o.e.v.k.m.i.d.ModelInstallArtifactLifecycleListener - < public void org.eclipse.virgo.kernel.model.internal.deployer.ModelInstallArtifactLifecycleListener.onInstalling(org.eclipse.virgo.kernel.install.artifact.InstallArtifact)
     [exec]     [junit] 03:45:03.087 [main] DEBUG o.e.virgo.nano.serviceability.Assert - > public static transient void org.eclipse.virgo.nano.serviceability.Assert.notNull(java.lang.Object, java.lang.String, java.lang.Object[])
     [exec]     [junit] 03:45:03.087 [main] DEBUG o.e.virgo.nano.serviceability.Assert - < public static transient void org.eclipse.virgo.nano.serviceability.Assert.notNull(java.lang.Object, java.lang.String, java.lang.Object[])
     [exec]     [junit] 03:45:03.087 [main] DEBUG o.e.virgo.nano.serviceability.Assert - > public static transient void org.eclipse.virgo.nano.serviceability.Assert.notNull(java.lang.Object, java.lang.String, java.lang.Object[])
     [exec]     [junit] 03:45:03.087 [main] DEBUG o.e.virgo.nano.serviceability.Assert - < public static transient void org.eclipse.virgo.nano.serviceability.Assert.notNull(java.lang.Object, java.lang.String, java.lang.Object[])
     [exec]     [junit] 03:45:03.087 [main] DEBUG o.e.virgo.nano.serviceability.Assert - > public static transient void org.eclipse.virgo.nano.serviceability.Assert.notNull(java.lang.Object, java.lang.String, java.lang.Object[])
     [exec]     [junit] 03:45:03.087 [main] DEBUG o.e.virgo.nano.serviceability.Assert - < public static transient void org.eclipse.virgo.nano.serviceability.Assert.notNull(java.lang.Object, java.lang.String, java.lang.Object[])
     [exec]     [junit] 03:45:03.088 [main] DEBUG o.e.virgo.nano.serviceability.Assert - > public static transient void org.eclipse.virgo.nano.serviceability.Assert.notNull(java.lang.Object, java.lang.String, java.lang.Object[])
     [exec]     [junit] 03:45:03.088 [main] DEBUG o.e.virgo.nano.serviceability.Assert - < public static transient void org.eclipse.virgo.nano.serviceability.Assert.notNull(java.lang.Object, java.lang.String, java.lang.Object[])
     [exec]     [junit] 03:45:03.088 [main] DEBUG o.e.virgo.nano.serviceability.Assert - > public static transient void org.eclipse.virgo.nano.serviceability.Assert.notNull(java.lang.Object, java.lang.String, java.lang.Object[])
     [exec]     [junit] 03:45:03.088 [main] DEBUG o.e.virgo.nano.serviceability.Assert - < public static transient void org.eclipse.virgo.nano.serviceability.Assert.notNull(java.lang.Object, java.lang.String, java.lang.Object[])
     [exec]     [junit] 03:45:03.088 [main] DEBUG o.e.v.k.m.i.d.ModelInstallArtifactLifecycleListener - > public void org.eclipse.virgo.kernel.model.internal.deployer.ModelInstallArtifactLifecycleListener.onInstalling(org.eclipse.virgo.kernel.install.artifact.InstallArtifact)
     [exec]     [junit] 03:45:03.088 [main] INFO  o.e.v.k.m.i.d.ModelInstallArtifactLifecycleListener - Processing installing event for bundle 'the-stub' version '0.0.0'
     [exec]     [junit] 03:45:03.088 [main] DEBUG o.e.virgo.nano.serviceability.Assert - > public static transient void org.eclipse.virgo.nano.serviceability.Assert.notNull(java.lang.Object, java.lang.String, java.lang.Object[])
     [exec]     [junit] 03:45:03.088 [main] DEBUG o.e.virgo.nano.serviceability.Assert - < public static transient void org.eclipse.virgo.nano.serviceability.Assert.notNull(java.lang.Object, java.lang.String, java.lang.Object[])
     [exec]     [junit] 03:45:03.088 [main] DEBUG o.e.virgo.nano.serviceability.Assert - > public static transient void org.eclipse.virgo.nano.serviceability.Assert.notNull(java.lang.Object, java.lang.String, java.lang.Object[])
     [exec]     [junit] 03:45:03.088 [main] DEBUG o.e.virgo.nano.serviceability.Assert - < public static transient void org.eclipse.virgo.nano.serviceability.Assert.notNull(java.lang.Object, java.lang.String, java.lang.Object[])
     [exec]     [junit] 03:45:03.088 [main] DEBUG o.e.virgo.nano.serviceability.Assert - > public static transient void org.eclipse.virgo.nano.serviceability.Assert.notNull(java.lang.Object, java.lang.String, java.lang.Object[])
     [exec]     [junit] 03:45:03.088 [main] DEBUG o.e.virgo.nano.serviceability.Assert - < public static transient void org.eclipse.virgo.nano.serviceability.Assert.notNull(java.lang.Object, java.lang.String, java.lang.Object[])
     [exec]     [junit] 03:45:03.088 [main] DEBUG o.e.virgo.nano.serviceability.Assert - > public static transient void org.eclipse.virgo.nano.serviceability.Assert.notNull(java.lang.Object, java.lang.String, java.lang.Object[])
     [exec]     [junit] 03:45:03.088 [main] DEBUG o.e.virgo.nano.serviceability.Assert - < public static transient void org.eclipse.virgo.nano.serviceability.Assert.notNull(java.lang.Object, java.lang.String, java.lang.Object[])
     [exec]     [junit] 03:45:03.088 [main] DEBUG o.e.virgo.nano.serviceability.Assert - > public static transient void org.eclipse.virgo.nano.serviceability.Assert.notNull(java.lang.Object, java.lang.String, java.lang.Object[])
     [exec]     [junit] 03:45:03.088 [main] DEBUG o.e.virgo.nano.serviceability.Assert - < public static transient void org.eclipse.virgo.nano.serviceability.Assert.notNull(java.lang.Object, java.lang.String, java.lang.Object[])
     [exec]     [junit] 03:45:03.088 [main] DEBUG o.e.virgo.nano.serviceability.Assert - > public static transient void org.eclipse.virgo.nano.serviceability.Assert.notNull(java.lang.Object, java.lang.String, java.lang.Object[])
     [exec]     [junit] 03:45:03.088 [main] DEBUG o.e.virgo.nano.serviceability.Assert - < public static transient void org.eclipse.virgo.nano.serviceability.Assert.notNull(java.lang.Object, java.lang.String, java.lang.Object[])
     [exec]     [junit] 03:45:03.088 [main] DEBUG o.e.virgo.nano.serviceability.Assert - > public static transient void org.eclipse.virgo.nano.serviceability.Assert.notNull(java.lang.Object, java.lang.String, java.lang.Object[])
     [exec]     [junit] 03:45:03.088 [main] DEBUG o.e.virgo.nano.serviceability.Assert - < public static transient void org.eclipse.virgo.nano.serviceability.Assert.notNull(java.lang.Object, java.lang.String, java.lang.Object[])
     [exec]     [junit] 03:45:03.088 [main] DEBUG o.e.v.k.m.i.d.ModelInstallArtifactLifecycleListener - < public void org.eclipse.virgo.kernel.model.internal.deployer.ModelInstallArtifactLifecycleListener.onInstalling(org.eclipse.virgo.kernel.install.artifact.InstallArtifact)
     [exec]     [junit] 03:45:03.088 [main] DEBUG o.e.v.k.m.i.d.ModelInstallArtifactLifecycleListener - > public void org.eclipse.virgo.kernel.model.internal.deployer.ModelInstallArtifactLifecycleListener.onInstallFailed(org.eclipse.virgo.kernel.install.artifact.InstallArtifact)
     [exec]     [junit] 03:45:03.089 [main] INFO  o.e.v.k.m.i.d.ModelInstallArtifactLifecycleListener - Processing install failed event for bundle 'the-stub' version '0.0.0'
     [exec]     [junit] 03:45:03.089 [main] DEBUG o.e.v.k.m.i.d.ModelInstallArtifactLifecycleListener - < public void org.eclipse.virgo.kernel.model.internal.deployer.ModelInstallArtifactLifecycleListener.onInstallFailed(org.eclipse.virgo.kernel.install.artifact.InstallArtifact)
     [exec]     [junit] ------------- ---------------- ---------------
     [exec]     [junit] Testsuite: org.eclipse.virgo.kernel.model.management.internal.DefaultArtifactObjectNameCreatorTests
     [exec]     [junit] Tests run: 6, Failures: 0, Errors: 0, Time elapsed: 0.009 sec
     [exec]     [junit] 
     [exec]     [junit] ------------- Standard Output ---------------
     [exec]     [junit] 03:45:03.148 [main] DEBUG o.e.virgo.nano.serviceability.Assert - > public static transient void org.eclipse.virgo.nano.serviceability.Assert.notNull(java.lang.Object, java.lang.String, java.lang.Object[])
     [exec]     [junit] 03:45:03.148 [main] DEBUG o.e.virgo.nano.serviceability.Assert - < public static transient void org.eclipse.virgo.nano.serviceability.Assert.notNull(java.lang.Object, java.lang.String, java.lang.Object[])
     [exec]     [junit] org.eclipse.virgo.nano.serviceability.Assert$FatalAssertionException: Argument [1] cannot be null
     [exec]     [junit] 	at org.eclipse.virgo.nano.serviceability.Assert.notNull(Assert.java:121) ~[org.eclipse.virgo.nano.core-3.6.4.RELEASE.jar:3.6.4.RELEASE]
     [exec]     [junit] 	at org.eclipse.virgo.nano.serviceability.enforcement.NonNullAssertionEnforcer.ajc$before$org_eclipse_virgo_nano_serviceability_enforcement_NonNullAssertionEnforcer$1$7118cd8(NonNullAssertionEnforcer.aj:57) [org.eclipse.virgo.nano.core-3.6.4.RELEASE.jar:3.6.4.RELEASE]
     [exec]     [junit] 	at org.eclipse.virgo.kernel.model.management.internal.DefaultRuntimeArtifactModelObjectNameCreator.createArtifactModel(DefaultRuntimeArtifactModelObjectNameCreator.java:62) [org.eclipse.virgo.kernel.model.jar:na]
     [exec]     [junit] 	at org.eclipse.virgo.kernel.model.management.internal.DefaultArtifactObjectNameCreatorTests.nullArtifactModelArtifact(DefaultArtifactObjectNameCreatorTests.java:31) [test-classes/:na]
     [exec]     [junit] 	at sun.reflect.NativeMethodAccessorImpl.invoke0(Native Method) ~[na:1.6.0_45]
     [exec]     [junit] 	at sun.reflect.NativeMethodAccessorImpl.invoke(NativeMethodAccessorImpl.java:39) ~[na:1.6.0_45]
     [exec]     [junit] 	at sun.reflect.DelegatingMethodAccessorImpl.invoke(DelegatingMethodAccessorImpl.java:25) ~[na:1.6.0_45]
     [exec]     [junit] 	at java.lang.reflect.Method.invoke(Method.java:597) ~[na:1.6.0_45]
     [exec]     [junit] 	at org.junit.runners.model.FrameworkMethod$1.runReflectiveCall(FrameworkMethod.java:44) [com.springsource.org.junit-4.7.0.jar:na]
     [exec]     [junit] 	at org.junit.internal.runners.model.ReflectiveCallable.run(ReflectiveCallable.java:15) [com.springsource.org.junit-4.7.0.jar:na]
     [exec]     [junit] 	at org.junit.runners.model.FrameworkMethod.invokeExplosively(FrameworkMethod.java:41) [com.springsource.org.junit-4.7.0.jar:na]
     [exec]     [junit] 	at org.junit.internal.runners.statements.InvokeMethod.evaluate(InvokeMethod.java:20) [com.springsource.org.junit-4.7.0.jar:na]
     [exec]     [junit] 	at org.junit.internal.runners.statements.ExpectException.evaluate(ExpectException.java:21) [com.springsource.org.junit-4.7.0.jar:na]
     [exec]     [junit] 	at org.junit.runners.BlockJUnit4ClassRunner.runChild(BlockJUnit4ClassRunner.java:76) [com.springsource.org.junit-4.7.0.jar:na]
     [exec]     [junit] 	at org.junit.runners.BlockJUnit4ClassRunner.runChild(BlockJUnit4ClassRunner.java:50) [com.springsource.org.junit-4.7.0.jar:na]
     [exec]     [junit] 	at org.junit.runners.ParentRunner$3.run(ParentRunner.java:193) [com.springsource.org.junit-4.7.0.jar:na]
     [exec]     [junit] 	at org.junit.runners.ParentRunner$1.schedule(ParentRunner.java:52) [com.springsource.org.junit-4.7.0.jar:na]
     [exec]     [junit] 	at org.junit.runners.ParentRunner.runChildren(ParentRunner.java:191) [com.springsource.org.junit-4.7.0.jar:na]
     [exec]     [junit] 	at org.junit.runners.ParentRunner.access$000(ParentRunner.java:42) [com.springsource.org.junit-4.7.0.jar:na]
     [exec]     [junit] 	at org.junit.runners.ParentRunner$2.evaluate(ParentRunner.java:184) [com.springsource.org.junit-4.7.0.jar:na]
     [exec]     [junit] 	at org.junit.runners.ParentRunner.run(ParentRunner.java:236) [com.springsource.org.junit-4.7.0.jar:na]
     [exec]     [junit] 	at junit.framework.JUnit4TestAdapter.run(JUnit4TestAdapter.java:39) [com.springsource.org.junit-4.7.0.jar:na]
     [exec]     [junit] 	at org.apache.tools.ant.taskdefs.optional.junit.JUnitTestRunner.run(JUnitTestRunner.java:520) [ant-junit.jar:na]
     [exec]     [junit] 	at org.apache.tools.ant.taskdefs.optional.junit.JUnitTestRunner.launch(JUnitTestRunner.java:1060) [ant-junit.jar:na]
     [exec]     [junit] 	at org.apache.tools.ant.taskdefs.optional.junit.JUnitTestRunner.main(JUnitTestRunner.java:884) [ant-junit.jar:na]
     [exec]     [junit] 03:45:03.149 [main] DEBUG o.e.virgo.nano.serviceability.Assert - > public static transient void org.eclipse.virgo.nano.serviceability.Assert.notNull(java.lang.Object, java.lang.String, java.lang.Object[])
     [exec]     [junit] 03:45:03.149 [main] DEBUG o.e.virgo.nano.serviceability.Assert - < public static transient void org.eclipse.virgo.nano.serviceability.Assert.notNull(java.lang.Object, java.lang.String, java.lang.Object[])
     [exec]     [junit] 03:45:03.149 [main] DEBUG o.e.v.k.m.m.i.DefaultRuntimeArtifactModelObjectNameCreator - > public javax.management.ObjectName org.eclipse.virgo.kernel.model.management.internal.DefaultRuntimeArtifactModelObjectNameCreator.createArtifactModel(org.eclipse.virgo.kernel.model.Artifact)
     [exec]     [junit] 03:45:03.149 [main] DEBUG o.e.v.k.m.m.i.DefaultRuntimeArtifactModelObjectNameCreator - > public javax.management.ObjectName org.eclipse.virgo.kernel.model.management.internal.DefaultRuntimeArtifactModelObjectNameCreator.createArtifactModel(java.lang.String, java.lang.String, org.osgi.framework.Version, org.eclipse.equinox.region.Region)
     [exec]     [junit] 03:45:03.150 [main] DEBUG o.e.v.k.m.m.i.DefaultRuntimeArtifactModelObjectNameCreator - < public javax.management.ObjectName org.eclipse.virgo.kernel.model.management.internal.DefaultRuntimeArtifactModelObjectNameCreator.createArtifactModel(java.lang.String, java.lang.String, org.osgi.framework.Version, org.eclipse.equinox.region.Region)
     [exec]     [junit] 03:45:03.150 [main] DEBUG o.e.v.k.m.m.i.DefaultRuntimeArtifactModelObjectNameCreator - < public javax.management.ObjectName org.eclipse.virgo.kernel.model.management.internal.DefaultRuntimeArtifactModelObjectNameCreator.createArtifactModel(org.eclipse.virgo.kernel.model.Artifact)
     [exec]     [junit] 03:45:03.150 [main] DEBUG o.e.v.k.m.m.i.DefaultRuntimeArtifactModelObjectNameCreator - > public javax.management.ObjectName org.eclipse.virgo.kernel.model.management.internal.DefaultRuntimeArtifactModelObjectNameCreator.createArtifactsOfTypeQuery(java.lang.String)
     [exec]     [junit] 03:45:03.150 [main] DEBUG o.e.v.k.m.m.i.DefaultRuntimeArtifactModelObjectNameCreator - < public javax.management.ObjectName org.eclipse.virgo.kernel.model.management.internal.DefaultRuntimeArtifactModelObjectNameCreator.createArtifactsOfTypeQuery(java.lang.String)
     [exec]     [junit] 03:45:03.150 [main] DEBUG o.e.v.k.m.m.i.DefaultRuntimeArtifactModelObjectNameCreator - > public javax.management.ObjectName org.eclipse.virgo.kernel.model.management.internal.DefaultRuntimeArtifactModelObjectNameCreator.createArtifactsOfTypeQuery(java.lang.String)
     [exec]     [junit] 03:45:03.151 [main] DEBUG o.e.v.k.m.m.i.DefaultRuntimeArtifactModelObjectNameCreator - < public javax.management.ObjectName org.eclipse.virgo.kernel.model.management.internal.DefaultRuntimeArtifactModelObjectNameCreator.createArtifactsOfTypeQuery(java.lang.String)
     [exec]     [junit] 03:45:03.151 [main] DEBUG o.e.v.k.m.m.i.DefaultRuntimeArtifactModelObjectNameCreator - > public javax.management.ObjectName org.eclipse.virgo.kernel.model.management.internal.DefaultRuntimeArtifactModelObjectNameCreator.createArtifactVersionsQuery(java.lang.String, java.lang.String)
     [exec]     [junit] 03:45:03.151 [main] DEBUG o.e.v.k.m.m.i.DefaultRuntimeArtifactModelObjectNameCreator - < public javax.management.ObjectName org.eclipse.virgo.kernel.model.management.internal.DefaultRuntimeArtifactModelObjectNameCreator.createArtifactVersionsQuery(java.lang.String, java.lang.String)
     [exec]     [junit] 03:45:03.151 [main] DEBUG o.e.v.k.m.m.i.DefaultRuntimeArtifactModelObjectNameCreator - > public javax.management.ObjectName org.eclipse.virgo.kernel.model.management.internal.DefaultRuntimeArtifactModelObjectNameCreator.createAllArtifactsQuery()
     [exec]     [junit] 03:45:03.152 [main] DEBUG o.e.v.k.m.m.i.DefaultRuntimeArtifactModelObjectNameCreator - < public javax.management.ObjectName org.eclipse.virgo.kernel.model.management.internal.DefaultRuntimeArtifactModelObjectNameCreator.createAllArtifactsQuery()
     [exec]     [junit] ------------- ---------------- ---------------
     [exec]     [junit] Testsuite: org.eclipse.virgo.kernel.model.management.internal.DelegatingManageableArtifactTests
     [exec]     [junit] Tests run: 3, Failures: 0, Errors: 0, Time elapsed: 0.012 sec
     [exec]     [junit] 
     [exec]     [junit] ------------- Standard Output ---------------
     [exec]     [junit] 03:45:03.167 [main] DEBUG o.e.virgo.nano.serviceability.Assert - > public static transient void org.eclipse.virgo.nano.serviceability.Assert.notNull(java.lang.Object, java.lang.String, java.lang.Object[])
     [exec]     [junit] 03:45:03.167 [main] DEBUG o.e.virgo.nano.serviceability.Assert - < public static transient void org.eclipse.virgo.nano.serviceability.Assert.notNull(java.lang.Object, java.lang.String, java.lang.Object[])
     [exec]     [junit] 03:45:03.167 [main] DEBUG o.e.virgo.nano.serviceability.Assert - > public static transient void org.eclipse.virgo.nano.serviceability.Assert.notNull(java.lang.Object, java.lang.String, java.lang.Object[])
     [exec]     [junit] 03:45:03.167 [main] DEBUG o.e.virgo.nano.serviceability.Assert - < public static transient void org.eclipse.virgo.nano.serviceability.Assert.notNull(java.lang.Object, java.lang.String, java.lang.Object[])
     [exec]     [junit] 03:45:03.168 [main] DEBUG o.e.v.k.m.m.i.DelegatingManageableArtifact - > public final boolean org.eclipse.virgo.kernel.model.management.internal.DelegatingManageableArtifact.refresh()
     [exec]     [junit] 03:45:03.168 [main] DEBUG o.e.v.k.m.m.i.DelegatingManageableArtifact - < public final boolean org.eclipse.virgo.kernel.model.management.internal.DelegatingManageableArtifact.refresh()
     [exec]     [junit] 03:45:03.168 [main] DEBUG o.e.v.k.m.m.i.DelegatingManageableArtifact - > public final void org.eclipse.virgo.kernel.model.management.internal.DelegatingManageableArtifact.start()
     [exec]     [junit] 03:45:03.168 [main] DEBUG o.e.v.k.m.m.i.DelegatingManageableArtifact - < public final void org.eclipse.virgo.kernel.model.management.internal.DelegatingManageableArtifact.start()
     [exec]     [junit] 03:45:03.168 [main] DEBUG o.e.v.k.m.m.i.DelegatingManageableArtifact - > public final void org.eclipse.virgo.kernel.model.management.internal.DelegatingManageableArtifact.stop()
     [exec]     [junit] 03:45:03.168 [main] DEBUG o.e.v.k.m.m.i.DelegatingManageableArtifact - < public final void org.eclipse.virgo.kernel.model.management.internal.DelegatingManageableArtifact.stop()
     [exec]     [junit] 03:45:03.168 [main] DEBUG o.e.v.k.m.m.i.DelegatingManageableArtifact - > public final void org.eclipse.virgo.kernel.model.management.internal.DelegatingManageableArtifact.uninstall()
     [exec]     [junit] 03:45:03.169 [main] DEBUG o.e.v.k.m.m.i.DelegatingManageableArtifact - < public final void org.eclipse.virgo.kernel.model.management.internal.DelegatingManageableArtifact.uninstall()
     [exec]     [junit] 03:45:03.169 [main] DEBUG o.e.virgo.nano.serviceability.Assert - > public static transient void org.eclipse.virgo.nano.serviceability.Assert.notNull(java.lang.Object, java.lang.String, java.lang.Object[])
     [exec]     [junit] 03:45:03.169 [main] DEBUG o.e.virgo.nano.serviceability.Assert - < public static transient void org.eclipse.virgo.nano.serviceability.Assert.notNull(java.lang.Object, java.lang.String, java.lang.Object[])
     [exec]     [junit] org.eclipse.virgo.nano.serviceability.Assert$FatalAssertionException: Argument [1] cannot be null
     [exec]     [junit] 	at org.eclipse.virgo.nano.serviceability.Assert.notNull(Assert.java:121) ~[org.eclipse.virgo.nano.core-3.6.4.RELEASE.jar:3.6.4.RELEASE]
     [exec]     [junit] 	at org.eclipse.virgo.nano.serviceability.enforcement.NonNullAssertionEnforcer.ajc$before$org_eclipse_virgo_nano_serviceability_enforcement_NonNullAssertionEnforcer$1$7118cd8(NonNullAssertionEnforcer.aj:57) [org.eclipse.virgo.nano.core-3.6.4.RELEASE.jar:3.6.4.RELEASE]
     [exec]     [junit] 	at org.eclipse.virgo.kernel.model.management.internal.DelegatingManageableArtifact.<init>(DelegatingManageableArtifact.java:43) [org.eclipse.virgo.kernel.model.jar:na]
     [exec]     [junit] 	at org.eclipse.virgo.kernel.model.management.internal.DelegatingManageableArtifactTests.nullCreator(DelegatingManageableArtifactTests.java:44) [test-classes/:na]
     [exec]     [junit] 	at sun.reflect.NativeMethodAccessorImpl.invoke0(Native Method) ~[na:1.6.0_45]
     [exec]     [junit] 	at sun.reflect.NativeMethodAccessorImpl.invoke(NativeMethodAccessorImpl.java:39) ~[na:1.6.0_45]
     [exec]     [junit] 	at sun.reflect.DelegatingMethodAccessorImpl.invoke(DelegatingMethodAccessorImpl.java:25) ~[na:1.6.0_45]
     [exec]     [junit] 	at java.lang.reflect.Method.invoke(Method.java:597) ~[na:1.6.0_45]
     [exec]     [junit] 	at org.junit.runners.model.FrameworkMethod$1.runReflectiveCall(FrameworkMethod.java:44) [com.springsource.org.junit-4.7.0.jar:na]
     [exec]     [junit] 	at org.junit.internal.runners.model.ReflectiveCallable.run(ReflectiveCallable.java:15) [com.springsource.org.junit-4.7.0.jar:na]
     [exec]     [junit] 	at org.junit.runners.model.FrameworkMethod.invokeExplosively(FrameworkMethod.java:41) [com.springsource.org.junit-4.7.0.jar:na]
     [exec]     [junit] 	at org.junit.internal.runners.statements.InvokeMethod.evaluate(InvokeMethod.java:20) [com.springsource.org.junit-4.7.0.jar:na]
     [exec]     [junit] 	at org.junit.internal.runners.statements.ExpectException.evaluate(ExpectException.java:21) [com.springsource.org.junit-4.7.0.jar:na]
     [exec]     [junit] 	at org.junit.runners.BlockJUnit4ClassRunner.runChild(BlockJUnit4ClassRunner.java:76) [com.springsource.org.junit-4.7.0.jar:na]
     [exec]     [junit] 	at org.junit.runners.BlockJUnit4ClassRunner.runChild(BlockJUnit4ClassRunner.java:50) [com.springsource.org.junit-4.7.0.jar:na]
     [exec]     [junit] 	at org.junit.runners.ParentRunner$3.run(ParentRunner.java:193) [com.springsource.org.junit-4.7.0.jar:na]
     [exec]     [junit] 	at org.junit.runners.ParentRunner$1.schedule(ParentRunner.java:52) [com.springsource.org.junit-4.7.0.jar:na]
     [exec]     [junit] 	at org.junit.runners.ParentRunner.runChildren(ParentRunner.java:191) [com.springsource.org.junit-4.7.0.jar:na]
     [exec]     [junit] 	at org.junit.runners.ParentRunner.access$000(ParentRunner.java:42) [com.springsource.org.junit-4.7.0.jar:na]
     [exec]     [junit] 	at org.junit.runners.ParentRunner$2.evaluate(ParentRunner.java:184) [com.springsource.org.junit-4.7.0.jar:na]
     [exec]     [junit] 	at org.junit.runners.ParentRunner.run(ParentRunner.java:236) [com.springsource.org.junit-4.7.0.jar:na]
     [exec]     [junit] 	at junit.framework.JUnit4TestAdapter.run(JUnit4TestAdapter.java:39) [com.springsource.org.junit-4.7.0.jar:na]
     [exec]     [junit] 	at org.apache.tools.ant.taskdefs.optional.junit.JUnitTestRunner.run(JUnitTestRunner.java:520) [ant-junit.jar:na]
     [exec]     [junit] 	at org.apache.tools.ant.taskdefs.optional.junit.JUnitTestRunner.launch(JUnitTestRunner.java:1060) [ant-junit.jar:na]
     [exec]     [junit] 	at org.apache.tools.ant.taskdefs.optional.junit.JUnitTestRunner.main(JUnitTestRunner.java:884) [ant-junit.jar:na]
     [exec]     [junit] 03:45:03.170 [main] DEBUG o.e.virgo.nano.serviceability.Assert - > public static transient void org.eclipse.virgo.nano.serviceability.Assert.notNull(java.lang.Object, java.lang.String, java.lang.Object[])
     [exec]     [junit] 03:45:03.170 [main] DEBUG o.e.virgo.nano.serviceability.Assert - < public static transient void org.eclipse.virgo.nano.serviceability.Assert.notNull(java.lang.Object, java.lang.String, java.lang.Object[])
     [exec]     [junit] 03:45:03.170 [main] DEBUG o.e.virgo.nano.serviceability.Assert - > public static transient void org.eclipse.virgo.nano.serviceability.Assert.notNull(java.lang.Object, java.lang.String, java.lang.Object[])
     [exec]     [junit] 03:45:03.170 [main] DEBUG o.e.virgo.nano.serviceability.Assert - < public static transient void org.eclipse.virgo.nano.serviceability.Assert.notNull(java.lang.Object, java.lang.String, java.lang.Object[])
     [exec]     [junit] org.eclipse.virgo.nano.serviceability.Assert$FatalAssertionException: Argument [2] cannot be null
     [exec]     [junit] 	at org.eclipse.virgo.nano.serviceability.Assert.notNull(Assert.java:121) ~[org.eclipse.virgo.nano.core-3.6.4.RELEASE.jar:3.6.4.RELEASE]
     [exec]     [junit] 	at org.eclipse.virgo.nano.serviceability.enforcement.NonNullAssertionEnforcer.ajc$before$org_eclipse_virgo_nano_serviceability_enforcement_NonNullAssertionEnforcer$2$ea5bfc82(NonNullAssertionEnforcer.aj:61) [org.eclipse.virgo.nano.core-3.6.4.RELEASE.jar:3.6.4.RELEASE]
     [exec]     [junit] 	at org.eclipse.virgo.kernel.model.management.internal.DelegatingManageableArtifact.<init>(DelegatingManageableArtifact.java:43) [org.eclipse.virgo.kernel.model.jar:na]
     [exec]     [junit] 	at org.eclipse.virgo.kernel.model.management.internal.DelegatingManageableArtifactTests.nullArtifact(DelegatingManageableArtifactTests.java:49) [test-classes/:na]
     [exec]     [junit] 	at sun.reflect.NativeMethodAccessorImpl.invoke0(Native Method) ~[na:1.6.0_45]
     [exec]     [junit] 	at sun.reflect.NativeMethodAccessorImpl.invoke(NativeMethodAccessorImpl.java:39) ~[na:1.6.0_45]
     [exec]     [junit] 	at sun.reflect.DelegatingMethodAccessorImpl.invoke(DelegatingMethodAccessorImpl.java:25) ~[na:1.6.0_45]
     [exec]     [junit] 	at java.lang.reflect.Method.invoke(Method.java:597) ~[na:1.6.0_45]
     [exec]     [junit] 	at org.junit.runners.model.FrameworkMethod$1.runReflectiveCall(FrameworkMethod.java:44) [com.springsource.org.junit-4.7.0.jar:na]
     [exec]     [junit] 	at org.junit.internal.runners.model.ReflectiveCallable.run(ReflectiveCallable.java:15) [com.springsource.org.junit-4.7.0.jar:na]
     [exec]     [junit] 	at org.junit.runners.model.FrameworkMethod.invokeExplosively(FrameworkMethod.java:41) [com.springsource.org.junit-4.7.0.jar:na]
     [exec]     [junit] 	at org.junit.internal.runners.statements.InvokeMethod.evaluate(InvokeMethod.java:20) [com.springsource.org.junit-4.7.0.jar:na]
     [exec]     [junit] 	at org.junit.internal.runners.statements.ExpectException.evaluate(ExpectException.java:21) [com.springsource.org.junit-4.7.0.jar:na]
     [exec]     [junit] 	at org.junit.runners.BlockJUnit4ClassRunner.runChild(BlockJUnit4ClassRunner.java:76) [com.springsource.org.junit-4.7.0.jar:na]
     [exec]     [junit] 	at org.junit.runners.BlockJUnit4ClassRunner.runChild(BlockJUnit4ClassRunner.java:50) [com.springsource.org.junit-4.7.0.jar:na]
     [exec]     [junit] 	at org.junit.runners.ParentRunner$3.run(ParentRunner.java:193) [com.springsource.org.junit-4.7.0.jar:na]
     [exec]     [junit] 	at org.junit.runners.ParentRunner$1.schedule(ParentRunner.java:52) [com.springsource.org.junit-4.7.0.jar:na]
     [exec]     [junit] 	at org.junit.runners.ParentRunner.runChildren(ParentRunner.java:191) [com.springsource.org.junit-4.7.0.jar:na]
     [exec]     [junit] 	at org.junit.runners.ParentRunner.access$000(ParentRunner.java:42) [com.springsource.org.junit-4.7.0.jar:na]
     [exec]     [junit] 	at org.junit.runners.ParentRunner$2.evaluate(ParentRunner.java:184) [com.springsource.org.junit-4.7.0.jar:na]
     [exec]     [junit] 	at org.junit.runners.ParentRunner.run(ParentRunner.java:236) [com.springsource.org.junit-4.7.0.jar:na]
     [exec]     [junit] 	at junit.framework.JUnit4TestAdapter.run(JUnit4TestAdapter.java:39) [com.springsource.org.junit-4.7.0.jar:na]
     [exec]     [junit] 	at org.apache.tools.ant.taskdefs.optional.junit.JUnitTestRunner.run(JUnitTestRunner.java:520) [ant-junit.jar:na]
     [exec]     [junit] 	at org.apache.tools.ant.taskdefs.optional.junit.JUnitTestRunner.launch(JUnitTestRunner.java:1060) [ant-junit.jar:na]
     [exec]     [junit] 	at org.apache.tools.ant.taskdefs.optional.junit.JUnitTestRunner.main(JUnitTestRunner.java:884) [ant-junit.jar:na]
     [exec]     [junit] ------------- ---------------- ---------------
     [exec]     [junit] Testsuite: org.eclipse.virgo.kernel.model.management.internal.DelegatingManageableCompositeArtifactTests
     [exec]     [junit] Tests run: 3, Failures: 0, Errors: 0, Time elapsed: 0.008 sec
     [exec]     [junit] 
     [exec]     [junit] ------------- Standard Output ---------------
     [exec]     [junit] 03:45:03.184 [main] DEBUG o.e.virgo.nano.serviceability.Assert - > public static transient void org.eclipse.virgo.nano.serviceability.Assert.notNull(java.lang.Object, java.lang.String, java.lang.Object[])
     [exec]     [junit] 03:45:03.184 [main] DEBUG o.e.virgo.nano.serviceability.Assert - < public static transient void org.eclipse.virgo.nano.serviceability.Assert.notNull(java.lang.Object, java.lang.String, java.lang.Object[])
     [exec]     [junit] 03:45:03.184 [main] DEBUG o.e.virgo.nano.serviceability.Assert - > public static transient void org.eclipse.virgo.nano.serviceability.Assert.notNull(java.lang.Object, java.lang.String, java.lang.Object[])
     [exec]     [junit] 03:45:03.184 [main] DEBUG o.e.virgo.nano.serviceability.Assert - < public static transient void org.eclipse.virgo.nano.serviceability.Assert.notNull(java.lang.Object, java.lang.String, java.lang.Object[])
     [exec]     [junit] 03:45:03.184 [main] DEBUG o.e.virgo.nano.serviceability.Assert - > public static transient void org.eclipse.virgo.nano.serviceability.Assert.notNull(java.lang.Object, java.lang.String, java.lang.Object[])
     [exec]     [junit] 03:45:03.184 [main] DEBUG o.e.virgo.nano.serviceability.Assert - < public static transient void org.eclipse.virgo.nano.serviceability.Assert.notNull(java.lang.Object, java.lang.String, java.lang.Object[])
     [exec]     [junit] 03:45:03.184 [main] DEBUG o.e.virgo.nano.serviceability.Assert - > public static transient void org.eclipse.virgo.nano.serviceability.Assert.notNull(java.lang.Object, java.lang.String, java.lang.Object[])
     [exec]     [junit] 03:45:03.184 [main] DEBUG o.e.virgo.nano.serviceability.Assert - < public static transient void org.eclipse.virgo.nano.serviceability.Assert.notNull(java.lang.Object, java.lang.String, java.lang.Object[])
     [exec]     [junit] 03:45:03.184 [main] DEBUG o.e.v.k.m.m.i.DelegatingManageableCompositeArtifact - > public boolean org.eclipse.virgo.kernel.model.management.internal.DelegatingManageableCompositeArtifact.isAtomic()
     [exec]     [junit] 03:45:03.185 [main] DEBUG o.e.v.k.m.m.i.DelegatingManageableCompositeArtifact - < public boolean org.eclipse.virgo.kernel.model.management.internal.DelegatingManageableCompositeArtifact.isAtomic()
     [exec]     [junit] 03:45:03.185 [main] DEBUG o.e.v.k.m.m.i.DelegatingManageableCompositeArtifact - > public boolean org.eclipse.virgo.kernel.model.management.internal.DelegatingManageableCompositeArtifact.isScoped()
     [exec]     [junit] 03:45:03.185 [main] DEBUG o.e.v.k.m.m.i.DelegatingManageableCompositeArtifact - < public boolean org.eclipse.virgo.kernel.model.management.internal.DelegatingManageableCompositeArtifact.isScoped()
     [exec]     [junit] 03:45:03.185 [main] DEBUG o.e.virgo.nano.serviceability.Assert - > public static transient void org.eclipse.virgo.nano.serviceability.Assert.notNull(java.lang.Object, java.lang.String, java.lang.Object[])
     [exec]     [junit] 03:45:03.185 [main] DEBUG o.e.virgo.nano.serviceability.Assert - < public static transient void org.eclipse.virgo.nano.serviceability.Assert.notNull(java.lang.Object, java.lang.String, java.lang.Object[])
     [exec]     [junit] org.eclipse.virgo.nano.serviceability.Assert$FatalAssertionException: Argument [1] cannot be null
     [exec]     [junit] 	at org.eclipse.virgo.nano.serviceability.Assert.notNull(Assert.java:121) ~[org.eclipse.virgo.nano.core-3.6.4.RELEASE.jar:3.6.4.RELEASE]
     [exec]     [junit] 	at org.eclipse.virgo.nano.serviceability.enforcement.NonNullAssertionEnforcer.ajc$before$org_eclipse_virgo_nano_serviceability_enforcement_NonNullAssertionEnforcer$1$7118cd8(NonNullAssertionEnforcer.aj:57) [org.eclipse.virgo.nano.core-3.6.4.RELEASE.jar:3.6.4.RELEASE]
     [exec]     [junit] 	at org.eclipse.virgo.kernel.model.management.internal.DelegatingManageableCompositeArtifact.<init>(DelegatingManageableCompositeArtifact.java:36) [org.eclipse.virgo.kernel.model.jar:na]
     [exec]     [junit] 	at org.eclipse.virgo.kernel.model.management.internal.DelegatingManageableCompositeArtifactTests.nullCreator(DelegatingManageableCompositeArtifactTests.java:34) [test-classes/:na]
     [exec]     [junit] 	at sun.reflect.NativeMethodAccessorImpl.invoke0(Native Method) ~[na:1.6.0_45]
     [exec]     [junit] 	at sun.reflect.NativeMethodAccessorImpl.invoke(NativeMethodAccessorImpl.java:39) ~[na:1.6.0_45]
     [exec]     [junit] 	at sun.reflect.DelegatingMethodAccessorImpl.invoke(DelegatingMethodAccessorImpl.java:25) ~[na:1.6.0_45]
     [exec]     [junit] 	at java.lang.reflect.Method.invoke(Method.java:597) ~[na:1.6.0_45]
     [exec]     [junit] 	at org.junit.runners.model.FrameworkMethod$1.runReflectiveCall(FrameworkMethod.java:44) [com.springsource.org.junit-4.7.0.jar:na]
     [exec]     [junit] 	at org.junit.internal.runners.model.ReflectiveCallable.run(ReflectiveCallable.java:15) [com.springsource.org.junit-4.7.0.jar:na]
     [exec]     [junit] 	at org.junit.runners.model.FrameworkMethod.invokeExplosively(FrameworkMethod.java:41) [com.springsource.org.junit-4.7.0.jar:na]
     [exec]     [junit] 	at org.junit.internal.runners.statements.InvokeMethod.evaluate(InvokeMethod.java:20) [com.springsource.org.junit-4.7.0.jar:na]
     [exec]     [junit] 	at org.junit.internal.runners.statements.ExpectException.evaluate(ExpectException.java:21) [com.springsource.org.junit-4.7.0.jar:na]
     [exec]     [junit] 	at org.junit.runners.BlockJUnit4ClassRunner.runChild(BlockJUnit4ClassRunner.java:76) [com.springsource.org.junit-4.7.0.jar:na]
     [exec]     [junit] 	at org.junit.runners.BlockJUnit4ClassRunner.runChild(BlockJUnit4ClassRunner.java:50) [com.springsource.org.junit-4.7.0.jar:na]
     [exec]     [junit] 	at org.junit.runners.ParentRunner$3.run(ParentRunner.java:193) [com.springsource.org.junit-4.7.0.jar:na]
     [exec]     [junit] 	at org.junit.runners.ParentRunner$1.schedule(ParentRunner.java:52) [com.springsource.org.junit-4.7.0.jar:na]
     [exec]     [junit] 	at org.junit.runners.ParentRunner.runChildren(ParentRunner.java:191) [com.springsource.org.junit-4.7.0.jar:na]
     [exec]     [junit] 	at org.junit.runners.ParentRunner.access$000(ParentRunner.java:42) [com.springsource.org.junit-4.7.0.jar:na]
     [exec]     [junit] 	at org.junit.runners.ParentRunner$2.evaluate(ParentRunner.java:184) [com.springsource.org.junit-4.7.0.jar:na]
     [exec]     [junit] 	at org.junit.runners.ParentRunner.run(ParentRunner.java:236) [com.springsource.org.junit-4.7.0.jar:na]
     [exec]     [junit] 	at junit.framework.JUnit4TestAdapter.run(JUnit4TestAdapter.java:39) [com.springsource.org.junit-4.7.0.jar:na]
     [exec]     [junit] 	at org.apache.tools.ant.taskdefs.optional.junit.JUnitTestRunner.run(JUnitTestRunner.java:520) [ant-junit.jar:na]
     [exec]     [junit] 	at org.apache.tools.ant.taskdefs.optional.junit.JUnitTestRunner.launch(JUnitTestRunner.java:1060) [ant-junit.jar:na]
     [exec]     [junit] 	at org.apache.tools.ant.taskdefs.optional.junit.JUnitTestRunner.main(JUnitTestRunner.java:884) [ant-junit.jar:na]
     [exec]     [junit] 03:45:03.186 [main] DEBUG o.e.virgo.nano.serviceability.Assert - > public static transient void org.eclipse.virgo.nano.serviceability.Assert.notNull(java.lang.Object, java.lang.String, java.lang.Object[])
     [exec]     [junit] 03:45:03.186 [main] DEBUG o.e.virgo.nano.serviceability.Assert - < public static transient void org.eclipse.virgo.nano.serviceability.Assert.notNull(java.lang.Object, java.lang.String, java.lang.Object[])
     [exec]     [junit] 03:45:03.186 [main] DEBUG o.e.virgo.nano.serviceability.Assert - > public static transient void org.eclipse.virgo.nano.serviceability.Assert.notNull(java.lang.Object, java.lang.String, java.lang.Object[])
     [exec]     [junit] 03:45:03.187 [main] DEBUG o.e.virgo.nano.serviceability.Assert - < public static transient void org.eclipse.virgo.nano.serviceability.Assert.notNull(java.lang.Object, java.lang.String, java.lang.Object[])
     [exec]     [junit] org.eclipse.virgo.nano.serviceability.Assert$FatalAssertionException: Argument [2] cannot be null
     [exec]     [junit] 	at org.eclipse.virgo.nano.serviceability.Assert.notNull(Assert.java:121) ~[org.eclipse.virgo.nano.core-3.6.4.RELEASE.jar:3.6.4.RELEASE]
     [exec]     [junit] 	at org.eclipse.virgo.nano.serviceability.enforcement.NonNullAssertionEnforcer.ajc$before$org_eclipse_virgo_nano_serviceability_enforcement_NonNullAssertionEnforcer$2$ea5bfc82(NonNullAssertionEnforcer.aj:61) [org.eclipse.virgo.nano.core-3.6.4.RELEASE.jar:3.6.4.RELEASE]
     [exec]     [junit] 	at org.eclipse.virgo.kernel.model.management.internal.DelegatingManageableCompositeArtifact.<init>(DelegatingManageableCompositeArtifact.java:36) [org.eclipse.virgo.kernel.model.jar:na]
     [exec]     [junit] 	at org.eclipse.virgo.kernel.model.management.internal.DelegatingManageableCompositeArtifactTests.nullArtifact(DelegatingManageableCompositeArtifactTests.java:39) [test-classes/:na]
     [exec]     [junit] 	at sun.reflect.NativeMethodAccessorImpl.invoke0(Native Method) ~[na:1.6.0_45]
     [exec]     [junit] 	at sun.reflect.NativeMethodAccessorImpl.invoke(NativeMethodAccessorImpl.java:39) ~[na:1.6.0_45]
     [exec]     [junit] 	at sun.reflect.DelegatingMethodAccessorImpl.invoke(DelegatingMethodAccessorImpl.java:25) ~[na:1.6.0_45]
     [exec]     [junit] 	at java.lang.reflect.Method.invoke(Method.java:597) ~[na:1.6.0_45]
     [exec]     [junit] 	at org.junit.runners.model.FrameworkMethod$1.runReflectiveCall(FrameworkMethod.java:44) [com.springsource.org.junit-4.7.0.jar:na]
     [exec]     [junit] 	at org.junit.internal.runners.model.ReflectiveCallable.run(ReflectiveCallable.java:15) [com.springsource.org.junit-4.7.0.jar:na]
     [exec]     [junit] 	at org.junit.runners.model.FrameworkMethod.invokeExplosively(FrameworkMethod.java:41) [com.springsource.org.junit-4.7.0.jar:na]
     [exec]     [junit] 	at org.junit.internal.runners.statements.InvokeMethod.evaluate(InvokeMethod.java:20) [com.springsource.org.junit-4.7.0.jar:na]
     [exec]     [junit] 	at org.junit.internal.runners.statements.ExpectException.evaluate(ExpectException.java:21) [com.springsource.org.junit-4.7.0.jar:na]
     [exec]     [junit] 	at org.junit.runners.BlockJUnit4ClassRunner.runChild(BlockJUnit4ClassRunner.java:76) [com.springsource.org.junit-4.7.0.jar:na]
     [exec]     [junit] 	at org.junit.runners.BlockJUnit4ClassRunner.runChild(BlockJUnit4ClassRunner.java:50) [com.springsource.org.junit-4.7.0.jar:na]
     [exec]     [junit] 	at org.junit.runners.ParentRunner$3.run(ParentRunner.java:193) [com.springsource.org.junit-4.7.0.jar:na]
     [exec]     [junit] 	at org.junit.runners.ParentRunner$1.schedule(ParentRunner.java:52) [com.springsource.org.junit-4.7.0.jar:na]
     [exec]     [junit] 	at org.junit.runners.ParentRunner.runChildren(ParentRunner.java:191) [com.springsource.org.junit-4.7.0.jar:na]
     [exec]     [junit] 	at org.junit.runners.ParentRunner.access$000(ParentRunner.java:42) [com.springsource.org.junit-4.7.0.jar:na]
     [exec]     [junit] 	at org.junit.runners.ParentRunner$2.evaluate(ParentRunner.java:184) [com.springsource.org.junit-4.7.0.jar:na]
     [exec]     [junit] 	at org.junit.runners.ParentRunner.run(ParentRunner.java:236) [com.springsource.org.junit-4.7.0.jar:na]
     [exec]     [junit] 	at junit.framework.JUnit4TestAdapter.run(JUnit4TestAdapter.java:39) [com.springsource.org.junit-4.7.0.jar:na]
     [exec]     [junit] 	at org.apache.tools.ant.taskdefs.optional.junit.JUnitTestRunner.run(JUnitTestRunner.java:520) [ant-junit.jar:na]
     [exec]     [junit] 	at org.apache.tools.ant.taskdefs.optional.junit.JUnitTestRunner.launch(JUnitTestRunner.java:1060) [ant-junit.jar:na]
     [exec]     [junit] 	at org.apache.tools.ant.taskdefs.optional.junit.JUnitTestRunner.main(JUnitTestRunner.java:884) [ant-junit.jar:na]
     [exec]     [junit] ------------- ---------------- ---------------
     [exec]     [junit] Testsuite: org.eclipse.virgo.kernel.model.management.internal.JmxArtifactRepositoryListenerTests
     [exec]     [junit] Tests run: 3, Failures: 0, Errors: 0, Time elapsed: 0.052 sec
     [exec]     [junit] 
     [exec]     [junit] ------------- Standard Output ---------------
     [exec]     [junit] 03:45:03.285 [main] DEBUG o.e.virgo.nano.serviceability.Assert - > public static transient void org.eclipse.virgo.nano.serviceability.Assert.notNull(java.lang.Object, java.lang.String, java.lang.Object[])
     [exec]     [junit] 03:45:03.286 [main] DEBUG o.e.virgo.nano.serviceability.Assert - < public static transient void org.eclipse.virgo.nano.serviceability.Assert.notNull(java.lang.Object, java.lang.String, java.lang.Object[])
     [exec]     [junit] 03:45:03.286 [main] DEBUG o.e.v.k.m.m.i.JmxArtifactRepositoryListener - > public void org.eclipse.virgo.kernel.model.management.internal.JmxArtifactRepositoryListener.added(org.eclipse.virgo.kernel.model.Artifact)
     [exec]     [junit] 03:45:03.286 [main] DEBUG o.e.virgo.nano.serviceability.Assert - > public static transient void org.eclipse.virgo.nano.serviceability.Assert.notNull(java.lang.Object, java.lang.String, java.lang.Object[])
     [exec]     [junit] 03:45:03.286 [main] DEBUG o.e.virgo.nano.serviceability.Assert - < public static transient void org.eclipse.virgo.nano.serviceability.Assert.notNull(java.lang.Object, java.lang.String, java.lang.Object[])
     [exec]     [junit] 03:45:03.286 [main] DEBUG o.e.virgo.nano.serviceability.Assert - > public static transient void org.eclipse.virgo.nano.serviceability.Assert.notNull(java.lang.Object, java.lang.String, java.lang.Object[])
     [exec]     [junit] 03:45:03.286 [main] DEBUG o.e.virgo.nano.serviceability.Assert - < public static transient void org.eclipse.virgo.nano.serviceability.Assert.notNull(java.lang.Object, java.lang.String, java.lang.Object[])
     [exec]     [junit] 03:45:03.286 [main] DEBUG o.e.virgo.nano.serviceability.Assert - > public static transient void org.eclipse.virgo.nano.serviceability.Assert.notNull(java.lang.Object, java.lang.String, java.lang.Object[])
     [exec]     [junit] 03:45:03.286 [main] DEBUG o.e.virgo.nano.serviceability.Assert - < public static transient void org.eclipse.virgo.nano.serviceability.Assert.notNull(java.lang.Object, java.lang.String, java.lang.Object[])
     [exec]     [junit] 03:45:03.286 [main] DEBUG o.e.virgo.nano.serviceability.Assert - > public static transient void org.eclipse.virgo.nano.serviceability.Assert.notNull(java.lang.Object, java.lang.String, java.lang.Object[])
     [exec]     [junit] 03:45:03.286 [main] DEBUG o.e.virgo.nano.serviceability.Assert - < public static transient void org.eclipse.virgo.nano.serviceability.Assert.notNull(java.lang.Object, java.lang.String, java.lang.Object[])
     [exec]     [junit] 03:45:03.291 [main] DEBUG o.e.v.k.m.m.i.JmxArtifactRepositoryListener - < public void org.eclipse.virgo.kernel.model.management.internal.JmxArtifactRepositoryListener.added(org.eclipse.virgo.kernel.model.Artifact)
     [exec]     [junit] 03:45:03.291 [main] DEBUG o.e.v.k.m.m.i.JmxArtifactRepositoryListener - > public void org.eclipse.virgo.kernel.model.management.internal.JmxArtifactRepositoryListener.removed(org.eclipse.virgo.kernel.model.Artifact)
     [exec]     [junit] 03:45:03.291 [main] DEBUG o.e.v.k.m.m.i.JmxArtifactRepositoryListener - < public void org.eclipse.virgo.kernel.model.management.internal.JmxArtifactRepositoryListener.removed(org.eclipse.virgo.kernel.model.Artifact)
     [exec]     [junit] 03:45:03.292 [main] DEBUG o.e.virgo.nano.serviceability.Assert - > public static transient void org.eclipse.virgo.nano.serviceability.Assert.notNull(java.lang.Object, java.lang.String, java.lang.Object[])
     [exec]     [junit] 03:45:03.292 [main] DEBUG o.e.virgo.nano.serviceability.Assert - < public static transient void org.eclipse.virgo.nano.serviceability.Assert.notNull(java.lang.Object, java.lang.String, java.lang.Object[])
     [exec]     [junit] 03:45:03.292 [main] DEBUG o.e.v.k.m.m.i.JmxArtifactRepositoryListener - > public void org.eclipse.virgo.kernel.model.management.internal.JmxArtifactRepositoryListener.added(org.eclipse.virgo.kernel.model.Artifact)
     [exec]     [junit] 03:45:03.292 [main] DEBUG o.e.virgo.nano.serviceability.Assert - > public static transient void org.eclipse.virgo.nano.serviceability.Assert.notNull(java.lang.Object, java.lang.String, java.lang.Object[])
     [exec]     [junit] 03:45:03.292 [main] DEBUG o.e.virgo.nano.serviceability.Assert - < public static transient void org.eclipse.virgo.nano.serviceability.Assert.notNull(java.lang.Object, java.lang.String, java.lang.Object[])
     [exec]     [junit] 03:45:03.292 [main] DEBUG o.e.virgo.nano.serviceability.Assert - > public static transient void org.eclipse.virgo.nano.serviceability.Assert.notNull(java.lang.Object, java.lang.String, java.lang.Object[])
     [exec]     [junit] 03:45:03.292 [main] DEBUG o.e.virgo.nano.serviceability.Assert - < public static transient void org.eclipse.virgo.nano.serviceability.Assert.notNull(java.lang.Object, java.lang.String, java.lang.Object[])
     [exec]     [junit] 03:45:03.292 [main] DEBUG o.e.virgo.nano.serviceability.Assert - > public static transient void org.eclipse.virgo.nano.serviceability.Assert.notNull(java.lang.Object, java.lang.String, java.lang.Object[])
     [exec]     [junit] 03:45:03.292 [main] DEBUG o.e.virgo.nano.serviceability.Assert - < public static transient void org.eclipse.virgo.nano.serviceability.Assert.notNull(java.lang.Object, java.lang.String, java.lang.Object[])
     [exec]     [junit] 03:45:03.292 [main] DEBUG o.e.virgo.nano.serviceability.Assert - > public static transient void org.eclipse.virgo.nano.serviceability.Assert.notNull(java.lang.Object, java.lang.String, java.lang.Object[])
     [exec]     [junit] 03:45:03.292 [main] DEBUG o.e.virgo.nano.serviceability.Assert - < public static transient void org.eclipse.virgo.nano.serviceability.Assert.notNull(java.lang.Object, java.lang.String, java.lang.Object[])
     [exec]     [junit] 03:45:03.292 [main] DEBUG o.e.v.k.m.m.i.JmxArtifactRepositoryListener - < public void org.eclipse.virgo.kernel.model.management.internal.JmxArtifactRepositoryListener.added(org.eclipse.virgo.kernel.model.Artifact)
     [exec]     [junit] 03:45:03.293 [main] DEBUG o.e.virgo.nano.serviceability.Assert - > public static transient void org.eclipse.virgo.nano.serviceability.Assert.notNull(java.lang.Object, java.lang.String, java.lang.Object[])
     [exec]     [junit] 03:45:03.293 [main] DEBUG o.e.virgo.nano.serviceability.Assert - < public static transient void org.eclipse.virgo.nano.serviceability.Assert.notNull(java.lang.Object, java.lang.String, java.lang.Object[])
     [exec]     [junit] 03:45:03.293 [main] DEBUG o.e.virgo.nano.serviceability.Assert - > public static transient void org.eclipse.virgo.nano.serviceability.Assert.notNull(java.lang.Object, java.lang.String, java.lang.Object[])
     [exec]     [junit] 03:45:03.293 [main] DEBUG o.e.virgo.nano.serviceability.Assert - < public static transient void org.eclipse.virgo.nano.serviceability.Assert.notNull(java.lang.Object, java.lang.String, java.lang.Object[])
     [exec]     [junit] org.eclipse.virgo.nano.serviceability.Assert$FatalAssertionException: Argument [1] cannot be null
     [exec]     [junit] 	at org.eclipse.virgo.nano.serviceability.Assert.notNull(Assert.java:121) ~[org.eclipse.virgo.nano.core-3.6.4.RELEASE.jar:3.6.4.RELEASE]
     [exec]     [junit] 	at org.eclipse.virgo.nano.serviceability.enforcement.NonNullAssertionEnforcer.ajc$before$org_eclipse_virgo_nano_serviceability_enforcement_NonNullAssertionEnforcer$1$7118cd8(NonNullAssertionEnforcer.aj:57) [org.eclipse.virgo.nano.core-3.6.4.RELEASE.jar:3.6.4.RELEASE]
     [exec]     [junit] 	at org.eclipse.virgo.kernel.model.management.internal.JmxArtifactRepositoryListener.<init>(JmxArtifactRepositoryListener.java:52) [org.eclipse.virgo.kernel.model.jar:na]
     [exec]     [junit] 	at org.eclipse.virgo.kernel.model.management.internal.JmxArtifactRepositoryListenerTests.nullCreator(JmxArtifactRepositoryListenerTests.java:45) [test-classes/:na]
     [exec]     [junit] 	at sun.reflect.NativeMethodAccessorImpl.invoke0(Native Method) ~[na:1.6.0_45]
     [exec]     [junit] 	at sun.reflect.NativeMethodAccessorImpl.invoke(NativeMethodAccessorImpl.java:39) ~[na:1.6.0_45]
     [exec]     [junit] 	at sun.reflect.DelegatingMethodAccessorImpl.invoke(DelegatingMethodAccessorImpl.java:25) ~[na:1.6.0_45]
     [exec]     [junit] 	at java.lang.reflect.Method.invoke(Method.java:597) ~[na:1.6.0_45]
     [exec]     [junit] 	at org.junit.runners.model.FrameworkMethod$1.runReflectiveCall(FrameworkMethod.java:44) [com.springsource.org.junit-4.7.0.jar:na]
     [exec]     [junit] 	at org.junit.internal.runners.model.ReflectiveCallable.run(ReflectiveCallable.java:15) [com.springsource.org.junit-4.7.0.jar:na]
     [exec]     [junit] 	at org.junit.runners.model.FrameworkMethod.invokeExplosively(FrameworkMethod.java:41) [com.springsource.org.junit-4.7.0.jar:na]
     [exec]     [junit] 	at org.junit.internal.runners.statements.InvokeMethod.evaluate(InvokeMethod.java:20) [com.springsource.org.junit-4.7.0.jar:na]
     [exec]     [junit] 	at org.junit.internal.runners.statements.ExpectException.evaluate(ExpectException.java:21) [com.springsource.org.junit-4.7.0.jar:na]
     [exec]     [junit] 	at org.junit.runners.BlockJUnit4ClassRunner.runChild(BlockJUnit4ClassRunner.java:76) [com.springsource.org.junit-4.7.0.jar:na]
     [exec]     [junit] 	at org.junit.runners.BlockJUnit4ClassRunner.runChild(BlockJUnit4ClassRunner.java:50) [com.springsource.org.junit-4.7.0.jar:na]
     [exec]     [junit] 	at org.junit.runners.ParentRunner$3.run(ParentRunner.java:193) [com.springsource.org.junit-4.7.0.jar:na]
     [exec]     [junit] 	at org.junit.runners.ParentRunner$1.schedule(ParentRunner.java:52) [com.springsource.org.junit-4.7.0.jar:na]
     [exec]     [junit] 	at org.junit.runners.ParentRunner.runChildren(ParentRunner.java:191) [com.springsource.org.junit-4.7.0.jar:na]
     [exec]     [junit] 	at org.junit.runners.ParentRunner.access$000(ParentRunner.java:42) [com.springsource.org.junit-4.7.0.jar:na]
     [exec]     [junit] 	at org.junit.runners.ParentRunner$2.evaluate(ParentRunner.java:184) [com.springsource.org.junit-4.7.0.jar:na]
     [exec]     [junit] 	at org.junit.runners.ParentRunner.run(ParentRunner.java:236) [com.springsource.org.junit-4.7.0.jar:na]
     [exec]     [junit] 	at junit.framework.JUnit4TestAdapter.run(JUnit4TestAdapter.java:39) [com.springsource.org.junit-4.7.0.jar:na]
     [exec]     [junit] 	at org.apache.tools.ant.taskdefs.optional.junit.JUnitTestRunner.run(JUnitTestRunner.java:520) [ant-junit.jar:na]
     [exec]     [junit] 	at org.apache.tools.ant.taskdefs.optional.junit.JUnitTestRunner.launch(JUnitTestRunner.java:1060) [ant-junit.jar:na]
     [exec]     [junit] 	at org.apache.tools.ant.taskdefs.optional.junit.JUnitTestRunner.main(JUnitTestRunner.java:884) [ant-junit.jar:na]
     [exec]     [junit] ------------- ---------------- ---------------
     [exec] 
     [exec] BUILD SUCCESSFUL
     [exec] Total time: 9 seconds
     [echo] exec-ant for target 'test.do' gave return code 0
   [subant] Leaving directory: /jobs/genie.virgo/virgo.kernel.3.6.snapshot/workspace/org.eclipse.virgo.kernel.model
   [subant] Entering directory: /jobs/genie.virgo/virgo.kernel.3.6.snapshot/workspace/org.eclipse.virgo.shell.command

exec-ant:
     [echo] exec-ant for target 'test.do' executing in directory '/jobs/genie.virgo/virgo.kernel.3.6.snapshot/workspace/org.eclipse.virgo.shell.command'
     [exec] Buildfile: /jobs/genie.virgo/virgo.kernel.3.6.snapshot/workspace/org.eclipse.virgo.shell.command/build.xml
     [exec] 
     [exec] ivy.init:
     [exec] 
     [exec] ivy.file.exists:
     [exec] 
     [exec] resolve.init:
     [exec] 
     [exec] resolve.compile:
     [exec] [ivy:cachepath] :: Ivy 2.1.0 - 20090925235825 :: http://ant.apache.org/ivy/ ::
     [exec] [ivy:cachepath] :: loading settings :: file = /jobs/genie.virgo/virgo.kernel.3.6.snapshot/workspace/virgo-build/common/ivysettings.xml
     [exec] 
     [exec] resolve.test:
     [exec] 
     [exec] resolve.aspects:
     [exec] 
     [exec] compile.init:
     [exec] 
     [exec] test.init:
     [exec]    [delete] Deleting: /jobs/genie.virgo/virgo.kernel.3.6.snapshot/workspace/user-ivy.properties
     [exec]    [delete] Deleting: /jobs/genie.virgo/virgo.kernel.3.6.snapshot/workspace/org.eclipse.virgo.shell.command/tmp.file
     [exec] 
     [exec] test.do:
     [exec]     [mkdir] Created dir: /jobs/genie.virgo/virgo.kernel.3.6.snapshot/workspace/org.eclipse.virgo.shell.command/target/test-classes
     [exec]   [s:javac] Compiling 34 source files to /jobs/genie.virgo/virgo.kernel.3.6.snapshot/workspace/org.eclipse.virgo.shell.command/target/test-classes
     [exec]      [copy] Copying 6 files to /jobs/genie.virgo/virgo.kernel.3.6.snapshot/workspace/org.eclipse.virgo.shell.command/target/test-classes
     [exec]     [junit] Testsuite: org.eclipse.virgo.shell.internal.AnnotationBasedCommandResolverTests
     [exec]     [junit] Tests run: 2, Failures: 0, Errors: 0, Time elapsed: 0.385 sec
     [exec]     [junit] 
     [exec]     [junit] ------------- Standard Output ---------------
     [exec]     [junit] 03:45:11.328 [main] DEBUG o.e.v.s.i.AnnotationBasedCommandResolver - > public java.util.List org.eclipse.virgo.shell.internal.AnnotationBasedCommandResolver.resolveCommands(org.osgi.framework.ServiceReference, java.lang.Object)
     [exec]     [junit] 03:45:11.337 [main] DEBUG o.e.v.s.i.AnnotationBasedCommandResolver - < public java.util.List org.eclipse.virgo.shell.internal.AnnotationBasedCommandResolver.resolveCommands(org.osgi.framework.ServiceReference, java.lang.Object)
     [exec]     [junit] 03:45:11.339 [main] DEBUG o.e.v.s.i.AnnotationBasedCommandResolver - > public java.util.List org.eclipse.virgo.shell.internal.AnnotationBasedCommandResolver.resolveCommands(org.osgi.framework.ServiceReference, java.lang.Object)
     [exec]     [junit] 03:45:11.340 [main] DEBUG o.e.v.s.i.AnnotationBasedCommandResolver - < public java.util.List org.eclipse.virgo.shell.internal.AnnotationBasedCommandResolver.resolveCommands(org.osgi.framework.ServiceReference, java.lang.Object)
     [exec]     [junit] ------------- ---------------- ---------------
     [exec]     [junit] ------------- Standard Error -----------------
     [exec]     [junit] SLF4J: Class path contains multiple SLF4J bindings.
     [exec]     [junit] SLF4J: Found binding in [jar:file:/opt/public/hipp/homes/genie.virgo/virgo-build-cache/ivy-cache/repository/org.eclipse.virgo.mirrored/ch.qos.logback.slf4j/1.0.7.v20121108-1250/ch.qos.logback.slf4j-1.0.7.v20121108-1250.jar!/org/slf4j/impl/StaticLoggerBinder.class]
     [exec]     [junit] SLF4J: Found binding in [jar:file:/opt/public/hipp/homes/genie.virgo/virgo-build-cache/ivy-cache/repository/org.eclipse.virgo.mirrored/org.slf4j.nop/1.7.2.v201212060727/org.slf4j.nop-1.7.2.v201212060727.jar!/org/slf4j/impl/StaticLoggerBinder.class]
     [exec]     [junit] SLF4J: See http://www.slf4j.org/codes.html#multiple_bindings for an explanation.
     [exec]     [junit] SLF4J: Actual binding is of type [ch.qos.logback.classic.util.ContextSelectorStaticBinder]
     [exec]     [junit] ------------- ---------------- ---------------
     [exec]     [junit] Testsuite: org.eclipse.virgo.shell.internal.StandardCommandProcessorTests
     [exec]     [junit] Tests run: 1, Failures: 0, Errors: 0, Time elapsed: 0.029 sec
     [exec]     [junit] 
     [exec]     [junit] ------------- Standard Output ---------------
     [exec]     [junit] 03:45:11.400 [main] DEBUG o.e.v.s.i.StandardCommandProcessor - > public org.eclipse.virgo.shell.internal.CommandSession org.eclipse.virgo.shell.internal.StandardCommandProcessor.createSession()
     [exec]     [junit] 03:45:11.401 [main] DEBUG o.e.v.s.i.StandardCommandProcessor - < public org.eclipse.virgo.shell.internal.CommandSession org.eclipse.virgo.shell.internal.StandardCommandProcessor.createSession()
     [exec]     [junit] ------------- ---------------- ---------------
     [exec]     [junit] Testsuite: org.eclipse.virgo.shell.internal.StandardCommandSessionTests
     [exec]     [junit] Tests run: 1, Failures: 0, Errors: 0, Time elapsed: 0.023 sec
     [exec]     [junit] 
     [exec]     [junit] ------------- Standard Output ---------------
     [exec]     [junit] 03:45:11.428 [main] DEBUG o.e.v.s.i.parsing.ParsingUtils - > public static org.eclipse.virgo.shell.internal.parsing.ParsedCommand org.eclipse.virgo.shell.internal.parsing.ParsingUtils.parseCommand(java.lang.CharSequence)
     [exec]     [junit] 03:45:11.430 [main] DEBUG o.e.v.s.i.parsing.ParsingUtils - < public static org.eclipse.virgo.shell.internal.parsing.ParsedCommand org.eclipse.virgo.shell.internal.parsing.ParsingUtils.parseCommand(java.lang.CharSequence)
     [exec]     [junit] 03:45:11.438 [main] DEBUG o.e.v.s.i.StandardCommandSession - > public java.util.List org.eclipse.virgo.shell.internal.StandardCommandSession.execute(java.lang.CharSequence)
     [exec]     [junit] 03:45:11.438 [main] DEBUG o.e.v.s.i.parsing.ParsingUtils - > public static org.eclipse.virgo.shell.internal.parsing.ParsedCommand org.eclipse.virgo.shell.internal.parsing.ParsingUtils.parseCommand(java.lang.CharSequence)
     [exec]     [junit] 03:45:11.438 [main] DEBUG o.e.v.s.i.parsing.ParsingUtils - < public static org.eclipse.virgo.shell.internal.parsing.ParsedCommand org.eclipse.virgo.shell.internal.parsing.ParsingUtils.parseCommand(java.lang.CharSequence)
     [exec]     [junit] 03:45:11.438 [main] DEBUG o.e.v.s.i.StandardCommandSession - < public java.util.List org.eclipse.virgo.shell.internal.StandardCommandSession.execute(java.lang.CharSequence)
     [exec]     [junit] ------------- ---------------- ---------------
     [exec]     [junit] Testsuite: org.eclipse.virgo.shell.internal.commands.AbztractCompositeInstallArtifactBasedCommandsTests
     [exec]     [junit] Tests run: 7, Failures: 0, Errors: 0, Time elapsed: 0.087 sec
     [exec]     [junit] 
     [exec]     [junit] ------------- Standard Output ---------------
     [exec]     [junit] 03:45:11.530 [main] DEBUG o.e.v.s.i.c.AbstractInstallArtifactBasedCommands - > public java.util.List org.eclipse.virgo.shell.internal.commands.AbstractInstallArtifactBasedCommands.start(java.lang.String, java.lang.String, java.lang.String)
     [exec]     [junit] 03:45:11.536 [main] DEBUG o.e.v.s.i.c.AbstractInstallArtifactBasedCommands - < public java.util.List org.eclipse.virgo.shell.internal.commands.AbstractInstallArtifactBasedCommands.start(java.lang.String, java.lang.String, java.lang.String)
     [exec]     [junit] 03:45:11.537 [main] DEBUG o.e.v.s.i.c.AbstractInstallArtifactBasedCommands - > public java.util.List org.eclipse.virgo.shell.internal.commands.AbstractInstallArtifactBasedCommands.stop(java.lang.String, java.lang.String, java.lang.String)
     [exec]     [junit] 03:45:11.538 [main] DEBUG o.e.v.s.i.c.AbstractInstallArtifactBasedCommands - < public java.util.List org.eclipse.virgo.shell.internal.commands.AbstractInstallArtifactBasedCommands.stop(java.lang.String, java.lang.String, java.lang.String)
     [exec]     [junit] 03:45:11.539 [main] DEBUG o.e.v.s.i.c.AbstractInstallArtifactBasedCommands - > public java.util.List org.eclipse.virgo.shell.internal.commands.AbstractInstallArtifactBasedCommands.list()
     [exec]     [junit] 03:45:11.540 [main] DEBUG o.e.v.s.i.c.AbstractInstallArtifactBasedCommands - < public java.util.List org.eclipse.virgo.shell.internal.commands.AbstractInstallArtifactBasedCommands.list()
     [exec]     [junit] 03:45:11.540 [main] DEBUG o.e.v.s.i.c.AbstractInstallArtifactBasedCommands - > public java.util.List org.eclipse.virgo.shell.internal.commands.AbstractInstallArtifactBasedCommands.examine(java.lang.String, java.lang.String, java.lang.String)
     [exec]     [junit] 03:45:11.541 [main] DEBUG o.e.v.s.i.c.AbstractInstallArtifactBasedCommands - < public java.util.List org.eclipse.virgo.shell.internal.commands.AbstractInstallArtifactBasedCommands.examine(java.lang.String, java.lang.String, java.lang.String)
     [exec]     [junit] 03:45:11.541 [main] DEBUG o.e.v.s.i.c.AbstractInstallArtifactBasedCommands - > public java.util.List org.eclipse.virgo.shell.internal.commands.AbstractInstallArtifactBasedCommands.refresh(java.lang.String, java.lang.String, java.lang.String)
     [exec]     [junit] 03:45:11.542 [main] DEBUG o.e.v.s.i.c.AbstractInstallArtifactBasedCommands - < public java.util.List org.eclipse.virgo.shell.internal.commands.AbstractInstallArtifactBasedCommands.refresh(java.lang.String, java.lang.String, java.lang.String)
     [exec]     [junit] 03:45:11.543 [main] DEBUG o.e.v.s.i.c.AbstractInstallArtifactBasedCommands - > public java.util.List org.eclipse.virgo.shell.internal.commands.AbstractInstallArtifactBasedCommands.refresh(java.lang.String, java.lang.String, java.lang.String)
     [exec]     [junit] 03:45:11.543 [main] DEBUG o.e.v.s.i.c.AbstractInstallArtifactBasedCommands - < public java.util.List org.eclipse.virgo.shell.internal.commands.AbstractInstallArtifactBasedCommands.refresh(java.lang.String, java.lang.String, java.lang.String)
     [exec]     [junit] 03:45:11.544 [main] DEBUG o.e.v.s.i.c.AbstractInstallArtifactBasedCommands - > public java.util.List org.eclipse.virgo.shell.internal.commands.AbstractInstallArtifactBasedCommands.uninstall(java.lang.String, java.lang.String, java.lang.String)
     [exec]     [junit] 03:45:11.545 [main] DEBUG o.e.v.s.i.c.AbstractInstallArtifactBasedCommands - < public java.util.List org.eclipse.virgo.shell.internal.commands.AbstractInstallArtifactBasedCommands.uninstall(java.lang.String, java.lang.String, java.lang.String)
     [exec]     [junit] ------------- ---------------- ---------------
     [exec]     [junit] Testsuite: org.eclipse.virgo.shell.internal.commands.ConfigCommandsTests
     [exec]     [junit] Tests run: 2, Failures: 0, Errors: 0, Time elapsed: 0.024 sec
     [exec]     [junit] 
     [exec]     [junit] ------------- Standard Output ---------------
     [exec]     [junit] 03:45:11.593 [main] DEBUG o.e.v.s.i.commands.ConfigCommands - > public java.util.List org.eclipse.virgo.shell.internal.commands.ConfigCommands.examine(java.lang.String, java.lang.String, java.lang.String)
     [exec]     [junit] 03:45:11.596 [main] DEBUG o.e.v.s.i.c.AbstractInstallArtifactBasedCommands - > public java.util.List org.eclipse.virgo.shell.internal.commands.AbstractInstallArtifactBasedCommands.examine(java.lang.String, java.lang.String, java.lang.String)
     [exec]     [junit] 03:45:11.597 [main] DEBUG o.e.v.s.i.f.ConfigInstallArtifactCommandFormatter - > public java.util.List org.eclipse.virgo.shell.internal.formatting.ConfigInstallArtifactCommandFormatter.formatExamine(org.eclipse.virgo.kernel.model.management.ManageableArtifact)
     [exec]     [junit] 03:45:11.598 [main] DEBUG o.e.v.s.i.f.ConfigInstallArtifactCommandFormatter - < public java.util.List org.eclipse.virgo.shell.internal.formatting.ConfigInstallArtifactCommandFormatter.formatExamine(org.eclipse.virgo.kernel.model.management.ManageableArtifact)
     [exec]     [junit] 03:45:11.598 [main] DEBUG o.e.v.s.i.c.AbstractInstallArtifactBasedCommands - < public java.util.List org.eclipse.virgo.shell.internal.commands.AbstractInstallArtifactBasedCommands.examine(java.lang.String, java.lang.String, java.lang.String)
     [exec]     [junit] 03:45:11.598 [main] DEBUG o.e.v.s.i.commands.ConfigCommands - < public java.util.List org.eclipse.virgo.shell.internal.commands.ConfigCommands.examine(java.lang.String, java.lang.String, java.lang.String)
     [exec]     [junit] 03:45:11.599 [main] DEBUG o.e.v.s.i.commands.ConfigCommands - > public java.util.List org.eclipse.virgo.shell.internal.commands.ConfigCommands.examine(java.lang.String, java.lang.String, java.lang.String)
     [exec]     [junit] 03:45:11.599 [main] DEBUG o.e.v.s.i.commands.ConfigCommands - < public java.util.List org.eclipse.virgo.shell.internal.commands.ConfigCommands.examine(java.lang.String, java.lang.String, java.lang.String)
     [exec]     [junit] ------------- ---------------- ---------------
     [exec]     [junit] Testsuite: org.eclipse.virgo.shell.internal.commands.InstallCommandTests
     [exec]     [junit] Tests run: 2, Failures: 0, Errors: 0, Time elapsed: 0.026 sec
     [exec]     [junit] 
     [exec]     [junit] ------------- Standard Output ---------------
     [exec]     [junit] 03:45:11.632 [main] DEBUG o.e.v.s.i.commands.InstallCommand - > public java.util.List org.eclipse.virgo.shell.internal.commands.InstallCommand.install(java.lang.String)
     [exec]     [junit] 03:45:11.638 [main] DEBUG o.e.v.s.i.commands.InstallCommand - < public java.util.List org.eclipse.virgo.shell.internal.commands.InstallCommand.install(java.lang.String)
     [exec]     [junit] 03:45:11.638 [main] DEBUG o.e.v.s.i.commands.InstallCommand - > public java.util.List org.eclipse.virgo.shell.internal.commands.InstallCommand.install(java.lang.String)
     [exec]     [junit] 03:45:11.639 [main] DEBUG o.e.v.s.i.commands.InstallCommand - < public java.util.List org.eclipse.virgo.shell.internal.commands.InstallCommand.install(java.lang.String)
     [exec]     [junit] ------------- ---------------- ---------------
     [exec]     [junit] Testsuite: org.eclipse.virgo.shell.internal.completers.AbztractInstallArtifactCompleterTests
     [exec]     [junit] Tests run: 5, Failures: 0, Errors: 0, Time elapsed: 0.015 sec
     [exec]     [junit] 
     [exec]     [junit] Testsuite: org.eclipse.virgo.shell.internal.completers.ConfigCompleterTests
     [exec]     [junit] Tests run: 2, Failures: 0, Errors: 0, Time elapsed: 0.018 sec
     [exec]     [junit] 
     [exec]     [junit] Testsuite: org.eclipse.virgo.shell.internal.completers.InstallCompleterTests
     [exec]     [junit] Tests run: 2, Failures: 0, Errors: 0, Time elapsed: 0.011 sec
     [exec]     [junit] 
     [exec]     [junit] Testsuite: org.eclipse.virgo.shell.internal.converters.LongConverterTests
     [exec]     [junit] Tests run: 5, Failures: 0, Errors: 0, Time elapsed: 0.013 sec
     [exec]     [junit] 
     [exec]     [junit] ------------- Standard Output ---------------
     [exec]     [junit] 03:45:11.737 [main] DEBUG o.e.v.s.i.converters.LongConverter - > public java.lang.Object org.eclipse.virgo.shell.internal.converters.LongConverter.convert(java.lang.Class, java.lang.Object)
     [exec]     [junit] 03:45:11.737 [main] DEBUG o.e.v.s.i.converters.LongConverter - < public java.lang.Object org.eclipse.virgo.shell.internal.converters.LongConverter.convert(java.lang.Class, java.lang.Object)
     [exec]     [junit] 03:45:11.737 [main] DEBUG o.e.v.s.i.converters.LongConverter - > public java.lang.Object org.eclipse.virgo.shell.internal.converters.LongConverter.convert(java.lang.Class, java.lang.Object)
     [exec]     [junit] 03:45:11.737 [main] DEBUG o.e.v.s.i.converters.LongConverter - < public java.lang.Object org.eclipse.virgo.shell.internal.converters.LongConverter.convert(java.lang.Class, java.lang.Object)
     [exec]     [junit] 03:45:11.737 [main] DEBUG o.e.v.s.i.converters.LongConverter - > public java.lang.Object org.eclipse.virgo.shell.internal.converters.LongConverter.convert(java.lang.Class, java.lang.Object)
     [exec]     [junit] 03:45:11.737 [main] DEBUG o.e.v.s.i.converters.LongConverter - < public java.lang.Object org.eclipse.virgo.shell.internal.converters.LongConverter.convert(java.lang.Class, java.lang.Object)
     [exec]     [junit] 03:45:11.737 [main] DEBUG o.e.v.s.i.converters.LongConverter - > public java.lang.Object org.eclipse.virgo.shell.internal.converters.LongConverter.convert(java.lang.Class, java.lang.Object)
     [exec]     [junit] 03:45:11.737 [main] DEBUG o.e.v.s.i.converters.LongConverter - < public java.lang.Object org.eclipse.virgo.shell.internal.converters.LongConverter.convert(java.lang.Class, java.lang.Object)
     [exec]     [junit] 03:45:11.738 [main] DEBUG o.e.v.s.i.converters.LongConverter - > public java.lang.CharSequence org.eclipse.virgo.shell.internal.converters.LongConverter.format(java.lang.Object, int, org.eclipse.virgo.shell.Converter)
     [exec]     [junit] 03:45:11.738 [main] DEBUG o.e.v.s.i.converters.LongConverter - < public java.lang.CharSequence org.eclipse.virgo.shell.internal.converters.LongConverter.format(java.lang.Object, int, org.eclipse.virgo.shell.Converter)
     [exec]     [junit] 03:45:11.738 [main] DEBUG o.e.v.s.i.converters.LongConverter - > public java.lang.CharSequence org.eclipse.virgo.shell.internal.converters.LongConverter.format(java.lang.Object, int, org.eclipse.virgo.shell.Converter)
     [exec]     [junit] 03:45:11.738 [main] DEBUG o.e.v.s.i.converters.LongConverter - < public java.lang.CharSequence org.eclipse.virgo.shell.internal.converters.LongConverter.format(java.lang.Object, int, org.eclipse.virgo.shell.Converter)
     [exec]     [junit] 03:45:11.738 [main] DEBUG o.e.v.s.i.converters.LongConverter - > public java.lang.CharSequence org.eclipse.virgo.shell.internal.converters.LongConverter.format(java.lang.Object, int, org.eclipse.virgo.shell.Converter)
     [exec]     [junit] 03:45:11.738 [main] DEBUG o.e.v.s.i.converters.LongConverter - < public java.lang.CharSequence org.eclipse.virgo.shell.internal.converters.LongConverter.format(java.lang.Object, int, org.eclipse.virgo.shell.Converter)
     [exec]     [junit] ------------- ---------------- ---------------
     [exec]     [junit] Testsuite: org.eclipse.virgo.shell.internal.converters.StringConverterTests
     [exec]     [junit] Tests run: 5, Failures: 0, Errors: 0, Time elapsed: 0.013 sec
     [exec]     [junit] 
     [exec]     [junit] ------------- Standard Output ---------------
     [exec]     [junit] 03:45:11.761 [main] DEBUG o.e.v.s.i.converters.StringConverter - > public java.lang.Object org.eclipse.virgo.shell.internal.converters.StringConverter.convert(java.lang.Class, java.lang.Object)
     [exec]     [junit] 03:45:11.761 [main] DEBUG o.e.v.s.i.converters.StringConverter - < public java.lang.Object org.eclipse.virgo.shell.internal.converters.StringConverter.convert(java.lang.Class, java.lang.Object)
     [exec]     [junit] 03:45:11.761 [main] DEBUG o.e.v.s.i.converters.StringConverter - > public java.lang.CharSequence org.eclipse.virgo.shell.internal.converters.StringConverter.format(java.lang.Object, int, org.eclipse.virgo.shell.Converter)
     [exec]     [junit] 03:45:11.761 [main] DEBUG o.e.v.s.i.converters.StringConverter - < public java.lang.CharSequence org.eclipse.virgo.shell.internal.converters.StringConverter.format(java.lang.Object, int, org.eclipse.virgo.shell.Converter)
     [exec]     [junit] 03:45:11.762 [main] DEBUG o.e.v.s.i.converters.StringConverter - > public java.lang.Object org.eclipse.virgo.shell.internal.converters.StringConverter.convert(java.lang.Class, java.lang.Object)
     [exec]     [junit] 03:45:11.762 [main] DEBUG o.e.v.s.i.converters.StringConverter - < public java.lang.Object org.eclipse.virgo.shell.internal.converters.StringConverter.convert(java.lang.Class, java.lang.Object)
     [exec]     [junit] 03:45:11.762 [main] DEBUG o.e.v.s.i.converters.StringConverter - > public java.lang.CharSequence org.eclipse.virgo.shell.internal.converters.StringConverter.format(java.lang.Object, int, org.eclipse.virgo.shell.Converter)
     [exec]     [junit] 03:45:11.762 [main] DEBUG o.e.v.s.i.converters.StringConverter - < public java.lang.CharSequence org.eclipse.virgo.shell.internal.converters.StringConverter.format(java.lang.Object, int, org.eclipse.virgo.shell.Converter)
     [exec]     [junit] ------------- ---------------- ---------------
     [exec]     [junit] Testsuite: org.eclipse.virgo.shell.internal.formatting.AbztractInstallArtifactCommandFormatterTests
     [exec]     [junit] Tests run: 1, Failures: 0, Errors: 0, Time elapsed: 0.008 sec
     [exec]     [junit] 
     [exec]     [junit] ------------- Standard Output ---------------
     [exec]     [junit] 03:45:11.778 [main] DEBUG o.e.v.s.i.f.AbstractInstallArtifactCommandFormatter - > public java.util.List org.eclipse.virgo.shell.internal.formatting.AbstractInstallArtifactCommandFormatter.formatList(java.util.List)
     [exec]     [junit] 03:45:11.779 [main] DEBUG o.e.v.s.i.f.AbstractInstallArtifactCommandFormatter - < public java.util.List org.eclipse.virgo.shell.internal.formatting.AbstractInstallArtifactCommandFormatter.formatList(java.util.List)
     [exec]     [junit] ------------- ---------------- ---------------
     [exec]     [junit] Testsuite: org.eclipse.virgo.shell.internal.formatting.CompositeInstallArtifactCommandFormatterTests
     [exec]     [junit] Tests run: 1, Failures: 0, Errors: 0, Time elapsed: 0.004 sec
     [exec]     [junit] 
     [exec]     [junit] ------------- Standard Output ---------------
     [exec]     [junit] 03:45:11.795 [main] DEBUG o.e.v.s.i.f.CompositeInstallArtifactCommandFormatter - > public java.util.List org.eclipse.virgo.shell.internal.formatting.CompositeInstallArtifactCommandFormatter.formatExamine(org.eclipse.virgo.kernel.model.management.ManageableCompositeArtifact)
     [exec]     [junit] 03:45:11.795 [main] DEBUG o.e.v.s.i.f.CompositeInstallArtifactCommandFormatter - < public java.util.List org.eclipse.virgo.shell.internal.formatting.CompositeInstallArtifactCommandFormatter.formatExamine(org.eclipse.virgo.kernel.model.management.ManageableCompositeArtifact)
     [exec]     [junit] ------------- ---------------- ---------------
     [exec]     [junit] Testsuite: org.eclipse.virgo.shell.internal.formatting.ConfigInstallArtifactCommandFormatterTests
     [exec]     [junit] Tests run: 1, Failures: 0, Errors: 0, Time elapsed: 0.006 sec
     [exec]     [junit] 
     [exec]     [junit] ------------- Standard Output ---------------
     [exec]     [junit] 03:45:11.809 [main] DEBUG o.e.v.s.i.f.ConfigInstallArtifactCommandFormatter - > public java.util.List org.eclipse.virgo.shell.internal.formatting.ConfigInstallArtifactCommandFormatter.formatExamine(org.eclipse.virgo.kernel.model.management.ManageableArtifact)
     [exec]     [junit] 03:45:11.810 [main] DEBUG o.e.v.s.i.f.PropertyFormatter - > public static java.util.List org.eclipse.virgo.shell.internal.formatting.PropertyFormatter.formatPropertyValue(java.lang.Object, int)
     [exec]     [junit] 03:45:11.811 [main] DEBUG o.e.v.s.i.f.PropertyFormatter - < public static java.util.List org.eclipse.virgo.shell.internal.formatting.PropertyFormatter.formatPropertyValue(java.lang.Object, int)
     [exec]     [junit] 03:45:11.811 [main] DEBUG o.e.v.s.i.f.PropertyFormatter - > public static java.util.List org.eclipse.virgo.shell.internal.formatting.PropertyFormatter.formatPropertyValue(java.lang.Object, int)
     [exec]     [junit] 03:45:11.811 [main] DEBUG o.e.v.s.i.f.PropertyFormatter - < public static java.util.List org.eclipse.virgo.shell.internal.formatting.PropertyFormatter.formatPropertyValue(java.lang.Object, int)
     [exec]     [junit] 03:45:11.811 [main] DEBUG o.e.v.s.i.f.PropertyFormatter - > public static java.util.List org.eclipse.virgo.shell.internal.formatting.PropertyFormatter.formatPropertyValue(java.lang.Object, int)
     [exec]     [junit] 03:45:11.811 [main] DEBUG o.e.v.s.i.f.PropertyFormatter - < public static java.util.List org.eclipse.virgo.shell.internal.formatting.PropertyFormatter.formatPropertyValue(java.lang.Object, int)
     [exec]     [junit] 03:45:11.811 [main] DEBUG o.e.v.s.i.f.PropertyFormatter - > public static java.util.List org.eclipse.virgo.shell.internal.formatting.PropertyFormatter.formatPropertyValue(java.lang.Object, int)
     [exec]     [junit] 03:45:11.811 [main] DEBUG o.e.v.s.i.f.PropertyFormatter - < public static java.util.List org.eclipse.virgo.shell.internal.formatting.PropertyFormatter.formatPropertyValue(java.lang.Object, int)
     [exec]     [junit] 03:45:11.811 [main] DEBUG o.e.v.s.i.f.ConfigInstallArtifactCommandFormatter - < public java.util.List org.eclipse.virgo.shell.internal.formatting.ConfigInstallArtifactCommandFormatter.formatExamine(org.eclipse.virgo.kernel.model.management.ManageableArtifact)
     [exec]     [junit] ------------- ---------------- ---------------
     [exec]     [junit] Testsuite: org.eclipse.virgo.shell.internal.formatting.PropertyFormatterTests
     [exec]     [junit] Tests run: 2, Failures: 0, Errors: 0, Time elapsed: 0.003 sec
     [exec]     [junit] 
     [exec]     [junit] ------------- Standard Output ---------------
     [exec]     [junit] 03:45:11.823 [main] DEBUG o.e.v.s.i.f.PropertyFormatter - > public static java.util.List org.eclipse.virgo.shell.internal.formatting.PropertyFormatter.formatPropertyValue(java.lang.Object, int)
     [exec]     [junit] 03:45:11.823 [main] DEBUG o.e.v.s.i.f.PropertyFormatter - < public static java.util.List org.eclipse.virgo.shell.internal.formatting.PropertyFormatter.formatPropertyValue(java.lang.Object, int)
     [exec]     [junit] 03:45:11.823 [main] DEBUG o.e.v.s.i.f.PropertyFormatter - > public static java.util.List org.eclipse.virgo.shell.internal.formatting.PropertyFormatter.formatPropertyValue(java.lang.Object, int)
     [exec]     [junit] 03:45:11.823 [main] DEBUG o.e.v.s.i.f.PropertyFormatter - < public static java.util.List org.eclipse.virgo.shell.internal.formatting.PropertyFormatter.formatPropertyValue(java.lang.Object, int)
     [exec]     [junit] 03:45:11.824 [main] DEBUG o.e.v.s.i.f.PropertyFormatter - > public static java.util.List org.eclipse.virgo.shell.internal.formatting.PropertyFormatter.formatPropertyValue(java.lang.Object, int)
     [exec]     [junit] 03:45:11.824 [main] DEBUG o.e.v.s.i.f.PropertyFormatter - < public static java.util.List org.eclipse.virgo.shell.internal.formatting.PropertyFormatter.formatPropertyValue(java.lang.Object, int)
     [exec]     [junit] 03:45:11.824 [main] DEBUG o.e.v.s.i.f.PropertyFormatter - > public static java.util.List org.eclipse.virgo.shell.internal.formatting.PropertyFormatter.formatPropertyValue(java.lang.Object, int)
     [exec]     [junit] 03:45:11.824 [main] DEBUG o.e.v.s.i.f.PropertyFormatter - < public static java.util.List org.eclipse.virgo.shell.internal.formatting.PropertyFormatter.formatPropertyValue(java.lang.Object, int)
     [exec]     [junit] ------------- ---------------- ---------------
     [exec]     [junit] Testsuite: org.eclipse.virgo.shell.internal.formatting.ServiceCommandFormatterTests
     [exec]     [junit] Tests run: 2, Failures: 0, Errors: 0, Time elapsed: 0.02 sec
     [exec]     [junit] 
     [exec]     [junit] ------------- Standard Output ---------------
     [exec]     [junit] 03:45:11.850 [main] DEBUG o.e.v.s.i.f.ServiceCommandFormatter - > public java.util.List org.eclipse.virgo.shell.internal.formatting.ServiceCommandFormatter.formatExamine(org.eclipse.virgo.shell.internal.util.ServiceHolder)
     [exec]     [junit] 03:45:11.851 [main] DEBUG o.e.v.s.i.f.PropertyFormatter - > public static java.util.List org.eclipse.virgo.shell.internal.formatting.PropertyFormatter.formatPropertyValue(java.lang.Object, int)
     [exec]     [junit] 03:45:11.851 [main] DEBUG o.e.v.s.i.f.PropertyFormatter - < public static java.util.List org.eclipse.virgo.shell.internal.formatting.PropertyFormatter.formatPropertyValue(java.lang.Object, int)
     [exec]     [junit] 03:45:11.851 [main] DEBUG o.e.v.s.i.f.PropertyFormatter - > public static java.util.List org.eclipse.virgo.shell.internal.formatting.PropertyFormatter.formatPropertyValue(java.lang.Object, int)
     [exec]     [junit] 03:45:11.851 [main] DEBUG o.e.v.s.i.f.PropertyFormatter - < public static java.util.List org.eclipse.virgo.shell.internal.formatting.PropertyFormatter.formatPropertyValue(java.lang.Object, int)
     [exec]     [junit] 03:45:11.853 [main] DEBUG o.e.v.s.i.f.ServiceCommandFormatter - < public java.util.List org.eclipse.virgo.shell.internal.formatting.ServiceCommandFormatter.formatExamine(org.eclipse.virgo.shell.internal.util.ServiceHolder)
     [exec]     [junit] 03:45:11.853 [main] DEBUG o.e.v.s.i.f.ServiceCommandFormatter - > public java.util.List org.eclipse.virgo.shell.internal.formatting.ServiceCommandFormatter.formatList(java.util.List)
     [exec]     [junit] 03:45:11.854 [main] DEBUG o.e.v.s.i.f.ServiceCommandFormatter$QuasiLiveServiceComparator - > public int org.eclipse.virgo.shell.internal.formatting.ServiceCommandFormatter.QuasiLiveServiceComparator.compare(org.eclipse.virgo.shell.internal.util.ServiceHolder, org.eclipse.virgo.shell.internal.util.ServiceHolder)
     [exec]     [junit] 03:45:11.854 [main] DEBUG o.e.v.s.i.f.ServiceCommandFormatter$QuasiLiveServiceComparator - < public int org.eclipse.virgo.shell.internal.formatting.ServiceCommandFormatter.QuasiLiveServiceComparator.compare(org.eclipse.virgo.shell.internal.util.ServiceHolder, org.eclipse.virgo.shell.internal.util.ServiceHolder)
     [exec]     [junit] 03:45:11.855 [main] DEBUG o.e.v.s.i.f.ServiceCommandFormatter - < public java.util.List org.eclipse.virgo.shell.internal.formatting.ServiceCommandFormatter.formatList(java.util.List)
     [exec]     [junit] ------------- ---------------- ---------------
     [exec]     [junit] Testsuite: org.eclipse.virgo.shell.internal.help.SimpleFileHelpAccessorTests
     [exec]     [junit] Tests run: 4, Failures: 0, Errors: 0, Time elapsed: 0.007 sec
     [exec]     [junit] 
     [exec]     [junit] Testsuite: org.eclipse.virgo.shell.internal.util.PackageHolderTests
     [exec]     [junit] Tests run: 6, Failures: 0, Errors: 0, Time elapsed: 0.007 sec
     [exec]     [junit] 
     [exec]     [junit] Testsuite: org.eclipse.virgo.shell.internal.util.QuasiBundleUtilTests
     [exec]     [junit] Tests run: 3, Failures: 0, Errors: 0, Time elapsed: 0.004 sec
     [exec]     [junit] 
     [exec]     [junit] Testsuite: org.eclipse.virgo.shell.internal.util.QuasiServiceUtilTests
     [exec]     [junit] Tests run: 1, Failures: 0, Errors: 0, Time elapsed: 0.003 sec
     [exec]     [junit] 
     [exec]     [junit] Testsuite: org.eclipse.virgo.shell.internal.util.ServiceHolderTests
     [exec]     [junit] Tests run: 5, Failures: 0, Errors: 0, Time elapsed: 0.005 sec
     [exec]     [junit] 
     [exec]     [junit] ------------- Standard Output ---------------
     [exec]     [junit] 03:45:11.922 [main] DEBUG o.e.v.s.internal.util.ServiceHolder - > public int org.eclipse.virgo.shell.internal.util.ServiceHolder.compareTo(org.eclipse.virgo.shell.internal.util.ServiceHolder)
     [exec]     [junit] 03:45:11.922 [main] DEBUG o.e.v.s.internal.util.ServiceHolder - < public int org.eclipse.virgo.shell.internal.util.ServiceHolder.compareTo(org.eclipse.virgo.shell.internal.util.ServiceHolder)
     [exec]     [junit] ------------- ---------------- ---------------
     [exec]     [junit] Testsuite: org.eclipse.virgo.shell.osgicommand.helper.ClassLoadingHelperTests
     [exec]     [junit] Tests run: 13, Failures: 0, Errors: 0, Time elapsed: 0.071 sec
     [exec]     [junit] 
     [exec]     [junit] ------------- Standard Output ---------------
     [exec]     [junit] 03:45:11.985 [main] DEBUG o.e.v.s.o.helper.ClassLoadingHelper - > public static boolean org.eclipse.virgo.shell.osgicommand.helper.ClassLoadingHelper.isPackageExported(org.osgi.framework.BundleContext, java.lang.String, org.osgi.framework.Bundle)
     [exec]     [junit] 03:45:11.985 [main] DEBUG o.e.v.s.o.helper.ClassLoadingHelper - < public static boolean org.eclipse.virgo.shell.osgicommand.helper.ClassLoadingHelper.isPackageExported(org.osgi.framework.BundleContext, java.lang.String, org.osgi.framework.Bundle)
     [exec]     [junit] 03:45:11.988 [main] DEBUG o.e.v.s.o.helper.ClassLoadingHelper - > public static boolean org.eclipse.virgo.shell.osgicommand.helper.ClassLoadingHelper.isPackageExported(org.osgi.framework.BundleContext, java.lang.String, org.osgi.framework.Bundle)
     [exec]     [junit] 03:45:11.989 [main] DEBUG o.e.v.s.o.helper.ClassLoadingHelper - > public static java.lang.String org.eclipse.virgo.shell.osgicommand.helper.ClassLoadingHelper.convertToClassName(java.lang.String)
     [exec]     [junit] 03:45:11.989 [main] DEBUG o.e.v.s.o.helper.ClassLoadingHelper - < public static java.lang.String org.eclipse.virgo.shell.osgicommand.helper.ClassLoadingHelper.convertToClassName(java.lang.String)
     [exec]     [junit] 03:45:11.989 [main] DEBUG o.e.v.s.o.helper.ClassLoadingHelper - < public static boolean org.eclipse.virgo.shell.osgicommand.helper.ClassLoadingHelper.isPackageExported(org.osgi.framework.BundleContext, java.lang.String, org.osgi.framework.Bundle)
     [exec]     [junit] 03:45:11.989 [main] DEBUG o.e.v.s.o.helper.ClassLoadingHelper - > public static java.lang.Class org.eclipse.virgo.shell.osgicommand.helper.ClassLoadingHelper.tryToLoadClass(java.lang.String, org.osgi.framework.Bundle)
     [exec]     [junit] 03:45:11.989 [main] DEBUG o.e.v.s.o.helper.ClassLoadingHelper - > public static java.lang.String org.eclipse.virgo.shell.osgicommand.helper.ClassLoadingHelper.convertToClassName(java.lang.String)
     [exec]     [junit] 03:45:11.989 [main] DEBUG o.e.v.s.o.helper.ClassLoadingHelper - < public static java.lang.String org.eclipse.virgo.shell.osgicommand.helper.ClassLoadingHelper.convertToClassName(java.lang.String)
     [exec]     [junit] 03:45:11.989 [main] DEBUG o.e.v.s.o.helper.ClassLoadingHelper - < public static java.lang.Class org.eclipse.virgo.shell.osgicommand.helper.ClassLoadingHelper.tryToLoadClass(java.lang.String, org.osgi.framework.Bundle)
     [exec]     [junit] 03:45:11.990 [main] DEBUG o.e.v.s.o.helper.ClassLoadingHelper - > public static java.lang.Class org.eclipse.virgo.shell.osgicommand.helper.ClassLoadingHelper.tryToLoadClass(java.lang.String, org.osgi.framework.Bundle)
     [exec]     [junit] 03:45:11.990 [main] DEBUG o.e.v.s.o.helper.ClassLoadingHelper - < public static java.lang.Class org.eclipse.virgo.shell.osgicommand.helper.ClassLoadingHelper.tryToLoadClass(java.lang.String, org.osgi.framework.Bundle)
     [exec]     [junit] 03:45:11.991 [main] DEBUG o.e.v.s.o.helper.ClassLoadingHelper - > public static java.lang.Class org.eclipse.virgo.shell.osgicommand.helper.ClassLoadingHelper.tryToLoadClass(java.lang.String, org.osgi.framework.Bundle)
     [exec]     [junit] 03:45:11.991 [main] DEBUG o.e.v.s.o.helper.ClassLoadingHelper - > public static java.lang.String org.eclipse.virgo.shell.osgicommand.helper.ClassLoadingHelper.convertToClassName(java.lang.String)
     [exec]     [junit] 03:45:11.991 [main] DEBUG o.e.v.s.o.helper.ClassLoadingHelper - < public static java.lang.String org.eclipse.virgo.shell.osgicommand.helper.ClassLoadingHelper.convertToClassName(java.lang.String)
     [exec]     [junit] 03:45:11.991 [main] DEBUG o.e.v.s.o.helper.ClassLoadingHelper - < public static java.lang.Class org.eclipse.virgo.shell.osgicommand.helper.ClassLoadingHelper.tryToLoadClass(java.lang.String, org.osgi.framework.Bundle)
     [exec]     [junit] 03:45:11.991 [main] DEBUG o.e.v.s.o.helper.ClassLoadingHelper - > public static java.lang.Class org.eclipse.virgo.shell.osgicommand.helper.ClassLoadingHelper.tryToLoadClass(java.lang.String, org.osgi.framework.Bundle)
     [exec]     [junit] 03:45:11.991 [main] DEBUG o.e.v.s.o.helper.ClassLoadingHelper - > public static java.lang.String org.eclipse.virgo.shell.osgicommand.helper.ClassLoadingHelper.convertToClassName(java.lang.String)
     [exec]     [junit] 03:45:11.991 [main] DEBUG o.e.v.s.o.helper.ClassLoadingHelper - < public static java.lang.String org.eclipse.virgo.shell.osgicommand.helper.ClassLoadingHelper.convertToClassName(java.lang.String)
     [exec]     [junit] 03:45:11.992 [main] DEBUG o.e.v.s.o.helper.ClassLoadingHelper - < public static java.lang.Class org.eclipse.virgo.shell.osgicommand.helper.ClassLoadingHelper.tryToLoadClass(java.lang.String, org.osgi.framework.Bundle)
     [exec]     [junit] 03:45:11.992 [main] DEBUG o.e.v.s.o.helper.ClassLoadingHelper - > public static java.lang.Class org.eclipse.virgo.shell.osgicommand.helper.ClassLoadingHelper.tryToLoadClass(java.lang.String, org.osgi.framework.Bundle)
     [exec]     [junit] 03:45:11.992 [main] DEBUG o.e.v.s.o.helper.ClassLoadingHelper - > public static java.lang.String org.eclipse.virgo.shell.osgicommand.helper.ClassLoadingHelper.convertToClassName(java.lang.String)
     [exec]     [junit] 03:45:11.992 [main] DEBUG o.e.v.s.o.helper.ClassLoadingHelper - < public static java.lang.String org.eclipse.virgo.shell.osgicommand.helper.ClassLoadingHelper.convertToClassName(java.lang.String)
     [exec]     [junit] 03:45:11.992 [main] DEBUG o.e.v.s.o.helper.ClassLoadingHelper - < public static java.lang.Class org.eclipse.virgo.shell.osgicommand.helper.ClassLoadingHelper.tryToLoadClass(java.lang.String, org.osgi.framework.Bundle)
     [exec]     [junit] 03:45:11.993 [main] DEBUG o.e.v.s.o.helper.ClassLoadingHelper - > public static java.lang.Class org.eclipse.virgo.shell.osgicommand.helper.ClassLoadingHelper.tryToLoadClass(java.lang.String, org.osgi.framework.Bundle)
     [exec]     [junit] 03:45:11.993 [main] DEBUG o.e.v.s.o.helper.ClassLoadingHelper - > public static java.lang.String org.eclipse.virgo.shell.osgicommand.helper.ClassLoadingHelper.convertToClassName(java.lang.String)
     [exec]     [junit] 03:45:11.993 [main] DEBUG o.e.v.s.o.helper.ClassLoadingHelper - < public static java.lang.String org.eclipse.virgo.shell.osgicommand.helper.ClassLoadingHelper.convertToClassName(java.lang.String)
     [exec]     [junit] 03:45:11.993 [main] DEBUG o.e.v.s.o.helper.ClassLoadingHelper - < public static java.lang.Class org.eclipse.virgo.shell.osgicommand.helper.ClassLoadingHelper.tryToLoadClass(java.lang.String, org.osgi.framework.Bundle)
     [exec]     [junit] 03:45:11.998 [main] DEBUG o.e.v.s.o.helper.ClassLoadingHelper - > public static java.lang.Class org.eclipse.virgo.shell.osgicommand.helper.ClassLoadingHelper.tryToLoadClass(java.lang.String, org.osgi.framework.Bundle)
     [exec]     [junit] 03:45:11.998 [main] DEBUG o.e.v.s.o.helper.ClassLoadingHelper - > public static java.lang.String org.eclipse.virgo.shell.osgicommand.helper.ClassLoadingHelper.convertToClassName(java.lang.String)
     [exec]     [junit] 03:45:11.998 [main] DEBUG o.e.v.s.o.helper.ClassLoadingHelper - < public static java.lang.String org.eclipse.virgo.shell.osgicommand.helper.ClassLoadingHelper.convertToClassName(java.lang.String)
     [exec]     [junit] 03:45:11.998 [main] DEBUG o.e.v.s.o.helper.ClassLoadingHelper - < public static java.lang.Class org.eclipse.virgo.shell.osgicommand.helper.ClassLoadingHelper.tryToLoadClass(java.lang.String, org.osgi.framework.Bundle)
     [exec]     [junit] 03:45:11.999 [main] DEBUG o.e.v.s.o.helper.ClassLoadingHelper - > public static java.lang.Class org.eclipse.virgo.shell.osgicommand.helper.ClassLoadingHelper.tryToLoadClass(java.lang.String, org.osgi.framework.Bundle)
     [exec]     [junit] 03:45:11.999 [main] DEBUG o.e.v.s.o.helper.ClassLoadingHelper - > public static java.lang.String org.eclipse.virgo.shell.osgicommand.helper.ClassLoadingHelper.convertToClassName(java.lang.String)
     [exec]     [junit] 03:45:11.999 [main] DEBUG o.e.v.s.o.helper.ClassLoadingHelper - < public static java.lang.String org.eclipse.virgo.shell.osgicommand.helper.ClassLoadingHelper.convertToClassName(java.lang.String)
     [exec]     [junit] 03:45:11.999 [main] DEBUG o.e.v.s.o.helper.ClassLoadingHelper - < public static java.lang.Class org.eclipse.virgo.shell.osgicommand.helper.ClassLoadingHelper.tryToLoadClass(java.lang.String, org.osgi.framework.Bundle)
     [exec]     [junit] 03:45:12.000 [main] DEBUG o.e.v.s.o.helper.ClassLoadingHelper - > public static java.lang.Class org.eclipse.virgo.shell.osgicommand.helper.ClassLoadingHelper.tryToLoadClass(java.lang.String, org.osgi.framework.Bundle)
     [exec]     [junit] 03:45:12.000 [main] DEBUG o.e.v.s.o.helper.ClassLoadingHelper - > public static java.lang.String org.eclipse.virgo.shell.osgicommand.helper.ClassLoadingHelper.convertToClassName(java.lang.String)
     [exec]     [junit] 03:45:12.000 [main] DEBUG o.e.v.s.o.helper.ClassLoadingHelper - < public static java.lang.String org.eclipse.virgo.shell.osgicommand.helper.ClassLoadingHelper.convertToClassName(java.lang.String)
     [exec]     [junit] 03:45:12.000 [main] DEBUG o.e.v.s.o.helper.ClassLoadingHelper - < public static java.lang.Class org.eclipse.virgo.shell.osgicommand.helper.ClassLoadingHelper.tryToLoadClass(java.lang.String, org.osgi.framework.Bundle)
     [exec]     [junit] 03:45:12.001 [main] DEBUG o.e.v.s.o.helper.ClassLoadingHelper - > public static java.lang.String org.eclipse.virgo.shell.osgicommand.helper.ClassLoadingHelper.convertToClassName(java.lang.String)
     [exec]     [junit] 03:45:12.001 [main] DEBUG o.e.v.s.o.helper.ClassLoadingHelper - < public static java.lang.String org.eclipse.virgo.shell.osgicommand.helper.ClassLoadingHelper.convertToClassName(java.lang.String)
     [exec]     [junit] 03:45:12.001 [main] DEBUG o.e.v.s.o.helper.ClassLoadingHelper - > public static java.lang.String org.eclipse.virgo.shell.osgicommand.helper.ClassLoadingHelper.convertToClassName(java.lang.String)
     [exec]     [junit] 03:45:12.001 [main] DEBUG o.e.v.s.o.helper.ClassLoadingHelper - < public static java.lang.String org.eclipse.virgo.shell.osgicommand.helper.ClassLoadingHelper.convertToClassName(java.lang.String)
     [exec]     [junit] 03:45:12.001 [main] DEBUG o.e.v.s.o.helper.ClassLoadingHelper - > public static java.lang.String org.eclipse.virgo.shell.osgicommand.helper.ClassLoadingHelper.convertToResourcePath(java.lang.String)
     [exec]     [junit] 03:45:12.001 [main] DEBUG o.e.v.s.o.helper.ClassLoadingHelper - < public static java.lang.String org.eclipse.virgo.shell.osgicommand.helper.ClassLoadingHelper.convertToResourcePath(java.lang.String)
     [exec]     [junit] 03:45:12.001 [main] DEBUG o.e.v.s.o.helper.ClassLoadingHelper - > public static java.lang.String org.eclipse.virgo.shell.osgicommand.helper.ClassLoadingHelper.convertToResourcePath(java.lang.String)
     [exec]     [junit] 03:45:12.001 [main] DEBUG o.e.v.s.o.helper.ClassLoadingHelper - < public static java.lang.String org.eclipse.virgo.shell.osgicommand.helper.ClassLoadingHelper.convertToResourcePath(java.lang.String)
     [exec]     [junit] ------------- ---------------- ---------------
     [exec]     [junit] Testsuite: org.eclipse.virgo.shell.osgicommand.internal.GogoClassLoadingCommandTests
     [exec]     [junit] Tests run: 10, Failures: 0, Errors: 0, Time elapsed: 0.021 sec
     [exec]     [junit] 
     [exec]     [junit] Testsuite: org.eclipse.virgo.shell.osgicommand.management.ClassLoadingSupportTests
     [exec]     [junit] Tests run: 4, Failures: 0, Errors: 0, Time elapsed: 0.008 sec
     [exec]     [junit] 
     [exec]     [junit] ------------- Standard Output ---------------
     [exec]     [junit] 03:45:12.043 [main] DEBUG o.e.v.s.o.helper.ClassLoadingHelper - > public static java.lang.Class org.eclipse.virgo.shell.osgicommand.helper.ClassLoadingHelper.tryToLoadClass(java.lang.String, org.osgi.framework.Bundle)
     [exec]     [junit] 03:45:12.043 [main] DEBUG o.e.v.s.o.helper.ClassLoadingHelper - > public static java.lang.String org.eclipse.virgo.shell.osgicommand.helper.ClassLoadingHelper.convertToClassName(java.lang.String)
     [exec]     [junit] 03:45:12.043 [main] DEBUG o.e.v.s.o.helper.ClassLoadingHelper - < public static java.lang.String org.eclipse.virgo.shell.osgicommand.helper.ClassLoadingHelper.convertToClassName(java.lang.String)
     [exec]     [junit] 03:45:12.043 [main] DEBUG o.e.v.s.o.helper.ClassLoadingHelper - < public static java.lang.Class org.eclipse.virgo.shell.osgicommand.helper.ClassLoadingHelper.tryToLoadClass(java.lang.String, org.osgi.framework.Bundle)
     [exec]     [junit] 03:45:12.044 [main] DEBUG o.e.v.s.o.helper.ClassLoadingHelper - > public static boolean org.eclipse.virgo.shell.osgicommand.helper.ClassLoadingHelper.isPackageExported(org.osgi.framework.BundleContext, java.lang.String, org.osgi.framework.Bundle)
     [exec]     [junit] 03:45:12.044 [main] DEBUG o.e.v.s.o.helper.ClassLoadingHelper - > public static java.lang.String org.eclipse.virgo.shell.osgicommand.helper.ClassLoadingHelper.convertToClassName(java.lang.String)
     [exec]     [junit] 03:45:12.044 [main] DEBUG o.e.v.s.o.helper.ClassLoadingHelper - < public static java.lang.String org.eclipse.virgo.shell.osgicommand.helper.ClassLoadingHelper.convertToClassName(java.lang.String)
     [exec]     [junit] 03:45:12.044 [main] DEBUG o.e.v.s.o.helper.ClassLoadingHelper - < public static boolean org.eclipse.virgo.shell.osgicommand.helper.ClassLoadingHelper.isPackageExported(org.osgi.framework.BundleContext, java.lang.String, org.osgi.framework.Bundle)
     [exec]     [junit] 03:45:12.045 [main] DEBUG o.e.v.s.o.m.ClassLoadingSupport - > public boolean org.eclipse.virgo.shell.osgicommand.management.ClassLoadingSupport.tryToLoadClassFromBundle(java.lang.String, long)
     [exec]     [junit] 03:45:12.045 [main] DEBUG o.e.v.s.o.helper.ClassLoadingHelper - > public static java.lang.Class org.eclipse.virgo.shell.osgicommand.helper.ClassLoadingHelper.tryToLoadClass(java.lang.String, org.osgi.framework.Bundle)
     [exec]     [junit] 03:45:12.045 [main] DEBUG o.e.v.s.o.helper.ClassLoadingHelper - > public static java.lang.String org.eclipse.virgo.shell.osgicommand.helper.ClassLoadingHelper.convertToClassName(java.lang.String)
     [exec]     [junit] 03:45:12.045 [main] DEBUG o.e.v.s.o.helper.ClassLoadingHelper - < public static java.lang.String org.eclipse.virgo.shell.osgicommand.helper.ClassLoadingHelper.convertToClassName(java.lang.String)
     [exec]     [junit] 03:45:12.045 [main] DEBUG o.e.v.s.o.helper.ClassLoadingHelper - < public static java.lang.Class org.eclipse.virgo.shell.osgicommand.helper.ClassLoadingHelper.tryToLoadClass(java.lang.String, org.osgi.framework.Bundle)
     [exec]     [junit] 03:45:12.045 [main] DEBUG o.e.v.s.o.m.ClassLoadingSupport - < public boolean org.eclipse.virgo.shell.osgicommand.management.ClassLoadingSupport.tryToLoadClassFromBundle(java.lang.String, long)
     [exec]     [junit] 03:45:12.045 [main] DEBUG o.e.v.s.o.m.ClassLoadingSupport - > public boolean org.eclipse.virgo.shell.osgicommand.management.ClassLoadingSupport.tryToLoadClassFromBundle(java.lang.String, long)
     [exec]     [junit] 03:45:12.045 [main] DEBUG o.e.v.s.o.helper.ClassLoadingHelper - > public static java.lang.Class org.eclipse.virgo.shell.osgicommand.helper.ClassLoadingHelper.tryToLoadClass(java.lang.String, org.osgi.framework.Bundle)
     [exec]     [junit] 03:45:12.046 [main] DEBUG o.e.v.s.o.helper.ClassLoadingHelper - > public static java.lang.String org.eclipse.virgo.shell.osgicommand.helper.ClassLoadingHelper.convertToClassName(java.lang.String)
     [exec]     [junit] 03:45:12.046 [main] DEBUG o.e.v.s.o.helper.ClassLoadingHelper - < public static java.lang.String org.eclipse.virgo.shell.osgicommand.helper.ClassLoadingHelper.convertToClassName(java.lang.String)
     [exec]     [junit] 03:45:12.046 [main] DEBUG o.e.v.s.o.helper.ClassLoadingHelper - < public static java.lang.Class org.eclipse.virgo.shell.osgicommand.helper.ClassLoadingHelper.tryToLoadClass(java.lang.String, org.osgi.framework.Bundle)
     [exec]     [junit] 03:45:12.046 [main] DEBUG o.e.v.s.o.m.ClassLoadingSupport - < public boolean org.eclipse.virgo.shell.osgicommand.management.ClassLoadingSupport.tryToLoadClassFromBundle(java.lang.String, long)
     [exec]     [junit] ------------- ---------------- ---------------
     [exec] 
     [exec] BUILD SUCCESSFUL
     [exec] Total time: 8 seconds
     [echo] exec-ant for target 'test.do' gave return code 0
   [subant] Leaving directory: /jobs/genie.virgo/virgo.kernel.3.6.snapshot/workspace/org.eclipse.virgo.shell.command
   [subant] Entering directory: /jobs/genie.virgo/virgo.kernel.3.6.snapshot/workspace/org.eclipse.virgo.kernel.stubs

exec-ant:
     [echo] exec-ant for target 'test.do' executing in directory '/jobs/genie.virgo/virgo.kernel.3.6.snapshot/workspace/org.eclipse.virgo.kernel.stubs'
     [exec] Buildfile: /jobs/genie.virgo/virgo.kernel.3.6.snapshot/workspace/org.eclipse.virgo.kernel.stubs/build.xml
     [exec] 
     [exec] ivy.init:
     [exec] 
     [exec] ivy.file.exists:
     [exec] 
     [exec] resolve.init:
     [exec] 
     [exec] resolve.compile:
     [exec] [ivy:cachepath] :: Ivy 2.1.0 - 20090925235825 :: http://ant.apache.org/ivy/ ::
     [exec] [ivy:cachepath] :: loading settings :: file = /jobs/genie.virgo/virgo.kernel.3.6.snapshot/workspace/virgo-build/common/ivysettings.xml
     [exec] 
     [exec] resolve.test:
     [exec] 
     [exec] resolve.aspects:
     [exec] 
     [exec] compile.init:
     [exec] 
     [exec] test.init:
     [exec]    [delete] Deleting: /jobs/genie.virgo/virgo.kernel.3.6.snapshot/workspace/user-ivy.properties
     [exec]    [delete] Deleting: /jobs/genie.virgo/virgo.kernel.3.6.snapshot/workspace/org.eclipse.virgo.kernel.stubs/tmp.file
     [exec] 
     [exec] test.do:
     [exec] 
     [exec] BUILD SUCCESSFUL
     [exec] Total time: 3 seconds
     [echo] exec-ant for target 'test.do' gave return code 0
   [subant] Leaving directory: /jobs/genie.virgo/virgo.kernel.3.6.snapshot/workspace/org.eclipse.virgo.kernel.stubs
   [subant] Entering directory: /jobs/genie.virgo/virgo.kernel.3.6.snapshot/workspace/org.eclipse.virgo.kernel
Trying to override old definition of task dist-jar
Trying to override old definition of task src-jar

exec-ant:
     [echo] exec-ant for target 'test.do' executing in directory '/jobs/genie.virgo/virgo.kernel.3.6.snapshot/workspace/org.eclipse.virgo.kernel'
     [exec] Buildfile: /jobs/genie.virgo/virgo.kernel.3.6.snapshot/workspace/org.eclipse.virgo.kernel/build.xml
     [exec] Trying to override old definition of task dist-jar
     [exec] Trying to override old definition of task src-jar
     [exec] 
     [exec] test.do:
     [exec] 
     [exec] BUILD SUCCESSFUL
     [exec] Total time: 0 seconds
     [echo] exec-ant for target 'test.do' gave return code 0
   [subant] Leaving directory: /jobs/genie.virgo/virgo.kernel.3.6.snapshot/workspace/org.eclipse.virgo.kernel
   [subant] Entering directory: /jobs/genie.virgo/virgo.kernel.3.6.snapshot/workspace/org.eclipse.virgo.kernel.test

exec-ant:
     [echo] exec-ant for target 'test.do' executing in directory '/jobs/genie.virgo/virgo.kernel.3.6.snapshot/workspace/org.eclipse.virgo.kernel.test'
     [exec] Buildfile: /jobs/genie.virgo/virgo.kernel.3.6.snapshot/workspace/org.eclipse.virgo.kernel.test/build.xml
     [exec] 
     [exec] ivy.init:
     [exec] 
     [exec] ivy.file.exists:
     [exec] 
     [exec] resolve.init:
     [exec] 
     [exec] resolve.compile:
     [exec] [ivy:cachepath] :: Ivy 2.1.0 - 20090925235825 :: http://ant.apache.org/ivy/ ::
     [exec] [ivy:cachepath] :: loading settings :: file = /jobs/genie.virgo/virgo.kernel.3.6.snapshot/workspace/virgo-build/common/ivysettings.xml
     [exec] 
     [exec] resolve.test:
     [exec] [ivy:cachepath] downloading http://build.eclipse.org/rt/virgo/ivy/bundles/release/org.eclipse.virgo.mirrored/org.apache.felix.gogo.command/0.10.0.v201209301215/org.apache.felix.gogo.command.source-0.10.0.v201209301215.jar ...
     [exec] [ivy:cachepath] .... (34kB)
     [exec] [ivy:cachepath] .. (0kB)
     [exec] [ivy:cachepath] 	[SUCCESSFUL ] org.eclipse.virgo.mirrored#org.apache.felix.gogo.command;0.10.0.v201209301215!org.apache.felix.gogo.command.source.jar(src) (36ms)
     [exec] [ivy:cachepath] downloading http://build.eclipse.org/rt/virgo/ivy/bundles/release/org.eclipse.virgo.mirrored/org.apache.felix.gogo.command/0.10.0.v201209301215/org.apache.felix.gogo.command-0.10.0.v201209301215.jar ...
     [exec] [ivy:cachepath] ........ (55kB)
     [exec] [ivy:cachepath] .. (0kB)
     [exec] [ivy:cachepath] 	[SUCCESSFUL ] org.eclipse.virgo.mirrored#org.apache.felix.gogo.command;0.10.0.v201209301215!org.apache.felix.gogo.command.jar (37ms)
     [exec] [ivy:cachepath] downloading http://build.eclipse.org/rt/virgo/ivy/bundles/release/org.eclipse.virgo.mirrored/org.apache.felix.gogo.shell/0.10.0.v201211091412/org.apache.felix.gogo.shell-0.10.0.v201211091412.jar ...
     [exec] [ivy:cachepath] ...... (59kB)
     [exec] [ivy:cachepath] .. (0kB)
     [exec] [ivy:cachepath] 	[SUCCESSFUL ] org.eclipse.virgo.mirrored#org.apache.felix.gogo.shell;0.10.0.v201211091412!org.apache.felix.gogo.shell.jar (40ms)
     [exec] [ivy:cachepath] downloading http://build.eclipse.org/rt/virgo/ivy/bundles/release/org.eclipse.virgo.mirrored/org.apache.felix.gogo.shell/0.10.0.v201211091412/org.apache.felix.gogo.shell.source-0.10.0.v201211091412.jar ...
     [exec] [ivy:cachepath] .... (37kB)
     [exec] [ivy:cachepath] .. (0kB)
     [exec] [ivy:cachepath] 	[SUCCESSFUL ] org.eclipse.virgo.mirrored#org.apache.felix.gogo.shell;0.10.0.v201211091412!org.apache.felix.gogo.shell.source.jar(src) (39ms)
     [exec] [ivy:cachepath] downloading http://build.eclipse.org/rt/virgo/ivy/bundles/release/org.eclipse.virgo.mirrored/org.apache.mina.core/2.0.2.v201108120515/org.apache.mina.core-2.0.2.v201108120515.jar ...
     [exec] [ivy:cachepath] ................................................................................................ (656kB)
     [exec] [ivy:cachepath] .. (0kB)
     [exec] [ivy:cachepath] 	[SUCCESSFUL ] org.eclipse.virgo.mirrored#org.apache.mina.core;2.0.2.v201108120515!org.apache.mina.core.jar (105ms)
     [exec] [ivy:cachepath] downloading http://build.eclipse.org/rt/virgo/ivy/bundles/release/org.eclipse.virgo.mirrored/org.apache.sshd.core/0.5.0.v201108120515/org.apache.sshd.core-0.5.0.v201108120515.jar ...
     [exec] [ivy:cachepath] .................................... (329kB)
     [exec] [ivy:cachepath] .. (0kB)
     [exec] [ivy:cachepath] 	[SUCCESSFUL ] org.eclipse.virgo.mirrored#org.apache.sshd.core;0.5.0.v201108120515!org.apache.sshd.core.jar (63ms)
     [exec] [ivy:cachepath] downloading http://build.eclipse.org/rt/virgo/ivy/bundles/release/org.eclipse.virgo.mirrored/org.apache.sshd.core/0.5.0.v201108120515/org.apache.sshd.core.source-0.5.0.v201108120515.jar ...
     [exec] [ivy:cachepath] ......................................... (263kB)
     [exec] [ivy:cachepath] .. (0kB)
     [exec] [ivy:cachepath] 	[SUCCESSFUL ] org.eclipse.virgo.mirrored#org.apache.sshd.core;0.5.0.v201108120515!org.apache.sshd.core.source.jar(src) (54ms)
     [exec] [ivy:cachepath] downloading http://build.eclipse.org/rt/virgo/ivy/bundles/release/org.eclipse.virgo.mirrored/org.eclipse.equinox.ds/1.4.0.v20120112-1400/org.eclipse.equinox.ds-1.4.0.v20120112-1400.jar ...
     [exec] [ivy:cachepath] .......................... (188kB)
     [exec] [ivy:cachepath] .. (0kB)
     [exec] [ivy:cachepath] 	[SUCCESSFUL ] org.eclipse.virgo.mirrored#org.eclipse.equinox.ds;1.4.0.v20120112-1400!org.eclipse.equinox.ds.jar (47ms)
     [exec] [ivy:cachepath] downloading http://build.eclipse.org/rt/virgo/ivy/bundles/release/org.eclipse.virgo.mirrored/org.eclipse.equinox.ds/1.4.0.v20120112-1400/org.eclipse.equinox.ds.source-1.4.0.v20120112-1400.jar ...
     [exec] [ivy:cachepath] ...................... (152kB)
     [exec] [ivy:cachepath] .. (0kB)
     [exec] [ivy:cachepath] 	[SUCCESSFUL ] org.eclipse.virgo.mirrored#org.eclipse.equinox.ds;1.4.0.v20120112-1400!org.eclipse.equinox.ds.source.jar(src) (38ms)
     [exec] [ivy:cachepath] downloading http://build.eclipse.org/rt/virgo/ivy/bundles/release/org.eclipse.virgo.mirrored/org.eclipse.equinox.util/1.0.300.v20111010-1614/org.eclipse.equinox.util.source-1.0.300.v20111010-1614.jar ...
     [exec] [ivy:cachepath] ....... (65kB)
     [exec] [ivy:cachepath] .. (0kB)
     [exec] [ivy:cachepath] 	[SUCCESSFUL ] org.eclipse.virgo.mirrored#org.eclipse.equinox.util;1.0.300.v20111010-1614!org.eclipse.equinox.util.source.jar(src) (37ms)
     [exec] [ivy:cachepath] downloading http://build.eclipse.org/rt/virgo/ivy/bundles/release/org.eclipse.virgo.mirrored/org.eclipse.equinox.util/1.0.300.v20111010-1614/org.eclipse.equinox.util-1.0.300.v20111010-1614.jar ...
     [exec] [ivy:cachepath] ....... (75kB)
     [exec] [ivy:cachepath] .. (0kB)
     [exec] [ivy:cachepath] 	[SUCCESSFUL ] org.eclipse.virgo.mirrored#org.eclipse.equinox.util;1.0.300.v20111010-1614!org.eclipse.equinox.util.jar (34ms)
     [exec] [ivy:cachepath] downloading http://build.eclipse.org/rt/virgo/ivy/bundles/release/org.eclipse.virgo.mirrored/org.eclipse.equinox.console/1.0.100.v20121001-124408/org.eclipse.equinox.console-1.0.100.v20121001-124408.jar ...
     [exec] [ivy:cachepath] ........... (108kB)
     [exec] [ivy:cachepath] .. (0kB)
     [exec] [ivy:cachepath] 	[SUCCESSFUL ] org.eclipse.virgo.mirrored#org.eclipse.equinox.console;1.0.100.v20121001-124408!org.eclipse.equinox.console.jar (36ms)
     [exec] [ivy:cachepath] downloading http://build.eclipse.org/rt/virgo/ivy/bundles/release/org.eclipse.virgo.mirrored/org.eclipse.equinox.console/1.0.100.v20121001-124408/org.eclipse.equinox.console.source-1.0.100.v20121001-124408.jar ...
     [exec] [ivy:cachepath] ........ (78kB)
     [exec] [ivy:cachepath] .. (0kB)
     [exec] [ivy:cachepath] 	[SUCCESSFUL ] org.eclipse.virgo.mirrored#org.eclipse.equinox.console;1.0.100.v20121001-124408!org.eclipse.equinox.console.source.jar(src) (37ms)
     [exec] [ivy:cachepath] downloading http://build.eclipse.org/rt/virgo/ivy/bundles/release/org.eclipse.virgo.mirrored/org.eclipse.equinox.console.ssh/1.0.0.v20120430-1356/org.eclipse.equinox.console.ssh-1.0.0.v20120430-1356.jar ...
     [exec] [ivy:cachepath] ..... (52kB)
     [exec] [ivy:cachepath] .. (0kB)
     [exec] [ivy:cachepath] 	[SUCCESSFUL ] org.eclipse.virgo.mirrored#org.eclipse.equinox.console.ssh;1.0.0.v20120430-1356!org.eclipse.equinox.console.ssh.jar (36ms)
     [exec] [ivy:cachepath] downloading http://build.eclipse.org/rt/virgo/ivy/bundles/release/org.eclipse.virgo.mirrored/org.eclipse.equinox.console.ssh/1.0.0.v20120430-1356/org.eclipse.equinox.console.ssh.source-1.0.0.v20120430-1356.jar ...
     [exec] [ivy:cachepath] .. (33kB)
     [exec] [ivy:cachepath] .. (0kB)
     [exec] [ivy:cachepath] 	[SUCCESSFUL ] org.eclipse.virgo.mirrored#org.eclipse.equinox.console.ssh;1.0.0.v20120430-1356!org.eclipse.equinox.console.ssh.source.jar(src) (33ms)
     [exec] [ivy:cachepath] downloading http://build.eclipse.org/rt/virgo/ivy/bundles/release/org.eclipse.virgo.nano/org.eclipse.virgo.nano.management/3.6.4.RELEASE/org.eclipse.virgo.nano.management-3.6.4.RELEASE.jar ...
     [exec] [ivy:cachepath] .. (8kB)
     [exec] [ivy:cachepath] .. (0kB)
     [exec] [ivy:cachepath] 	[SUCCESSFUL ] org.eclipse.virgo.nano#org.eclipse.virgo.nano.management;3.6.4.RELEASE!org.eclipse.virgo.nano.management.jar (38ms)
     [exec] [ivy:cachepath] downloading http://build.eclipse.org/rt/virgo/ivy/bundles/release/org.eclipse.virgo.nano/org.eclipse.virgo.nano.management/3.6.4.RELEASE/org.eclipse.virgo.nano.management-sources-3.6.4.RELEASE.jar ...
     [exec] [ivy:cachepath] .. (4kB)
     [exec] [ivy:cachepath] .. (0kB)
     [exec] [ivy:cachepath] 	[SUCCESSFUL ] org.eclipse.virgo.nano#org.eclipse.virgo.nano.management;3.6.4.RELEASE!org.eclipse.virgo.nano.management-sources.jar(src) (34ms)
     [exec] [ivy:cachepath] downloading /opt/public/hipp/homes/genie.virgo/virgo-build-cache/integration-repo/org.eclipse.virgo.kernel/org.eclipse.virgo.shell.command/3.6.5.CI-2017-06-07_03-37-23/org.eclipse.virgo.shell.command-3.6.5.CI-2017-06-07_03-37-23.jar ...
     [exec] [ivy:cachepath] .... (181kB)
     [exec] [ivy:cachepath] .. (0kB)
     [exec] [ivy:cachepath] 	[SUCCESSFUL ] org.eclipse.virgo.kernel#org.eclipse.virgo.shell.command;3.6.5.CI-2017-06-07_03-37-23!org.eclipse.virgo.shell.command.jar (10ms)
     [exec] [ivy:cachepath] downloading /opt/public/hipp/homes/genie.virgo/virgo-build-cache/integration-repo/org.eclipse.virgo.kernel/org.eclipse.virgo.shell.command/3.6.5.CI-2017-06-07_03-37-23/org.eclipse.virgo.shell.command-sources-3.6.5.CI-2017-06-07_03-37-23.jar ...
     [exec] [ivy:cachepath] ... (84kB)
     [exec] [ivy:cachepath] .. (0kB)
     [exec] [ivy:cachepath] 	[SUCCESSFUL ] org.eclipse.virgo.kernel#org.eclipse.virgo.shell.command;3.6.5.CI-2017-06-07_03-37-23!org.eclipse.virgo.shell.command-sources.jar(src) (8ms)
     [exec] [ivy:cachepath] downloading http://build.eclipse.org/rt/virgo/ivy/bundles/release/org.eclipse.virgo.medic/org.eclipse.virgo.medic.logbackcorefragment/3.6.4.RELEASE/org.eclipse.virgo.medic.logbackcorefragment-3.6.4.RELEASE.jar ...
     [exec] [ivy:cachepath] .. (1kB)
     [exec] [ivy:cachepath] .. (0kB)
     [exec] [ivy:cachepath] 	[SUCCESSFUL ] org.eclipse.virgo.medic#org.eclipse.virgo.medic.logbackcorefragment;3.6.4.RELEASE!org.eclipse.virgo.medic.logbackcorefragment.jar (31ms)
     [exec] [ivy:cachepath] downloading http://build.eclipse.org/rt/virgo/ivy/bundles/release/org.eclipse.virgo.medic/org.eclipse.virgo.medic.logbackcorefragment/3.6.4.RELEASE/org.eclipse.virgo.medic.logbackcorefragment-sources-3.6.4.RELEASE.jar ...
     [exec] [ivy:cachepath] .. (0kB)
     [exec] [ivy:cachepath] .. (0kB)
     [exec] [ivy:cachepath] 	[SUCCESSFUL ] org.eclipse.virgo.medic#org.eclipse.virgo.medic.logbackcorefragment;3.6.4.RELEASE!org.eclipse.virgo.medic.logbackcorefragment-sources.jar(src) (32ms)
     [exec] [ivy:cachepath] downloading http://build.eclipse.org/rt/virgo/ivy/bundles/release/org.eclipse.virgo.medic/org.eclipse.virgo.medic.logbackclassicfragment/3.6.4.RELEASE/org.eclipse.virgo.medic.logbackclassicfragment-3.6.4.RELEASE.jar ...
     [exec] [ivy:cachepath] .. (1kB)
     [exec] [ivy:cachepath] .. (0kB)
     [exec] [ivy:cachepath] 	[SUCCESSFUL ] org.eclipse.virgo.medic#org.eclipse.virgo.medic.logbackclassicfragment;3.6.4.RELEASE!org.eclipse.virgo.medic.logbackclassicfragment.jar (31ms)
     [exec] [ivy:cachepath] downloading http://build.eclipse.org/rt/virgo/ivy/bundles/release/org.eclipse.virgo.medic/org.eclipse.virgo.medic.logbackclassicfragment/3.6.4.RELEASE/org.eclipse.virgo.medic.logbackclassicfragment-sources-3.6.4.RELEASE.jar ...
     [exec] [ivy:cachepath] .. (0kB)
     [exec] [ivy:cachepath] .. (0kB)
     [exec] [ivy:cachepath] 	[SUCCESSFUL ] org.eclipse.virgo.medic#org.eclipse.virgo.medic.logbackclassicfragment;3.6.4.RELEASE!org.eclipse.virgo.medic.logbackclassicfragment-sources.jar(src) (35ms)
     [exec] [ivy:cachepath] downloading http://build.eclipse.org/rt/virgo/ivy/bundles/release/org.eclipse.virgo.test/org.eclipse.virgo.test.framework/3.6.4.RELEASE/org.eclipse.virgo.test.framework-sources-3.6.4.RELEASE.jar ...
     [exec] [ivy:cachepath] .. (17kB)
     [exec] [ivy:cachepath] .. (0kB)
     [exec] [ivy:cachepath] 	[SUCCESSFUL ] org.eclipse.virgo.test#org.eclipse.virgo.test.framework;3.6.4.RELEASE!org.eclipse.virgo.test.framework-sources.jar(src) (32ms)
     [exec] [ivy:cachepath] downloading http://build.eclipse.org/rt/virgo/ivy/bundles/release/org.eclipse.virgo.test/org.eclipse.virgo.test.framework/3.6.4.RELEASE/org.eclipse.virgo.test.framework-3.6.4.RELEASE.jar ...
     [exec] [ivy:cachepath] ............................. (223kB)
     [exec] [ivy:cachepath] .. (0kB)
     [exec] [ivy:cachepath] 	[SUCCESSFUL ] org.eclipse.virgo.test#org.eclipse.virgo.test.framework;3.6.4.RELEASE!org.eclipse.virgo.test.framework.jar (41ms)
     [exec] [ivy:cachepath] downloading http://build.eclipse.org/rt/virgo/ivy/bundles/release/org.eclipse.virgo.mirrored/org.slf4j.jcl/1.7.2.v20121108-1250/org.slf4j.jcl-1.7.2.v20121108-1250.jar ...
     [exec] [ivy:cachepath] .. (23kB)
     [exec] [ivy:cachepath] .. (0kB)
     [exec] [ivy:cachepath] 	[SUCCESSFUL ] org.eclipse.virgo.mirrored#org.slf4j.jcl;1.7.2.v20121108-1250!org.slf4j.jcl.jar (30ms)
     [exec] [ivy:cachepath] downloading http://build.eclipse.org/rt/virgo/ivy/bundles/release/org.eclipse.virgo.mirrored/org.slf4j.jcl/1.7.2.v20121108-1250/org.slf4j.jcl.source-1.7.2.v20121108-1250.jar ...
     [exec] [ivy:cachepath] .. (31kB)
     [exec] [ivy:cachepath] .. (0kB)
     [exec] [ivy:cachepath] 	[SUCCESSFUL ] org.eclipse.virgo.mirrored#org.slf4j.jcl;1.7.2.v20121108-1250!org.slf4j.jcl.source.jar(src) (33ms)
     [exec] 
     [exec] compile.init:
     [exec] 
     [exec] test.init:
     [exec]    [delete] Deleting: /jobs/genie.virgo/virgo.kernel.3.6.snapshot/workspace/user-ivy.properties
     [exec]    [delete] Deleting: /jobs/genie.virgo/virgo.kernel.3.6.snapshot/workspace/org.eclipse.virgo.kernel.test/tmp.file
     [exec] 
     [exec] test.do:
     [exec]     [mkdir] Created dir: /jobs/genie.virgo/virgo.kernel.3.6.snapshot/workspace/org.eclipse.virgo.kernel.test/target/test-classes
     [exec]   [s:javac] Compiling 15 source files to /jobs/genie.virgo/virgo.kernel.3.6.snapshot/workspace/org.eclipse.virgo.kernel.test/target/test-classes
     [exec]      [copy] Copying 40 files to /jobs/genie.virgo/virgo.kernel.3.6.snapshot/workspace/org.eclipse.virgo.kernel.test/target/test-classes
     [exec]     [junit] Testsuite: org.eclipse.virgo.kernel.concurrent.test.ApplicationContextDependencyMonitorIntegrationTests
[locks-and-latches] Releasing all the locks
[locks-and-latches] All the locks released
Build was aborted
Finished: ABORTED