FailedConsole Output

Skipping 763 KB.. Full Log
h4mBoaKIQQqqJTk/rzgfqNYZQoMUMkAAI0hhAQASWqbMYgAAAA==:test:org.eclipse.virgo.test.framework:sourcesJar
:test:org.eclipse.virgo.test.framework:assemble
:test:org.eclipse.virgo.test.framework:findbugsMain FAILED
:test:org.eclipse.virgo.test.framework:compileTestJava
Download https://repo1.maven.org/maven2/org/ops4j/pax/exam/pax-exam-junit4/4.1.0/pax-exam-junit4-4.1.0.pom
Download https://repo1.maven.org/maven2/org/ops4j/pax/exam/4.1.0/exam-4.1.0.pom
Download https://repo1.maven.org/maven2/org/ops4j/pax/exam-reactor/4.1.0/exam-reactor-4.1.0.pom
Download https://repo1.maven.org/maven2/org/ops4j/master/3.3.0/master-3.3.0.pom
Download https://repo1.maven.org/maven2/org/sonatype/oss/oss-parent/9/oss-parent-9.pom
Download https://repo1.maven.org/maven2/org/ops4j/pax/exam/pax-exam-spi/4.1.0/pax-exam-spi-4.1.0.pom
Download https://repo1.maven.org/maven2/org/ops4j/base/ops4j-base-lang/1.4.0/ops4j-base-lang-1.4.0.pom
Download https://repo1.maven.org/maven2/org/ops4j/base/1.4.0/base-1.4.0.pom
Download https://repo1.maven.org/maven2/org/ops4j/master/3.1.0/master-3.1.0.pom
Download http://build.eclipse.org/rt/virgo/ivy/bundles/release/org.ops4j/master/3.1.0/ivy-3.1.0.xml
Download http://build.eclipse.org/rt/virgo/ivy/bundles/release/org.ops4j/base/1.4.0/ivy-1.4.0.xml
Download http://build.eclipse.org/rt/virgo/ivy/bundles/release/org.ops4j.base/ops4j-base-lang/1.4.0/ivy-1.4.0.xml
Download https://repo1.maven.org/maven2/org/ops4j/pax/exam/pax-exam/4.1.0/pax-exam-4.1.0.pom
Download https://repo1.maven.org/maven2/org/ops4j/base/ops4j-base-spi/1.4.0/ops4j-base-spi-1.4.0.pom
Download http://build.eclipse.org/rt/virgo/ivy/bundles/release/org.ops4j.base/ops4j-base-spi/1.4.0/ivy-1.4.0.xml
Download https://repo1.maven.org/maven2/org/slf4j/slf4j-api/1.6.6/slf4j-api-1.6.6.pom
Download https://repo1.maven.org/maven2/org/slf4j/slf4j-parent/1.6.6/slf4j-parent-1.6.6.pom
Download https://repo1.maven.org/maven2/org/ops4j/pax/tinybundles/tinybundles/2.0.0/tinybundles-2.0.0.pom
Download https://repo1.maven.org/maven2/org/ops4j/master/3.2.0/master-3.2.0.pom
Download http://build.eclipse.org/rt/virgo/ivy/bundles/release/org.ops4j/master/3.2.0/ivy-3.2.0.xml
Download http://build.eclipse.org/rt/virgo/ivy/bundles/release/org.ops4j.pax.tinybundles/tinybundles/2.0.0/ivy-2.0.0.xml
Download https://repo1.maven.org/maven2/org/ops4j/base/ops4j-base-store/1.4.0/ops4j-base-store-1.4.0.pom
Download http://build.eclipse.org/rt/virgo/ivy/bundles/release/org.ops4j.base/ops4j-base-store/1.4.0/ivy-1.4.0.xml
Download https://repo1.maven.org/maven2/org/ops4j/base/ops4j-base-util-property/1.4.0/ops4j-base-util-property-1.4.0.pom
Download http://build.eclipse.org/rt/virgo/ivy/bundles/release/org.ops4j.base/ops4j-base-util-property/1.4.0/ivy-1.4.0.xml
:test:org.eclipse.virgo.test.framework:compileTestJava FAILED
:test:org.eclipse.virgo.test.framework:processTestResources
:test:org.eclipse.virgo.test.launcher:sourcesJar
:test:org.eclipse.virgo.test.launcher:assemble
:test:org.eclipse.virgo.test.launcher:findbugsMain FAILED
:test:org.eclipse.virgo.test.launcher:compileTestJava FAILED
:test:org.eclipse.virgo.test.launcher:processTestResources
:test:org.eclipse.virgo.test.stubs:sourcesJar
:test:org.eclipse.virgo.test.stubs:assemble
:test:org.eclipse.virgo.test.stubs:findbugsMain FAILED
:test:org.eclipse.virgo.test.stubs:compileTestAspect
[ant:taskdef] Could not load definitions from resource org/aspectj/tools/ant/taskdefs/aspectjTaskdefs.properties. It could not be found.
[ant:iajc] warning incorrect classpath: /jobs/genie.virgo/virgo-spring4/workspace/test/org.eclipse.virgo.test.stubs/build/resources/main
incorrect classpath: /opt/public/hipp/homes/genie.virgo/.gradle/caches/modules-2/files-2.1/org.aspectj/aspectjrt/1.8.10/1a14fe9e912f6e8bdbb5429b78b4090d8b47bc1/aspectjrt-1.8.10.jar
incorrect classpath: /opt/public/hipp/homes/genie.virgo/.gradle/caches/modules-2/files-2.1/junit/junit/4.7/d9444742a5b897c6280724a49f57a8155517d21f/junit-4.7.jar
incorrect classpath: /opt/public/hipp/homes/genie.virgo/.gradle/caches/modules-2/files-2.1/org.eclipse.virgo.mirrored/org.eclipse.osgi/3.9.1.v20140110-1610/b27f1304f18fede876f940aefa6c9eb5632619d7/org.eclipse.osgi-3.9.1.v20140110-1610.jar
incorrect classpath: /opt/public/hipp/homes/genie.virgo/.gradle/caches/modules-2/files-2.1/org.eclipse.virgo.mirrored/org.eclipse.osgi.services/3.3.100.v20130513-1956/1d73531fac5372870373a06193985611b1239f0c/org.eclipse.osgi.services-3.3.100.v20130513-1956.jar
incorrect classpath: /opt/public/hipp/homes/genie.virgo/.gradle/caches/modules-2/files-2.1/org.eclipse.virgo.mirrored/org.eclipse.equinox.region/1.1.101.v20130722-1314/c489cb1220df26c1261394e47aad0a62918fa05f/org.eclipse.equinox.region-1.1.101.v20130722-1314.jar
[ant:iajc] error classpath error: unable to find org.aspectj.lang.JoinPoint (check that aspectjrt.jar is in your classpath)
[ant:iajc] fail unexpected exception -- (BuildException) unable to copy resources to destDir: /jobs/genie.virgo/virgo-spring4/workspace/test/org.eclipse.virgo.test.stubs/build/classes/test
unable to copy resources to destDir: /jobs/genie.virgo/virgo-spring4/workspace/test/org.eclipse.virgo.test.stubs/build/classes/test
unable to copy resources to destDir: /jobs/genie.virgo/virgo-spring4/workspace/test/org.eclipse.virgo.test.stubs/build/classes/test
	at org.aspectj.tools.ant.taskdefs.AjcTask.completeDestdir(AjcTask.java:1608)
	at org.aspectj.tools.ant.taskdefs.AjcTask.doCompletionTasks(AjcTask.java:1592)
	at org.aspectj.tools.ant.taskdefs.AjcTask$2.run(AjcTask.java:1277)
	at org.aspectj.tools.ajc.Main.report(Main.java:495)
	at org.aspectj.tools.ajc.Main.run(Main.java:372)
	at org.aspectj.tools.ajc.Main.runMain(Main.java:248)
	at org.aspectj.tools.ant.taskdefs.AjcTask.executeInSameVM(AjcTask.java:1286)
	at org.aspectj.tools.ant.taskdefs.AjcTask.execute(AjcTask.java:1096)
	at org.apache.tools.ant.UnknownElement.execute(UnknownElement.java:293)
	at sun.reflect.GeneratedMethodAccessor388.invoke(Unknown Source)
	at sun.reflect.DelegatingMethodAccessorImpl.invoke(DelegatingMethodAccessorImpl.java:43)
	at java.lang.reflect.Method.invoke(Method.java:498)
	at org.apache.tools.ant.dispatch.DispatchUtils.execute(DispatchUtils.java:106)
	at groovy.util.AntBuilder.performTask(AntBuilder.java:327)
	at groovy.util.AntBuilder.nodeCompleted(AntBuilder.java:272)
	at org.gradle.api.internal.project.ant.BasicAntBuilder.nodeCompleted(BasicAntBuilder.java:78)
	at groovy.util.BuilderSupport.doInvokeMethod(BuilderSupport.java:154)
	at groovy.util.AntBuilder.doInvokeMethod(AntBuilder.java:207)
	at org.gradle.api.internal.project.ant.BasicAntBuilder.doInvokeMethod(BasicAntBuilder.java:103)
	at groovy.util.BuilderSupport.invokeMethod(BuilderSupport.java:67)
	at org.codehaus.groovy.runtime.callsite.PogoMetaClassSite.call(PogoMetaClassSite.java:48)
	at org.codehaus.groovy.runtime.callsite.AbstractCallSite.call(AbstractCallSite.java:133)
	at aspectj.Ajc.compile(AspectJPlugin.groovy:71)
	at sun.reflect.NativeMethodAccessorImpl.invoke0(Native Method)
	at sun.reflect.NativeMethodAccessorImpl.invoke(NativeMethodAccessorImpl.java:62)
	at sun.reflect.DelegatingMethodAccessorImpl.invoke(DelegatingMethodAccessorImpl.java:43)
	at java.lang.reflect.Method.invoke(Method.java:498)
	at org.gradle.internal.reflect.JavaMethod.invoke(JavaMethod.java:73)
	at org.gradle.api.internal.project.taskfactory.DefaultTaskClassInfoStore$StandardTaskAction.doExecute(DefaultTaskClassInfoStore.java:141)
	at org.gradle.api.internal.project.taskfactory.DefaultTaskClassInfoStore$StandardTaskAction.execute(DefaultTaskClassInfoStore.java:134)
	at org.gradle.api.internal.project.taskfactory.DefaultTaskClassInfoStore$StandardTaskAction.execute(DefaultTaskClassInfoStore.java:123)
	at org.gradle.api.internal.AbstractTask$TaskActionWrapper.execute(AbstractTask.java:692)
	at org.gradle.api.internal.AbstractTask$TaskActionWrapper.execute(AbstractTask.java:675)
	at org.gradle.api.internal.tasks.execution.ExecuteActionsTaskExecuter$1.execute(ExecuteActionsTaskExecuter.java:115)
	at org.gradle.api.internal.tasks.execution.ExecuteActionsTaskExecuter$1.execute(ExecuteActionsTaskExecuter.java:109)
	at org.gradle.internal.Transformers$4.transform(Transformers.java:169)
	at org.gradle.internal.progress.DefaultBuildOperationExecutor.run(DefaultBuildOperationExecutor.java:106)
	at org.gradle.internal.progress.DefaultBuildOperationExecutor.run(DefaultBuildOperationExecutor.java:56)
	at org.gradle.api.internal.tasks.execution.ExecuteActionsTaskExecuter.executeAction(ExecuteActionsTaskExecuter.java:109)
	at org.gradle.api.internal.tasks.execution.ExecuteActionsTaskExecuter.executeActions(ExecuteActionsTaskExecuter.java:90)
	at org.gradle.api.internal.tasks.execution.ExecuteActionsTaskExecuter.execute(ExecuteActionsTaskExecuter.java:68)
	at org.gradle.api.internal.tasks.execution.SkipUpToDateTaskExecuter.execute(SkipUpToDateTaskExecuter.java:62)
	at org.gradle.api.internal.tasks.execution.ValidatingTaskExecuter.execute(ValidatingTaskExecuter.java:58)
	at org.gradle.api.internal.tasks.execution.SkipEmptySourceFilesTaskExecuter.execute(SkipEmptySourceFilesTaskExecuter.java:88)
	at org.gradle.api.internal.tasks.execution.ResolveTaskArtifactStateTaskExecuter.execute(ResolveTaskArtifactStateTaskExecuter.java:46)
	at org.gradle.api.internal.tasks.execution.SkipTaskWithNoActionsExecuter.execute(SkipTaskWithNoActionsExecuter.java:51)
	at org.gradle.api.internal.tasks.execution.SkipOnlyIfTaskExecuter.execute(SkipOnlyIfTaskExecuter.java:54)
	at org.gradle.api.internal.tasks.execution.ExecuteAtMostOnceTaskExecuter.execute(ExecuteAtMostOnceTaskExecuter.java:43)
	at org.gradle.api.internal.tasks.execution.CatchExceptionTaskExecuter.execute(CatchExceptionTaskExecuter.java:34)
	at org.gradle.execution.taskgraph.DefaultTaskGraphExecuter$EventFiringTaskWorker$1.execute(DefaultTaskGraphExecuter.java:236)
	at org.gradle.execution.taskgraph.DefaultTaskGraphExecuter$EventFiringTaskWorker$1.execute(DefaultTaskGraphExecuter.java:228)
	at org.gradle.internal.Transformers$4.transform(Transformers.java:169)
	at org.gradle.internal.progress.DefaultBuildOperationExecutor.run(DefaultBuildOperationExecutor.java:106)
	at org.gradle.internal.progress.DefaultBuildOperationExecutor.run(DefaultBuildOperationExecutor.java:61)
	at org.gradle.execution.taskgraph.DefaultTaskGraphExecuter$EventFiringTaskWorker.execute(DefaultTaskGraphExecuter.java:228)
	at org.gradle.execution.taskgraph.DefaultTaskGraphExecuter$EventFiringTaskWorker.execute(DefaultTaskGraphExecuter.java:215)
	at org.gradle.execution.taskgraph.AbstractTaskPlanExecutor$TaskExecutorWorker.processTask(AbstractTaskPlanExecutor.java:77)
	at org.gradle.execution.taskgraph.AbstractTaskPlanExecutor$TaskExecutorWorker.run(AbstractTaskPlanExecutor.java:58)
	at org.gradle.execution.taskgraph.DefaultTaskPlanExecutor.process(DefaultTaskPlanExecutor.java:32)
	at org.gradle.execution.taskgraph.DefaultTaskGraphExecuter.execute(DefaultTaskGraphExecuter.java:113)
	at org.gradle.execution.SelectedTaskExecutionAction.execute(SelectedTaskExecutionAction.java:37)
	at org.gradle.execution.DefaultBuildExecuter.execute(DefaultBuildExecuter.java:37)
	at org.gradle.execution.DefaultBuildExecuter.access$000(DefaultBuildExecuter.java:23)
	at org.gradle.execution.DefaultBuildExecuter$1.proceed(DefaultBuildExecuter.java:43)
	at org.gradle.execution.DryRunBuildExecutionAction.execute(DryRunBuildExecutionAction.java:32)
	at org.gradle.execution.DefaultBuildExecuter.execute(DefaultBuildExecuter.java:37)
	at org.gradle.execution.DefaultBuildExecuter.execute(DefaultBuildExecuter.java:30)
	at org.gradle.initialization.DefaultGradleLauncher$RunTasksAction.execute(DefaultGradleLauncher.java:230)
	at org.gradle.initialization.DefaultGradleLauncher$RunTasksAction.execute(DefaultGradleLauncher.java:227)
	at org.gradle.internal.Transformers$4.transform(Transformers.java:169)
	at org.gradle.internal.progress.DefaultBuildOperationExecutor.run(DefaultBuildOperationExecutor.java:106)
	at org.gradle.internal.progress.DefaultBuildOperationExecutor.run(DefaultBuildOperationExecutor.java:56)
	at org.gradle.initialization.DefaultGradleLauncher.doBuildStages(DefaultGradleLauncher.java:161)
	at org.gradle.initialization.DefaultGradleLauncher.doBuild(DefaultGradleLauncher.java:112)
	at org.gradle.initialization.DefaultGradleLauncher.run(DefaultGradleLauncher.java:95)
	at org.gradle.launcher.exec.GradleBuildController.run(GradleBuildController.java:66)
	at org.gradle.tooling.internal.provider.ExecuteBuildActionRunner.run(ExecuteBuildActionRunner.java:28)
	at org.gradle.launcher.exec.ChainingBuildActionRunner.run(ChainingBuildActionRunner.java:35)
	at org.gradle.launcher.exec.InProcessBuildActionExecuter.execute(InProcessBuildActionExecuter.java:41)
	at org.gradle.launcher.exec.InProcessBuildActionExecuter.execute(InProcessBuildActionExecuter.java:26)
	at org.gradle.tooling.internal.provider.ContinuousBuildActionExecuter.execute(ContinuousBuildActionExecuter.java:75)
	at org.gradle.tooling.internal.provider.ContinuousBuildActionExecuter.execute(ContinuousBuildActionExecuter.java:49)
	at org.gradle.tooling.internal.provider.ServicesSetupBuildActionExecuter.execute(ServicesSetupBuildActionExecuter.java:49)
	at org.gradle.tooling.internal.provider.ServicesSetupBuildActionExecuter.execute(ServicesSetupBuildActionExecuter.java:31)
	at org.gradle.launcher.daemon.server.exec.ExecuteBuild.doBuild(ExecuteBuild.java:67)
	at org.gradle.launcher.daemon.server.exec.BuildCommandOnly.execute(BuildCommandOnly.java:36)
	at org.gradle.launcher.daemon.server.api.DaemonCommandExecution.proceed(DaemonCommandExecution.java:120)
	at org.gradle.launcher.daemon.server.exec.WatchForDisconnection.execute(WatchForDisconnection.java:37)
	at org.gradle.launcher.daemon.server.api.DaemonCommandExecution.proceed(DaemonCommandExecution.java:120)
	at org.gradle.launcher.daemon.server.exec.ResetDeprecationLogger.execute(ResetDeprecationLogger.java:26)
	at org.gradle.launcher.daemon.server.api.DaemonCommandExecution.proceed(DaemonCommandExecution.java:120)
	at org.gradle.launcher.daemon.server.exec.RequestStopIfSingleUsedDaemon.execute(RequestStopIfSingleUsedDaemon.java:34)
	at org.gradle.launcher.daemon.server.api.DaemonCommandExecution.proceed(DaemonCommandExecution.java:120)
	at org.gradle.launcher.daemon.server.exec.ForwardClientInput$2.call(ForwardClientInput.java:74)
	at org.gradle.launcher.daemon.server.exec.ForwardClientInput$2.call(ForwardClientInput.java:72)
	at org.gradle.util.Swapper.swap(Swapper.java:38)
	at org.gradle.launcher.daemon.server.exec.ForwardClientInput.execute(ForwardClientInput.java:72)
	at org.gradle.launcher.daemon.server.api.DaemonCommandExecution.proceed(DaemonCommandExecution.java:120)
	at org.gradle.launcher.daemon.server.exec.LogAndCheckHealth.execute(LogAndCheckHealth.java:55)
	at org.gradle.launcher.daemon.server.api.DaemonCommandExecution.proceed(DaemonCommandExecution.java:120)
	at org.gradle.launcher.daemon.server.exec.LogToClient.doBuild(LogToClient.java:60)
	at org.gradle.launcher.daemon.server.exec.BuildCommandOnly.execute(BuildCommandOnly.java:36)
	at org.gradle.launcher.daemon.server.api.DaemonCommandExecution.proceed(DaemonCommandExecution.java:120)
	at org.gradle.launcher.daemon.server.exec.EstablishBuildEnvironment.doBuild(EstablishBuildEnvironment.java:72)
	at org.gradle.launcher.daemon.server.exec.BuildCommandOnly.execute(BuildCommandOnly.java:36)
	at org.gradle.launcher.daemon.server.api.DaemonCommandExecution.proceed(DaemonCommandExecution.java:120)
	at org.gradle.launcher.daemon.server.exec.StartBuildOrRespondWithBusy$1.run(StartBuildOrRespondWithBusy.java:50)
	at org.gradle.launcher.daemon.server.DaemonStateCoordinator$1.run(DaemonStateCoordinator.java:297)
	at org.gradle.internal.concurrent.ExecutorPolicy$CatchAndRecordFailures.onExecute(ExecutorPolicy.java:63)
	at org.gradle.internal.concurrent.StoppableExecutorImpl$1.run(StoppableExecutorImpl.java:46)
	at java.util.concurrent.ThreadPoolExecutor.runWorker(ThreadPoolExecutor.java:1149)
	at java.util.concurrent.ThreadPoolExecutor$Worker.run(ThreadPoolExecutor.java:624)
	at java.lang.Thread.run(Thread.java:748)
[ant:iajc] MessageHolder:  (9 info)  (1 warning)  (1 error)  (1 fail) 
[ant:iajc] [error   0]: error classpath error: unable to find org.aspectj.lang.JoinPoint (check that aspectjrt.jar is in your classpath)
:test:org.eclipse.virgo.test.stubs:compileTestAspect FAILED
:test:org.eclipse.virgo.test.stubs:processTestResources NO-SOURCE
:test:org.eclipse.virgo.test.tools:sourcesJar
:test:org.eclipse.virgo.test.tools:assemble
:test:org.eclipse.virgo.test.tools:findbugsMain FAILED
:test:org.eclipse.virgo.test.tools:compileTestJava NO-SOURCE
:test:org.eclipse.virgo.test.tools:processTestResources NO-SOURCE
:test:org.eclipse.virgo.test.tools:testClasses UP-TO-DATE
:test:org.eclipse.virgo.test.tools:test NO-SOURCE
:util:org.eclipse.virgo.util.common:findbugsMain FAILED
:util:org.eclipse.virgo.util.common:compileTestJavaPicked up JAVA_TOOL_OPTIONS: -Xmx2G -Djava.io.tmpdir=/tmp/genie.virgo
Error: Could not find or load main class org.eclipse.jdt.internal.compiler.batch.Main
 FAILED
:util:org.eclipse.virgo.util.common:processTestResources NO-SOURCE
:util:org.eclipse.virgo.util.env:findbugsMain FAILED
:util:org.eclipse.virgo.util.env:compileTestJavaPicked up JAVA_TOOL_OPTIONS: -Xmx2G -Djava.io.tmpdir=/tmp/genie.virgo
Error: Could not find or load main class org.eclipse.jdt.internal.compiler.batch.Main
 FAILED
:util:org.eclipse.virgo.util.env:processTestResources NO-SOURCE
:util:org.eclipse.virgo.util.integrationtest:sourcesJar
:util:org.eclipse.virgo.util.integrationtest:assemble
:util:org.eclipse.virgo.util.integrationtest:findbugsMain NO-SOURCE
:util:org.eclipse.virgo.util.integrationtest:compileTestJava FAILED
:util:org.eclipse.virgo.util.integrationtest:processTestResources NO-SOURCE
:util:org.eclipse.virgo.util.io:findbugsMain FAILED
:util:org.eclipse.virgo.util.io:compileTestJavaPicked up JAVA_TOOL_OPTIONS: -Xmx2G -Djava.io.tmpdir=/tmp/genie.virgo
Error: Could not find or load main class org.eclipse.jdt.internal.compiler.batch.Main
 FAILED
:util:org.eclipse.virgo.util.io:processTestResources
:util:org.eclipse.virgo.util.jmx:findbugsMain FAILED
:util:org.eclipse.virgo.util.jmx:compileTestAspect
[ant:taskdef] Could not load definitions from resource org/aspectj/tools/ant/taskdefs/aspectjTaskdefs.properties. It could not be found.
[ant:iajc] warning incorrect classpath: /opt/public/hipp/homes/genie.virgo/.gradle/caches/modules-2/files-2.1/org.aspectj/aspectjrt/1.8.10/1a14fe9e912f6e8bdbb5429b78b4090d8b47bc1/aspectjrt-1.8.10.jar
incorrect classpath: /opt/public/hipp/homes/genie.virgo/.gradle/caches/modules-2/files-2.1/org.slf4j/slf4j-api/1.7.25/da76ca59f6a57ee3102f8f9bd9cee742973efa8a/slf4j-api-1.7.25.jar
incorrect classpath: /opt/public/hipp/homes/genie.virgo/.gradle/caches/modules-2/files-2.1/junit/junit/4.7/d9444742a5b897c6280724a49f57a8155517d21f/junit-4.7.jar
[ant:iajc] error classpath error: unable to find org.aspectj.lang.JoinPoint (check that aspectjrt.jar is in your classpath)
[ant:iajc] fail unexpected exception -- (BuildException) unable to copy resources to destDir: /jobs/genie.virgo/virgo-spring4/workspace/util/org.eclipse.virgo.util.jmx/build/classes/test
unable to copy resources to destDir: /jobs/genie.virgo/virgo-spring4/workspace/util/org.eclipse.virgo.util.jmx/build/classes/test
unable to copy resources to destDir: /jobs/genie.virgo/virgo-spring4/workspace/util/org.eclipse.virgo.util.jmx/build/classes/test
	at org.aspectj.tools.ant.taskdefs.AjcTask.completeDestdir(AjcTask.java:1608)
	at org.aspectj.tools.ant.taskdefs.AjcTask.doCompletionTasks(AjcTask.java:1592)
	at org.aspectj.tools.ant.taskdefs.AjcTask$2.run(AjcTask.java:1277)
	at org.aspectj.tools.ajc.Main.report(Main.java:495)
	at org.aspectj.tools.ajc.Main.run(Main.java:372)
	at org.aspectj.tools.ajc.Main.runMain(Main.java:248)
	at org.aspectj.tools.ant.taskdefs.AjcTask.executeInSameVM(AjcTask.java:1286)
	at org.aspectj.tools.ant.taskdefs.AjcTask.execute(AjcTask.java:1096)
	at org.apache.tools.ant.UnknownElement.execute(UnknownElement.java:293)
	at sun.reflect.GeneratedMethodAccessor388.invoke(Unknown Source)
	at sun.reflect.DelegatingMethodAccessorImpl.invoke(DelegatingMethodAccessorImpl.java:43)
	at java.lang.reflect.Method.invoke(Method.java:498)
	at org.apache.tools.ant.dispatch.DispatchUtils.execute(DispatchUtils.java:106)
	at groovy.util.AntBuilder.performTask(AntBuilder.java:327)
	at groovy.util.AntBuilder.nodeCompleted(AntBuilder.java:272)
	at org.gradle.api.internal.project.ant.BasicAntBuilder.nodeCompleted(BasicAntBuilder.java:78)
	at groovy.util.BuilderSupport.doInvokeMethod(BuilderSupport.java:154)
	at groovy.util.AntBuilder.doInvokeMethod(AntBuilder.java:207)
	at org.gradle.api.internal.project.ant.BasicAntBuilder.doInvokeMethod(BasicAntBuilder.java:103)
	at groovy.util.BuilderSupport.invokeMethod(BuilderSupport.java:67)
	at org.codehaus.groovy.runtime.callsite.PogoMetaClassSite.call(PogoMetaClassSite.java:48)
	at org.codehaus.groovy.runtime.callsite.AbstractCallSite.call(AbstractCallSite.java:133)
	at aspectj.Ajc.compile(AspectJPlugin.groovy:71)
	at sun.reflect.NativeMethodAccessorImpl.invoke0(Native Method)
	at sun.reflect.NativeMethodAccessorImpl.invoke(NativeMethodAccessorImpl.java:62)
	at sun.reflect.DelegatingMethodAccessorImpl.invoke(DelegatingMethodAccessorImpl.java:43)
	at java.lang.reflect.Method.invoke(Method.java:498)
	at org.gradle.internal.reflect.JavaMethod.invoke(JavaMethod.java:73)
	at org.gradle.api.internal.project.taskfactory.DefaultTaskClassInfoStore$StandardTaskAction.doExecute(DefaultTaskClassInfoStore.java:141)
	at org.gradle.api.internal.project.taskfactory.DefaultTaskClassInfoStore$StandardTaskAction.execute(DefaultTaskClassInfoStore.java:134)
	at org.gradle.api.internal.project.taskfactory.DefaultTaskClassInfoStore$StandardTaskAction.execute(DefaultTaskClassInfoStore.java:123)
	at org.gradle.api.internal.AbstractTask$TaskActionWrapper.execute(AbstractTask.java:692)
	at org.gradle.api.internal.AbstractTask$TaskActionWrapper.execute(AbstractTask.java:675)
	at org.gradle.api.internal.tasks.execution.ExecuteActionsTaskExecuter$1.execute(ExecuteActionsTaskExecuter.java:115)
	at org.gradle.api.internal.tasks.execution.ExecuteActionsTaskExecuter$1.execute(ExecuteActionsTaskExecuter.java:109)
	at org.gradle.internal.Transformers$4.transform(Transformers.java:169)
	at org.gradle.internal.progress.DefaultBuildOperationExecutor.run(DefaultBuildOperationExecutor.java:106)
	at org.gradle.internal.progress.DefaultBuildOperationExecutor.run(DefaultBuildOperationExecutor.java:56)
	at org.gradle.api.internal.tasks.execution.ExecuteActionsTaskExecuter.executeAction(ExecuteActionsTaskExecuter.java:109)
	at org.gradle.api.internal.tasks.execution.ExecuteActionsTaskExecuter.executeActions(ExecuteActionsTaskExecuter.java:90)
	at org.gradle.api.internal.tasks.execution.ExecuteActionsTaskExecuter.execute(ExecuteActionsTaskExecuter.java:68)
	at org.gradle.api.internal.tasks.execution.SkipUpToDateTaskExecuter.execute(SkipUpToDateTaskExecuter.java:62)
	at org.gradle.api.internal.tasks.execution.ValidatingTaskExecuter.execute(ValidatingTaskExecuter.java:58)
	at org.gradle.api.internal.tasks.execution.SkipEmptySourceFilesTaskExecuter.execute(SkipEmptySourceFilesTaskExecuter.java:88)
	at org.gradle.api.internal.tasks.execution.ResolveTaskArtifactStateTaskExecuter.execute(ResolveTaskArtifactStateTaskExecuter.java:46)
	at org.gradle.api.internal.tasks.execution.SkipTaskWithNoActionsExecuter.execute(SkipTaskWithNoActionsExecuter.java:51)
	at org.gradle.api.internal.tasks.execution.SkipOnlyIfTaskExecuter.execute(SkipOnlyIfTaskExecuter.java:54)
	at org.gradle.api.internal.tasks.execution.ExecuteAtMostOnceTaskExecuter.execute(ExecuteAtMostOnceTaskExecuter.java:43)
	at org.gradle.api.internal.tasks.execution.CatchExceptionTaskExecuter.execute(CatchExceptionTaskExecuter.java:34)
	at org.gradle.execution.taskgraph.DefaultTaskGraphExecuter$EventFiringTaskWorker$1.execute(DefaultTaskGraphExecuter.java:236)
	at org.gradle.execution.taskgraph.DefaultTaskGraphExecuter$EventFiringTaskWorker$1.execute(DefaultTaskGraphExecuter.java:228)
	at org.gradle.internal.Transformers$4.transform(Transformers.java:169)
	at org.gradle.internal.progress.DefaultBuildOperationExecutor.run(DefaultBuildOperationExecutor.java:106)
	at org.gradle.internal.progress.DefaultBuildOperationExecutor.run(DefaultBuildOperationExecutor.java:61)
	at org.gradle.execution.taskgraph.DefaultTaskGraphExecuter$EventFiringTaskWorker.execute(DefaultTaskGraphExecuter.java:228)
	at org.gradle.execution.taskgraph.DefaultTaskGraphExecuter$EventFiringTaskWorker.execute(DefaultTaskGraphExecuter.java:215)
	at org.gradle.execution.taskgraph.AbstractTaskPlanExecutor$TaskExecutorWorker.processTask(AbstractTaskPlanExecutor.java:77)
	at org.gradle.execution.taskgraph.AbstractTaskPlanExecutor$TaskExecutorWorker.run(AbstractTaskPlanExecutor.java:58)
	at org.gradle.execution.taskgraph.DefaultTaskPlanExecutor.process(DefaultTaskPlanExecutor.java:32)
	at org.gradle.execution.taskgraph.DefaultTaskGraphExecuter.execute(DefaultTaskGraphExecuter.java:113)
	at org.gradle.execution.SelectedTaskExecutionAction.execute(SelectedTaskExecutionAction.java:37)
	at org.gradle.execution.DefaultBuildExecuter.execute(DefaultBuildExecuter.java:37)
	at org.gradle.execution.DefaultBuildExecuter.access$000(DefaultBuildExecuter.java:23)
	at org.gradle.execution.DefaultBuildExecuter$1.proceed(DefaultBuildExecuter.java:43)
	at org.gradle.execution.DryRunBuildExecutionAction.execute(DryRunBuildExecutionAction.java:32)
	at org.gradle.execution.DefaultBuildExecuter.execute(DefaultBuildExecuter.java:37)
	at org.gradle.execution.DefaultBuildExecuter.execute(DefaultBuildExecuter.java:30)
	at org.gradle.initialization.DefaultGradleLauncher$RunTasksAction.execute(DefaultGradleLauncher.java:230)
	at org.gradle.initialization.DefaultGradleLauncher$RunTasksAction.execute(DefaultGradleLauncher.java:227)
	at org.gradle.internal.Transformers$4.transform(Transformers.java:169)
	at org.gradle.internal.progress.DefaultBuildOperationExecutor.run(DefaultBuildOperationExecutor.java:106)
	at org.gradle.internal.progress.DefaultBuildOperationExecutor.run(DefaultBuildOperationExecutor.java:56)
	at org.gradle.initialization.DefaultGradleLauncher.doBuildStages(DefaultGradleLauncher.java:161)
	at org.gradle.initialization.DefaultGradleLauncher.doBuild(DefaultGradleLauncher.java:112)
	at org.gradle.initialization.DefaultGradleLauncher.run(DefaultGradleLauncher.java:95)
	at org.gradle.launcher.exec.GradleBuildController.run(GradleBuildController.java:66)
	at org.gradle.tooling.internal.provider.ExecuteBuildActionRunner.run(ExecuteBuildActionRunner.java:28)
	at org.gradle.launcher.exec.ChainingBuildActionRunner.run(ChainingBuildActionRunner.java:35)
	at org.gradle.launcher.exec.InProcessBuildActionExecuter.execute(InProcessBuildActionExecuter.java:41)
	at org.gradle.launcher.exec.InProcessBuildActionExecuter.execute(InProcessBuildActionExecuter.java:26)
	at org.gradle.tooling.internal.provider.ContinuousBuildActionExecuter.execute(ContinuousBuildActionExecuter.java:75)
	at org.gradle.tooling.internal.provider.ContinuousBuildActionExecuter.execute(ContinuousBuildActionExecuter.java:49)
	at org.gradle.tooling.internal.provider.ServicesSetupBuildActionExecuter.execute(ServicesSetupBuildActionExecuter.java:49)
	at org.gradle.tooling.internal.provider.ServicesSetupBuildActionExecuter.execute(ServicesSetupBuildActionExecuter.java:31)
	at org.gradle.launcher.daemon.server.exec.ExecuteBuild.doBuild(ExecuteBuild.java:67)
	at org.gradle.launcher.daemon.server.exec.BuildCommandOnly.execute(BuildCommandOnly.java:36)
	at org.gradle.launcher.daemon.server.api.DaemonCommandExecution.proceed(DaemonCommandExecution.java:120)
	at org.gradle.launcher.daemon.server.exec.WatchForDisconnection.execute(WatchForDisconnection.java:37)
	at org.gradle.launcher.daemon.server.api.DaemonCommandExecution.proceed(DaemonCommandExecution.java:120)
	at org.gradle.launcher.daemon.server.exec.ResetDeprecationLogger.execute(ResetDeprecationLogger.java:26)
	at org.gradle.launcher.daemon.server.api.DaemonCommandExecution.proceed(DaemonCommandExecution.java:120)
	at org.gradle.launcher.daemon.server.exec.RequestStopIfSingleUsedDaemon.execute(RequestStopIfSingleUsedDaemon.java:34)
	at org.gradle.launcher.daemon.server.api.DaemonCommandExecution.proceed(DaemonCommandExecution.java:120)
	at org.gradle.launcher.daemon.server.exec.ForwardClientInput$2.call(ForwardClientInput.java:74)
	at org.gradle.launcher.daemon.server.exec.ForwardClientInput$2.call(ForwardClientInput.java:72)
	at org.gradle.util.Swapper.swap(Swapper.java:38)
	at org.gradle.launcher.daemon.server.exec.ForwardClientInput.execute(ForwardClientInput.java:72)
	at org.gradle.launcher.daemon.server.api.DaemonCommandExecution.proceed(DaemonCommandExecution.java:120)
	at org.gradle.launcher.daemon.server.exec.LogAndCheckHealth.execute(LogAndCheckHealth.java:55)
	at org.gradle.launcher.daemon.server.api.DaemonCommandExecution.proceed(DaemonCommandExecution.java:120)
	at org.gradle.launcher.daemon.server.exec.LogToClient.doBuild(LogToClient.java:60)
	at org.gradle.launcher.daemon.server.exec.BuildCommandOnly.execute(BuildCommandOnly.java:36)
	at org.gradle.launcher.daemon.server.api.DaemonCommandExecution.proceed(DaemonCommandExecution.java:120)
	at org.gradle.launcher.daemon.server.exec.EstablishBuildEnvironment.doBuild(EstablishBuildEnvironment.java:72)
	at org.gradle.launcher.daemon.server.exec.BuildCommandOnly.execute(BuildCommandOnly.java:36)
	at org.gradle.launcher.daemon.server.api.DaemonCommandExecution.proceed(DaemonCommandExecution.java:120)
	at org.gradle.launcher.daemon.server.exec.StartBuildOrRespondWithBusy$1.run(StartBuildOrRespondWithBusy.java:50)
	at org.gradle.launcher.daemon.server.DaemonStateCoordinator$1.run(DaemonStateCoordinator.java:297)
	at org.gradle.internal.concurrent.ExecutorPolicy$CatchAndRecordFailures.onExecute(ExecutorPolicy.java:63)
	at org.gradle.internal.concurrent.StoppableExecutorImpl$1.run(StoppableExecutorImpl.java:46)
	at java.util.concurrent.ThreadPoolExecutor.runWorker(ThreadPoolExecutor.java:1149)
	at java.util.concurrent.ThreadPoolExecutor$Worker.run(ThreadPoolExecutor.java:624)
	at java.lang.Thread.run(Thread.java:748)
[ant:iajc] MessageHolder:  (6 info)  (1 warning)  (1 error)  (1 fail) 
[ant:iajc] [error   0]: error classpath error: unable to find org.aspectj.lang.JoinPoint (check that aspectjrt.jar is in your classpath)
:util:org.eclipse.virgo.util.jmx:compileTestAspect FAILED
:util:org.eclipse.virgo.util.jmx:processTestResources NO-SOURCE
:util:org.eclipse.virgo.util.math:findbugsMain FAILED
:util:org.eclipse.virgo.util.math:compileTestJavaPicked up JAVA_TOOL_OPTIONS: -Xmx2G -Djava.io.tmpdir=/tmp/genie.virgo
Error: Could not find or load main class org.eclipse.jdt.internal.compiler.batch.Main
 FAILED
:util:org.eclipse.virgo.util.math:processTestResources NO-SOURCE
:util:org.eclipse.virgo.util.osgi:findbugsMain FAILED
:util:org.eclipse.virgo.util.osgi:compileTestJavaPicked up JAVA_TOOL_OPTIONS: -Xmx2G -Djava.io.tmpdir=/tmp/genie.virgo
Error: Could not find or load main class org.eclipse.jdt.internal.compiler.batch.Main
 FAILED
:util:org.eclipse.virgo.util.osgi:processTestResources
:util:org.eclipse.virgo.util.osgi.manifest:findbugsMain FAILED
:util:org.eclipse.virgo.util.osgi.manifest:compileTestJavaPicked up JAVA_TOOL_OPTIONS: -Xmx2G -Djava.io.tmpdir=/tmp/genie.virgo
Error: Could not find or load main class org.eclipse.jdt.internal.compiler.batch.Main
 FAILED
:util:org.eclipse.virgo.util.osgi.manifest:processTestResources
:util:org.eclipse.virgo.util.parser.launcher:findbugsMain FAILED
:util:org.eclipse.virgo.util.parser.launcher:compileTestJavaPicked up JAVA_TOOL_OPTIONS: -Xmx2G -Djava.io.tmpdir=/tmp/genie.virgo
Error: Could not find or load main class org.eclipse.jdt.internal.compiler.batch.Main
 FAILED
:util:org.eclipse.virgo.util.parser.launcher:processTestResources
:util:org.eclipse.virgo.util.parser.manifest:findbugsMain FAILED
:util:org.eclipse.virgo.util.parser.manifest:compileTestJavaPicked up JAVA_TOOL_OPTIONS: -Xmx2G -Djava.io.tmpdir=/tmp/genie.virgo
Error: Could not find or load main class org.eclipse.jdt.internal.compiler.batch.Main
 FAILED
:util:org.eclipse.virgo.util.parser.manifest:processTestResources
:web:org.eclipse.virgo.web.core:findbugsMain FAILED
:web:org.eclipse.virgo.web.core:compileTestJavaPicked up JAVA_TOOL_OPTIONS: -Xmx2G -Djava.io.tmpdir=/tmp/genie.virgo
Error: Could not find or load main class org.eclipse.jdt.internal.compiler.batch.Main
 FAILED
:web:org.eclipse.virgo.web.core:processTestResources NO-SOURCE
:web:org.eclipse.virgo.web.dm:findbugsMain FAILED
:web:org.eclipse.virgo.web.dm:compileTestJavaPicked up JAVA_TOOL_OPTIONS: -Xmx2G -Djava.io.tmpdir=/tmp/genie.virgo
Error: Could not find or load main class org.eclipse.jdt.internal.compiler.batch.Main
 FAILED
:web:org.eclipse.virgo.web.dm:processTestResources NO-SOURCE
:web:org.eclipse.virgo.web.enterprise.appdeployer:findbugsMain FAILED
:web:org.eclipse.virgo.web.enterprise.appdeployer:compileTestJava NO-SOURCE
:web:org.eclipse.virgo.web.enterprise.appdeployer:processTestResources NO-SOURCE
:web:org.eclipse.virgo.web.enterprise.appdeployer:testClasses UP-TO-DATE
:web:org.eclipse.virgo.web.enterprise.appdeployer:test NO-SOURCE
:web:org.eclipse.virgo.web.enterprise.applistener:findbugsMain FAILED
:web:org.eclipse.virgo.web.enterprise.applistener:compileTestJava NO-SOURCE
:web:org.eclipse.virgo.web.enterprise.applistener:processTestResources NO-SOURCE
:web:org.eclipse.virgo.web.enterprise.applistener:testClasses UP-TO-DATE
:web:org.eclipse.virgo.web.enterprise.applistener:test NO-SOURCE
:web:org.eclipse.virgo.web.enterprise.catalina.fragment.webbeans:findbugsMain NO-SOURCE
:web:org.eclipse.virgo.web.enterprise.catalina.fragment.webbeans:compileTestJava NO-SOURCE
:web:org.eclipse.virgo.web.enterprise.catalina.fragment.webbeans:processTestResources NO-SOURCE
:web:org.eclipse.virgo.web.enterprise.catalina.fragment.webbeans:testClasses UP-TO-DATE
:web:org.eclipse.virgo.web.enterprise.catalina.fragment.webbeans:test NO-SOURCE
:web:org.eclipse.virgo.web.enterprise.catalina.fragment.webbeans:check UP-TO-DATE
:web:org.eclipse.virgo.web.enterprise.catalina.fragment.webbeans:build
:web:org.eclipse.virgo.web.enterprise.javax.persistence.extension:findbugsMain FAILED
:web:org.eclipse.virgo.web.enterprise.javax.persistence.extension:compileTestJavaPicked up JAVA_TOOL_OPTIONS: -Xmx2G -Djava.io.tmpdir=/tmp/genie.virgo
Error: Could not find or load main class org.eclipse.jdt.internal.compiler.batch.Main
 FAILED
:web:org.eclipse.virgo.web.enterprise.javax.persistence.extension:processTestResources NO-SOURCE
:web:org.eclipse.virgo.web.enterprise.javax.persistence.provider.initializer:findbugsMain FAILED
:web:org.eclipse.virgo.web.enterprise.javax.persistence.provider.initializer:compileTestJavaPicked up JAVA_TOOL_OPTIONS: -Xmx2G -Djava.io.tmpdir=/tmp/genie.virgo
Error: Could not find or load main class org.eclipse.jdt.internal.compiler.batch.Main
 FAILED
:web:org.eclipse.virgo.web.enterprise.javax.persistence.provider.initializer:processTestResources NO-SOURCE
:web:org.eclipse.virgo.web.enterprise.jsf.support:findbugsMain FAILED
:web:org.eclipse.virgo.web.enterprise.jsf.support:compileTestJava NO-SOURCE
:web:org.eclipse.virgo.web.enterprise.jsf.support:processTestResources NO-SOURCE
:web:org.eclipse.virgo.web.enterprise.jsf.support:testClasses UP-TO-DATE
:web:org.eclipse.virgo.web.enterprise.jsf.support:test NO-SOURCE
:web:org.eclipse.virgo.web.enterprise.openejb.fragment.bval:findbugsMain NO-SOURCE
:web:org.eclipse.virgo.web.enterprise.openejb.fragment.bval:compileTestJava NO-SOURCE
:web:org.eclipse.virgo.web.enterprise.openejb.fragment.bval:processTestResources NO-SOURCE
:web:org.eclipse.virgo.web.enterprise.openejb.fragment.bval:testClasses UP-TO-DATE
:web:org.eclipse.virgo.web.enterprise.openejb.fragment.bval:test NO-SOURCE
:web:org.eclipse.virgo.web.enterprise.openejb.fragment.bval:check UP-TO-DATE
:web:org.eclipse.virgo.web.enterprise.openejb.fragment.bval:build
:web:org.eclipse.virgo.web.enterprise.openejb.fragment.jotm:findbugsMain FAILED
:web:org.eclipse.virgo.web.enterprise.openejb.fragment.jotm:compileTestJava NO-SOURCE
:web:org.eclipse.virgo.web.enterprise.openejb.fragment.jotm:processTestResources NO-SOURCE
:web:org.eclipse.virgo.web.enterprise.openejb.fragment.jotm:testClasses UP-TO-DATE
:web:org.eclipse.virgo.web.enterprise.openejb.fragment.jotm:test NO-SOURCE
:web:org.eclipse.virgo.web.enterprise.openejb.fragment.jpa:findbugsMain NO-SOURCE
:web:org.eclipse.virgo.web.enterprise.openejb.fragment.jpa:compileTestJava NO-SOURCE
:web:org.eclipse.virgo.web.enterprise.openejb.fragment.jpa:processTestResources NO-SOURCE
:web:org.eclipse.virgo.web.enterprise.openejb.fragment.jpa:testClasses UP-TO-DATE
:web:org.eclipse.virgo.web.enterprise.openejb.fragment.jpa:test NO-SOURCE
:web:org.eclipse.virgo.web.enterprise.openejb.fragment.jpa:check UP-TO-DATE
:web:org.eclipse.virgo.web.enterprise.openejb.fragment.jpa:build
:web:org.eclipse.virgo.web.enterprise.openejb.fragment.webbeans:findbugsMain NO-SOURCE
:web:org.eclipse.virgo.web.enterprise.openejb.fragment.webbeans:compileTestJava NO-SOURCE
:web:org.eclipse.virgo.web.enterprise.openejb.fragment.webbeans:processTestResources NO-SOURCE
:web:org.eclipse.virgo.web.enterprise.openejb.fragment.webbeans:testClasses UP-TO-DATE
:web:org.eclipse.virgo.web.enterprise.openejb.fragment.webbeans:test NO-SOURCE
:web:org.eclipse.virgo.web.enterprise.openejb.fragment.webbeans:check UP-TO-DATE
:web:org.eclipse.virgo.web.enterprise.openejb.fragment.webbeans:build
:web:org.eclipse.virgo.web.enterprise.openejb.initialiser:findbugsMain FAILED
:web:org.eclipse.virgo.web.enterprise.openejb.initialiser:compileTestJava NO-SOURCE
:web:org.eclipse.virgo.web.enterprise.openejb.initialiser:processTestResources NO-SOURCE
:web:org.eclipse.virgo.web.enterprise.openejb.initialiser:testClasses UP-TO-DATE
:web:org.eclipse.virgo.web.enterprise.openejb.initialiser:test NO-SOURCE
:web:org.eclipse.virgo.web.enterprise.openejb.jpa.integration:findbugsMain FAILED
:web:org.eclipse.virgo.web.enterprise.openejb.jpa.integration:compileTestJava NO-SOURCE
:web:org.eclipse.virgo.web.enterprise.openejb.jpa.integration:processTestResources NO-SOURCE
:web:org.eclipse.virgo.web.enterprise.openejb.jpa.integration:testClasses UP-TO-DATE
:web:org.eclipse.virgo.web.enterprise.openejb.jpa.integration:test NO-SOURCE
:web:org.eclipse.virgo.web.enterprise.openejb.tomcat.factory:findbugsMain FAILED
:web:org.eclipse.virgo.web.enterprise.openejb.tomcat.factory:compileTestJavaPicked up JAVA_TOOL_OPTIONS: -Xmx2G -Djava.io.tmpdir=/tmp/genie.virgo
Error: Could not find or load main class org.eclipse.jdt.internal.compiler.batch.Main
 FAILED
:web:org.eclipse.virgo.web.enterprise.openejb.tomcat.factory:processTestResources NO-SOURCE
:web:org.eclipse.virgo.web.enterprise.openwebbeans.initialiser:findbugsMain FAILED
:web:org.eclipse.virgo.web.enterprise.openwebbeans.initialiser:compileTestJava NO-SOURCE
:web:org.eclipse.virgo.web.enterprise.openwebbeans.initialiser:processTestResources NO-SOURCE
:web:org.eclipse.virgo.web.enterprise.openwebbeans.initialiser:testClasses UP-TO-DATE
:web:org.eclipse.virgo.web.enterprise.openwebbeans.initialiser:test NO-SOURCE
:web:org.eclipse.virgo.web.enterprise.persistence.openejb.classloading.hook:findbugsMain FAILED
:web:org.eclipse.virgo.web.enterprise.persistence.openejb.classloading.hook:compileTestJavaPicked up JAVA_TOOL_OPTIONS: -Xmx2G -Djava.io.tmpdir=/tmp/genie.virgo
Error: Could not find or load main class org.eclipse.jdt.internal.compiler.batch.Main
 FAILED
:web:org.eclipse.virgo.web.enterprise.persistence.openejb.classloading.hook:processTestResources NO-SOURCE
:web:org.eclipse.virgo.web.enterprise.security:findbugsMain FAILED
:web:org.eclipse.virgo.web.enterprise.security:compileTestJavaPicked up JAVA_TOOL_OPTIONS: -Xmx2G -Djava.io.tmpdir=/tmp/genie.virgo
Error: Could not find or load main class org.eclipse.jdt.internal.compiler.batch.Main
 FAILED
:web:org.eclipse.virgo.web.enterprise.security:processTestResources NO-SOURCE
:web:org.eclipse.virgo.web.enterprise.security.openejb.classloading.hook:findbugsMain FAILED
:web:org.eclipse.virgo.web.enterprise.security.openejb.classloading.hook:compileTestJava NO-SOURCE
:web:org.eclipse.virgo.web.enterprise.security.openejb.classloading.hook:processTestResources NO-SOURCE
:web:org.eclipse.virgo.web.enterprise.security.openejb.classloading.hook:testClasses UP-TO-DATE
:web:org.eclipse.virgo.web.enterprise.security.openejb.classloading.hook:test NO-SOURCE
:web:org.eclipse.virgo.web.enterprise.security.valve:findbugsMain FAILED
:web:org.eclipse.virgo.web.enterprise.security.valve:compileTestJava NO-SOURCE
:web:org.eclipse.virgo.web.enterprise.security.valve:processTestResources NO-SOURCE
:web:org.eclipse.virgo.web.enterprise.security.valve:testClasses UP-TO-DATE
:web:org.eclipse.virgo.web.enterprise.security.valve:test NO-SOURCE
:web:org.eclipse.virgo.web.enterprise.services.accessor:findbugsMain FAILED
:web:org.eclipse.virgo.web.enterprise.services.accessor:compileTestJavaPicked up JAVA_TOOL_OPTIONS: -Xmx2G -Djava.io.tmpdir=/tmp/genie.virgo
Error: Could not find or load main class org.eclipse.jdt.internal.compiler.batch.Main
 FAILED
:web:org.eclipse.virgo.web.enterprise.services.accessor:processTestResources NO-SOURCE
:web:org.eclipse.virgo.web.servlet.adapter:findbugsMain NO-SOURCE
:web:org.eclipse.virgo.web.servlet.adapter:compileTestJava NO-SOURCE
:web:org.eclipse.virgo.web.servlet.adapter:processTestResources NO-SOURCE
:web:org.eclipse.virgo.web.servlet.adapter:testClasses UP-TO-DATE
:web:org.eclipse.virgo.web.servlet.adapter:test NO-SOURCE
:web:org.eclipse.virgo.web.servlet.adapter:check UP-TO-DATE
:web:org.eclipse.virgo.web.servlet.adapter:build
:web:org.eclipse.virgo.web.spring.integration:findbugsMain NO-SOURCE
:web:org.eclipse.virgo.web.spring.integration:compileTestJava NO-SOURCE
:web:org.eclipse.virgo.web.spring.integration:processTestResources NO-SOURCE
:web:org.eclipse.virgo.web.spring.integration:testClasses UP-TO-DATE
:web:org.eclipse.virgo.web.spring.integration:test NO-SOURCE
:web:org.eclipse.virgo.web.spring.integration:check UP-TO-DATE
:web:org.eclipse.virgo.web.spring.integration:build
:web:org.eclipse.virgo.web.tomcat.support:findbugsMain FAILED
:web:org.eclipse.virgo.web.tomcat.support:compileTestJava NO-SOURCE
:web:org.eclipse.virgo.web.tomcat.support:processTestResources NO-SOURCE
:web:org.eclipse.virgo.web.tomcat.support:testClasses UP-TO-DATE
:web:org.eclipse.virgo.web.tomcat.support:test NO-SOURCE
:web:org.eclipse.virgo.web.war.deployer:findbugsMain FAILED
:web:org.eclipse.virgo.web.war.deployer:compileTestJavaPicked up JAVA_TOOL_OPTIONS: -Xmx2G -Djava.io.tmpdir=/tmp/genie.virgo
Error: Could not find or load main class org.eclipse.jdt.internal.compiler.batch.Main
 FAILED
:web:org.eclipse.virgo.web.war.deployer:processTestResources
:packaging:jetty-server:org.eclipse.virgo.jetty.smoketest:sourcesJar
:packaging:jetty-server:org.eclipse.virgo.jetty.smoketest:assemble
:packaging:jetty-server:org.eclipse.virgo.jetty.smoketest:findbugsMain NO-SOURCE
:packaging:jetty-server:org.eclipse.virgo.jetty.smoketest:compileTestJava NO-SOURCE
:packaging:jetty-server:org.eclipse.virgo.jetty.smoketest:processTestResources NO-SOURCE
:packaging:jetty-server:org.eclipse.virgo.jetty.smoketest:testClasses UP-TO-DATE
:packaging:jetty-server:org.eclipse.virgo.jetty.smoketest:test NO-SOURCE
:packaging:jetty-server:org.eclipse.virgo.jetty.smoketest:check UP-TO-DATE
:packaging:jetty-server:org.eclipse.virgo.jetty.smoketest:build
:packaging:kernel:org.eclipse.virgo.kernel.smoketest:sourcesJar
:packaging:kernel:org.eclipse.virgo.kernel.smoketest:assemble
:packaging:kernel:org.eclipse.virgo.kernel.smoketest:findbugsMain NO-SOURCE
:packaging:kernel:org.eclipse.virgo.kernel.smoketest:compileTestJava NO-SOURCE
:packaging:kernel:org.eclipse.virgo.kernel.smoketest:processTestResources NO-SOURCE
:packaging:kernel:org.eclipse.virgo.kernel.smoketest:testClasses UP-TO-DATE
:packaging:kernel:org.eclipse.virgo.kernel.smoketest:test NO-SOURCE
:packaging:kernel:org.eclipse.virgo.kernel.smoketest:check UP-TO-DATE
:packaging:kernel:org.eclipse.virgo.kernel.smoketest:build
:packaging:nano:org.eclipse.virgo.nano.smoketest:sourcesJar
:packaging:nano:org.eclipse.virgo.nano.smoketest:assemble
:packaging:nano:org.eclipse.virgo.nano.smoketest:findbugsMain NO-SOURCE
:packaging:nano:org.eclipse.virgo.nano.smoketest:compileTestJava NO-SOURCE
:packaging:nano:org.eclipse.virgo.nano.smoketest:processTestResources NO-SOURCE
:packaging:nano:org.eclipse.virgo.nano.smoketest:testClasses UP-TO-DATE
:packaging:nano:org.eclipse.virgo.nano.smoketest:test NO-SOURCE
:packaging:nano:org.eclipse.virgo.nano.smoketest:check UP-TO-DATE
:packaging:nano:org.eclipse.virgo.nano.smoketest:build
:packaging:tomcat-server:org.eclipse.virgo.tomcat.smoketest:sourcesJar
:packaging:tomcat-server:org.eclipse.virgo.tomcat.smoketest:assemble
:packaging:tomcat-server:org.eclipse.virgo.tomcat.smoketest:findbugsMain NO-SOURCE
:packaging:tomcat-server:org.eclipse.virgo.tomcat.smoketest:compileTestJava NO-SOURCE
:packaging:tomcat-server:org.eclipse.virgo.tomcat.smoketest:processTestResources NO-SOURCE
:packaging:tomcat-server:org.eclipse.virgo.tomcat.smoketest:testClasses UP-TO-DATE
:packaging:tomcat-server:org.eclipse.virgo.tomcat.smoketest:test NO-SOURCE
:packaging:tomcat-server:org.eclipse.virgo.tomcat.smoketest:check UP-TO-DATE
:packaging:tomcat-server:org.eclipse.virgo.tomcat.smoketest:build
:packaging:jetty-server:installDist
:packaging:kernel:installDist
:packaging:nano:installDist
:packaging:tomcat-server:installDist
:packaging:nano:installFullDist
:packaging:nano:installRapDist

FAILURE: Build completed with 56 failures.

1: Task failed with an exception.
-----------
* What went wrong:
Execution failed for task ':repository:org.eclipse.virgo.repository:findbugsMain'.
> Failed to run Gradle FindBugs Worker
   > Process 'Gradle FindBugs Worker 58' finished with non-zero exit value 1

* Try:
Run with --stacktrace option to get the stack trace. Run with --info or --debug option to get more log output.
==============================================================================

2: Task failed with an exception.
-----------
* What went wrong:
Execution failed for task ':repository:org.eclipse.virgo.repository:compileTestJava'.
> Compilation failed with exit code 1; see the compiler error output for details.

* Try:
Run with --stacktrace option to get the stack trace. Run with --info or --debug option to get more log output.
==============================================================================

3: Task failed with an exception.
-----------
* What went wrong:
Execution failed for task ':test:org.eclipse.virgo.test.framework:findbugsMain'.
> Failed to run Gradle FindBugs Worker
   > Process 'Gradle FindBugs Worker 59' finished with non-zero exit value 1

* Try:
Run with --stacktrace option to get the stack trace. Run with --info or --debug option to get more log output.
==============================================================================

4: Task failed with an exception.
-----------
* What went wrong:
Could not resolve all dependencies for configuration ':test:org.eclipse.virgo.test.framework:testCompileClasspath'.
> Could not resolve org.ops4j.base:ops4j-base-lang:1.4.0.
  Required by:
      project :test:org.eclipse.virgo.test.framework > org.ops4j.pax.exam:pax-exam-junit4:4.1.0
      project :test:org.eclipse.virgo.test.framework > org.ops4j.pax.exam:pax-exam-junit4:4.1.0 > org.ops4j.pax.exam:pax-exam-spi:4.1.0 > org.ops4j.pax.exam:pax-exam:4.1.0
   > Could not resolve org.ops4j.base:ops4j-base-lang:1.4.0.
      > Could not parse POM https://repo1.maven.org/maven2/org/ops4j/base/ops4j-base-lang/1.4.0/ops4j-base-lang-1.4.0.pom
         > Could not resolve org.ops4j:base:1.4.0.
            > Could not resolve org.ops4j:base:1.4.0.
               > Could not parse POM https://repo1.maven.org/maven2/org/ops4j/base/1.4.0/base-1.4.0.pom
                  > Could not resolve org.ops4j:master:3.1.0.
                     > Could not resolve org.ops4j:master:3.1.0.
                        > Could not parse POM https://repo1.maven.org/maven2/org/ops4j/master/3.1.0/master-3.1.0.pom
                           > Could not read 'file:/opt/public/hipp/homes/genie.virgo/.gradle/caches/modules-2/files-2.1/org.sonatype.oss/oss-parent/7/46b8a785b60a2767095b8611613b58577e96d4c9/oss-parent-7.pom' as it does not exist.
                     > Could not resolve org.ops4j:master:3.1.0.
                        > Could not parse Ivy file http://build.eclipse.org/rt/virgo/ivy/bundles/release/org.ops4j/master/3.1.0/ivy-3.1.0.xml
                           > The markup in the document preceding the root element must be well-formed.
                     > Could not resolve org.ops4j:master:3.1.0.
                        > Failed to download SHA1 for resource 'http://build.eclipse.org/rt/virgo/ivy/bundles/milestone/org.ops4j/master/3.1.0/ivy-3.1.0.xml'.
                           > For input string: "<!"
            > Could not resolve org.ops4j:base:1.4.0.
               > Could not parse Ivy file http://build.eclipse.org/rt/virgo/ivy/bundles/release/org.ops4j/base/1.4.0/ivy-1.4.0.xml
                  > The markup in the document preceding the root element must be well-formed.
            > Could not resolve org.ops4j:base:1.4.0.
               > Failed to download SHA1 for resource 'http://build.eclipse.org/rt/virgo/ivy/bundles/milestone/org.ops4j/base/1.4.0/ivy-1.4.0.xml'.
                  > For input string: "<!"
   > Could not resolve org.ops4j.base:ops4j-base-lang:1.4.0.
      > Could not parse Ivy file http://build.eclipse.org/rt/virgo/ivy/bundles/release/org.ops4j.base/ops4j-base-lang/1.4.0/ivy-1.4.0.xml
         > The markup in the document preceding the root element must be well-formed.
   > Could not resolve org.ops4j.base:ops4j-base-lang:1.4.0.
      > Failed to download SHA1 for resource 'http://build.eclipse.org/rt/virgo/ivy/bundles/milestone/org.ops4j.base/ops4j-base-lang/1.4.0/ivy-1.4.0.xml'.
         > For input string: "<!"
> Could not resolve org.ops4j.base:ops4j-base-spi:1.4.0.
  Required by:
      project :test:org.eclipse.virgo.test.framework > org.ops4j.pax.exam:pax-exam-junit4:4.1.0 > org.ops4j.pax.exam:pax-exam-spi:4.1.0
   > Could not resolve org.ops4j.base:ops4j-base-spi:1.4.0.
      > Could not parse POM https://repo1.maven.org/maven2/org/ops4j/base/ops4j-base-spi/1.4.0/ops4j-base-spi-1.4.0.pom
         > Could not resolve org.ops4j:base:1.4.0.
            > Could not resolve org.ops4j:base:1.4.0.
               > Could not parse POM https://repo1.maven.org/maven2/org/ops4j/base/1.4.0/base-1.4.0.pom
                  > Could not resolve org.ops4j:master:3.1.0.
                     > Could not resolve org.ops4j:master:3.1.0.
                        > Could not parse POM https://repo1.maven.org/maven2/org/ops4j/master/3.1.0/master-3.1.0.pom
                           > Could not read 'file:/opt/public/hipp/homes/genie.virgo/.gradle/caches/modules-2/files-2.1/org.sonatype.oss/oss-parent/7/46b8a785b60a2767095b8611613b58577e96d4c9/oss-parent-7.pom' as it does not exist.
                     > Could not resolve org.ops4j:master:3.1.0.
                        > Could not parse Ivy file http://build.eclipse.org/rt/virgo/ivy/bundles/release/org.ops4j/master/3.1.0/ivy-3.1.0.xml
                           > The markup in the document preceding the root element must be well-formed.
                     > Could not resolve org.ops4j:master:3.1.0.
                        > Failed to download SHA1 for resource 'http://build.eclipse.org/rt/virgo/ivy/bundles/milestone/org.ops4j/master/3.1.0/ivy-3.1.0.xml'.
                           > For input string: "<!"
            > Could not resolve org.ops4j:base:1.4.0.
               > Could not parse Ivy file http://build.eclipse.org/rt/virgo/ivy/bundles/release/org.ops4j/base/1.4.0/ivy-1.4.0.xml
                  > The markup in the document preceding the root element must be well-formed.
            > Could not resolve org.ops4j:base:1.4.0.
               > Failed to download SHA1 for resource 'http://build.eclipse.org/rt/virgo/ivy/bundles/milestone/org.ops4j/base/1.4.0/ivy-1.4.0.xml'.
                  > For input string: "<!"
   > Could not resolve org.ops4j.base:ops4j-base-spi:1.4.0.
      > Could not parse Ivy file http://build.eclipse.org/rt/virgo/ivy/bundles/release/org.ops4j.base/ops4j-base-spi/1.4.0/ivy-1.4.0.xml
         > The markup in the document preceding the root element must be well-formed.
   > Could not resolve org.ops4j.base:ops4j-base-spi:1.4.0.
      > Failed to download SHA1 for resource 'http://build.eclipse.org/rt/virgo/ivy/bundles/milestone/org.ops4j.base/ops4j-base-spi/1.4.0/ivy-1.4.0.xml'.
         > For input string: "<!"
> Could not resolve org.ops4j.pax.tinybundles:tinybundles:2.0.0.
  Required by:
      project :test:org.eclipse.virgo.test.framework > org.ops4j.pax.exam:pax-exam-junit4:4.1.0 > org.ops4j.pax.exam:pax-exam-spi:4.1.0
   > Could not resolve org.ops4j.pax.tinybundles:tinybundles:2.0.0.
      > Could not parse POM https://repo1.maven.org/maven2/org/ops4j/pax/tinybundles/tinybundles/2.0.0/tinybundles-2.0.0.pom
         > Could not resolve org.ops4j:master:3.2.0.
            > Could not resolve org.ops4j:master:3.2.0.
               > Could not parse POM https://repo1.maven.org/maven2/org/ops4j/master/3.2.0/master-3.2.0.pom
                  > Could not read 'file:/opt/public/hipp/homes/genie.virgo/.gradle/caches/modules-2/files-2.1/org.sonatype.oss/oss-parent/7/46b8a785b60a2767095b8611613b58577e96d4c9/oss-parent-7.pom' as it does not exist.
            > Could not resolve org.ops4j:master:3.2.0.
               > Could not parse Ivy file http://build.eclipse.org/rt/virgo/ivy/bundles/release/org.ops4j/master/3.2.0/ivy-3.2.0.xml
                  > The markup in the document preceding the root element must be well-formed.
            > Could not resolve org.ops4j:master:3.2.0.
               > Failed to download SHA1 for resource 'http://build.eclipse.org/rt/virgo/ivy/bundles/milestone/org.ops4j/master/3.2.0/ivy-3.2.0.xml'.
                  > For input string: "<!"
   > Could not resolve org.ops4j.pax.tinybundles:tinybundles:2.0.0.
      > Could not parse Ivy file http://build.eclipse.org/rt/virgo/ivy/bundles/release/org.ops4j.pax.tinybundles/tinybundles/2.0.0/ivy-2.0.0.xml
         > The markup in the document preceding the root element must be well-formed.
   > Could not resolve org.ops4j.pax.tinybundles:tinybundles:2.0.0.
      > Failed to download SHA1 for resource 'http://build.eclipse.org/rt/virgo/ivy/bundles/milestone/org.ops4j.pax.tinybundles/tinybundles/2.0.0/ivy-2.0.0.xml'.
         > For input string: "<!"
> Could not resolve org.ops4j.base:ops4j-base-store:1.4.0.
  Required by:
      project :test:org.eclipse.virgo.test.framework > org.ops4j.pax.exam:pax-exam-junit4:4.1.0 > org.ops4j.pax.exam:pax-exam-spi:4.1.0 > org.ops4j.pax.exam:pax-exam:4.1.0
   > Could not resolve org.ops4j.base:ops4j-base-store:1.4.0.
      > Could not parse POM https://repo1.maven.org/maven2/org/ops4j/base/ops4j-base-store/1.4.0/ops4j-base-store-1.4.0.pom
         > Could not resolve org.ops4j:base:1.4.0.
            > Could not resolve org.ops4j:base:1.4.0.
               > Could not parse POM https://repo1.maven.org/maven2/org/ops4j/base/1.4.0/base-1.4.0.pom
                  > Could not resolve org.ops4j:master:3.1.0.
                     > Could not resolve org.ops4j:master:3.1.0.
                        > Could not parse POM https://repo1.maven.org/maven2/org/ops4j/master/3.1.0/master-3.1.0.pom
                           > Could not read 'file:/opt/public/hipp/homes/genie.virgo/.gradle/caches/modules-2/files-2.1/org.sonatype.oss/oss-parent/7/46b8a785b60a2767095b8611613b58577e96d4c9/oss-parent-7.pom' as it does not exist.
                     > Could not resolve org.ops4j:master:3.1.0.
                        > Could not parse Ivy file http://build.eclipse.org/rt/virgo/ivy/bundles/release/org.ops4j/master/3.1.0/ivy-3.1.0.xml
                           > The markup in the document preceding the root element must be well-formed.
                     > Could not resolve org.ops4j:master:3.1.0.
                        > Failed to download SHA1 for resource 'http://build.eclipse.org/rt/virgo/ivy/bundles/milestone/org.ops4j/master/3.1.0/ivy-3.1.0.xml'.
                           > For input string: "<!"
            > Could not resolve org.ops4j:base:1.4.0.
               > Could not parse Ivy file http://build.eclipse.org/rt/virgo/ivy/bundles/release/org.ops4j/base/1.4.0/ivy-1.4.0.xml
                  > The markup in the document preceding the root element must be well-formed.
            > Could not resolve org.ops4j:base:1.4.0.
               > Failed to download SHA1 for resource 'http://build.eclipse.org/rt/virgo/ivy/bundles/milestone/org.ops4j/base/1.4.0/ivy-1.4.0.xml'.
                  > For input string: "<!"
   > Could not resolve org.ops4j.base:ops4j-base-store:1.4.0.
      > Could not parse Ivy file http://build.eclipse.org/rt/virgo/ivy/bundles/release/org.ops4j.base/ops4j-base-store/1.4.0/ivy-1.4.0.xml
         > The markup in the document preceding the root element must be well-formed.
   > Could not resolve org.ops4j.base:ops4j-base-store:1.4.0.
      > Failed to download SHA1 for resource 'http://build.eclipse.org/rt/virgo/ivy/bundles/milestone/org.ops4j.base/ops4j-base-store/1.4.0/ivy-1.4.0.xml'.
         > For input string: "<!"
> Could not resolve org.ops4j.base:ops4j-base-util-property:1.4.0.
  Required by:
      project :test:org.eclipse.virgo.test.framework > org.ops4j.pax.exam:pax-exam-junit4:4.1.0 > org.ops4j.pax.exam:pax-exam-spi:4.1.0 > org.ops4j.pax.exam:pax-exam:4.1.0
   > Could not resolve org.ops4j.base:ops4j-base-util-property:1.4.0.
      > Could not parse POM https://repo1.maven.org/maven2/org/ops4j/base/ops4j-base-util-property/1.4.0/ops4j-base-util-property-1.4.0.pom
         > Could not resolve org.ops4j:base:1.4.0.
            > Could not resolve org.ops4j:base:1.4.0.
               > Could not parse POM https://repo1.maven.org/maven2/org/ops4j/base/1.4.0/base-1.4.0.pom
                  > Could not resolve org.ops4j:master:3.1.0.
                     > Could not resolve org.ops4j:master:3.1.0.
                        > Could not parse POM https://repo1.maven.org/maven2/org/ops4j/master/3.1.0/master-3.1.0.pom
                           > Could not read 'file:/opt/public/hipp/homes/genie.virgo/.gradle/caches/modules-2/files-2.1/org.sonatype.oss/oss-parent/7/46b8a785b60a2767095b8611613b58577e96d4c9/oss-parent-7.pom' as it does not exist.
                     > Could not resolve org.ops4j:master:3.1.0.
                        > Could not parse Ivy file http://build.eclipse.org/rt/virgo/ivy/bundles/release/org.ops4j/master/3.1.0/ivy-3.1.0.xml
                           > The markup in the document preceding the root element must be well-formed.
                     > Could not resolve org.ops4j:master:3.1.0.
                        > Failed to download SHA1 for resource 'http://build.eclipse.org/rt/virgo/ivy/bundles/milestone/org.ops4j/master/3.1.0/ivy-3.1.0.xml'.
                           > For input string: "<!"
            > Could not resolve org.ops4j:base:1.4.0.
               > Could not parse Ivy file http://build.eclipse.org/rt/virgo/ivy/bundles/release/org.ops4j/base/1.4.0/ivy-1.4.0.xml
                  > The markup in the document preceding the root element must be well-formed.
            > Could not resolve org.ops4j:base:1.4.0.
               > Failed to download SHA1 for resource 'http://build.eclipse.org/rt/virgo/ivy/bundles/milestone/org.ops4j/base/1.4.0/ivy-1.4.0.xml'.
                  > For input string: "<!"
   > Could not resolve org.ops4j.base:ops4j-base-util-property:1.4.0.
      > Could not parse Ivy file http://build.eclipse.org/rt/virgo/ivy/bundles/release/org.ops4j.base/ops4j-base-util-property/1.4.0/ivy-1.4.0.xml
         > The markup in the document preceding the root element must be well-formed.
   > Could not resolve org.ops4j.base:ops4j-base-util-property:1.4.0.
      > Failed to download SHA1 for resource 'http://build.eclipse.org/rt/virgo/ivy/bundles/milestone/org.ops4j.base/ops4j-base-util-property/1.4.0/ivy-1.4.0.xml'.
         > For input string: "<!"

* Try:
Run with --stacktrace option to get the stack trace. Run with --info or --debug option to get more log output.
==============================================================================

5: Task failed with an exception.
-----------
* What went wrong:
Execution failed for task ':test:org.eclipse.virgo.test.launcher:findbugsMain'.
> Failed to run Gradle FindBugs Worker
   > Process 'Gradle FindBugs Worker 60' finished with non-zero exit value 1

* Try:
Run with --stacktrace option to get the stack trace. Run with --info or --debug option to get more log output.
==============================================================================

6: Task failed with an exception.
-----------
* What went wrong:
Could not resolve all dependencies for configuration ':test:org.eclipse.virgo.test.launcher:testCompileClasspath'.
> Could not resolve org.ops4j.base:ops4j-base-lang:1.4.0.
  Required by:
      project :test:org.eclipse.virgo.test.launcher > org.ops4j.pax.exam:pax-exam-junit4:4.1.0
      project :test:org.eclipse.virgo.test.launcher > org.ops4j.pax.exam:pax-exam-junit4:4.1.0 > org.ops4j.pax.exam:pax-exam-spi:4.1.0 > org.ops4j.pax.exam:pax-exam:4.1.0
   > Could not resolve org.ops4j.base:ops4j-base-lang:1.4.0.
      > Could not parse POM https://repo1.maven.org/maven2/org/ops4j/base/ops4j-base-lang/1.4.0/ops4j-base-lang-1.4.0.pom
         > Could not resolve org.ops4j:base:1.4.0.
            > Could not resolve org.ops4j:base:1.4.0.
               > Could not parse POM https://repo1.maven.org/maven2/org/ops4j/base/1.4.0/base-1.4.0.pom
                  > Could not resolve org.ops4j:master:3.1.0.
                     > Could not resolve org.ops4j:master:3.1.0.
                        > Could not parse POM https://repo1.maven.org/maven2/org/ops4j/master/3.1.0/master-3.1.0.pom
                           > Could not read 'file:/opt/public/hipp/homes/genie.virgo/.gradle/caches/modules-2/files-2.1/org.sonatype.oss/oss-parent/7/46b8a785b60a2767095b8611613b58577e96d4c9/oss-parent-7.pom' as it does not exist.
                     > Could not resolve org.ops4j:master:3.1.0.
                        > Could not parse Ivy file http://build.eclipse.org/rt/virgo/ivy/bundles/release/org.ops4j/master/3.1.0/ivy-3.1.0.xml
                           > The markup in the document preceding the root element must be well-formed.
                     > Could not resolve org.ops4j:master:3.1.0.
                        > Failed to download SHA1 for resource 'http://build.eclipse.org/rt/virgo/ivy/bundles/milestone/org.ops4j/master/3.1.0/ivy-3.1.0.xml'.
                           > For input string: "<!"
            > Could not resolve org.ops4j:base:1.4.0.
               > Could not parse Ivy file http://build.eclipse.org/rt/virgo/ivy/bundles/release/org.ops4j/base/1.4.0/ivy-1.4.0.xml
                  > The markup in the document preceding the root element must be well-formed.
            > Could not resolve org.ops4j:base:1.4.0.
               > Failed to download SHA1 for resource 'http://build.eclipse.org/rt/virgo/ivy/bundles/milestone/org.ops4j/base/1.4.0/ivy-1.4.0.xml'.
                  > For input string: "<!"
   > Could not resolve org.ops4j.base:ops4j-base-lang:1.4.0.
      > Could not parse Ivy file http://build.eclipse.org/rt/virgo/ivy/bundles/release/org.ops4j.base/ops4j-base-lang/1.4.0/ivy-1.4.0.xml
         > The markup in the document preceding the root element must be well-formed.
   > Could not resolve org.ops4j.base:ops4j-base-lang:1.4.0.
      > Failed to download SHA1 for resource 'http://build.eclipse.org/rt/virgo/ivy/bundles/milestone/org.ops4j.base/ops4j-base-lang/1.4.0/ivy-1.4.0.xml'.
         > For input string: "<!"
> Could not resolve org.ops4j.base:ops4j-base-spi:1.4.0.
  Required by:
      project :test:org.eclipse.virgo.test.launcher > org.ops4j.pax.exam:pax-exam-junit4:4.1.0 > org.ops4j.pax.exam:pax-exam-spi:4.1.0
   > Could not resolve org.ops4j.base:ops4j-base-spi:1.4.0.
      > Could not parse POM https://repo1.maven.org/maven2/org/ops4j/base/ops4j-base-spi/1.4.0/ops4j-base-spi-1.4.0.pom
         > Could not resolve org.ops4j:base:1.4.0.
            > Could not resolve org.ops4j:base:1.4.0.
               > Could not parse POM https://repo1.maven.org/maven2/org/ops4j/base/1.4.0/base-1.4.0.pom
                  > Could not resolve org.ops4j:master:3.1.0.
                     > Could not resolve org.ops4j:master:3.1.0.
                        > Could not parse POM https://repo1.maven.org/maven2/org/ops4j/master/3.1.0/master-3.1.0.pom
                           > Could not read 'file:/opt/public/hipp/homes/genie.virgo/.gradle/caches/modules-2/files-2.1/org.sonatype.oss/oss-parent/7/46b8a785b60a2767095b8611613b58577e96d4c9/oss-parent-7.pom' as it does not exist.
                     > Could not resolve org.ops4j:master:3.1.0.
                        > Could not parse Ivy file http://build.eclipse.org/rt/virgo/ivy/bundles/release/org.ops4j/master/3.1.0/ivy-3.1.0.xml
                           > The markup in the document preceding the root element must be well-formed.
                     > Could not resolve org.ops4j:master:3.1.0.
                        > Failed to download SHA1 for resource 'http://build.eclipse.org/rt/virgo/ivy/bundles/milestone/org.ops4j/master/3.1.0/ivy-3.1.0.xml'.
                           > For input string: "<!"
            > Could not resolve org.ops4j:base:1.4.0.
               > Could not parse Ivy file http://build.eclipse.org/rt/virgo/ivy/bundles/release/org.ops4j/base/1.4.0/ivy-1.4.0.xml
                  > The markup in the document preceding the root element must be well-formed.
            > Could not resolve org.ops4j:base:1.4.0.
               > Failed to download SHA1 for resource 'http://build.eclipse.org/rt/virgo/ivy/bundles/milestone/org.ops4j/base/1.4.0/ivy-1.4.0.xml'.
                  > For input string: "<!"
   > Could not resolve org.ops4j.base:ops4j-base-spi:1.4.0.
      > Could not parse Ivy file http://build.eclipse.org/rt/virgo/ivy/bundles/release/org.ops4j.base/ops4j-base-spi/1.4.0/ivy-1.4.0.xml
         > The markup in the document preceding the root element must be well-formed.
   > Could not resolve org.ops4j.base:ops4j-base-spi:1.4.0.
      > Failed to download SHA1 for resource 'http://build.eclipse.org/rt/virgo/ivy/bundles/milestone/org.ops4j.base/ops4j-base-spi/1.4.0/ivy-1.4.0.xml'.
         > For input string: "<!"
> Could not resolve org.ops4j.pax.tinybundles:tinybundles:2.0.0.
  Required by:
      project :test:org.eclipse.virgo.test.launcher > org.ops4j.pax.exam:pax-exam-junit4:4.1.0 > org.ops4j.pax.exam:pax-exam-spi:4.1.0
   > Could not resolve org.ops4j.pax.tinybundles:tinybundles:2.0.0.
      > Could not parse POM https://repo1.maven.org/maven2/org/ops4j/pax/tinybundles/tinybundles/2.0.0/tinybundles-2.0.0.pom
         > Could not resolve org.ops4j:master:3.2.0.
            > Could not resolve org.ops4j:master:3.2.0.
               > Could not parse POM https://repo1.maven.org/maven2/org/ops4j/master/3.2.0/master-3.2.0.pom
                  > Could not read 'file:/opt/public/hipp/homes/genie.virgo/.gradle/caches/modules-2/files-2.1/org.sonatype.oss/oss-parent/7/46b8a785b60a2767095b8611613b58577e96d4c9/oss-parent-7.pom' as it does not exist.
            > Could not resolve org.ops4j:master:3.2.0.
               > Could not parse Ivy file http://build.eclipse.org/rt/virgo/ivy/bundles/release/org.ops4j/master/3.2.0/ivy-3.2.0.xml
                  > The markup in the document preceding the root element must be well-formed.
            > Could not resolve org.ops4j:master:3.2.0.
               > Failed to download SHA1 for resource 'http://build.eclipse.org/rt/virgo/ivy/bundles/milestone/org.ops4j/master/3.2.0/ivy-3.2.0.xml'.
                  > For input string: "<!"
   > Could not resolve org.ops4j.pax.tinybundles:tinybundles:2.0.0.
      > Could not parse Ivy file http://build.eclipse.org/rt/virgo/ivy/bundles/release/org.ops4j.pax.tinybundles/tinybundles/2.0.0/ivy-2.0.0.xml
         > The markup in the document preceding the root element must be well-formed.
   > Could not resolve org.ops4j.pax.tinybundles:tinybundles:2.0.0.
      > Failed to download SHA1 for resource 'http://build.eclipse.org/rt/virgo/ivy/bundles/milestone/org.ops4j.pax.tinybundles/tinybundles/2.0.0/ivy-2.0.0.xml'.
         > For input string: "<!"
> Could not resolve org.ops4j.base:ops4j-base-store:1.4.0.
  Required by:
      project :test:org.eclipse.virgo.test.launcher > org.ops4j.pax.exam:pax-exam-junit4:4.1.0 > org.ops4j.pax.exam:pax-exam-spi:4.1.0 > org.ops4j.pax.exam:pax-exam:4.1.0
   > Could not resolve org.ops4j.base:ops4j-base-store:1.4.0.
      > Could not parse POM https://repo1.maven.org/maven2/org/ops4j/base/ops4j-base-store/1.4.0/ops4j-base-store-1.4.0.pom
         > Could not resolve org.ops4j:base:1.4.0.
            > Could not resolve org.ops4j:base:1.4.0.
               > Could not parse POM https://repo1.maven.org/maven2/org/ops4j/base/1.4.0/base-1.4.0.pom
                  > Could not resolve org.ops4j:master:3.1.0.
                     > Could not resolve org.ops4j:master:3.1.0.
                        > Could not parse POM https://repo1.maven.org/maven2/org/ops4j/master/3.1.0/master-3.1.0.pom
                           > Could not read 'file:/opt/public/hipp/homes/genie.virgo/.gradle/caches/modules-2/files-2.1/org.sonatype.oss/oss-parent/7/46b8a785b60a2767095b8611613b58577e96d4c9/oss-parent-7.pom' as it does not exist.
                     > Could not resolve org.ops4j:master:3.1.0.
                        > Could not parse Ivy file http://build.eclipse.org/rt/virgo/ivy/bundles/release/org.ops4j/master/3.1.0/ivy-3.1.0.xml
                           > The markup in the document preceding the root element must be well-formed.
                     > Could not resolve org.ops4j:master:3.1.0.
                        > Failed to download SHA1 for resource 'http://build.eclipse.org/rt/virgo/ivy/bundles/milestone/org.ops4j/master/3.1.0/ivy-3.1.0.xml'.
                           > For input string: "<!"
            > Could not resolve org.ops4j:base:1.4.0.
               > Could not parse Ivy file http://build.eclipse.org/rt/virgo/ivy/bundles/release/org.ops4j/base/1.4.0/ivy-1.4.0.xml
                  > The markup in the document preceding the root element must be well-formed.
            > Could not resolve org.ops4j:base:1.4.0.
               > Failed to download SHA1 for resource 'http://build.eclipse.org/rt/virgo/ivy/bundles/milestone/org.ops4j/base/1.4.0/ivy-1.4.0.xml'.
                  > For input string: "<!"
   > Could not resolve org.ops4j.base:ops4j-base-store:1.4.0.
      > Could not parse Ivy file http://build.eclipse.org/rt/virgo/ivy/bundles/release/org.ops4j.base/ops4j-base-store/1.4.0/ivy-1.4.0.xml
         > The markup in the document preceding the root element must be well-formed.
   > Could not resolve org.ops4j.base:ops4j-base-store:1.4.0.
      > Failed to download SHA1 for resource 'http://build.eclipse.org/rt/virgo/ivy/bundles/milestone/org.ops4j.base/ops4j-base-store/1.4.0/ivy-1.4.0.xml'.
         > For input string: "<!"
> Could not resolve org.ops4j.base:ops4j-base-util-property:1.4.0.
  Required by:
      project :test:org.eclipse.virgo.test.launcher > org.ops4j.pax.exam:pax-exam-junit4:4.1.0 > org.ops4j.pax.exam:pax-exam-spi:4.1.0 > org.ops4j.pax.exam:pax-exam:4.1.0
   > Could not resolve org.ops4j.base:ops4j-base-util-property:1.4.0.
      > Could not parse POM https://repo1.maven.org/maven2/org/ops4j/base/ops4j-base-util-property/1.4.0/ops4j-base-util-property-1.4.0.pom
         > Could not resolve org.ops4j:base:1.4.0.
            > Could not resolve org.ops4j:base:1.4.0.
               > Could not parse POM https://repo1.maven.org/maven2/org/ops4j/base/1.4.0/base-1.4.0.pom
                  > Could not resolve org.ops4j:master:3.1.0.
                     > Could not resolve org.ops4j:master:3.1.0.
                        > Could not parse POM https://repo1.maven.org/maven2/org/ops4j/master/3.1.0/master-3.1.0.pom
                           > Could not read 'file:/opt/public/hipp/homes/genie.virgo/.gradle/caches/modules-2/files-2.1/org.sonatype.oss/oss-parent/7/46b8a785b60a2767095b8611613b58577e96d4c9/oss-parent-7.pom' as it does not exist.
                     > Could not resolve org.ops4j:master:3.1.0.
                        > Could not parse Ivy file http://build.eclipse.org/rt/virgo/ivy/bundles/release/org.ops4j/master/3.1.0/ivy-3.1.0.xml
                           > The markup in the document preceding the root element must be well-formed.
                     > Could not resolve org.ops4j:master:3.1.0.
                        > Failed to download SHA1 for resource 'http://build.eclipse.org/rt/virgo/ivy/bundles/milestone/org.ops4j/master/3.1.0/ivy-3.1.0.xml'.
                           > For input string: "<!"
            > Could not resolve org.ops4j:base:1.4.0.
               > Could not parse Ivy file http://build.eclipse.org/rt/virgo/ivy/bundles/release/org.ops4j/base/1.4.0/ivy-1.4.0.xml
                  > The markup in the document preceding the root element must be well-formed.
            > Could not resolve org.ops4j:base:1.4.0.
               > Failed to download SHA1 for resource 'http://build.eclipse.org/rt/virgo/ivy/bundles/milestone/org.ops4j/base/1.4.0/ivy-1.4.0.xml'.
                  > For input string: "<!"
   > Could not resolve org.ops4j.base:ops4j-base-util-property:1.4.0.
      > Could not parse Ivy file http://build.eclipse.org/rt/virgo/ivy/bundles/release/org.ops4j.base/ops4j-base-util-property/1.4.0/ivy-1.4.0.xml
         > The markup in the document preceding the root element must be well-formed.
   > Could not resolve org.ops4j.base:ops4j-base-util-property:1.4.0.
      > Failed to download SHA1 for resource 'http://build.eclipse.org/rt/virgo/ivy/bundles/milestone/org.ops4j.base/ops4j-base-util-property/1.4.0/ivy-1.4.0.xml'.
         > For input string: "<!"

* Try:
Run with --stacktrace option to get the stack trace. Run with --info or --debug option to get more log output.
==============================================================================

7: Task failed with an exception.
-----------
* What went wrong:
Execution failed for task ':test:org.eclipse.virgo.test.stubs:findbugsMain'.
> Failed to run Gradle FindBugs Worker
   > Process 'Gradle FindBugs Worker 61' finished with non-zero exit value 1

* Try:
Run with --stacktrace option to get the stack trace. Run with --info or --debug option to get more log output.
==============================================================================

8: Task failed with an exception.
-----------
* What went wrong:
Execution failed for task ':test:org.eclipse.virgo.test.stubs:compileTestAspect'.
> 1 errors

* Try:
Run with --stacktrace option to get the stack trace. Run with --info or --debug option to get more log output.
==============================================================================

9: Task failed with an exception.
-----------
* What went wrong:
Execution failed for task ':test:org.eclipse.virgo.test.tools:findbugsMain'.
> Failed to run Gradle FindBugs Worker
   > Process 'Gradle FindBugs Worker 62' finished with non-zero exit value 1

* Try:
Run with --stacktrace option to get the stack trace. Run with --info or --debug option to get more log output.
==============================================================================

10: Task failed with an exception.
-----------
* What went wrong:
Execution failed for task ':util:org.eclipse.virgo.util.common:findbugsMain'.
> Failed to run Gradle FindBugs Worker
   > Process 'Gradle FindBugs Worker 63' finished with non-zero exit value 1

* Try:
Run with --stacktrace option to get the stack trace. Run with --info or --debug option to get more log output.
==============================================================================

11: Task failed with an exception.
-----------
* What went wrong:
Execution failed for task ':util:org.eclipse.virgo.util.common:compileTestJava'.
> Compilation failed with exit code 1; see the compiler error output for details.

* Try:
Run with --stacktrace option to get the stack trace. Run with --info or --debug option to get more log output.
==============================================================================

12: Task failed with an exception.
-----------
* What went wrong:
Execution failed for task ':util:org.eclipse.virgo.util.env:findbugsMain'.
> Failed to run Gradle FindBugs Worker
   > Process 'Gradle FindBugs Worker 64' finished with non-zero exit value 1

* Try:
Run with --stacktrace option to get the stack trace. Run with --info or --debug option to get more log output.
==============================================================================

13: Task failed with an exception.
-----------
* What went wrong:
Execution failed for task ':util:org.eclipse.virgo.util.env:compileTestJava'.
> Compilation failed with exit code 1; see the compiler error output for details.

* Try:
Run with --stacktrace option to get the stack trace. Run with --info or --debug option to get more log output.
==============================================================================

14: Task failed with an exception.
-----------
* What went wrong:
Could not resolve all dependencies for configuration ':util:org.eclipse.virgo.util.integrationtest:testCompileClasspath'.
> Could not resolve org.ops4j.base:ops4j-base-lang:1.4.0.
  Required by:
      project :util:org.eclipse.virgo.util.integrationtest > org.ops4j.pax.exam:pax-exam-junit4:4.1.0
      project :util:org.eclipse.virgo.util.integrationtest > org.ops4j.pax.exam:pax-exam-junit4:4.1.0 > org.ops4j.pax.exam:pax-exam-spi:4.1.0 > org.ops4j.pax.exam:pax-exam:4.1.0
   > Could not resolve org.ops4j.base:ops4j-base-lang:1.4.0.
      > Could not parse POM https://repo1.maven.org/maven2/org/ops4j/base/ops4j-base-lang/1.4.0/ops4j-base-lang-1.4.0.pom
         > Could not resolve org.ops4j:base:1.4.0.
            > Could not resolve org.ops4j:base:1.4.0.
               > Could not parse POM https://repo1.maven.org/maven2/org/ops4j/base/1.4.0/base-1.4.0.pom
                  > Could not resolve org.ops4j:master:3.1.0.
                     > Could not resolve org.ops4j:master:3.1.0.
                        > Could not parse POM https://repo1.maven.org/maven2/org/ops4j/master/3.1.0/master-3.1.0.pom
                           > Could not read 'file:/opt/public/hipp/homes/genie.virgo/.gradle/caches/modules-2/files-2.1/org.sonatype.oss/oss-parent/7/46b8a785b60a2767095b8611613b58577e96d4c9/oss-parent-7.pom' as it does not exist.
                     > Could not resolve org.ops4j:master:3.1.0.
                        > Could not parse Ivy file http://build.eclipse.org/rt/virgo/ivy/bundles/release/org.ops4j/master/3.1.0/ivy-3.1.0.xml
                           > The markup in the document preceding the root element must be well-formed.
                     > Could not resolve org.ops4j:master:3.1.0.
                        > Failed to download SHA1 for resource 'http://build.eclipse.org/rt/virgo/ivy/bundles/milestone/org.ops4j/master/3.1.0/ivy-3.1.0.xml'.
                           > For input string: "<!"
            > Could not resolve org.ops4j:base:1.4.0.
               > Could not parse Ivy file http://build.eclipse.org/rt/virgo/ivy/bundles/release/org.ops4j/base/1.4.0/ivy-1.4.0.xml
                  > The markup in the document preceding the root element must be well-formed.
            > Could not resolve org.ops4j:base:1.4.0.
               > Failed to download SHA1 for resource 'http://build.eclipse.org/rt/virgo/ivy/bundles/milestone/org.ops4j/base/1.4.0/ivy-1.4.0.xml'.
                  > For input string: "<!"
   > Could not resolve org.ops4j.base:ops4j-base-lang:1.4.0.
      > Could not parse Ivy file http://build.eclipse.org/rt/virgo/ivy/bundles/release/org.ops4j.base/ops4j-base-lang/1.4.0/ivy-1.4.0.xml
         > The markup in the document preceding the root element must be well-formed.
   > Could not resolve org.ops4j.base:ops4j-base-lang:1.4.0.
      > Failed to download SHA1 for resource 'http://build.eclipse.org/rt/virgo/ivy/bundles/milestone/org.ops4j.base/ops4j-base-lang/1.4.0/ivy-1.4.0.xml'.
         > For input string: "<!"
> Could not resolve org.ops4j.base:ops4j-base-spi:1.4.0.
  Required by:
      project :util:org.eclipse.virgo.util.integrationtest > org.ops4j.pax.exam:pax-exam-junit4:4.1.0 > org.ops4j.pax.exam:pax-exam-spi:4.1.0
   > Could not resolve org.ops4j.base:ops4j-base-spi:1.4.0.
      > Could not parse POM https://repo1.maven.org/maven2/org/ops4j/base/ops4j-base-spi/1.4.0/ops4j-base-spi-1.4.0.pom
         > Could not resolve org.ops4j:base:1.4.0.
            > Could not resolve org.ops4j:base:1.4.0.
               > Could not parse POM https://repo1.maven.org/maven2/org/ops4j/base/1.4.0/base-1.4.0.pom
                  > Could not resolve org.ops4j:master:3.1.0.
                     > Could not resolve org.ops4j:master:3.1.0.
                        > Could not parse POM https://repo1.maven.org/maven2/org/ops4j/master/3.1.0/master-3.1.0.pom
                           > Could not read 'file:/opt/public/hipp/homes/genie.virgo/.gradle/caches/modules-2/files-2.1/org.sonatype.oss/oss-parent/7/46b8a785b60a2767095b8611613b58577e96d4c9/oss-parent-7.pom' as it does not exist.
                     > Could not resolve org.ops4j:master:3.1.0.
                        > Could not parse Ivy file http://build.eclipse.org/rt/virgo/ivy/bundles/release/org.ops4j/master/3.1.0/ivy-3.1.0.xml
                           > The markup in the document preceding the root element must be well-formed.
                     > Could not resolve org.ops4j:master:3.1.0.
                        > Failed to download SHA1 for resource 'http://build.eclipse.org/rt/virgo/ivy/bundles/milestone/org.ops4j/master/3.1.0/ivy-3.1.0.xml'.
                           > For input string: "<!"
            > Could not resolve org.ops4j:base:1.4.0.
               > Could not parse Ivy file http://build.eclipse.org/rt/virgo/ivy/bundles/release/org.ops4j/base/1.4.0/ivy-1.4.0.xml
                  > The markup in the document preceding the root element must be well-formed.
            > Could not resolve org.ops4j:base:1.4.0.
               > Failed to download SHA1 for resource 'http://build.eclipse.org/rt/virgo/ivy/bundles/milestone/org.ops4j/base/1.4.0/ivy-1.4.0.xml'.
                  > For input string: "<!"
   > Could not resolve org.ops4j.base:ops4j-base-spi:1.4.0.
      > Could not parse Ivy file http://build.eclipse.org/rt/virgo/ivy/bundles/release/org.ops4j.base/ops4j-base-spi/1.4.0/ivy-1.4.0.xml
         > The markup in the document preceding the root element must be well-formed.
   > Could not resolve org.ops4j.base:ops4j-base-spi:1.4.0.
      > Failed to download SHA1 for resource 'http://build.eclipse.org/rt/virgo/ivy/bundles/milestone/org.ops4j.base/ops4j-base-spi/1.4.0/ivy-1.4.0.xml'.
         > For input string: "<!"
> Could not resolve org.ops4j.pax.tinybundles:tinybundles:2.0.0.
  Required by:
      project :util:org.eclipse.virgo.util.integrationtest > org.ops4j.pax.exam:pax-exam-junit4:4.1.0 > org.ops4j.pax.exam:pax-exam-spi:4.1.0
   > Could not resolve org.ops4j.pax.tinybundles:tinybundles:2.0.0.
      > Could not parse POM https://repo1.maven.org/maven2/org/ops4j/pax/tinybundles/tinybundles/2.0.0/tinybundles-2.0.0.pom
         > Could not resolve org.ops4j:master:3.2.0.
            > Could not resolve org.ops4j:master:3.2.0.
               > Could not parse POM https://repo1.maven.org/maven2/org/ops4j/master/3.2.0/master-3.2.0.pom
                  > Could not read 'file:/opt/public/hipp/homes/genie.virgo/.gradle/caches/modules-2/files-2.1/org.sonatype.oss/oss-parent/7/46b8a785b60a2767095b8611613b58577e96d4c9/oss-parent-7.pom' as it does not exist.
            > Could not resolve org.ops4j:master:3.2.0.
               > Could not parse Ivy file http://build.eclipse.org/rt/virgo/ivy/bundles/release/org.ops4j/master/3.2.0/ivy-3.2.0.xml
                  > The markup in the document preceding the root element must be well-formed.
            > Could not resolve org.ops4j:master:3.2.0.
               > Failed to download SHA1 for resource 'http://build.eclipse.org/rt/virgo/ivy/bundles/milestone/org.ops4j/master/3.2.0/ivy-3.2.0.xml'.
                  > For input string: "<!"
   > Could not resolve org.ops4j.pax.tinybundles:tinybundles:2.0.0.
      > Could not parse Ivy file http://build.eclipse.org/rt/virgo/ivy/bundles/release/org.ops4j.pax.tinybundles/tinybundles/2.0.0/ivy-2.0.0.xml
         > The markup in the document preceding the root element must be well-formed.
   > Could not resolve org.ops4j.pax.tinybundles:tinybundles:2.0.0.
      > Failed to download SHA1 for resource 'http://build.eclipse.org/rt/virgo/ivy/bundles/milestone/org.ops4j.pax.tinybundles/tinybundles/2.0.0/ivy-2.0.0.xml'.
         > For input string: "<!"
> Could not resolve org.ops4j.base:ops4j-base-store:1.4.0.
  Required by:
      project :util:org.eclipse.virgo.util.integrationtest > org.ops4j.pax.exam:pax-exam-junit4:4.1.0 > org.ops4j.pax.exam:pax-exam-spi:4.1.0 > org.ops4j.pax.exam:pax-exam:4.1.0
   > Could not resolve org.ops4j.base:ops4j-base-store:1.4.0.
      > Could not parse POM https://repo1.maven.org/maven2/org/ops4j/base/ops4j-base-store/1.4.0/ops4j-base-store-1.4.0.pom
         > Could not resolve org.ops4j:base:1.4.0.
            > Could not resolve org.ops4j:base:1.4.0.
               > Could not parse POM https://repo1.maven.org/maven2/org/ops4j/base/1.4.0/base-1.4.0.pom
                  > Could not resolve org.ops4j:master:3.1.0.
                     > Could not resolve org.ops4j:master:3.1.0.
                        > Could not parse POM https://repo1.maven.org/maven2/org/ops4j/master/3.1.0/master-3.1.0.pom
                           > Could not read 'file:/opt/public/hipp/homes/genie.virgo/.gradle/caches/modules-2/files-2.1/org.sonatype.oss/oss-parent/7/46b8a785b60a2767095b8611613b58577e96d4c9/oss-parent-7.pom' as it does not exist.
                     > Could not resolve org.ops4j:master:3.1.0.
                        > Could not parse Ivy file http://build.eclipse.org/rt/virgo/ivy/bundles/release/org.ops4j/master/3.1.0/ivy-3.1.0.xml
                           > The markup in the document preceding the root element must be well-formed.
                     > Could not resolve org.ops4j:master:3.1.0.
                        > Failed to download SHA1 for resource 'http://build.eclipse.org/rt/virgo/ivy/bundles/milestone/org.ops4j/master/3.1.0/ivy-3.1.0.xml'.
                           > For input string: "<!"
            > Could not resolve org.ops4j:base:1.4.0.
               > Could not parse Ivy file http://build.eclipse.org/rt/virgo/ivy/bundles/release/org.ops4j/base/1.4.0/ivy-1.4.0.xml
                  > The markup in the document preceding the root element must be well-formed.
            > Could not resolve org.ops4j:base:1.4.0.
               > Failed to download SHA1 for resource 'http://build.eclipse.org/rt/virgo/ivy/bundles/milestone/org.ops4j/base/1.4.0/ivy-1.4.0.xml'.
                  > For input string: "<!"
   > Could not resolve org.ops4j.base:ops4j-base-store:1.4.0.
      > Could not parse Ivy file http://build.eclipse.org/rt/virgo/ivy/bundles/release/org.ops4j.base/ops4j-base-store/1.4.0/ivy-1.4.0.xml
         > The markup in the document preceding the root element must be well-formed.
   > Could not resolve org.ops4j.base:ops4j-base-store:1.4.0.
      > Failed to download SHA1 for resource 'http://build.eclipse.org/rt/virgo/ivy/bundles/milestone/org.ops4j.base/ops4j-base-store/1.4.0/ivy-1.4.0.xml'.
         > For input string: "<!"
> Could not resolve org.ops4j.base:ops4j-base-util-property:1.4.0.
  Required by:
      project :util:org.eclipse.virgo.util.integrationtest > org.ops4j.pax.exam:pax-exam-junit4:4.1.0 > org.ops4j.pax.exam:pax-exam-spi:4.1.0 > org.ops4j.pax.exam:pax-exam:4.1.0
   > Could not resolve org.ops4j.base:ops4j-base-util-property:1.4.0.
      > Could not parse POM https://repo1.maven.org/maven2/org/ops4j/base/ops4j-base-util-property/1.4.0/ops4j-base-util-property-1.4.0.pom
         > Could not resolve org.ops4j:base:1.4.0.
            > Could not resolve org.ops4j:base:1.4.0.
               > Could not parse POM https://repo1.maven.org/maven2/org/ops4j/base/1.4.0/base-1.4.0.pom
                  > Could not resolve org.ops4j:master:3.1.0.
                     > Could not resolve org.ops4j:master:3.1.0.
                        > Could not parse POM https://repo1.maven.org/maven2/org/ops4j/master/3.1.0/master-3.1.0.pom
                           > Could not read 'file:/opt/public/hipp/homes/genie.virgo/.gradle/caches/modules-2/files-2.1/org.sonatype.oss/oss-parent/7/46b8a785b60a2767095b8611613b58577e96d4c9/oss-parent-7.pom' as it does not exist.
                     > Could not resolve org.ops4j:master:3.1.0.
                        > Could not parse Ivy file http://build.eclipse.org/rt/virgo/ivy/bundles/release/org.ops4j/master/3.1.0/ivy-3.1.0.xml
                           > The markup in the document preceding the root element must be well-formed.
                     > Could not resolve org.ops4j:master:3.1.0.
                        > Failed to download SHA1 for resource 'http://build.eclipse.org/rt/virgo/ivy/bundles/milestone/org.ops4j/master/3.1.0/ivy-3.1.0.xml'.
                           > For input string: "<!"
            > Could not resolve org.ops4j:base:1.4.0.
               > Could not parse Ivy file http://build.eclipse.org/rt/virgo/ivy/bundles/release/org.ops4j/base/1.4.0/ivy-1.4.0.xml
                  > The markup in the document preceding the root element must be well-formed.
            > Could not resolve org.ops4j:base:1.4.0.
               > Failed to download SHA1 for resource 'http://build.eclipse.org/rt/virgo/ivy/bundles/milestone/org.ops4j/base/1.4.0/ivy-1.4.0.xml'.
                  > For input string: "<!"
   > Could not resolve org.ops4j.base:ops4j-base-util-property:1.4.0.
      > Could not parse Ivy file http://build.eclipse.org/rt/virgo/ivy/bundles/release/org.ops4j.base/ops4j-base-util-property/1.4.0/ivy-1.4.0.xml
         > The markup in the document preceding the root element must be well-formed.
   > Could not resolve org.ops4j.base:ops4j-base-util-property:1.4.0.
      > Failed to download SHA1 for resource 'http://build.eclipse.org/rt/virgo/ivy/bundles/milestone/org.ops4j.base/ops4j-base-util-property/1.4.0/ivy-1.4.0.xml'.
         > For input string: "<!"

* Try:
Run with --stacktrace option to get the stack trace. Run with --info or --debug option to get more log output.
==============================================================================

15: Task failed with an exception.
-----------
* What went wrong:
Execution failed for task ':util:org.eclipse.virgo.util.io:findbugsMain'.
> Failed to run Gradle FindBugs Worker
   > Process 'Gradle FindBugs Worker 65' finished with non-zero exit value 1

* Try:
Run with --stacktrace option to get the stack trace. Run with --info or --debug option to get more log output.
==============================================================================

16: Task failed with an exception.
-----------
* What went wrong:
Execution failed for task ':util:org.eclipse.virgo.util.io:compileTestJava'.
> Compilation failed with exit code 1; see the compiler error output for details.

* Try:
Run with --stacktrace option to get the stack trace. Run with --info or --debug option to get more log output.
==============================================================================

17: Task failed with an exception.
-----------
* What went wrong:
Execution failed for task ':util:org.eclipse.virgo.util.jmx:findbugsMain'.
> Failed to run Gradle FindBugs Worker
   > Process 'Gradle FindBugs Worker 66' finished with non-zero exit value 1

* Try:
Run with --stacktrace option to get the stack trace. Run with --info or --debug option to get more log output.
==============================================================================

18: Task failed with an exception.
-----------
* What went wrong:
Execution failed for task ':util:org.eclipse.virgo.util.jmx:compileTestAspect'.
> 1 errors

* Try:
Run with --stacktrace option to get the stack trace. Run with --info or --debug option to get more log output.
==============================================================================

19: Task failed with an exception.
-----------
* What went wrong:
Execution failed for task ':util:org.eclipse.virgo.util.math:findbugsMain'.
> Failed to run Gradle FindBugs Worker
   > Process 'Gradle FindBugs Worker 67' finished with non-zero exit value 1

* Try:
Run with --stacktrace option to get the stack trace. Run with --info or --debug option to get more log output.
==============================================================================

20: Task failed with an exception.
-----------
* What went wrong:
Execution failed for task ':util:org.eclipse.virgo.util.math:compileTestJava'.
> Compilation failed with exit code 1; see the compiler error output for details.

* Try:
Run with --stacktrace option to get the stack trace. Run with --info or --debug option to get more log output.
==============================================================================

21: Task failed with an exception.
-----------
* What went wrong:
Execution failed for task ':util:org.eclipse.virgo.util.osgi:findbugsMain'.
> Failed to run Gradle FindBugs Worker
   > Process 'Gradle FindBugs Worker 68' finished with non-zero exit value 1

* Try:
Run with --stacktrace option to get the stack trace. Run with --info or --debug option to get more log output.
==============================================================================

22: Task failed with an exception.
-----------
* What went wrong:
Execution failed for task ':util:org.eclipse.virgo.util.osgi:compileTestJava'.
> Compilation failed with exit code 1; see the compiler error output for details.

* Try:
Run with --stacktrace option to get the stack trace. Run with --info or --debug option to get more log output.
==============================================================================

23: Task failed with an exception.
-----------
* What went wrong:
Execution failed for task ':util:org.eclipse.virgo.util.osgi.manifest:findbugsMain'.
> Failed to run Gradle FindBugs Worker
   > Process 'Gradle FindBugs Worker 69' finished with non-zero exit value 1

* Try:
Run with --stacktrace option to get the stack trace. Run with --info or --debug option to get more log output.
==============================================================================

24: Task failed with an exception.
-----------
* What went wrong:
Execution failed for task ':util:org.eclipse.virgo.util.osgi.manifest:compileTestJava'.
> Compilation failed with exit code 1; see the compiler error output for details.

* Try:
Run with --stacktrace option to get the stack trace. Run with --info or --debug option to get more log output.
==============================================================================

25: Task failed with an exception.
-----------
* What went wrong:
Execution failed for task ':util:org.eclipse.virgo.util.parser.launcher:findbugsMain'.
> Failed to run Gradle FindBugs Worker
   > Process 'Gradle FindBugs Worker 70' finished with non-zero exit value 1

* Try:
Run with --stacktrace option to get the stack trace. Run with --info or --debug option to get more log output.
==============================================================================

26: Task failed with an exception.
-----------
* What went wrong:
Execution failed for task ':util:org.eclipse.virgo.util.parser.launcher:compileTestJava'.
> Compilation failed with exit code 1; see the compiler error output for details.

* Try:
Run with --stacktrace option to get the stack trace. Run with --info or --debug option to get more log output.
==============================================================================

27: Task failed with an exception.
-----------
* What went wrong:
Execution failed for task ':util:org.eclipse.virgo.util.parser.manifest:findbugsMain'.
> Failed to run Gradle FindBugs Worker
   > Process 'Gradle FindBugs Worker 71' finished with non-zero exit value 1

* Try:
Run with --stacktrace option to get the stack trace. Run with --info or --debug option to get more log output.
==============================================================================

28: Task failed with an exception.
-----------
* What went wrong:
Execution failed for task ':util:org.eclipse.virgo.util.parser.manifest:compileTestJava'.
> Compilation failed with exit code 1; see the compiler error output for details.

* Try:
Run with --stacktrace option to get the stack trace. Run with --info or --debug option to get more log output.
==============================================================================

29: Task failed with an exception.
-----------
* What went wrong:
Execution failed for task ':web:org.eclipse.virgo.web.core:findbugsMain'.
> Failed to run Gradle FindBugs Worker
   > Process 'Gradle FindBugs Worker 72' finished with non-zero exit value 1

* Try:
Run with --stacktrace option to get the stack trace. Run with --info or --debug option to get more log output.
==============================================================================

30: Task failed with an exception.
-----------
* What went wrong:
Execution failed for task ':web:org.eclipse.virgo.web.core:compileTestJava'.
> Compilation failed with exit code 1; see the compiler error output for details.

* Try:
Run with --stacktrace option to get the stack trace. Run with --info or --debug option to get more log output.
==============================================================================

31: Task failed with an exception.
-----------
* What went wrong:
Execution failed for task ':web:org.eclipse.virgo.web.dm:findbugsMain'.
> Failed to run Gradle FindBugs Worker
   > Process 'Gradle FindBugs Worker 73' finished with non-zero exit value 1

* Try:
Run with --stacktrace option to get the stack trace. Run with --info or --debug option to get more log output.
==============================================================================

32: Task failed with an exception.
-----------
* What went wrong:
Execution failed for task ':web:org.eclipse.virgo.web.dm:compileTestJava'.
> Compilation failed with exit code 1; see the compiler error output for details.

* Try:
Run with --stacktrace option to get the stack trace. Run with --info or --debug option to get more log output.
==============================================================================

33: Task failed with an exception.
-----------
* What went wrong:
Execution failed for task ':web:org.eclipse.virgo.web.enterprise.appdeployer:findbugsMain'.
> Failed to run Gradle FindBugs Worker
   > Process 'Gradle FindBugs Worker 74' finished with non-zero exit value 1

* Try:
Run with --stacktrace option to get the stack trace. Run with --info or --debug option to get more log output.
==============================================================================

34: Task failed with an exception.
-----------
* What went wrong:
Execution failed for task ':web:org.eclipse.virgo.web.enterprise.applistener:findbugsMain'.
> Failed to run Gradle FindBugs Worker
   > Process 'Gradle FindBugs Worker 75' finished with non-zero exit value 1

* Try:
Run with --stacktrace option to get the stack trace. Run with --info or --debug option to get more log output.
==============================================================================

35: Task failed with an exception.
-----------
* What went wrong:
Execution failed for task ':web:org.eclipse.virgo.web.enterprise.javax.persistence.extension:findbugsMain'.
> Failed to run Gradle FindBugs Worker
   > Process 'Gradle FindBugs Worker 76' finished with non-zero exit value 1

* Try:
Run with --stacktrace option to get the stack trace. Run with --info or --debug option to get more log output.
==============================================================================

36: Task failed with an exception.
-----------
* What went wrong:
Execution failed for task ':web:org.eclipse.virgo.web.enterprise.javax.persistence.extension:compileTestJava'.
> Compilation failed with exit code 1; see the compiler error output for details.

* Try:
Run with --stacktrace option to get the stack trace. Run with --info or --debug option to get more log output.
==============================================================================

37: Task failed with an exception.
-----------
* What went wrong:
Execution failed for task ':web:org.eclipse.virgo.web.enterprise.javax.persistence.provider.initializer:findbugsMain'.
> Failed to run Gradle FindBugs Worker
   > Process 'Gradle FindBugs Worker 77' finished with non-zero exit value 1

* Try:
Run with --stacktrace option to get the stack trace. Run with --info or --debug option to get more log output.
==============================================================================

38: Task failed with an exception.
-----------
* What went wrong:
Execution failed for task ':web:org.eclipse.virgo.web.enterprise.javax.persistence.provider.initializer:compileTestJava'.
> Compilation failed with exit code 1; see the compiler error output for details.

* Try:
Run with --stacktrace option to get the stack trace. Run with --info or --debug option to get more log output.
==============================================================================

39: Task failed with an exception.
-----------
* What went wrong:
Execution failed for task ':web:org.eclipse.virgo.web.enterprise.jsf.support:findbugsMain'.
> Failed to run Gradle FindBugs Worker
   > Process 'Gradle FindBugs Worker 78' finished with non-zero exit value 1

* Try:
Run with --stacktrace option to get the stack trace. Run with --info or --debug option to get more log output.
==============================================================================

40: Task failed with an exception.
-----------
* What went wrong:
Execution failed for task ':web:org.eclipse.virgo.web.enterprise.openejb.fragment.jotm:findbugsMain'.
> Failed to run Gradle FindBugs Worker
   > Process 'Gradle FindBugs Worker 79' finished with non-zero exit value 1

* Try:
Run with --stacktrace option to get the stack trace. Run with --info or --debug option to get more log output.
==============================================================================

41: Task failed with an exception.
-----------
* What went wrong:
Execution failed for task ':web:org.eclipse.virgo.web.enterprise.openejb.initialiser:findbugsMain'.
> Failed to run Gradle FindBugs Worker
   > Process 'Gradle FindBugs Worker 80' finished with non-zero exit value 1

* Try:
Run with --stacktrace option to get the stack trace. Run with --info or --debug option to get more log output.
==============================================================================

42: Task failed with an exception.
-----------
* What went wrong:
Execution failed for task ':web:org.eclipse.virgo.web.enterprise.openejb.jpa.integration:findbugsMain'.
> Failed to run Gradle FindBugs Worker
   > Process 'Gradle FindBugs Worker 81' finished with non-zero exit value 1

* Try:
Run with --stacktrace option to get the stack trace. Run with --info or --debug option to get more log output.
==============================================================================

43: Task failed with an exception.
-----------
* What went wrong:
Execution failed for task ':web:org.eclipse.virgo.web.enterprise.openejb.tomcat.factory:findbugsMain'.
> Failed to run Gradle FindBugs Worker
   > Process 'Gradle FindBugs Worker 82' finished with non-zero exit value 1

* Try:
Run with --stacktrace option to get the stack trace. Run with --info or --debug option to get more log output.
==============================================================================

44: Task failed with an exception.
-----------
* What went wrong:
Execution failed for task ':web:org.eclipse.virgo.web.enterprise.openejb.tomcat.factory:compileTestJava'.
> Compilation failed with exit code 1; see the compiler error output for details.

* Try:
Run with --stacktrace option to get the stack trace. Run with --info or --debug option to get more log output.
==============================================================================

45: Task failed with an exception.
-----------
* What went wrong:
Execution failed for task ':web:org.eclipse.virgo.web.enterprise.openwebbeans.initialiser:findbugsMain'.
> Failed to run Gradle FindBugs Worker
   > Process 'Gradle FindBugs Worker 83' finished with non-zero exit value 1

* Try:
Run with --stacktrace option to get the stack trace. Run with --info or --debug option to get more log output.
==============================================================================

46: Task failed with an exception.
-----------
* What went wrong:
Execution failed for task ':web:org.eclipse.virgo.web.enterprise.persistence.openejb.classloading.hook:findbugsMain'.
> Failed to run Gradle FindBugs Worker
   > Process 'Gradle FindBugs Worker 84' finished with non-zero exit value 1

* Try:
Run with --stacktrace option to get the stack trace. Run with --info or --debug option to get more log output.
==============================================================================

47: Task failed with an exception.
-----------
* What went wrong:
Execution failed for task ':web:org.eclipse.virgo.web.enterprise.persistence.openejb.classloading.hook:compileTestJava'.
> Compilation failed with exit code 1; see the compiler error output for details.

* Try:
Run with --stacktrace option to get the stack trace. Run with --info or --debug option to get more log output.
==============================================================================

48: Task failed with an exception.
-----------
* What went wrong:
Execution failed for task ':web:org.eclipse.virgo.web.enterprise.security:findbugsMain'.
> Failed to run Gradle FindBugs Worker
   > Process 'Gradle FindBugs Worker 85' finished with non-zero exit value 1

* Try:
Run with --stacktrace option to get the stack trace. Run with --info or --debug option to get more log output.
==============================================================================

49: Task failed with an exception.
-----------
* What went wrong:
Execution failed for task ':web:org.eclipse.virgo.web.enterprise.security:compileTestJava'.
> Compilation failed with exit code 1; see the compiler error output for details.

* Try:
Run with --stacktrace option to get the stack trace. Run with --info or --debug option to get more log output.
==============================================================================

50: Task failed with an exception.
-----------
* What went wrong:
Execution failed for task ':web:org.eclipse.virgo.web.enterprise.security.openejb.classloading.hook:findbugsMain'.
> Failed to run Gradle FindBugs Worker
   > Process 'Gradle FindBugs Worker 86' finished with non-zero exit value 1

* Try:
Run with --stacktrace option to get the stack trace. Run with --info or --debug option to get more log output.
==============================================================================

51: Task failed with an exception.
-----------
* What went wrong:
Execution failed for task ':web:org.eclipse.virgo.web.enterprise.security.valve:findbugsMain'.
> Failed to run Gradle FindBugs Worker
   > Process 'Gradle FindBugs Worker 87' finished with non-zero exit value 1

* Try:
Run with --stacktrace option to get the stack trace. Run with --info or --debug option to get more log output.
==============================================================================

52: Task failed with an exception.
-----------
* What went wrong:
Execution failed for task ':web:org.eclipse.virgo.web.enterprise.services.accessor:findbugsMain'.
> Failed to run Gradle FindBugs Worker
   > Process 'Gradle FindBugs Worker 88' finished with non-zero exit value 1

* Try:
Run with --stacktrace option to get the stack trace. Run with --info or --debug option to get more log output.
==============================================================================

53: Task failed with an exception.
-----------
* What went wrong:
Execution failed for task ':web:org.eclipse.virgo.web.enterprise.services.accessor:compileTestJava'.
> Compilation failed with exit code 1; see the compiler error output for details.

* Try:
Run with --stacktrace option to get the stack trace. Run with --info or --debug option to get more log output.
==============================================================================

54: Task failed with an exception.
-----------
* What went wrong:
Execution failed for task ':web:org.eclipse.virgo.web.tomcat.support:findbugsMain'.
> Failed to run Gradle FindBugs Worker
   > Process 'Gradle FindBugs Worker 89' finished with non-zero exit value 1

* Try:
Run with --stacktrace option to get the stack trace. Run with --info or --debug option to get more log output.
==============================================================================

55: Task failed with an exception.
-----------
* What went wrong:
Execution failed for task ':web:org.eclipse.virgo.web.war.deployer:findbugsMain'.
> Failed to run Gradle FindBugs Worker
   > Process 'Gradle FindBugs Worker 90' finished with non-zero exit value 1

* Try:
Run with --stacktrace option to get the stack trace. Run with --info or --debug option to get more log output.
==============================================================================

56: Task failed with an exception.
-----------
* What went wrong:
Execution failed for task ':web:org.eclipse.virgo.web.war.deployer:compileTestJava'.
> Compilation failed with exit code 1; see the compiler error output for details.

* Try:
Run with --stacktrace option to get the stack trace. Run with --info or --debug option to get more log output.
==============================================================================

BUILD FAILED

Total time: 11 mins 58.507 secs
Build step 'Invoke Gradle script' changed build result to FAILURE
Build step 'Invoke Gradle script' marked build as failure
[FINDBUGS] Skipping publisher since build result is FAILURE
Sending e-mails to: fwaibel@datenkollektiv.de dmarthaler@gmx.net
Recording test results
Archiving artifacts
Started calculate disk usage of build
Finished Calculation of disk usage of build in 0 seconds
Started calculate disk usage of workspace
Finished Calculation of disk usage of workspace in 0 seconds
Finished: FAILURE