FailedConsole Output

Started by user fwaibel@eclipsesource.com
Checkout:workspace / /home/hudson/genie.virgo/.hudson/jobs/3.7.0.Milestones/workspace - hudson.remoting.LocalChannel@552be604
Using strategy: Default
Git Exe: git
Last Built Revision: Revision 631cbb2e7559f4af286861315234200c2334cff6 (origin/master)
Checkout:workspace / /home/hudson/genie.virgo/.hudson/jobs/3.7.0.Milestones/workspace - hudson.remoting.LocalChannel@552be604
Fetching changes from the remote Git repository
Fetching upstream changes from git://git.eclipse.org/gitroot/virgo/org.eclipse.virgo.root.git
Commencing build of Revision fcef6b9366de5793cc42b8bc6759fbc99329734b (origin/master)
Checking out Revision fcef6b9366de5793cc42b8bc6759fbc99329734b (origin/master)
The origin is non-bare.
Trying to fetch apps into /home/hudson/genie.virgo/.hudson/jobs/3.7.0.Milestones/workspace/apps
Problem fetching from submodule apps - could be unavailable. Continuing anyway
Trying to fetch kernel into /home/hudson/genie.virgo/.hudson/jobs/3.7.0.Milestones/workspace/kernel
Problem fetching from submodule kernel - could be unavailable. Continuing anyway
Trying to fetch medic into /home/hudson/genie.virgo/.hudson/jobs/3.7.0.Milestones/workspace/medic
Problem fetching from submodule medic - could be unavailable. Continuing anyway
Trying to fetch nano into /home/hudson/genie.virgo/.hudson/jobs/3.7.0.Milestones/workspace/nano
Problem fetching from submodule nano - could be unavailable. Continuing anyway
Trying to fetch packaging into /home/hudson/genie.virgo/.hudson/jobs/3.7.0.Milestones/workspace/packaging
Problem fetching from submodule packaging - could be unavailable. Continuing anyway
Trying to fetch repository into /home/hudson/genie.virgo/.hudson/jobs/3.7.0.Milestones/workspace/repository
Problem fetching from submodule repository - could be unavailable. Continuing anyway
Trying to fetch test into /home/hudson/genie.virgo/.hudson/jobs/3.7.0.Milestones/workspace/test
Problem fetching from submodule test - could be unavailable. Continuing anyway
Trying to fetch util into /home/hudson/genie.virgo/.hudson/jobs/3.7.0.Milestones/workspace/util
Problem fetching from submodule util - could be unavailable. Continuing anyway
Trying to fetch web into /home/hudson/genie.virgo/.hudson/jobs/3.7.0.Milestones/workspace/web
Problem fetching from submodule web - could be unavailable. Continuing anyway
The origin is non-bare.
[locks-and-latches] Checking to see if we really have the locks
[locks-and-latches] Have all the locks, build can start
[Gradle] - Launching build.
[workspace] $ /home/hudson/genie.virgo/.hudson/jobs/3.7.0.Milestones/workspace/gradlew -Declipse.build=true -Dskip.docs=true -Dci.build.signjars=true -Dskip.local.signing=true --stacktrace --continue -Dhttp.proxyHost=proxy.eclipse.org -Dhttp.proxyPort=9898 -Dhttp.nonProxyHosts=172.30.206.* -Dhttps.proxyHost=proxy.eclipse.org -Dhttps.proxyPort=9898 -Dhttps.nonProxyHosts=172.30.206.* -Dftp.proxyHost=proxy.eclipse.org -Dftp.proxyPort=9898 -Dftp.nonProxyHosts=172.30.206.* clean jar build signing distZip fullDistZip rapDistZip installDist installFullDist installRapDist zipUpdateSite -x distTar -x fullDistTar -x rapDistTar
Java HotSpot(TM) Server VM warning: ignoring option MaxPermSize=256m; support was removed in 8.0
Starting a Gradle Daemon (subsequent builds will be faster)
:buildSrc:compileJava UP-TO-DATE
:buildSrc:compileGroovy UP-TO-DATE
:buildSrc:processResources UP-TO-DATE
:buildSrc:classes UP-TO-DATE
:buildSrc:jar UP-TO-DATE
:buildSrc:assemble UP-TO-DATE
:buildSrc:compileTestJava UP-TO-DATE
:buildSrc:compileTestGroovy UP-TO-DATE
:buildSrc:processTestResources UP-TO-DATE
:buildSrc:testClasses UP-TO-DATE
:buildSrc:test UP-TO-DATE
:buildSrc:check UP-TO-DATE
:buildSrc:build UP-TO-DATE
Checking that proxy properties are set before proceeding...
http.proxyHost = proxy.eclipse.org
http.proxyPort = 9898
http.nonProxyHosts = 172.30.206.*
Done.
/jobs/genie.virgo/3.7.0.Milestones/workspace/kernel/org.eclipse.virgo.kernel.services/build/libs/org.eclipse.virgo.kernel.services-3.7.0.RELEASE.jar

FAILURE: Build failed with an exception.

* What went wrong:
Task 'signing' not found in root project 'workspace'.

* Try:
Run gradlew tasks to get a list of available tasks. Run with --info or --debug option to get more log output.

* Exception is:
org.gradle.execution.TaskSelectionException: Task 'signing' not found in root project 'workspace'.
	at org.gradle.execution.TaskSelector.getSelection(TaskSelector.java:100)
	at org.gradle.execution.TaskSelector.getSelection(TaskSelector.java:75)
	at org.gradle.execution.commandline.CommandLineTaskParser.parseTasks(CommandLineTaskParser.java:42)
	at org.gradle.execution.TaskNameResolvingBuildConfigurationAction.configure(TaskNameResolvingBuildConfigurationAction.java:44)
	at org.gradle.execution.DefaultBuildConfigurationActionExecuter.configure(DefaultBuildConfigurationActionExecuter.java:48)
	at org.gradle.execution.DefaultBuildConfigurationActionExecuter.access$000(DefaultBuildConfigurationActionExecuter.java:25)
	at org.gradle.execution.DefaultBuildConfigurationActionExecuter$1.proceed(DefaultBuildConfigurationActionExecuter.java:54)
	at org.gradle.execution.DefaultTasksBuildExecutionAction.configure(DefaultTasksBuildExecutionAction.java:44)
	at org.gradle.execution.DefaultBuildConfigurationActionExecuter.configure(DefaultBuildConfigurationActionExecuter.java:48)
	at org.gradle.execution.DefaultBuildConfigurationActionExecuter.access$000(DefaultBuildConfigurationActionExecuter.java:25)
	at org.gradle.execution.DefaultBuildConfigurationActionExecuter$1.proceed(DefaultBuildConfigurationActionExecuter.java:54)
	at org.gradle.execution.ExcludedTaskFilteringBuildConfigurationAction.configure(ExcludedTaskFilteringBuildConfigurationAction.java:47)
	at org.gradle.execution.DefaultBuildConfigurationActionExecuter.configure(DefaultBuildConfigurationActionExecuter.java:48)
	at org.gradle.execution.DefaultBuildConfigurationActionExecuter.select(DefaultBuildConfigurationActionExecuter.java:36)
	at org.gradle.initialization.DefaultGradleLauncher$3.run(DefaultGradleLauncher.java:175)
	at org.gradle.internal.Factories$1.create(Factories.java:22)
	at org.gradle.internal.progress.DefaultBuildOperationExecutor.run(DefaultBuildOperationExecutor.java:91)
	at org.gradle.internal.progress.DefaultBuildOperationExecutor.run(DefaultBuildOperationExecutor.java:53)
	at org.gradle.initialization.DefaultGradleLauncher.doBuildStages(DefaultGradleLauncher.java:172)
	at org.gradle.initialization.DefaultGradleLauncher.access$200(DefaultGradleLauncher.java:33)
	at org.gradle.initialization.DefaultGradleLauncher$1.create(DefaultGradleLauncher.java:112)
	at org.gradle.initialization.DefaultGradleLauncher$1.create(DefaultGradleLauncher.java:106)
	at org.gradle.internal.progress.DefaultBuildOperationExecutor.run(DefaultBuildOperationExecutor.java:91)
	at org.gradle.internal.progress.DefaultBuildOperationExecutor.run(DefaultBuildOperationExecutor.java:63)
	at org.gradle.initialization.DefaultGradleLauncher.doBuild(DefaultGradleLauncher.java:106)
	at org.gradle.initialization.DefaultGradleLauncher.run(DefaultGradleLauncher.java:92)
	at org.gradle.launcher.exec.GradleBuildController.run(GradleBuildController.java:66)
	at org.gradle.tooling.internal.provider.ExecuteBuildActionRunner.run(ExecuteBuildActionRunner.java:28)
	at org.gradle.launcher.exec.ChainingBuildActionRunner.run(ChainingBuildActionRunner.java:35)
	at org.gradle.launcher.exec.InProcessBuildActionExecuter.execute(InProcessBuildActionExecuter.java:41)
	at org.gradle.launcher.exec.InProcessBuildActionExecuter.execute(InProcessBuildActionExecuter.java:26)
	at org.gradle.tooling.internal.provider.ContinuousBuildActionExecuter.execute(ContinuousBuildActionExecuter.java:79)
	at org.gradle.tooling.internal.provider.ContinuousBuildActionExecuter.execute(ContinuousBuildActionExecuter.java:51)
	at org.gradle.launcher.daemon.server.exec.ExecuteBuild.doBuild(ExecuteBuild.java:59)
	at org.gradle.launcher.daemon.server.exec.BuildCommandOnly.execute(BuildCommandOnly.java:36)
	at org.gradle.launcher.daemon.server.api.DaemonCommandExecution.proceed(DaemonCommandExecution.java:120)
	at org.gradle.launcher.daemon.server.exec.WatchForDisconnection.execute(WatchForDisconnection.java:47)
	at org.gradle.launcher.daemon.server.api.DaemonCommandExecution.proceed(DaemonCommandExecution.java:120)
	at org.gradle.launcher.daemon.server.exec.ResetDeprecationLogger.execute(ResetDeprecationLogger.java:26)
	at org.gradle.launcher.daemon.server.api.DaemonCommandExecution.proceed(DaemonCommandExecution.java:120)
	at org.gradle.launcher.daemon.server.exec.RequestStopIfSingleUsedDaemon.execute(RequestStopIfSingleUsedDaemon.java:34)
	at org.gradle.launcher.daemon.server.api.DaemonCommandExecution.proceed(DaemonCommandExecution.java:120)
	at org.gradle.launcher.daemon.server.exec.ForwardClientInput$2.call(ForwardClientInput.java:74)
	at org.gradle.launcher.daemon.server.exec.ForwardClientInput$2.call(ForwardClientInput.java:72)
	at org.gradle.util.Swapper.swap(Swapper.java:38)
	at org.gradle.launcher.daemon.server.exec.ForwardClientInput.execute(ForwardClientInput.java:72)
	at org.gradle.launcher.daemon.server.api.DaemonCommandExecution.proceed(DaemonCommandExecution.java:120)
	at org.gradle.launcher.daemon.server.exec.LogAndCheckHealth.execute(LogAndCheckHealth.java:55)
	at org.gradle.launcher.daemon.server.api.DaemonCommandExecution.proceed(DaemonCommandExecution.java:120)
	at org.gradle.launcher.daemon.server.exec.LogToClient.doBuild(LogToClient.java:60)
	at org.gradle.launcher.daemon.server.exec.BuildCommandOnly.execute(BuildCommandOnly.java:36)
	at org.gradle.launcher.daemon.server.api.DaemonCommandExecution.proceed(DaemonCommandExecution.java:120)
	at org.gradle.launcher.daemon.server.exec.EstablishBuildEnvironment.doBuild(EstablishBuildEnvironment.java:72)
	at org.gradle.launcher.daemon.server.exec.BuildCommandOnly.execute(BuildCommandOnly.java:36)
	at org.gradle.launcher.daemon.server.api.DaemonCommandExecution.proceed(DaemonCommandExecution.java:120)
	at org.gradle.launcher.daemon.server.exec.HintGCAfterBuild.execute(HintGCAfterBuild.java:44)
	at org.gradle.launcher.daemon.server.api.DaemonCommandExecution.proceed(DaemonCommandExecution.java:120)
	at org.gradle.launcher.daemon.server.exec.StartBuildOrRespondWithBusy$1.run(StartBuildOrRespondWithBusy.java:50)
	at org.gradle.launcher.daemon.server.DaemonStateCoordinator$1.run(DaemonStateCoordinator.java:293)
	at org.gradle.internal.concurrent.ExecutorPolicy$CatchAndRecordFailures.onExecute(ExecutorPolicy.java:54)
	at org.gradle.internal.concurrent.StoppableExecutorImpl$1.run(StoppableExecutorImpl.java:40)


BUILD FAILED

Total time: 11.555 secs
[locks-and-latches] Releasing all the locks
[locks-and-latches] All the locks released
Recording test results
Archiving artifacts
Sending e-mails to: fwaibel@eclipsesource.com
Finished: FAILURE