FailedConsole Output

Skipping 285 KB.. Full Log
Zn++WXpC7zV766aHPULSYGhooiBimoluT8vOJ8oFpnCA1SyAABjCCFBQDX67qaYgAAAA==:org.eclipse.virgo.site:org.eclipse.virgo.nano.mbeans.controller:testClasses UP-TO-DATE
:org.eclipse.virgo.site:org.eclipse.virgo.nano.mbeans.controller:test UP-TO-DATE
:org.eclipse.virgo.site:org.eclipse.virgo.nano.mbeans.controller:check UP-TO-DATE
:org.eclipse.virgo.site:org.eclipse.virgo.nano.mbeans.controller:build
:org.eclipse.virgo.site:org.eclipse.virgo.nano.war.deployer:assemble
:org.eclipse.virgo.site:org.eclipse.virgo.nano.war.deployer:compileTestJava UP-TO-DATE
:org.eclipse.virgo.site:org.eclipse.virgo.nano.war.deployer:processTestResources UP-TO-DATE
:org.eclipse.virgo.site:org.eclipse.virgo.nano.war.deployer:testClasses UP-TO-DATE
:org.eclipse.virgo.site:org.eclipse.virgo.nano.war.deployer:test UP-TO-DATE
:org.eclipse.virgo.site:org.eclipse.virgo.nano.war.deployer:check UP-TO-DATE
:org.eclipse.virgo.site:org.eclipse.virgo.nano.war.deployer:build
:org.eclipse.virgo.site:org.eclipse.virgo.p2.provisioning:assemble
:org.eclipse.virgo.site:org.eclipse.virgo.p2.provisioning:compileTestJava UP-TO-DATE
:org.eclipse.virgo.site:org.eclipse.virgo.p2.provisioning:processTestResources UP-TO-DATE
:org.eclipse.virgo.site:org.eclipse.virgo.p2.provisioning:testClasses UP-TO-DATE
:org.eclipse.virgo.site:org.eclipse.virgo.p2.provisioning:test UP-TO-DATE
:org.eclipse.virgo.site:org.eclipse.virgo.p2.provisioning:check UP-TO-DATE
:org.eclipse.virgo.site:org.eclipse.virgo.p2.provisioning:build
:org.eclipse.virgo.site:org.eclipse.virgo.services.concurrent:assemble
:org.eclipse.virgo.site:org.eclipse.virgo.services.concurrent:compileTestJava UP-TO-DATE
:org.eclipse.virgo.site:org.eclipse.virgo.services.concurrent:processTestResources UP-TO-DATE
:org.eclipse.virgo.site:org.eclipse.virgo.services.concurrent:testClasses UP-TO-DATE
:org.eclipse.virgo.site:org.eclipse.virgo.services.concurrent:test UP-TO-DATE
:org.eclipse.virgo.site:org.eclipse.virgo.services.concurrent:check UP-TO-DATE
:org.eclipse.virgo.site:org.eclipse.virgo.services.concurrent:build
:org.eclipse.virgo.site:org.eclipse.virgo.services.ds:assemble
:org.eclipse.virgo.site:org.eclipse.virgo.services.ds:compileTestJava UP-TO-DATE
:org.eclipse.virgo.site:org.eclipse.virgo.services.ds:processTestResources UP-TO-DATE
:org.eclipse.virgo.site:org.eclipse.virgo.services.ds:testClasses UP-TO-DATE
:org.eclipse.virgo.site:org.eclipse.virgo.services.ds:test UP-TO-DATE
:org.eclipse.virgo.site:org.eclipse.virgo.services.ds:check UP-TO-DATE
:org.eclipse.virgo.site:org.eclipse.virgo.services.ds:build
:org.eclipse.virgo.site:org.eclipse.virgo.shell:assemble
:org.eclipse.virgo.site:org.eclipse.virgo.shell:compileTestJava UP-TO-DATE
:org.eclipse.virgo.site:org.eclipse.virgo.shell:processTestResources UP-TO-DATE
:org.eclipse.virgo.site:org.eclipse.virgo.shell:testClasses UP-TO-DATE
:org.eclipse.virgo.site:org.eclipse.virgo.shell:test UP-TO-DATE
:org.eclipse.virgo.site:org.eclipse.virgo.shell:check UP-TO-DATE
:org.eclipse.virgo.site:org.eclipse.virgo.shell:build
:org.eclipse.virgo.site:org.eclipse.virgo.simpleconfigurator:assemble
:org.eclipse.virgo.site:org.eclipse.virgo.simpleconfigurator:compileTestJava UP-TO-DATE
:org.eclipse.virgo.site:org.eclipse.virgo.simpleconfigurator:processTestResources UP-TO-DATE
:org.eclipse.virgo.site:org.eclipse.virgo.simpleconfigurator:testClasses UP-TO-DATE
:org.eclipse.virgo.site:org.eclipse.virgo.simpleconfigurator:test UP-TO-DATE
:org.eclipse.virgo.site:org.eclipse.virgo.simpleconfigurator:check UP-TO-DATE
:org.eclipse.virgo.site:org.eclipse.virgo.simpleconfigurator:build
:org.eclipse.virgo.site:org.eclipse.virgo.springdm:assemble
:org.eclipse.virgo.site:org.eclipse.virgo.springdm:compileTestJava UP-TO-DATE
:org.eclipse.virgo.site:org.eclipse.virgo.springdm:processTestResources UP-TO-DATE
:org.eclipse.virgo.site:org.eclipse.virgo.springdm:testClasses UP-TO-DATE
:org.eclipse.virgo.site:org.eclipse.virgo.springdm:test UP-TO-DATE
:org.eclipse.virgo.site:org.eclipse.virgo.springdm:check UP-TO-DATE
:org.eclipse.virgo.site:org.eclipse.virgo.springdm:build
:org.eclipse.virgo.site:org.eclipse.virgo.tools:assemble
:org.eclipse.virgo.site:org.eclipse.virgo.tools:compileTestJava UP-TO-DATE
:org.eclipse.virgo.site:org.eclipse.virgo.tools:processTestResources UP-TO-DATE
:org.eclipse.virgo.site:org.eclipse.virgo.tools:testClasses UP-TO-DATE
:org.eclipse.virgo.site:org.eclipse.virgo.tools:test UP-TO-DATE
:org.eclipse.virgo.site:org.eclipse.virgo.tools:check UP-TO-DATE
:org.eclipse.virgo.site:org.eclipse.virgo.tools:build
:org.eclipse.virgo.site:org.eclipse.virgo.webconsole.deps:assemble
:org.eclipse.virgo.site:org.eclipse.virgo.webconsole.deps:compileTestJava UP-TO-DATE
:org.eclipse.virgo.site:org.eclipse.virgo.webconsole.deps:processTestResources UP-TO-DATE
:org.eclipse.virgo.site:org.eclipse.virgo.webconsole.deps:testClasses UP-TO-DATE
:org.eclipse.virgo.site:org.eclipse.virgo.webconsole.deps:test UP-TO-DATE
:org.eclipse.virgo.site:org.eclipse.virgo.webconsole.deps:check UP-TO-DATE
:org.eclipse.virgo.site:org.eclipse.virgo.webconsole.deps:build
:packaging:jetty-server:packageResourcesAndProducts
Copy the lib artifacts:
org.eclipse.virgo.kernel.equinox.extensions-3.7.0.RELEASE.jar
org.eclipse.virgo.nano.authentication-3.7.0.RELEASE.jar
org.eclipse.virgo.nano.shutdown-3.7.0.RELEASE.jar
org.eclipse.virgo.util.env-3.7.0.RELEASE.jar
org.eclipse.equinox.launcher-1.3.0.v20130327-1440.jar
to '/jobs/genie.virgo/3.7.0.Milestones/workspace/packaging/jetty-server/build/common_resources/lib'.
Copy the libPersistence artifacts:
org.eclipse.virgo.web.enterprise.openejb.jpa.integration-3.7.0.RELEASE.jar
to '/jobs/genie.virgo/3.7.0.Milestones/workspace/packaging/jetty-server/build/common_resources/lib/persistence'.
Copy the libEndorsed artifacts:
javax.annotation-1.2.0.v201401042248.jar
javax.interceptor-api-1.2.jar
javax.transaction-api-1.2.jar
to '/jobs/genie.virgo/3.7.0.Milestones/workspace/packaging/jetty-server/build/common_resources/lib/endorsed'.
Copy the pluginsExtras artifacts:
org.eclipse.virgo.kernel.userregion-3.7.0.RELEASE.jar
to '/jobs/genie.virgo/3.7.0.Milestones/workspace/packaging/jetty-server/build/common_resources/plugins'.
Copy the repositoryExt artifacts:
org.eclipse.osgi.services-3.3.100.v20130513-1956.jar
osgi.enterprise-4.2.0.v201108120515.jar
org.eclipse.equinox.ds-1.4.200.v20131126-2331.jar
org.eclipse.equinox.util-1.0.500.v20130404-1337.jar
org.eclipse.equinox.region-1.1.101.v20130722-1314.jar
oevm.org.aopalliance-1.0.0.jar
org.apache.commons.codec-1.10.0.jar
org.springframework.aop-4.2.9.RELEASE.jar
org.springframework.beans-4.2.9.RELEASE.jar
org.springframework.context-4.2.9.RELEASE.jar
org.springframework.core-4.2.9.RELEASE.jar
org.springframework.expression-4.2.9.RELEASE.jar
gemini-blueprint-io-2.0.0.RELEASE.jar
gemini-blueprint-core-2.0.0.RELEASE.jar
gemini-blueprint-extender-2.0.0.RELEASE.jar
org.eclipse.gemini.management-1.0.5.RELEASE.jar
org.eclipse.virgo.management.fragment-3.7.0.RELEASE.jar
org.eclipse.virgo.kernel.agent.dm-3.7.0.RELEASE.jar
org.eclipse.virgo.kernel.deployer.dm-3.7.0.RELEASE.jar
org.eclipse.virgo.kernel.dmfragment-3.7.0.RELEASE.jar
commons-io-2.2.jar
commons-fileupload-1.3.2.jar
jolokia-osgi-1.3.3.jar
org.eclipse.virgo.medic-3.7.0.RELEASE.jar
org.eclipse.virgo.medic.core-3.7.0.RELEASE.jar
org.eclipse.virgo.web.dm-3.7.0.RELEASE.jar
javax.jms-1.1.0.v201205091237.jar
javax.servlet-3.1.0.20170128.jar
org.springframework.aspects-4.2.9.RELEASE.jar
org.springframework.context.support-4.2.9.RELEASE.jar
org.springframework.jdbc-4.2.9.RELEASE.jar
org.springframework.messaging-4.2.9.RELEASE.jar
org.springframework.jms-4.2.9.RELEASE.jar
org.springframework.orm-4.2.9.RELEASE.jar
org.springframework.oxm-4.2.9.RELEASE.jar
org.springframework.transaction-4.2.9.RELEASE.jar
org.springframework.web-4.2.9.RELEASE.jar
org.springframework.webmvc-4.2.9.RELEASE.jar
org.springframework.webmvc.portlet-4.2.9.RELEASE.jar
org.springframework.websocket-4.2.9.RELEASE.jar
org.aspectj.weaver-1.8.10.jar
oevm.javax.portlet-2.0.0.jar
javax.servlet.jsp.jstl-api-1.2.1.jar
javax.servlet.jsp.jstl-1.2.5-b03.jar
org.eclipse.virgo.web.servlet.adapter-3.7.0.RELEASE.jar
org.eclipse.jetty.continuation-8.1.16.v20140903.jar
org.eclipse.jetty.deploy-8.1.16.v20140903.jar
org.eclipse.jetty.http-8.1.16.v20140903.jar
org.eclipse.jetty.io-8.1.16.v20140903.jar
org.eclipse.jetty.osgi.boot-8.1.16.v20140903.jar
org.eclipse.jetty.security-8.1.16.v20140903.jar
org.eclipse.jetty.server-8.1.16.v20140903.jar
org.eclipse.jetty.servlet-8.1.16.v20140903.jar
org.eclipse.jetty.util-8.1.16.v20140903.jar
org.eclipse.jetty.webapp-8.1.16.v20140903.jar
org.eclipse.jetty.xml-8.1.16.v20140903.jar
to '/jobs/genie.virgo/3.7.0.Milestones/workspace/packaging/jetty-server/build/common_resources/repository/ext'.
Copy the pickup artifacts:
org.eclipse.virgo.management.console-3.7.0.RELEASE.jar
org.eclipse.virgo.apps.splash-3.7.0.RELEASE.jar
to '/jobs/genie.virgo/3.7.0.Milestones/workspace/packaging/jetty-server/build/common_resources/pickup'.
:packaging:jetty-server:check UP-TO-DATE
:packaging:kernel:packageResourcesAndProducts
Copy the lib artifacts:
org.eclipse.virgo.kernel.equinox.extensions-3.7.0.RELEASE.jar
org.eclipse.virgo.nano.authentication-3.7.0.RELEASE.jar
org.eclipse.virgo.nano.shutdown-3.7.0.RELEASE.jar
org.eclipse.virgo.util.env-3.7.0.RELEASE.jar
org.eclipse.equinox.launcher-1.3.0.v20130327-1440.jar
to '/jobs/genie.virgo/3.7.0.Milestones/workspace/packaging/kernel/build/common_resources/lib'.
Copy the libPersistence artifacts:
org.eclipse.virgo.web.enterprise.openejb.jpa.integration-3.7.0.RELEASE.jar
to '/jobs/genie.virgo/3.7.0.Milestones/workspace/packaging/kernel/build/common_resources/lib/persistence'.
Copy the libEndorsed artifacts:
javax.annotation-1.2.0.v201401042248.jar
javax.interceptor-api-1.2.jar
javax.transaction-api-1.2.jar
to '/jobs/genie.virgo/3.7.0.Milestones/workspace/packaging/kernel/build/common_resources/lib/endorsed'.
Copy the pluginsExtras artifacts:
org.eclipse.virgo.kernel.userregion-3.7.0.RELEASE.jar
to '/jobs/genie.virgo/3.7.0.Milestones/workspace/packaging/kernel/build/common_resources/plugins'.
Copy the repositoryExt artifacts:
org.eclipse.osgi.services-3.3.100.v20130513-1956.jar
osgi.enterprise-4.2.0.v201108120515.jar
org.eclipse.equinox.ds-1.4.200.v20131126-2331.jar
org.eclipse.equinox.util-1.0.500.v20130404-1337.jar
org.eclipse.equinox.region-1.1.101.v20130722-1314.jar
oevm.org.aopalliance-1.0.0.jar
org.apache.commons.codec-1.10.0.jar
org.springframework.aop-4.2.9.RELEASE.jar
org.springframework.beans-4.2.9.RELEASE.jar
org.springframework.context-4.2.9.RELEASE.jar
org.springframework.core-4.2.9.RELEASE.jar
org.springframework.expression-4.2.9.RELEASE.jar
gemini-blueprint-io-2.0.0.RELEASE.jar
gemini-blueprint-core-2.0.0.RELEASE.jar
gemini-blueprint-extender-2.0.0.RELEASE.jar
org.eclipse.gemini.management-1.0.5.RELEASE.jar
org.eclipse.virgo.management.fragment-3.7.0.RELEASE.jar
org.eclipse.virgo.kernel.agent.dm-3.7.0.RELEASE.jar
org.eclipse.virgo.kernel.deployer.dm-3.7.0.RELEASE.jar
org.eclipse.virgo.kernel.dmfragment-3.7.0.RELEASE.jar
commons-io-2.2.jar
commons-fileupload-1.3.2.jar
jolokia-osgi-1.3.3.jar
to '/jobs/genie.virgo/3.7.0.Milestones/workspace/packaging/kernel/build/common_resources/repository/ext'.
Copy the pickup artifacts:
org.eclipse.virgo.management.console-3.7.0.RELEASE.jar
to '/jobs/genie.virgo/3.7.0.Milestones/workspace/packaging/kernel/build/common_resources/pickup'.
:packaging:kernel:check UP-TO-DATE
:packaging:nano:packageResourcesAndProducts
Copy the lib artifacts:
org.eclipse.virgo.kernel.equinox.extensions-3.7.0.RELEASE.jar
org.eclipse.virgo.nano.authentication-3.7.0.RELEASE.jar
org.eclipse.virgo.nano.shutdown-3.7.0.RELEASE.jar
org.eclipse.virgo.util.env-3.7.0.RELEASE.jar
org.eclipse.equinox.launcher-1.3.0.v20130327-1440.jar
to '/jobs/genie.virgo/3.7.0.Milestones/workspace/packaging/nano/build/common_resources/lib'.
Copy the libPersistence artifacts:
org.eclipse.virgo.web.enterprise.openejb.jpa.integration-3.7.0.RELEASE.jar
to '/jobs/genie.virgo/3.7.0.Milestones/workspace/packaging/nano/build/common_resources/lib/persistence'.
Copy the libEndorsed artifacts:
javax.annotation-1.2.0.v201401042248.jar
javax.interceptor-api-1.2.jar
javax.transaction-api-1.2.jar
to '/jobs/genie.virgo/3.7.0.Milestones/workspace/packaging/nano/build/common_resources/lib/endorsed'.
Copy the pickup artifacts:
org.eclipse.virgo.management.console-3.7.0.RELEASE.jar
to '/jobs/genie.virgo/3.7.0.Milestones/workspace/packaging/nano/build/common_resources/pickup'.
:packaging:nano:check UP-TO-DATE
:packaging:tomcat-server:packageResourcesAndProducts
Copy the lib artifacts:
org.eclipse.virgo.kernel.equinox.extensions-3.7.0.RELEASE.jar
org.eclipse.virgo.nano.authentication-3.7.0.RELEASE.jar
org.eclipse.virgo.nano.shutdown-3.7.0.RELEASE.jar
org.eclipse.virgo.util.env-3.7.0.RELEASE.jar
org.eclipse.equinox.launcher-1.3.0.v20130327-1440.jar
to '/jobs/genie.virgo/3.7.0.Milestones/workspace/packaging/tomcat-server/build/common_resources/lib'.
Copy the libPersistence artifacts:
org.eclipse.virgo.web.enterprise.openejb.jpa.integration-3.7.0.RELEASE.jar
to '/jobs/genie.virgo/3.7.0.Milestones/workspace/packaging/tomcat-server/build/common_resources/lib/persistence'.
Copy the libEndorsed artifacts:
javax.annotation-1.2.0.v201401042248.jar
javax.interceptor-api-1.2.jar
javax.transaction-api-1.2.jar
to '/jobs/genie.virgo/3.7.0.Milestones/workspace/packaging/tomcat-server/build/common_resources/lib/endorsed'.
Copy the pluginsExtras artifacts:
org.eclipse.virgo.kernel.userregion-3.7.0.RELEASE.jar
to '/jobs/genie.virgo/3.7.0.Milestones/workspace/packaging/tomcat-server/build/common_resources/plugins'.
Copy the repositoryExt artifacts:
org.eclipse.osgi.services-3.3.100.v20130513-1956.jar
osgi.enterprise-4.2.0.v201108120515.jar
org.eclipse.equinox.ds-1.4.200.v20131126-2331.jar
org.eclipse.equinox.util-1.0.500.v20130404-1337.jar
org.eclipse.equinox.region-1.1.101.v20130722-1314.jar
oevm.org.aopalliance-1.0.0.jar
org.apache.commons.codec-1.10.0.jar
org.springframework.aop-4.2.9.RELEASE.jar
org.springframework.beans-4.2.9.RELEASE.jar
org.springframework.context-4.2.9.RELEASE.jar
org.springframework.core-4.2.9.RELEASE.jar
org.springframework.expression-4.2.9.RELEASE.jar
gemini-blueprint-io-2.0.0.RELEASE.jar
gemini-blueprint-core-2.0.0.RELEASE.jar
gemini-blueprint-extender-2.0.0.RELEASE.jar
org.eclipse.gemini.management-1.0.5.RELEASE.jar
org.eclipse.virgo.management.fragment-3.7.0.RELEASE.jar
org.eclipse.virgo.kernel.agent.dm-3.7.0.RELEASE.jar
org.eclipse.virgo.kernel.deployer.dm-3.7.0.RELEASE.jar
org.eclipse.virgo.kernel.dmfragment-3.7.0.RELEASE.jar
commons-io-2.2.jar
commons-fileupload-1.3.2.jar
jolokia-osgi-1.3.3.jar
org.eclipse.virgo.medic-3.7.0.RELEASE.jar
org.eclipse.virgo.medic.core-3.7.0.RELEASE.jar
org.eclipse.virgo.web.dm-3.7.0.RELEASE.jar
javax.jms-1.1.0.v201205091237.jar
javax.servlet-3.1.0.20170128.jar
org.springframework.aspects-4.2.9.RELEASE.jar
org.springframework.context.support-4.2.9.RELEASE.jar
org.springframework.jdbc-4.2.9.RELEASE.jar
org.springframework.messaging-4.2.9.RELEASE.jar
org.springframework.jms-4.2.9.RELEASE.jar
org.springframework.orm-4.2.9.RELEASE.jar
org.springframework.oxm-4.2.9.RELEASE.jar
org.springframework.transaction-4.2.9.RELEASE.jar
org.springframework.web-4.2.9.RELEASE.jar
org.springframework.webmvc-4.2.9.RELEASE.jar
org.springframework.webmvc.portlet-4.2.9.RELEASE.jar
org.springframework.websocket-4.2.9.RELEASE.jar
org.aspectj.weaver-1.8.10.jar
oevm.javax.portlet-2.0.0.jar
javax.servlet.jsp.jstl-api-1.2.1.jar
javax.servlet.jsp.jstl-1.2.5-b03.jar
org.eclipse.virgo.web.core-3.7.0.RELEASE.jar
org.eclipse.virgo.web.tomcat.support-3.7.0.RELEASE.jar
org.eclipse.virgo.web.servlet.adapter-3.7.0.RELEASE.jar
org.eclipse.virgo.web.spring.integration-3.7.0.RELEASE.jar
javax.annotation-1.2.0.v201401042248.jar
javax.ejb-3.1.1.v201204261316.jar
javax.el-3.0.0.20170128.jar
javax.mail-1.5.5.jar
javax.persistence-2.1.0.v201304241213.jar
javax.servlet.jsp-2.3.0.20170128.jar
javax.security.auth.message-1.1.0.20170128.jar
javax.xml.rpc-1.1.0.v201005080400.jar
javax.websocket-1.1.0.20170128.jar
org.eclipse.equinox.event-1.3.0.v20130327-1442.jar
oevm.org.apache.taglibs.standard-1.1.2.v20110517.jar
slf4j-api-1.7.22.jar
slf4j-jcl-1.7.22.jar
jul-to-slf4j-1.7.22.jar
slf4j-log4j12-1.7.22.jar
org.eclipse.jdt.core.compiler.batch-3.10.0.v20140604-1726.jar
org.apache.catalina-8.5.11.jar
org.apache.catalina.ha-8.5.11.jar
org.apache.catalina.tribes-8.5.11.jar
org.apache.coyote-8.5.11.jar
org.apache.el-8.5.11.jar
org.apache.jasper-8.5.11.jar
org.apache.juli-8.5.11.jar
org.apache.tomcat.api-8.5.11.jar
org.apache.tomcat.util-8.5.11.jar
org.apache.tomcat.util.scan-8.5.11.jar
org.apache.tomcat.jni-8.5.11.jar
org.apache.tomcat.websocket-8.5.11.jar
org.eclipse.gemini.web.core-3.0.0.RELEASE.jar
org.eclipse.gemini.web.tomcat-3.0.0.RELEASE.jar
org.eclipse.gemini.web.jaspic.fragment-3.0.0.RELEASE.jar
to '/jobs/genie.virgo/3.7.0.Milestones/workspace/packaging/tomcat-server/build/common_resources/repository/ext'.
Copy the pickup artifacts:
org.eclipse.virgo.management.console-3.7.0.RELEASE.jar
org.eclipse.virgo.apps.splash-3.7.0.RELEASE.jar
to '/jobs/genie.virgo/3.7.0.Milestones/workspace/packaging/tomcat-server/build/common_resources/pickup'.
:packaging:tomcat-server:check UP-TO-DATE
:repository:org.eclipse.virgo.repository:compileTestJava
:repository:org.eclipse.virgo.repository:processTestResources
:repository:org.eclipse.virgo.repository:testClasses
:repository:org.eclipse.virgo.repository:test
:repository:org.eclipse.virgo.repository:check
:repository:org.eclipse.virgo.repository:build
:test:org.eclipse.virgo.test.framework:sourcesJar
:test:org.eclipse.virgo.test.framework:assemble
:test:org.eclipse.virgo.test.framework:compileTestJava
:test:org.eclipse.virgo.test.framework:processTestResources
:test:org.eclipse.virgo.test.framework:testClasses
:test:org.eclipse.virgo.test.framework:test
:test:org.eclipse.virgo.test.framework:check
:test:org.eclipse.virgo.test.framework:build
:test:org.eclipse.virgo.test.launcher:sourcesJar
:test:org.eclipse.virgo.test.launcher:assemble
:test:org.eclipse.virgo.test.launcher:compileTestJava
:test:org.eclipse.virgo.test.launcher:processTestResources
:test:org.eclipse.virgo.test.launcher:testClasses
:test:org.eclipse.virgo.test.launcher:test
:test:org.eclipse.virgo.test.launcher:check
:test:org.eclipse.virgo.test.launcher:build
:test:org.eclipse.virgo.test.stubs:sourcesJar
:test:org.eclipse.virgo.test.stubs:assemble
:test:org.eclipse.virgo.test.stubs:compileTestAspect
:test:org.eclipse.virgo.test.stubs:compileTestJava
:test:org.eclipse.virgo.test.stubs:processTestResources
:test:org.eclipse.virgo.test.stubs:testClasses
:test:org.eclipse.virgo.test.stubs:test
:test:org.eclipse.virgo.test.stubs:check
:test:org.eclipse.virgo.test.stubs:build
:test:org.eclipse.virgo.test.tools:sourcesJar
:test:org.eclipse.virgo.test.tools:assemble
:test:org.eclipse.virgo.test.tools:compileTestJava UP-TO-DATE
:test:org.eclipse.virgo.test.tools:processTestResources UP-TO-DATE
:test:org.eclipse.virgo.test.tools:testClasses UP-TO-DATE
:test:org.eclipse.virgo.test.tools:test UP-TO-DATE
:test:org.eclipse.virgo.test.tools:check UP-TO-DATE
:test:org.eclipse.virgo.test.tools:build
:util:org.eclipse.virgo.util.common:compileTestJava
:util:org.eclipse.virgo.util.common:processTestResources UP-TO-DATE
:util:org.eclipse.virgo.util.common:testClasses
:util:org.eclipse.virgo.util.common:test
:util:org.eclipse.virgo.util.common:check
:util:org.eclipse.virgo.util.common:build
:util:org.eclipse.virgo.util.env:compileTestJava
:util:org.eclipse.virgo.util.env:processTestResources UP-TO-DATE
:util:org.eclipse.virgo.util.env:testClasses
:util:org.eclipse.virgo.util.env:test
:util:org.eclipse.virgo.util.env:check
:util:org.eclipse.virgo.util.env:build
:util:org.eclipse.virgo.util.integrationtest:sourcesJar
:util:org.eclipse.virgo.util.integrationtest:assemble
:util:org.eclipse.virgo.util.integrationtest:compileTestJavaincorrect classpath: /jobs/genie.virgo/3.7.0.Milestones/workspace/util/org.eclipse.virgo.util.integrationtest/build/classes/main
incorrect classpath: /jobs/genie.virgo/3.7.0.Milestones/workspace/util/org.eclipse.virgo.util.integrationtest/build/resources/main
----------
1. WARNING in /jobs/genie.virgo/3.7.0.Milestones/workspace/util/org.eclipse.virgo.util.integrationtest/src/test/java/org/eclipse/virgo/util/test/UtilBundlesResolutionPaxExamTests.java (at line 109)
	Dictionary<String, String> headers = bundle.getHeaders();
	                                     ^^^^^^^^^^^^^^^^^^^
Type safety: The expression of type Dictionary needs unchecked conversion to conform to Dictionary<String,String>
----------
1 problem (1 warning)

:util:org.eclipse.virgo.util.integrationtest:processTestResources UP-TO-DATE
:util:org.eclipse.virgo.util.integrationtest:testClasses
:util:org.eclipse.virgo.util.integrationtest:test
:util:org.eclipse.virgo.util.integrationtest:check
:util:org.eclipse.virgo.util.integrationtest:build
:util:org.eclipse.virgo.util.io:compileTestJava
:util:org.eclipse.virgo.util.io:processTestResources
:util:org.eclipse.virgo.util.io:testClasses
:util:org.eclipse.virgo.util.io:test
:util:org.eclipse.virgo.util.io:check
:util:org.eclipse.virgo.util.io:build
:util:org.eclipse.virgo.util.jmx:compileTestAspect
:util:org.eclipse.virgo.util.jmx:compileTestJava
:util:org.eclipse.virgo.util.jmx:processTestResources UP-TO-DATE
:util:org.eclipse.virgo.util.jmx:testClasses
:util:org.eclipse.virgo.util.jmx:test
:util:org.eclipse.virgo.util.jmx:check
:util:org.eclipse.virgo.util.jmx:build
:util:org.eclipse.virgo.util.math:compileTestJava
:util:org.eclipse.virgo.util.math:processTestResources UP-TO-DATE
:util:org.eclipse.virgo.util.math:testClasses
:util:org.eclipse.virgo.util.math:test
:util:org.eclipse.virgo.util.math:check
:util:org.eclipse.virgo.util.math:build
:util:org.eclipse.virgo.util.osgi:compileTestJava
:util:org.eclipse.virgo.util.osgi:processTestResources
:util:org.eclipse.virgo.util.osgi:testClasses
:util:org.eclipse.virgo.util.osgi:test
:util:org.eclipse.virgo.util.osgi:check
:util:org.eclipse.virgo.util.osgi:build
:util:org.eclipse.virgo.util.osgi.manifest:compileTestJava
:util:org.eclipse.virgo.util.osgi.manifest:processTestResources
:util:org.eclipse.virgo.util.osgi.manifest:testClasses
:util:org.eclipse.virgo.util.osgi.manifest:test
:util:org.eclipse.virgo.util.osgi.manifest:check
:util:org.eclipse.virgo.util.osgi.manifest:build
:util:org.eclipse.virgo.util.parser.launcher:compileTestJava
:util:org.eclipse.virgo.util.parser.launcher:processTestResources
:util:org.eclipse.virgo.util.parser.launcher:testClasses
:util:org.eclipse.virgo.util.parser.launcher:test
:util:org.eclipse.virgo.util.parser.launcher:check
:util:org.eclipse.virgo.util.parser.launcher:build
:util:org.eclipse.virgo.util.parser.manifest:compileTestJava
:util:org.eclipse.virgo.util.parser.manifest:processTestResources
:util:org.eclipse.virgo.util.parser.manifest:testClasses
:util:org.eclipse.virgo.util.parser.manifest:test
:util:org.eclipse.virgo.util.parser.manifest:check
:util:org.eclipse.virgo.util.parser.manifest:build
:web:org.eclipse.virgo.web.core:compileTestJava
:web:org.eclipse.virgo.web.core:processTestResources UP-TO-DATE
:web:org.eclipse.virgo.web.core:testClasses
:web:org.eclipse.virgo.web.core:test
:web:org.eclipse.virgo.web.core:check
:web:org.eclipse.virgo.web.core:build
:web:org.eclipse.virgo.web.dm:compileTestJavaincorrect classpath: /jobs/genie.virgo/3.7.0.Milestones/workspace/web/org.eclipse.virgo.web.dm/build/resources/main

:web:org.eclipse.virgo.web.dm:processTestResources UP-TO-DATE
:web:org.eclipse.virgo.web.dm:testClasses
:web:org.eclipse.virgo.web.dm:test
:web:org.eclipse.virgo.web.dm:check
:web:org.eclipse.virgo.web.dm:build
:web:org.eclipse.virgo.web.enterprise.appdeployer:compileTestJava UP-TO-DATE
:web:org.eclipse.virgo.web.enterprise.appdeployer:processTestResources UP-TO-DATE
:web:org.eclipse.virgo.web.enterprise.appdeployer:testClasses UP-TO-DATE
:web:org.eclipse.virgo.web.enterprise.appdeployer:test UP-TO-DATE
:web:org.eclipse.virgo.web.enterprise.appdeployer:check UP-TO-DATE
:web:org.eclipse.virgo.web.enterprise.appdeployer:build
:web:org.eclipse.virgo.web.enterprise.applistener:compileTestJava UP-TO-DATE
:web:org.eclipse.virgo.web.enterprise.applistener:processTestResources UP-TO-DATE
:web:org.eclipse.virgo.web.enterprise.applistener:testClasses UP-TO-DATE
:web:org.eclipse.virgo.web.enterprise.applistener:test UP-TO-DATE
:web:org.eclipse.virgo.web.enterprise.applistener:check UP-TO-DATE
:web:org.eclipse.virgo.web.enterprise.applistener:build
:web:org.eclipse.virgo.web.enterprise.catalina.fragment.webbeans:compileTestJava UP-TO-DATE
:web:org.eclipse.virgo.web.enterprise.catalina.fragment.webbeans:processTestResources UP-TO-DATE
:web:org.eclipse.virgo.web.enterprise.catalina.fragment.webbeans:testClasses UP-TO-DATE
:web:org.eclipse.virgo.web.enterprise.catalina.fragment.webbeans:test UP-TO-DATE
:web:org.eclipse.virgo.web.enterprise.catalina.fragment.webbeans:check UP-TO-DATE
:web:org.eclipse.virgo.web.enterprise.catalina.fragment.webbeans:build
:web:org.eclipse.virgo.web.enterprise.javax.persistence.extension:compileTestJava----------
1. WARNING in /jobs/genie.virgo/3.7.0.Milestones/workspace/web/org.eclipse.virgo.web.enterprise.javax.persistence.extension/src/test/java/org/eclipse/virgo/web/enterprise/javax/persistence/extension/TestPersistenceProvider.java (at line 40)
	public boolean generateSchema(String arg0, Map arg1) {
	                                           ^^^
Map is a raw type. References to generic type Map<K,V> should be parameterized
----------
2. WARNING in /jobs/genie.virgo/3.7.0.Milestones/workspace/web/org.eclipse.virgo.web.enterprise.javax.persistence.extension/src/test/java/org/eclipse/virgo/web/enterprise/javax/persistence/extension/TestPersistenceProvider.java (at line 45)
	public void generateSchema(PersistenceUnitInfo arg0, Map arg1) {
	                                                     ^^^
Map is a raw type. References to generic type Map<K,V> should be parameterized
----------
2 problems (2 warnings)

:web:org.eclipse.virgo.web.enterprise.javax.persistence.extension:processTestResources UP-TO-DATE
:web:org.eclipse.virgo.web.enterprise.javax.persistence.extension:testClasses
:web:org.eclipse.virgo.web.enterprise.javax.persistence.extension:test
:web:org.eclipse.virgo.web.enterprise.javax.persistence.extension:check
:web:org.eclipse.virgo.web.enterprise.javax.persistence.extension:build
:web:org.eclipse.virgo.web.enterprise.javax.persistence.provider.initializer:compileTestJava
:web:org.eclipse.virgo.web.enterprise.javax.persistence.provider.initializer:processTestResources UP-TO-DATE
:web:org.eclipse.virgo.web.enterprise.javax.persistence.provider.initializer:testClasses
:web:org.eclipse.virgo.web.enterprise.javax.persistence.provider.initializer:test
:web:org.eclipse.virgo.web.enterprise.javax.persistence.provider.initializer:check
:web:org.eclipse.virgo.web.enterprise.javax.persistence.provider.initializer:build
:web:org.eclipse.virgo.web.enterprise.jsf.support:compileTestJava UP-TO-DATE
:web:org.eclipse.virgo.web.enterprise.jsf.support:processTestResources UP-TO-DATE
:web:org.eclipse.virgo.web.enterprise.jsf.support:testClasses UP-TO-DATE
:web:org.eclipse.virgo.web.enterprise.jsf.support:test UP-TO-DATE
:web:org.eclipse.virgo.web.enterprise.jsf.support:check UP-TO-DATE
:web:org.eclipse.virgo.web.enterprise.jsf.support:build
:web:org.eclipse.virgo.web.enterprise.openejb.fragment.bval:compileTestJava UP-TO-DATE
:web:org.eclipse.virgo.web.enterprise.openejb.fragment.bval:processTestResources UP-TO-DATE
:web:org.eclipse.virgo.web.enterprise.openejb.fragment.bval:testClasses UP-TO-DATE
:web:org.eclipse.virgo.web.enterprise.openejb.fragment.bval:test UP-TO-DATE
:web:org.eclipse.virgo.web.enterprise.openejb.fragment.bval:check UP-TO-DATE
:web:org.eclipse.virgo.web.enterprise.openejb.fragment.bval:build
:web:org.eclipse.virgo.web.enterprise.openejb.fragment.jotm:compileTestJava UP-TO-DATE
:web:org.eclipse.virgo.web.enterprise.openejb.fragment.jotm:processTestResources UP-TO-DATE
:web:org.eclipse.virgo.web.enterprise.openejb.fragment.jotm:testClasses UP-TO-DATE
:web:org.eclipse.virgo.web.enterprise.openejb.fragment.jotm:test UP-TO-DATE
:web:org.eclipse.virgo.web.enterprise.openejb.fragment.jotm:check UP-TO-DATE
:web:org.eclipse.virgo.web.enterprise.openejb.fragment.jotm:build
:web:org.eclipse.virgo.web.enterprise.openejb.fragment.jpa:compileTestJava UP-TO-DATE
:web:org.eclipse.virgo.web.enterprise.openejb.fragment.jpa:processTestResources UP-TO-DATE
:web:org.eclipse.virgo.web.enterprise.openejb.fragment.jpa:testClasses UP-TO-DATE
:web:org.eclipse.virgo.web.enterprise.openejb.fragment.jpa:test UP-TO-DATE
:web:org.eclipse.virgo.web.enterprise.openejb.fragment.jpa:check UP-TO-DATE
:web:org.eclipse.virgo.web.enterprise.openejb.fragment.jpa:build
:web:org.eclipse.virgo.web.enterprise.openejb.fragment.webbeans:compileTestJava UP-TO-DATE
:web:org.eclipse.virgo.web.enterprise.openejb.fragment.webbeans:processTestResources UP-TO-DATE
:web:org.eclipse.virgo.web.enterprise.openejb.fragment.webbeans:testClasses UP-TO-DATE
:web:org.eclipse.virgo.web.enterprise.openejb.fragment.webbeans:test UP-TO-DATE
:web:org.eclipse.virgo.web.enterprise.openejb.fragment.webbeans:check UP-TO-DATE
:web:org.eclipse.virgo.web.enterprise.openejb.fragment.webbeans:build
:web:org.eclipse.virgo.web.enterprise.openejb.initialiser:compileTestJava UP-TO-DATE
:web:org.eclipse.virgo.web.enterprise.openejb.initialiser:processTestResources UP-TO-DATE
:web:org.eclipse.virgo.web.enterprise.openejb.initialiser:testClasses UP-TO-DATE
:web:org.eclipse.virgo.web.enterprise.openejb.initialiser:test UP-TO-DATE
:web:org.eclipse.virgo.web.enterprise.openejb.initialiser:check UP-TO-DATE
:web:org.eclipse.virgo.web.enterprise.openejb.initialiser:build
:web:org.eclipse.virgo.web.enterprise.openejb.jpa.integration:compileTestJava UP-TO-DATE
:web:org.eclipse.virgo.web.enterprise.openejb.jpa.integration:processTestResources UP-TO-DATE
:web:org.eclipse.virgo.web.enterprise.openejb.jpa.integration:testClasses UP-TO-DATE
:web:org.eclipse.virgo.web.enterprise.openejb.jpa.integration:test UP-TO-DATE
:web:org.eclipse.virgo.web.enterprise.openejb.jpa.integration:check UP-TO-DATE
:web:org.eclipse.virgo.web.enterprise.openejb.jpa.integration:build
:web:org.eclipse.virgo.web.enterprise.openejb.tomcat.factory:compileTestJava
:web:org.eclipse.virgo.web.enterprise.openejb.tomcat.factory:processTestResources UP-TO-DATE
:web:org.eclipse.virgo.web.enterprise.openejb.tomcat.factory:testClasses
:web:org.eclipse.virgo.web.enterprise.openejb.tomcat.factory:test
:web:org.eclipse.virgo.web.enterprise.openejb.tomcat.factory:check
:web:org.eclipse.virgo.web.enterprise.openejb.tomcat.factory:build
:web:org.eclipse.virgo.web.enterprise.openwebbeans.initialiser:compileTestJava UP-TO-DATE
:web:org.eclipse.virgo.web.enterprise.openwebbeans.initialiser:processTestResources UP-TO-DATE
:web:org.eclipse.virgo.web.enterprise.openwebbeans.initialiser:testClasses UP-TO-DATE
:web:org.eclipse.virgo.web.enterprise.openwebbeans.initialiser:test UP-TO-DATE
:web:org.eclipse.virgo.web.enterprise.openwebbeans.initialiser:check UP-TO-DATE
:web:org.eclipse.virgo.web.enterprise.openwebbeans.initialiser:build
:web:org.eclipse.virgo.web.enterprise.persistence.openejb.classloading.hook:compileTestJava
:web:org.eclipse.virgo.web.enterprise.persistence.openejb.classloading.hook:processTestResources UP-TO-DATE
:web:org.eclipse.virgo.web.enterprise.persistence.openejb.classloading.hook:testClasses
:web:org.eclipse.virgo.web.enterprise.persistence.openejb.classloading.hook:test
:web:org.eclipse.virgo.web.enterprise.persistence.openejb.classloading.hook:check
:web:org.eclipse.virgo.web.enterprise.persistence.openejb.classloading.hook:build
:web:org.eclipse.virgo.web.enterprise.security:compileTestJava----------
1. WARNING in /jobs/genie.virgo/3.7.0.Milestones/workspace/web/org.eclipse.virgo.web.enterprise.security/src/test/java/org/eclipse/virgo/web/enterprise/security/StandardSecurityServiceTest.java (at line 193)
	ThreadLocal<Wrapper> wrapperLocal = (ThreadLocal<Wrapper>) wrapper; 
	                                    ^^^^^^^^^^^^^^^^^^^^^^^^^^^^^^
Type safety: Unchecked cast from Object to ThreadLocal<Wrapper>
----------
1 problem (1 warning)

:web:org.eclipse.virgo.web.enterprise.security:processTestResources UP-TO-DATE
:web:org.eclipse.virgo.web.enterprise.security:testClasses
:web:org.eclipse.virgo.web.enterprise.security:test
:web:org.eclipse.virgo.web.enterprise.security:check
:web:org.eclipse.virgo.web.enterprise.security:build
:web:org.eclipse.virgo.web.enterprise.security.openejb.classloading.hook:compileTestJava UP-TO-DATE
:web:org.eclipse.virgo.web.enterprise.security.openejb.classloading.hook:processTestResources UP-TO-DATE
:web:org.eclipse.virgo.web.enterprise.security.openejb.classloading.hook:testClasses UP-TO-DATE
:web:org.eclipse.virgo.web.enterprise.security.openejb.classloading.hook:test UP-TO-DATE
:web:org.eclipse.virgo.web.enterprise.security.openejb.classloading.hook:check UP-TO-DATE
:web:org.eclipse.virgo.web.enterprise.security.openejb.classloading.hook:build
:web:org.eclipse.virgo.web.enterprise.security.valve:compileTestJava UP-TO-DATE
:web:org.eclipse.virgo.web.enterprise.security.valve:processTestResources UP-TO-DATE
:web:org.eclipse.virgo.web.enterprise.security.valve:testClasses UP-TO-DATE
:web:org.eclipse.virgo.web.enterprise.security.valve:test UP-TO-DATE
:web:org.eclipse.virgo.web.enterprise.security.valve:check UP-TO-DATE
:web:org.eclipse.virgo.web.enterprise.security.valve:build
:web:org.eclipse.virgo.web.enterprise.services.accessor:compileTestJava----------
1. WARNING in /jobs/genie.virgo/3.7.0.Milestones/workspace/web/org.eclipse.virgo.web.enterprise.services.accessor/src/test/java/org/eclipse/virgo/web/enterprise/services/accessor/WebAppBundleClassloaderCustomizerTest.java (at line 94)
	assertTrue(((List<ClassLoaderDelegateHook>) field.get(PluggableDelegatingClassLoaderDelegateHook.getInstance())).contains(webAppBundleClassloaderCustomizer.getWebAppBundleClassLoaderDelegateHook()));
	           ^^^^^^^^^^^^^^^^^^^^^^^^^^^^^^^^^^^^^^^^^^^^^^^^^^^^^^^^^^^^^^^^^^^^^^^^^^^^^^^^^^^^^^^^^^^^^^^^^^^^^
Type safety: Unchecked cast from Object to List<ClassLoaderDelegateHook>
----------
2. WARNING in /jobs/genie.virgo/3.7.0.Milestones/workspace/web/org.eclipse.virgo.web.enterprise.services.accessor/src/test/java/org/eclipse/virgo/web/enterprise/services/accessor/WebAppBundleClassloaderCustomizerTest.java (at line 98)
	assertTrue(((Map<Bundle, Set<String>>) field2.get(webAppBundleClassloaderCustomizer.getWebAppBundleClassLoaderDelegateHook())).containsKey(webBundle));
	           ^^^^^^^^^^^^^^^^^^^^^^^^^^^^^^^^^^^^^^^^^^^^^^^^^^^^^^^^^^^^^^^^^^^^^^^^^^^^^^^^^^^^^^^^^^^^^^^^^^^^^^^^^^^^^^^^^^^
Type safety: Unchecked cast from Object to Map<Bundle,Set<String>>
----------
3. WARNING in /jobs/genie.virgo/3.7.0.Milestones/workspace/web/org.eclipse.virgo.web.enterprise.services.accessor/src/test/java/org/eclipse/virgo/web/enterprise/services/accessor/WebAppBundleClassloaderCustomizerTest.java (at line 104)
	assertTrue(((List<ClassLoaderDelegateHook>) field.get(PluggableDelegatingClassLoaderDelegateHook.getInstance())).isEmpty());
	           ^^^^^^^^^^^^^^^^^^^^^^^^^^^^^^^^^^^^^^^^^^^^^^^^^^^^^^^^^^^^^^^^^^^^^^^^^^^^^^^^^^^^^^^^^^^^^^^^^^^^^
Type safety: Unchecked cast from Object to List<ClassLoaderDelegateHook>
----------
3 problems (3 warnings)

:web:org.eclipse.virgo.web.enterprise.services.accessor:processTestResources UP-TO-DATE
:web:org.eclipse.virgo.web.enterprise.services.accessor:testClasses
:web:org.eclipse.virgo.web.enterprise.services.accessor:test
:web:org.eclipse.virgo.web.enterprise.services.accessor:check
:web:org.eclipse.virgo.web.enterprise.services.accessor:build
:web:org.eclipse.virgo.web.servlet.adapter:compileTestJava UP-TO-DATE
:web:org.eclipse.virgo.web.servlet.adapter:processTestResources UP-TO-DATE
:web:org.eclipse.virgo.web.servlet.adapter:testClasses UP-TO-DATE
:web:org.eclipse.virgo.web.servlet.adapter:test UP-TO-DATE
:web:org.eclipse.virgo.web.servlet.adapter:check UP-TO-DATE
:web:org.eclipse.virgo.web.servlet.adapter:build
:web:org.eclipse.virgo.web.spring.integration:compileTestJava UP-TO-DATE
:web:org.eclipse.virgo.web.spring.integration:processTestResources UP-TO-DATE
:web:org.eclipse.virgo.web.spring.integration:testClasses UP-TO-DATE
:web:org.eclipse.virgo.web.spring.integration:test UP-TO-DATE
:web:org.eclipse.virgo.web.spring.integration:check UP-TO-DATE
:web:org.eclipse.virgo.web.spring.integration:build
:web:org.eclipse.virgo.web.tomcat.support:compileTestJava UP-TO-DATE
:web:org.eclipse.virgo.web.tomcat.support:processTestResources UP-TO-DATE
:web:org.eclipse.virgo.web.tomcat.support:testClasses UP-TO-DATE
:web:org.eclipse.virgo.web.tomcat.support:test UP-TO-DATE
:web:org.eclipse.virgo.web.tomcat.support:check UP-TO-DATE
:web:org.eclipse.virgo.web.tomcat.support:build
:web:org.eclipse.virgo.web.war.deployer:compileTestJava
:web:org.eclipse.virgo.web.war.deployer:processTestResources
:web:org.eclipse.virgo.web.war.deployer:testClasses
:web:org.eclipse.virgo.web.war.deployer:test
:web:org.eclipse.virgo.web.war.deployer:check
:web:org.eclipse.virgo.web.war.deployer:build
:packaging:jetty-server:org.eclipse.virgo.jetty.smoketest:sourcesJar
:packaging:jetty-server:org.eclipse.virgo.jetty.smoketest:assemble
:packaging:jetty-server:org.eclipse.virgo.jetty.smoketest:compileTestJava UP-TO-DATE
:packaging:jetty-server:org.eclipse.virgo.jetty.smoketest:processTestResources UP-TO-DATE
:packaging:jetty-server:org.eclipse.virgo.jetty.smoketest:testClasses UP-TO-DATE
:packaging:jetty-server:org.eclipse.virgo.jetty.smoketest:test UP-TO-DATE
:packaging:jetty-server:org.eclipse.virgo.jetty.smoketest:check UP-TO-DATE
:packaging:jetty-server:org.eclipse.virgo.jetty.smoketest:build
:packaging:kernel:org.eclipse.virgo.kernel.smoketest:sourcesJar
:packaging:kernel:org.eclipse.virgo.kernel.smoketest:assemble
:packaging:kernel:org.eclipse.virgo.kernel.smoketest:compileTestJava UP-TO-DATE
:packaging:kernel:org.eclipse.virgo.kernel.smoketest:processTestResources UP-TO-DATE
:packaging:kernel:org.eclipse.virgo.kernel.smoketest:testClasses UP-TO-DATE
:packaging:kernel:org.eclipse.virgo.kernel.smoketest:test UP-TO-DATE
:packaging:kernel:org.eclipse.virgo.kernel.smoketest:check UP-TO-DATE
:packaging:kernel:org.eclipse.virgo.kernel.smoketest:build
:packaging:nano:org.eclipse.virgo.nano.smoketest:sourcesJar
:packaging:nano:org.eclipse.virgo.nano.smoketest:assemble
:packaging:nano:org.eclipse.virgo.nano.smoketest:compileTestJava UP-TO-DATE
:packaging:nano:org.eclipse.virgo.nano.smoketest:processTestResources UP-TO-DATE
:packaging:nano:org.eclipse.virgo.nano.smoketest:testClasses UP-TO-DATE
:packaging:nano:org.eclipse.virgo.nano.smoketest:test UP-TO-DATE
:packaging:nano:org.eclipse.virgo.nano.smoketest:check UP-TO-DATE
:packaging:nano:org.eclipse.virgo.nano.smoketest:build
:packaging:tomcat-server:org.eclipse.virgo.tomcat.smoketest:sourcesJar
:packaging:tomcat-server:org.eclipse.virgo.tomcat.smoketest:assemble
:packaging:tomcat-server:org.eclipse.virgo.tomcat.smoketest:compileTestJava UP-TO-DATE
:packaging:tomcat-server:org.eclipse.virgo.tomcat.smoketest:processTestResources UP-TO-DATE
:packaging:tomcat-server:org.eclipse.virgo.tomcat.smoketest:testClasses UP-TO-DATE
:packaging:tomcat-server:org.eclipse.virgo.tomcat.smoketest:test UP-TO-DATE
:packaging:tomcat-server:org.eclipse.virgo.tomcat.smoketest:check UP-TO-DATE
:packaging:tomcat-server:org.eclipse.virgo.tomcat.smoketest:build
:apps:org.eclipse.virgo.apps.repository.core:signing
|--> Signing Jar File: /jobs/genie.virgo/3.7.0.Milestones/workspace/apps/org.eclipse.virgo.apps.repository.core/build/libs/org.eclipse.virgo.apps.repository.core-3.7.0.RELEASE.jar
  % Total    % Received % Xferd  Average Speed   Time    Time     Time  Current
                                 Dload  Upload   Total   Spent    Left  Speed

  0     0    0     0    0     0      0      0 --:--:-- --:--:-- --:--:--     0
100 25602    0     0  100 25602      0  25456  0:00:01  0:00:01 --:--:-- 25474
100 58950  100 33348  100 25602  32842  25214  0:00:01  0:00:01 --:--:-- 32855
:apps:org.eclipse.virgo.apps.repository.web:signing
|--> Signing Jar File: /jobs/genie.virgo/3.7.0.Milestones/workspace/apps/org.eclipse.virgo.apps.repository.web/build/libs/org.eclipse.virgo.apps.repository.web-3.7.0.RELEASE.jar
  % Total    % Received % Xferd  Average Speed   Time    Time     Time  Current
                                 Dload  Upload   Total   Spent    Left  Speed

  0     0    0     0    0     0      0      0 --:--:-- --:--:-- --:--:--     0
100  3594    0     0  100  3594      0   3570  0:00:01  0:00:01 --:--:--  3572
100 12773  100  9179  100  3594   7203   2820  0:00:01  0:00:01 --:--:--  7204
:apps:org.eclipse.virgo.apps.splash:signing
|--> Signing Jar File: /jobs/genie.virgo/3.7.0.Milestones/workspace/apps/org.eclipse.virgo.apps.splash/build/libs/org.eclipse.virgo.apps.splash-3.7.0.RELEASE.jar
  % Total    % Received % Xferd  Average Speed   Time    Time     Time  Current
                                 Dload  Upload   Total   Spent    Left  Speed

  0     0    0     0    0     0      0      0 --:--:-- --:--:-- --:--:--     0
100 85022    0     0  100 85022      0   403k --:--:-- --:--:-- --:--:--  403k
 47  173k    0     0  100 85022      0  65084  0:00:01  0:00:01 --:--:-- 65051
100  173k  100 92573  100 85022  70693  64927  0:00:01  0:00:01 --:--:-- 70666
:kernel:org.eclipse.virgo.kernel.agent.dm:signing
|--> Signing Jar File: /jobs/genie.virgo/3.7.0.Milestones/workspace/kernel/org.eclipse.virgo.kernel.agent.dm/build/libs/org.eclipse.virgo.kernel.agent.dm-3.7.0.RELEASE.jar
  % Total    % Received % Xferd  Average Speed   Time    Time     Time  Current
                                 Dload  Upload   Total   Spent    Left  Speed

  0     0    0     0    0     0      0      0 --:--:-- --:--:-- --:--:--     0
 41 42597    0     0  100 17756      0  18292 --:--:-- --:--:-- --:--:-- 18286
100 42597  100 24841  100 17756  21167  15130  0:00:01  0:00:01 --:--:-- 21177
:kernel:org.eclipse.virgo.kernel.artifact:signing
|--> Signing Jar File: /jobs/genie.virgo/3.7.0.Milestones/workspace/kernel/org.eclipse.virgo.kernel.artifact/build/libs/org.eclipse.virgo.kernel.artifact-3.7.0.RELEASE.jar
  % Total    % Received % Xferd  Average Speed   Time    Time     Time  Current
                                 Dload  Upload   Total   Spent    Left  Speed

  0     0    0     0    0     0      0      0 --:--:-- --:--:-- --:--:--     0
100 48597    0     0  100 48597      0  48284  0:00:01  0:00:01 --:--:-- 48307
100  103k  100 57221  100 48597  48650  41317  0:00:01  0:00:01 --:--:-- 48657
:kernel:org.eclipse.virgo.kernel.deployer:signing
|--> Signing Jar File: /jobs/genie.virgo/3.7.0.Milestones/workspace/kernel/org.eclipse.virgo.kernel.deployer/build/libs/org.eclipse.virgo.kernel.deployer-3.7.0.RELEASE.jar
  % Total    % Received % Xferd  Average Speed   Time    Time     Time  Current
                                 Dload  Upload   Total   Spent    Left  Speed

  0     0    0     0    0     0      0      0 --:--:-- --:--:-- --:--:--     0
100  270k    0     0  100  270k      0   269k  0:00:01  0:00:01 --:--:--  269k
100  570k  100  299k  100  270k   259k   235k  0:00:01  0:00:01 --:--:--  259k
:kernel:org.eclipse.virgo.kernel.deployer.dm:signing
|--> Signing Jar File: /jobs/genie.virgo/3.7.0.Milestones/workspace/kernel/org.eclipse.virgo.kernel.deployer.dm/build/libs/org.eclipse.virgo.kernel.deployer.dm-3.7.0.RELEASE.jar
  % Total    % Received % Xferd  Average Speed   Time    Time     Time  Current
                                 Dload  Upload   Total   Spent    Left  Speed

  0     0    0     0    0     0      0      0 --:--:-- --:--:-- --:--:--     0
100  6901    0     0  100  6901      0   6854  0:00:01  0:00:01 --:--:--  6859
100 19945  100 13044  100  6901  12774   6758  0:00:01  0:00:01 --:--:-- 12775
:kernel:org.eclipse.virgo.kernel.dmfragment:signing
|--> Signing Jar File: /jobs/genie.virgo/3.7.0.Milestones/workspace/kernel/org.eclipse.virgo.kernel.dmfragment/build/libs/org.eclipse.virgo.kernel.dmfragment-3.7.0.RELEASE.jar
  % Total    % Received % Xferd  Average Speed   Time    Time     Time  Current
                                 Dload  Upload   Total   Spent    Left  Speed

  0     0    0     0    0     0      0      0 --:--:-- --:--:-- --:--:--     0
 41 43124    0     0  100 17874      0  18123 --:--:-- --:--:-- --:--:-- 18109
100 43124  100 25250  100 17874  25577  18105 --:--:-- --:--:-- --:--:-- 25556
:kernel:org.eclipse.virgo.kernel.equinox.extensions:signing
|--> Signing Jar File: /jobs/genie.virgo/3.7.0.Milestones/workspace/kernel/org.eclipse.virgo.kernel.equinox.extensions/build/libs/org.eclipse.virgo.kernel.equinox.extensions-3.7.0.RELEASE.jar
  % Total    % Received % Xferd  Average Speed   Time    Time     Time  Current
                                 Dload  Upload   Total   Spent    Left  Speed

  0     0    0     0    0     0      0      0 --:--:-- --:--:-- --:--:--     0
100 24097    0     0  100 24097      0  23957  0:00:01  0:00:01 --:--:-- 23977
 43 55687    0     0  100 24097      0  18756  0:00:01  0:00:01 --:--:-- 18752
100 55687  100 31590  100 24097  24568  18741  0:00:01  0:00:01 --:--:-- 24564
:kernel:org.eclipse.virgo.kernel.kerneldmfragment:signing
|--> Signing Jar File: /jobs/genie.virgo/3.7.0.Milestones/workspace/kernel/org.eclipse.virgo.kernel.kerneldmfragment/build/libs/org.eclipse.virgo.kernel.kerneldmfragment-3.7.0.RELEASE.jar
  % Total    % Received % Xferd  Average Speed   Time    Time     Time  Current
                                 Dload  Upload   Total   Spent    Left  Speed

  0     0    0     0    0     0      0      0 --:--:-- --:--:-- --:--:--     0
100  1481    0     0  100  1481      0   1472  0:00:01  0:00:01 --:--:--  1473
100  8476  100  6995  100  1481   5551   1175  0:00:01  0:00:01 --:--:--  5551
:kernel:org.eclipse.virgo.kernel.model:signing
|--> Signing Jar File: /jobs/genie.virgo/3.7.0.Milestones/workspace/kernel/org.eclipse.virgo.kernel.model/build/libs/org.eclipse.virgo.kernel.model-3.7.0.RELEASE.jar
  % Total    % Received % Xferd  Average Speed   Time    Time     Time  Current
                                 Dload  Upload   Total   Spent    Left  Speed

  0     0    0     0    0     0      0      0 --:--:-- --:--:-- --:--:--     0
100 66734    0     0  100 66734      0  66284  0:00:01  0:00:01 --:--:-- 66335
100  139k  100 76429  100 66734  61573  53762  0:00:01  0:00:01 --:--:-- 61586
:kernel:org.eclipse.virgo.kernel.osgi:signing
|--> Signing Jar File: /jobs/genie.virgo/3.7.0.Milestones/workspace/kernel/org.eclipse.virgo.kernel.osgi/build/libs/org.eclipse.virgo.kernel.osgi-3.7.0.RELEASE.jar
  % Total    % Received % Xferd  Average Speed   Time    Time     Time  Current
                                 Dload  Upload   Total   Spent    Left  Speed

  0     0    0     0    0     0      0      0 --:--:-- --:--:-- --:--:--     0
100 38650    0     0  100 38650      0  38407  0:00:01  0:00:01 --:--:-- 38419
100 87130  100 48480  100 38650  40845  32563  0:00:01  0:00:01 --:--:-- 40876
:kernel:org.eclipse.virgo.kernel.services:signing
|--> Signing Jar File: /jobs/genie.virgo/3.7.0.Milestones/workspace/kernel/org.eclipse.virgo.kernel.services/build/libs/org.eclipse.virgo.kernel.services-3.7.0.RELEASE.jar
  % Total    % Received % Xferd  Average Speed   Time    Time     Time  Current
                                 Dload  Upload   Total   Spent    Left  Speed

  0     0    0     0    0     0      0      0 --:--:-- --:--:-- --:--:--     0
100 32092    0     0  100 32092      0  31899  0:00:01  0:00:01 --:--:-- 31932
100 72709  100 40617  100 32092  34567  27312  0:00:01  0:00:01 --:--:-- 34597
:kernel:org.eclipse.virgo.kernel.userregion:signing
|--> Signing Jar File: /jobs/genie.virgo/3.7.0.Milestones/workspace/kernel/org.eclipse.virgo.kernel.userregion/build/libs/org.eclipse.virgo.kernel.userregion-3.7.0.RELEASE.jar
  % Total    % Received % Xferd  Average Speed   Time    Time     Time  Current
                                 Dload  Upload   Total   Spent    Left  Speed

  0     0    0     0    0     0      0      0 --:--:-- --:--:-- --:--:--     0
100  154k    0     0  100  154k      0   751k --:--:-- --:--:-- --:--:--  749k
 47  323k    0     0  100  154k      0   125k  0:00:01  0:00:01 --:--:--  125k
100  323k  100  168k  100  154k   137k   125k  0:00:01  0:00:01 --:--:--  137k
:kernel:org.eclipse.virgo.kernel.userregionfactory:signing
|--> Signing Jar File: /jobs/genie.virgo/3.7.0.Milestones/workspace/kernel/org.eclipse.virgo.kernel.userregionfactory/build/libs/org.eclipse.virgo.kernel.userregionfactory-3.7.0.RELEASE.jar
  % Total    % Received % Xferd  Average Speed   Time    Time     Time  Current
                                 Dload  Upload   Total   Spent    Left  Speed

  0     0    0     0    0     0      0      0 --:--:-- --:--:-- --:--:--     0
 41 36640    0     0  100 15214      0  15589 --:--:-- --:--:-- --:--:-- 15588
100 36640  100 21426  100 15214  21936  15576 --:--:-- --:--:-- --:--:-- 21930
:kernel:org.eclipse.virgo.management.console:signing
|--> Signing Jar File: /jobs/genie.virgo/3.7.0.Milestones/workspace/kernel/org.eclipse.virgo.management.console/build/libs/org.eclipse.virgo.management.console-3.7.0.RELEASE.jar
  % Total    % Received % Xferd  Average Speed   Time    Time     Time  Current
                                 Dload  Upload   Total   Spent    Left  Speed

  0     0    0     0    0     0      0      0 --:--:-- --:--:-- --:--:--     0
100  318k    0     0  100  318k      0   316k  0:00:01  0:00:01 --:--:--  316k
100  651k  100  332k  100  318k   274k   262k  0:00:01  0:00:01 --:--:--  274k
:kernel:org.eclipse.virgo.management.fragment:signing
|--> Signing Jar File: /jobs/genie.virgo/3.7.0.Milestones/workspace/kernel/org.eclipse.virgo.management.fragment/build/libs/org.eclipse.virgo.management.fragment-3.7.0.RELEASE.jar
  % Total    % Received % Xferd  Average Speed   Time    Time     Time  Current
                                 Dload  Upload   Total   Spent    Left  Speed

  0     0    0     0    0     0      0      0 --:--:-- --:--:-- --:--:--     0
100  2712    0     0  100  2712      0   2694  0:00:01  0:00:01 --:--:--  2695
100 10988  100  8276  100  2712   7979   2614  0:00:01  0:00:01 --:--:--  7980
:kernel:org.eclipse.virgo.shell.command:signing
|--> Signing Jar File: /jobs/genie.virgo/3.7.0.Milestones/workspace/kernel/org.eclipse.virgo.shell.command/build/libs/org.eclipse.virgo.shell.command-3.7.0.RELEASE.jar
  % Total    % Received % Xferd  Average Speed   Time    Time     Time  Current
                                 Dload  Upload   Total   Spent    Left  Speed

  0     0    0     0    0     0      0      0 --:--:-- --:--:-- --:--:--     0
100  122k    0     0  100  122k      0   121k  0:00:01  0:00:01 --:--:--  121k
100  259k  100  137k  100  122k   108k  98841  0:00:01  0:00:01 --:--:--  108k
:medic:org.eclipse.virgo.medic:signing
|--> Signing Jar File: /jobs/genie.virgo/3.7.0.Milestones/workspace/medic/org.eclipse.virgo.medic/build/libs/org.eclipse.virgo.medic-3.7.0.RELEASE.jar
  % Total    % Received % Xferd  Average Speed   Time    Time     Time  Current
                                 Dload  Upload   Total   Spent    Left  Speed

  0     0    0     0    0     0      0      0 --:--:-- --:--:-- --:--:--     0
 40 37551    0     0  100 15191      0  15245 --:--:-- --:--:-- --:--:-- 15236
100 37551  100 22360  100 15191  22420  15231 --:--:-- --:--:-- --:--:-- 22404
:medic:org.eclipse.virgo.medic.core:signing
|--> Signing Jar File: /jobs/genie.virgo/3.7.0.Milestones/workspace/medic/org.eclipse.virgo.medic.core/build/libs/org.eclipse.virgo.medic.core-3.7.0.RELEASE.jar
  % Total    % Received % Xferd  Average Speed   Time    Time     Time  Current
                                 Dload  Upload   Total   Spent    Left  Speed

  0     0    0     0    0     0      0      0 --:--:-- --:--:-- --:--:--     0
100 89380    0     0  100 89380      0  88792  0:00:01  0:00:01 --:--:-- 88846
100  187k  100  100k  100 89380  87020  75630  0:00:01  0:00:01 --:--:-- 87078
:medic:org.eclipse.virgo.medic.logbackclassicfragment:signing
|--> Signing Jar File: /jobs/genie.virgo/3.7.0.Milestones/workspace/medic/org.eclipse.virgo.medic.logbackclassicfragment/build/libs/org.eclipse.virgo.medic.logbackclassicfragment-3.7.0.RELEASE.jar
  % Total    % Received % Xferd  Average Speed   Time    Time     Time  Current
                                 Dload  Upload   Total   Spent    Left  Speed

  0     0    0     0    0     0      0      0 --:--:-- --:--:-- --:--:--     0
100  1501    0     0  100  1501      0   7331 --:--:-- --:--:-- --:--:--  7321
100  8424  100  6923  100  1501   6910   1498  0:00:01  0:00:01 --:--:--  6916
:medic:org.eclipse.virgo.medic.logbackcorefragment:signing
|--> Signing Jar File: /jobs/genie.virgo/3.7.0.Milestones/workspace/medic/org.eclipse.virgo.medic.logbackcorefragment/build/libs/org.eclipse.virgo.medic.logbackcorefragment-3.7.0.RELEASE.jar
  % Total    % Received % Xferd  Average Speed   Time    Time     Time  Current
                                 Dload  Upload   Total   Spent    Left  Speed

  0     0    0     0    0     0      0      0 --:--:-- --:--:-- --:--:--     0
100  1495    0     0  100  1495      0   7269 --:--:-- --:--:-- --:--:--  7257
100  8410  100  6915  100  1495   6830   1476  0:00:01  0:00:01 --:--:--  6833
:nano:org.eclipse.virgo.nano.core:signing
|--> Signing Jar File: /jobs/genie.virgo/3.7.0.Milestones/workspace/nano/org.eclipse.virgo.nano.core/build/libs/org.eclipse.virgo.nano.core-3.7.0.RELEASE.jar
  % Total    % Received % Xferd  Average Speed   Time    Time     Time  Current
                                 Dload  Upload   Total   Spent    Left  Speed

  0     0    0     0    0     0      0      0 --:--:-- --:--:-- --:--:--     0
100  145k    0     0  100  145k      0   710k --:--:-- --:--:-- --:--:--  709k
100  306k  100  160k  100  145k   158k   143k  0:00:01  0:00:01 --:--:--  158k
:nano:org.eclipse.virgo.nano.deployer:signing
|--> Signing Jar File: /jobs/genie.virgo/3.7.0.Milestones/workspace/nano/org.eclipse.virgo.nano.deployer/build/libs/org.eclipse.virgo.nano.deployer-3.7.0.RELEASE.jar
  % Total    % Received % Xferd  Average Speed   Time    Time     Time  Current
                                 Dload  Upload   Total   Spent    Left  Speed

  0     0    0     0    0     0      0      0 --:--:-- --:--:-- --:--:--     0
100 33739    0     0  100 33739      0   160k --:--:-- --:--:-- --:--:--  159k
 45 74680    0     0  100 33739      0  27823  0:00:01  0:00:01 --:--:-- 27814
100 74680  100 40941  100 33739  33730  27797  0:00:01  0:00:01 --:--:-- 33724
:nano:org.eclipse.virgo.nano.deployer.api:signing
|--> Signing Jar File: /jobs/genie.virgo/3.7.0.Milestones/workspace/nano/org.eclipse.virgo.nano.deployer.api/build/libs/org.eclipse.virgo.nano.deployer.api-3.7.0.RELEASE.jar
  % Total    % Received % Xferd  Average Speed   Time    Time     Time  Current
                                 Dload  Upload   Total   Spent    Left  Speed

  0     0    0     0    0     0      0      0 --:--:-- --:--:-- --:--:--     0
100 12734    0     0  100 12734      0  12658  0:00:01  0:00:01 --:--:-- 12670
100 32557  100 19823  100 12734  19466  12504  0:00:01  0:00:01 --:--:-- 19472
:nano:org.eclipse.virgo.nano.deployer.hot:signing
|--> Signing Jar File: /jobs/genie.virgo/3.7.0.Milestones/workspace/nano/org.eclipse.virgo.nano.deployer.hot/build/libs/org.eclipse.virgo.nano.deployer.hot-3.7.0.RELEASE.jar
  % Total    % Received % Xferd  Average Speed   Time    Time     Time  Current
                                 Dload  Upload   Total   Spent    Left  Speed

  0     0    0     0    0     0      0      0 --:--:-- --:--:-- --:--:--     0
 38 26437    0     0  100 10197      0  10786 --:--:-- --:--:-- --:--:-- 10779
100 26437  100 16240  100 10197  17170  10780 --:--:-- --:--:-- --:--:-- 17167
:nano:org.eclipse.virgo.nano.management:signing
|--> Signing Jar File: /jobs/genie.virgo/3.7.0.Milestones/workspace/nano/org.eclipse.virgo.nano.management/build/libs/org.eclipse.virgo.nano.management-3.7.0.RELEASE.jar
  % Total    % Received % Xferd  Average Speed   Time    Time     Time  Current
                                 Dload  Upload   Total   Spent    Left  Speed

  0     0    0     0    0     0      0      0 --:--:-- --:--:-- --:--:--     0
100  8389    0     0  100  8389      0   8332  0:00:01  0:00:01 --:--:--  8338
100 22981  100 14592  100  8389  13572   7802  0:00:01  0:00:01 --:--:-- 13573
:nano:org.eclipse.virgo.nano.management.controller:signing
|--> Signing Jar File: /jobs/genie.virgo/3.7.0.Milestones/workspace/nano/org.eclipse.virgo.nano.management.controller/build/libs/org.eclipse.virgo.nano.management.controller-3.7.0.RELEASE.jar
  % Total    % Received % Xferd  Average Speed   Time    Time     Time  Current
                                 Dload  Upload   Total   Spent    Left  Speed

  0     0    0     0    0     0      0      0 --:--:-- --:--:-- --:--:--     0
 29 14147    0     0  100  4153      0   4434 --:--:-- --:--:-- --:--:--  4432
100 14147  100  9994  100  4153  10664   4431 --:--:-- --:--:-- --:--:-- 10654
:nano:org.eclipse.virgo.nano.services.concurrent:signing
|--> Signing Jar File: /jobs/genie.virgo/3.7.0.Milestones/workspace/nano/org.eclipse.virgo.nano.services.concurrent/build/libs/org.eclipse.virgo.nano.services.concurrent-3.7.0.RELEASE.jar
  % Total    % Received % Xferd  Average Speed   Time    Time     Time  Current
                                 Dload  Upload   Total   Spent    Left  Speed

  0     0    0     0    0     0      0      0 --:--:-- --:--:-- --:--:--     0
 38 28338    0     0  100 10953      0  11257 --:--:-- --:--:-- --:--:-- 11256
100 28338  100 17385  100 10953  17855  11249 --:--:-- --:--:-- --:--:-- 17849
:nano:org.eclipse.virgo.nano.services.ds:signing
|--> Signing Jar File: /jobs/genie.virgo/3.7.0.Milestones/workspace/nano/org.eclipse.virgo.nano.services.ds/build/libs/org.eclipse.virgo.nano.services.ds-3.7.0.RELEASE.jar
  % Total    % Received % Xferd  Average Speed   Time    Time     Time  Current
                                 Dload  Upload   Total   Spent    Left  Speed

  0     0    0     0    0     0      0      0 --:--:-- --:--:-- --:--:--     0
100  7971    0     0  100  7971      0   7918  0:00:01  0:00:01 --:--:--  7923
100  7971    0     0  100  7971      0   3970  0:00:02  0:00:02 --:--:--  3971
100  7971    0     0  100  7971      0   2649  0:00:03  0:00:03 --:--:--  2649
100  7971    0     0  100  7971      0   1987  0:00:04  0:00:04 --:--:--  1988
100 22225  100 14254  100  7971   3075   1719  0:00:04  0:00:04 --:--:--  3075
:repository:org.eclipse.virgo.repository:signing
|--> Signing Jar File: /jobs/genie.virgo/3.7.0.Milestones/workspace/repository/org.eclipse.virgo.repository/build/libs/org.eclipse.virgo.repository-3.7.0.RELEASE.jar
  % Total    % Received % Xferd  Average Speed   Time    Time     Time  Current
                                 Dload  Upload   Total   Spent    Left  Speed

  0     0    0     0    0     0      0      0 --:--:-- --:--:-- --:--:--     0
100  135k    0     0  100  135k      0   663k --:--:-- --:--:-- --:--:--  662k
 47  288k    0     0  100  135k      0   110k  0:00:01  0:00:01 --:--:--  109k
100  288k  100  153k  100  135k   123k   109k  0:00:01  0:00:01 --:--:--  123k
:util:org.eclipse.virgo.util.common:signing
|--> Signing Jar File: /jobs/genie.virgo/3.7.0.Milestones/workspace/util/org.eclipse.virgo.util.common/build/libs/org.eclipse.virgo.util.common-3.7.0.RELEASE.jar
  % Total    % Received % Xferd  Average Speed   Time    Time     Time  Current
                                 Dload  Upload   Total   Spent    Left  Speed

  0     0    0     0    0     0      0      0 --:--:-- --:--:-- --:--:--     0
100 57264    0     0  100 57264      0  56894  0:00:01  0:00:01 --:--:-- 56922
100  121k  100 66838  100 57264  56037  48010  0:00:01  0:00:01 --:--:-- 56072
:util:org.eclipse.virgo.util.env:signing
|--> Signing Jar File: /jobs/genie.virgo/3.7.0.Milestones/workspace/util/org.eclipse.virgo.util.env/build/libs/org.eclipse.virgo.util.env-3.7.0.RELEASE.jar
  % Total    % Received % Xferd  Average Speed   Time    Time     Time  Current
                                 Dload  Upload   Total   Spent    Left  Speed

  0     0    0     0    0     0      0      0 --:--:-- --:--:-- --:--:--     0
100  4192    0     0  100  4192      0   4163  0:00:01  0:00:01 --:--:--  4166
100 14172  100  9980  100  4192   8788   3691  0:00:01  0:00:01 --:--:--  8792
:util:org.eclipse.virgo.util.io:signing
|--> Signing Jar File: /jobs/genie.virgo/3.7.0.Milestones/workspace/util/org.eclipse.virgo.util.io/build/libs/org.eclipse.virgo.util.io-3.7.0.RELEASE.jar
  % Total    % Received % Xferd  Average Speed   Time    Time     Time  Current
                                 Dload  Upload   Total   Spent    Left  Speed

  0     0    0     0    0     0      0      0 --:--:-- --:--:-- --:--:--     0
100 30531    0     0  100 30531      0  30335  0:00:01  0:00:01 --:--:-- 30348
100 68437  100 37906  100 30531  33214  26752  0:00:01  0:00:01 --:--:-- 33221
:util:org.eclipse.virgo.util.jmx:signing
|--> Signing Jar File: /jobs/genie.virgo/3.7.0.Milestones/workspace/util/org.eclipse.virgo.util.jmx/build/libs/org.eclipse.virgo.util.jmx-3.7.0.RELEASE.jar
  % Total    % Received % Xferd  Average Speed   Time    Time     Time  Current
                                 Dload  Upload   Total   Spent    Left  Speed

  0     0    0     0    0     0      0      0 --:--:-- --:--:-- --:--:--     0
100  4757    0     0  100  4757      0   4727  0:00:01  0:00:01 --:--:--  4728
100 15340  100 10583  100  4757   9591   4311  0:00:01  0:00:01 --:--:--  9594
:util:org.eclipse.virgo.util.math:signing
|--> Signing Jar File: /jobs/genie.virgo/3.7.0.Milestones/workspace/util/org.eclipse.virgo.util.math/build/libs/org.eclipse.virgo.util.math-3.7.0.RELEASE.jar
  % Total    % Received % Xferd  Average Speed   Time    Time     Time  Current
                                 Dload  Upload   Total   Spent    Left  Speed

  0     0    0     0    0     0      0      0 --:--:-- --:--:-- --:--:--     0
100  9443    0     0  100  9443      0   9387  0:00:01  0:00:01 --:--:--  9396
100 25193  100 15750  100  9443  13966   8373  0:00:01  0:00:01 --:--:-- 13975
:util:org.eclipse.virgo.util.osgi:signing
|--> Signing Jar File: /jobs/genie.virgo/3.7.0.Milestones/workspace/util/org.eclipse.virgo.util.osgi/build/libs/org.eclipse.virgo.util.osgi-3.7.0.RELEASE.jar
  % Total    % Received % Xferd  Average Speed   Time    Time     Time  Current
                                 Dload  Upload   Total   Spent    Left  Speed

  0     0    0     0    0     0      0      0 --:--:-- --:--:-- --:--:--     0
100  3130    0     0  100  3130      0  15225 --:--:-- --:--:-- --:--:-- 15194
100 11955  100  8825  100  3130   7631   2706  0:00:01  0:00:01 --:--:--  7634
:util:org.eclipse.virgo.util.osgi.manifest:signing
|--> Signing Jar File: /jobs/genie.virgo/3.7.0.Milestones/workspace/util/org.eclipse.virgo.util.osgi.manifest/build/libs/org.eclipse.virgo.util.osgi.manifest-3.7.0.RELEASE.jar
  % Total    % Received % Xferd  Average Speed   Time    Time     Time  Current
                                 Dload  Upload   Total   Spent    Left  Speed

  0     0    0     0    0     0      0      0 --:--:-- --:--:-- --:--:--     0
100 92833    0     0  100 92833      0   442k --:--:-- --:--:-- --:--:--  442k
 46  194k    0     0  100 92833      0  76224  0:00:01  0:00:01 --:--:-- 76217
100  194k  100  103k  100 92833  85669  74840  0:00:01  0:00:01 --:--:-- 85629
:util:org.eclipse.virgo.util.parser.launcher:signing
|--> Signing Jar File: /jobs/genie.virgo/3.7.0.Milestones/workspace/util/org.eclipse.virgo.util.parser.launcher/build/libs/org.eclipse.virgo.util.parser.launcher-3.7.0.RELEASE.jar
  % Total    % Received % Xferd  Average Speed   Time    Time     Time  Current
                                 Dload  Upload   Total   Spent    Left  Speed

  0     0    0     0    0     0      0      0 --:--:-- --:--:-- --:--:--     0
 36 22192    0     0  100  8081      0   8370 --:--:-- --:--:-- --:--:--  8365
100 22192  100 14111  100  8081  14606   8364 --:--:-- --:--:-- --:--:-- 14592
:util:org.eclipse.virgo.util.parser.manifest:signing
|--> Signing Jar File: /jobs/genie.virgo/3.7.0.Milestones/workspace/util/org.eclipse.virgo.util.parser.manifest/build/libs/org.eclipse.virgo.util.parser.manifest-3.7.0.RELEASE.jar
  % Total    % Received % Xferd  Average Speed   Time    Time     Time  Current
                                 Dload  Upload   Total   Spent    Left  Speed

  0     0    0     0    0     0      0      0 --:--:-- --:--:-- --:--:--     0
100 25688    0     0  100 25688      0  25538  0:00:01  0:00:01 --:--:-- 25560
100 58615  100 32927  100 25688  29118  22716  0:00:01  0:00:01 --:--:-- 29138
:web:org.eclipse.virgo.web.core:signing
|--> Signing Jar File: /jobs/genie.virgo/3.7.0.Milestones/workspace/web/org.eclipse.virgo.web.core/build/libs/org.eclipse.virgo.web.core-3.7.0.RELEASE.jar
  % Total    % Received % Xferd  Average Speed   Time    Time     Time  Current
                                 Dload  Upload   Total   Spent    Left  Speed

  0     0    0     0    0     0      0      0 --:--:-- --:--:-- --:--:--     0
 43 58760    0     0  100 25656      0  27499 --:--:-- --:--:-- --:--:-- 27498
100 58760  100 33104  100 25656  35436  27464 --:--:-- --:--:-- --:--:-- 35405
:web:org.eclipse.virgo.web.dm:signing
|--> Signing Jar File: /jobs/genie.virgo/3.7.0.Milestones/workspace/web/org.eclipse.virgo.web.dm/build/libs/org.eclipse.virgo.web.dm-3.7.0.RELEASE.jar
  % Total    % Received % Xferd  Average Speed   Time    Time     Time  Current
                                 Dload  Upload   Total   Spent    Left  Speed

  0     0    0     0    0     0      0      0 --:--:-- --:--:-- --:--:--     0
100  5421    0     0  100  5421      0   5385  0:00:01  0:00:01 --:--:--  5388
100 16457  100 11036  100  5421  10056   4939  0:00:01  0:00:01 --:--:-- 10060
:web:org.eclipse.virgo.web.enterprise.appdeployer:signing
|--> Signing Jar File: /jobs/genie.virgo/3.7.0.Milestones/workspace/web/org.eclipse.virgo.web.enterprise.appdeployer/build/libs/org.eclipse.virgo.web.enterprise.appdeployer-3.7.0.RELEASE.jar
  % Total    % Received % Xferd  Average Speed   Time    Time     Time  Current
                                 Dload  Upload   Total   Spent    Left  Speed

  0     0    0     0    0     0      0      0 --:--:-- --:--:-- --:--:--     0
100 28819    0     0  100 28819      0  28636  0:00:01  0:00:01 --:--:-- 28647
100 64259  100 35440  100 28819  29886  24303  0:00:01  0:00:01 --:--:-- 29907
:web:org.eclipse.virgo.web.enterprise.applistener:signing
|--> Signing Jar File: /jobs/genie.virgo/3.7.0.Milestones/workspace/web/org.eclipse.virgo.web.enterprise.applistener/build/libs/org.eclipse.virgo.web.enterprise.applistener-3.7.0.RELEASE.jar
  % Total    % Received % Xferd  Average Speed   Time    Time     Time  Current
                                 Dload  Upload   Total   Spent    Left  Speed

  0     0    0     0    0     0      0      0 --:--:-- --:--:-- --:--:--     0
100  6285    0     0  100  6285      0   6242  0:00:01  0:00:01 --:--:--  6247
100 18442  100 12157  100  6285  10153   5249  0:00:01  0:00:01 --:--:-- 10156
:web:org.eclipse.virgo.web.enterprise.catalina.fragment.webbeans:signing
|--> Signing Jar File: /jobs/genie.virgo/3.7.0.Milestones/workspace/web/org.eclipse.virgo.web.enterprise.catalina.fragment.webbeans/build/libs/org.eclipse.virgo.web.enterprise.catalina.fragment.webbeans-3.7.0.RELEASE.jar
  % Total    % Received % Xferd  Average Speed   Time    Time     Time  Current
                                 Dload  Upload   Total   Spent    Left  Speed

  0     0    0     0    0     0      0      0 --:--:-- --:--:-- --:--:--     0
100  1546    0     0  100  1546      0   1535  0:00:01  0:00:01 --:--:--  1536
 18  8501    0     0  100  1546      0   1266  0:00:01  0:00:01 --:--:--  1266
100  8501  100  6955  100  1546   5693   1265  0:00:01  0:00:01 --:--:--  5691
:web:org.eclipse.virgo.web.enterprise.javax.persistence.extension:signing
|--> Signing Jar File: /jobs/genie.virgo/3.7.0.Milestones/workspace/web/org.eclipse.virgo.web.enterprise.javax.persistence.extension/build/libs/org.eclipse.virgo.web.enterprise.javax.persistence.extension-3.7.0.RELEASE.jar
  % Total    % Received % Xferd  Average Speed   Time    Time     Time  Current
                                 Dload  Upload   Total   Spent    Left  Speed

  0     0    0     0    0     0      0      0 --:--:-- --:--:-- --:--:--     0
100  9861    0     0  100  9861      0   9797  0:00:01  0:00:01 --:--:--  9802
100 25798  100 15937  100  9861  15481   9579  0:00:01  0:00:01 --:--:-- 15487
:web:org.eclipse.virgo.web.enterprise.javax.persistence.provider.initializer:signing
|--> Signing Jar File: /jobs/genie.virgo/3.7.0.Milestones/workspace/web/org.eclipse.virgo.web.enterprise.javax.persistence.provider.initializer/build/libs/org.eclipse.virgo.web.enterprise.javax.persistence.provider.initializer-3.7.0.RELEASE.jar
  % Total    % Received % Xferd  Average Speed   Time    Time     Time  Current
                                 Dload  Upload   Total   Spent    Left  Speed

  0     0    0     0    0     0      0      0 --:--:-- --:--:-- --:--:--     0
 29 13800    0     0  100  4028      0   4017  0:00:01  0:00:01 --:--:--  4019
100 13800  100  9772  100  4028   9740   4014  0:00:01  0:00:01 --:--:--  9742
:web:org.eclipse.virgo.web.enterprise.jsf.support:signing
|--> Signing Jar File: /jobs/genie.virgo/3.7.0.Milestones/workspace/web/org.eclipse.virgo.web.enterprise.jsf.support/build/libs/org.eclipse.virgo.web.enterprise.jsf.support-3.7.0.RELEASE.jar
  % Total    % Received % Xferd  Average Speed   Time    Time     Time  Current
                                 Dload  Upload   Total   Spent    Left  Speed

  0     0    0     0    0     0      0      0 --:--:-- --:--:-- --:--:--     0
 35 20330    0     0  100  7297      0   7258  0:00:01  0:00:01 --:--:--  7260
100 20330  100 13033  100  7297  12957   7254  0:00:01  0:00:01 --:--:-- 12968
:web:org.eclipse.virgo.web.enterprise.openejb.fragment.bval:signing
|--> Signing Jar File: /jobs/genie.virgo/3.7.0.Milestones/workspace/web/org.eclipse.virgo.web.enterprise.openejb.fragment.bval/build/libs/org.eclipse.virgo.web.enterprise.openejb.fragment.bval-3.7.0.RELEASE.jar
  % Total    % Received % Xferd  Average Speed   Time    Time     Time  Current
                                 Dload  Upload   Total   Spent    Left  Speed

  0     0    0     0    0     0      0      0 --:--:-- --:--:-- --:--:--     0
100  1879    0     0  100  1879      0   1866  0:00:01  0:00:01 --:--:--  1867
100  9361  100  7482  100  1879   6121   1537  0:00:01  0:00:01 --:--:--  6122
:web:org.eclipse.virgo.web.enterprise.openejb.fragment.jotm:signing
|--> Signing Jar File: /jobs/genie.virgo/3.7.0.Milestones/workspace/web/org.eclipse.virgo.web.enterprise.openejb.fragment.jotm/build/libs/org.eclipse.virgo.web.enterprise.openejb.fragment.jotm-3.7.0.RELEASE.jar
  % Total    % Received % Xferd  Average Speed   Time    Time     Time  Current
                                 Dload  Upload   Total   Spent    Left  Speed

  0     0    0     0    0     0      0      0 --:--:-- --:--:-- --:--:--     0
100  3900    0     0  100  3900      0   3875  0:00:01  0:00:01 --:--:--  3876
100 13679  100  9779  100  3900   8704   3471  0:00:01  0:00:01 --:--:--  8707
:web:org.eclipse.virgo.web.enterprise.openejb.fragment.jpa:signing
|--> Signing Jar File: /jobs/genie.virgo/3.7.0.Milestones/workspace/web/org.eclipse.virgo.web.enterprise.openejb.fragment.jpa/build/libs/org.eclipse.virgo.web.enterprise.openejb.fragment.jpa-3.7.0.RELEASE.jar
  % Total    % Received % Xferd  Average Speed   Time    Time     Time  Current
                                 Dload  Upload   Total   Spent    Left  Speed

  0     0    0     0    0     0      0      0 --:--:-- --:--:-- --:--:--     0
 18  8493    0     0  100  1542      0   1553 --:--:-- --:--:-- --:--:--  1552
100  8493  100  6951  100  1542   6996   1551 --:--:-- --:--:-- --:--:--  6992
:web:org.eclipse.virgo.web.enterprise.openejb.fragment.webbeans:signing
|--> Signing Jar File: /jobs/genie.virgo/3.7.0.Milestones/workspace/web/org.eclipse.virgo.web.enterprise.openejb.fragment.webbeans/build/libs/org.eclipse.virgo.web.enterprise.openejb.fragment.webbeans-3.7.0.RELEASE.jar
  % Total    % Received % Xferd  Average Speed   Time    Time     Time  Current
                                 Dload  Upload   Total   Spent    Left  Speed

  0     0    0     0    0     0      0      0 --:--:-- --:--:-- --:--:--     0
100  1971    0     0  100  1971      0   1958  0:00:01  0:00:01 --:--:--  1959
100  9543  100  7572  100  1971   7378   1920  0:00:01  0:00:01 --:--:--  7380
:web:org.eclipse.virgo.web.enterprise.openejb.initialiser:signing
|--> Signing Jar File: /jobs/genie.virgo/3.7.0.Milestones/workspace/web/org.eclipse.virgo.web.enterprise.openejb.initialiser/build/libs/org.eclipse.virgo.web.enterprise.openejb.initialiser-3.7.0.RELEASE.jar
  % Total    % Received % Xferd  Average Speed   Time    Time     Time  Current
                                 Dload  Upload   Total   Spent    Left  Speed

  0     0    0     0    0     0      0      0 --:--:-- --:--:-- --:--:--     0
100  9306    0     0  100  9306      0   9251  0:00:01  0:00:01 --:--:--  9259
100 24822  100 15516  100  9306  12621   7569  0:00:01  0:00:01 --:--:-- 12624
:web:org.eclipse.virgo.web.enterprise.openejb.jpa.integration:signing
|--> Signing Jar File: /jobs/genie.virgo/3.7.0.Milestones/workspace/web/org.eclipse.virgo.web.enterprise.openejb.jpa.integration/build/libs/org.eclipse.virgo.web.enterprise.openejb.jpa.integration-3.7.0.RELEASE.jar
  % Total    % Received % Xferd  Average Speed   Time    Time     Time  Current
                                 Dload  Upload   Total   Spent    Left  Speed

  0     0    0     0    0     0      0      0 --:--:-- --:--:-- --:--:--     0
100  5892    0     0  100  5892      0   5857  0:00:01  0:00:01 --:--:--  5862
100 17793  100 11901  100  5892   9740   4822  0:00:01  0:00:01 --:--:--  9746
:web:org.eclipse.virgo.web.enterprise.openejb.tomcat.factory:signing
|--> Signing Jar File: /jobs/genie.virgo/3.7.0.Milestones/workspace/web/org.eclipse.virgo.web.enterprise.openejb.tomcat.factory/build/libs/org.eclipse.virgo.web.enterprise.openejb.tomcat.factory-3.7.0.RELEASE.jar
  % Total    % Received % Xferd  Average Speed   Time    Time     Time  Current
                                 Dload  Upload   Total   Spent    Left  Speed

  0     0    0     0    0     0      0      0 --:--:-- --:--:-- --:--:--     0
100  4425    0     0  100  4425      0  21517 --:--:-- --:--:-- --:--:-- 21480
 30 14748    0     0  100  4425      0   4025  0:00:01  0:00:01 --:--:--  4022
100 14748  100 10323  100  4425   9386   4023  0:00:01  0:00:01 --:--:--  9384
:web:org.eclipse.virgo.web.enterprise.openwebbeans.initialiser:signing
|--> Signing Jar File: /jobs/genie.virgo/3.7.0.Milestones/workspace/web/org.eclipse.virgo.web.enterprise.openwebbeans.initialiser/build/libs/org.eclipse.virgo.web.enterprise.openwebbeans.initialiser-3.7.0.RELEASE.jar
  % Total    % Received % Xferd  Average Speed   Time    Time     Time  Current
                                 Dload  Upload   Total   Spent    Left  Speed

  0     0    0     0    0     0      0      0 --:--:-- --:--:-- --:--:--     0
100 29040  100 17640  100 11400  19427  12555 --:--:-- --:--:-- --:--:-- 19448
:web:org.eclipse.virgo.web.enterprise.persistence.openejb.classloading.hook:signing
|--> Signing Jar File: /jobs/genie.virgo/3.7.0.Milestones/workspace/web/org.eclipse.virgo.web.enterprise.persistence.openejb.classloading.hook/build/libs/org.eclipse.virgo.web.enterprise.persistence.openejb.classloading.hook-3.7.0.RELEASE.jar
  % Total    % Received % Xferd  Average Speed   Time    Time     Time  Current
                                 Dload  Upload   Total   Spent    Left  Speed

  0     0    0     0    0     0      0      0 --:--:-- --:--:-- --:--:--     0
100  8449    0     0  100  8449      0  41263 --:--:-- --:--:-- --:--:-- 41214
100 23022  100 14573  100  8449  14484   8397  0:00:01  0:00:01 --:--:-- 14486
:web:org.eclipse.virgo.web.enterprise.security:signing
|--> Signing Jar File: /jobs/genie.virgo/3.7.0.Milestones/workspace/web/org.eclipse.virgo.web.enterprise.security/build/libs/org.eclipse.virgo.web.enterprise.security-3.7.0.RELEASE.jar
  % Total    % Received % Xferd  Average Speed   Time    Time     Time  Current
                                 Dload  Upload   Total   Spent    Left  Speed

  0     0    0     0    0     0      0      0 --:--:-- --:--:-- --:--:--     0
100 10044    0     0  100 10044      0  49049 --:--:-- --:--:-- --:--:-- 48995
100 26408  100 16364  100 10044  17045  10462 --:--:-- --:--:-- --:--:-- 17045
:web:org.eclipse.virgo.web.enterprise.security.openejb.classloading.hook:signing
|--> Signing Jar File: /jobs/genie.virgo/3.7.0.Milestones/workspace/web/org.eclipse.virgo.web.enterprise.security.openejb.classloading.hook/build/libs/org.eclipse.virgo.web.enterprise.security.openejb.classloading.hook-3.7.0.RELEASE.jar
  % Total    % Received % Xferd  Average Speed   Time    Time     Time  Current
                                 Dload  Upload   Total   Spent    Left  Speed

  0     0    0     0    0     0      0      0 --:--:-- --:--:-- --:--:--     0
100  4914    0     0  100  4914      0  23899 --:--:-- --:--:-- --:--:-- 23854
 31 15745    0     0  100  4914      0   4285  0:00:01  0:00:01 --:--:--  4284
100 15745  100 10831  100  4914   9439   4282  0:00:01  0:00:01 --:--:--  9434
:web:org.eclipse.virgo.web.enterprise.security.valve:signing
|--> Signing Jar File: /jobs/genie.virgo/3.7.0.Milestones/workspace/web/org.eclipse.virgo.web.enterprise.security.valve/build/libs/org.eclipse.virgo.web.enterprise.security.valve-3.7.0.RELEASE.jar
  % Total    % Received % Xferd  Average Speed   Time    Time     Time  Current
                                 Dload  Upload   Total   Spent    Left  Speed

  0     0    0     0    0     0      0      0 --:--:-- --:--:-- --:--:--     0
100  3844    0     0  100  3844      0   3819  0:00:01  0:00:01 --:--:--  3821
100 13427  100  9583  100  3844   8207   3292  0:00:01  0:00:01 --:--:--  8211
:web:org.eclipse.virgo.web.enterprise.services.accessor:signing
|--> Signing Jar File: /jobs/genie.virgo/3.7.0.Milestones/workspace/web/org.eclipse.virgo.web.enterprise.services.accessor/build/libs/org.eclipse.virgo.web.enterprise.services.accessor-3.7.0.RELEASE.jar
  % Total    % Received % Xferd  Average Speed   Time    Time     Time  Current
                                 Dload  Upload   Total   Spent    Left  Speed

  0     0    0     0    0     0      0      0 --:--:-- --:--:-- --:--:--     0
 45 71253    0     0  100 32127      0  34965 --:--:-- --:--:-- --:--:-- 34958
100 71253  100 39126  100 32127  42533  34924 --:--:-- --:--:-- --:--:-- 42528
:web:org.eclipse.virgo.web.servlet.adapter:signing
|--> Signing Jar File: /jobs/genie.virgo/3.7.0.Milestones/workspace/web/org.eclipse.virgo.web.servlet.adapter/build/libs/org.eclipse.virgo.web.servlet.adapter-3.7.0.RELEASE.jar
  % Total    % Received % Xferd  Average Speed   Time    Time     Time  Current
                                 Dload  Upload   Total   Spent    Left  Speed

  0     0    0     0    0     0      0      0 --:--:-- --:--:-- --:--:--     0
100  1501    0     0  100  1501      0   1490  0:00:01  0:00:01 --:--:--  1492
100  8435  100  6934  100  1501   5484   1187  0:00:01  0:00:01 --:--:--  5485
:web:org.eclipse.virgo.web.spring.integration:signing
|--> Signing Jar File: /jobs/genie.virgo/3.7.0.Milestones/workspace/web/org.eclipse.virgo.web.spring.integration/build/libs/org.eclipse.virgo.web.spring.integration-3.7.0.RELEASE.jar
  % Total    % Received % Xferd  Average Speed   Time    Time     Time  Current
                                 Dload  Upload   Total   Spent    Left  Speed

  0     0    0     0    0     0      0      0 --:--:-- --:--:-- --:--:--     0
100  1469    0     0  100  1469      0   1459  0:00:01  0:00:01 --:--:--  1460
100  8360  100  6891  100  1469   6620   1411  0:00:01  0:00:01 --:--:--  6625
:web:org.eclipse.virgo.web.tomcat.support:signing
|--> Signing Jar File: /jobs/genie.virgo/3.7.0.Milestones/workspace/web/org.eclipse.virgo.web.tomcat.support/build/libs/org.eclipse.virgo.web.tomcat.support-3.7.0.RELEASE.jar
  % Total    % Received % Xferd  Average Speed   Time    Time     Time  Current
                                 Dload  Upload   Total   Spent    Left  Speed

  0     0    0     0    0     0      0      0 --:--:-- --:--:-- --:--:--     0
100 13926    0     0  100 13926      0  13845  0:00:01  0:00:01 --:--:-- 13856
100 34603  100 20677  100 13926  17123  11532  0:00:01  0:00:01 --:--:-- 17130
:web:org.eclipse.virgo.web.war.deployer:signing
|--> Signing Jar File: /jobs/genie.virgo/3.7.0.Milestones/workspace/web/org.eclipse.virgo.web.war.deployer/build/libs/org.eclipse.virgo.web.war.deployer-3.7.0.RELEASE.jar
  % Total    % Received % Xferd  Average Speed   Time    Time     Time  Current
                                 Dload  Upload   Total   Spent    Left  Speed

  0     0    0     0    0     0      0      0 --:--:-- --:--:-- --:--:--     0
 43 53042    0     0  100 23316      0  23436 --:--:-- --:--:-- --:--:-- 23433
100 53042  100 29726  100 23316  29854  23416 --:--:-- --:--:-- --:--:-- 29845

FAILURE: Build failed with an exception.

* Where:
Build file '/jobs/genie.virgo/3.7.0.Milestones/workspace/org.eclipse.virgo.site/build.gradle' line: 513

* What went wrong:
Execution failed for task ':org.eclipse.virgo.site:signBundles'.
> jarsigner returned: 1

* Try:
Run with --info or --debug option to get more log output.

* Exception is:
org.gradle.api.tasks.TaskExecutionException: Execution failed for task ':org.eclipse.virgo.site:signBundles'.
	at org.gradle.api.internal.tasks.execution.ExecuteActionsTaskExecuter.executeActions(ExecuteActionsTaskExecuter.java:69)
	at org.gradle.api.internal.tasks.execution.ExecuteActionsTaskExecuter.execute(ExecuteActionsTaskExecuter.java:46)
	at org.gradle.api.internal.tasks.execution.PostExecutionAnalysisTaskExecuter.execute(PostExecutionAnalysisTaskExecuter.java:35)
	at org.gradle.api.internal.tasks.execution.SkipUpToDateTaskExecuter.execute(SkipUpToDateTaskExecuter.java:64)
	at org.gradle.api.internal.tasks.execution.ValidatingTaskExecuter.execute(ValidatingTaskExecuter.java:58)
	at org.gradle.api.internal.tasks.execution.SkipEmptySourceFilesTaskExecuter.execute(SkipEmptySourceFilesTaskExecuter.java:52)
	at org.gradle.api.internal.tasks.execution.SkipTaskWithNoActionsExecuter.execute(SkipTaskWithNoActionsExecuter.java:52)
	at org.gradle.api.internal.tasks.execution.SkipOnlyIfTaskExecuter.execute(SkipOnlyIfTaskExecuter.java:53)
	at org.gradle.api.internal.tasks.execution.ExecuteAtMostOnceTaskExecuter.execute(ExecuteAtMostOnceTaskExecuter.java:43)
	at org.gradle.execution.taskgraph.DefaultTaskGraphExecuter$EventFiringTaskWorker.execute(DefaultTaskGraphExecuter.java:233)
	at org.gradle.execution.taskgraph.DefaultTaskGraphExecuter$EventFiringTaskWorker.execute(DefaultTaskGraphExecuter.java:215)
	at org.gradle.execution.taskgraph.AbstractTaskPlanExecutor$TaskExecutorWorker.processTask(AbstractTaskPlanExecutor.java:74)
	at org.gradle.execution.taskgraph.AbstractTaskPlanExecutor$TaskExecutorWorker.run(AbstractTaskPlanExecutor.java:55)
	at org.gradle.execution.taskgraph.DefaultTaskPlanExecutor.process(DefaultTaskPlanExecutor.java:32)
	at org.gradle.execution.taskgraph.DefaultTaskGraphExecuter.execute(DefaultTaskGraphExecuter.java:113)
	at org.gradle.execution.SelectedTaskExecutionAction.execute(SelectedTaskExecutionAction.java:37)
	at org.gradle.execution.DefaultBuildExecuter.execute(DefaultBuildExecuter.java:37)
	at org.gradle.execution.DefaultBuildExecuter.access$000(DefaultBuildExecuter.java:23)
	at org.gradle.execution.DefaultBuildExecuter$1.proceed(DefaultBuildExecuter.java:43)
	at org.gradle.execution.DryRunBuildExecutionAction.execute(DryRunBuildExecutionAction.java:32)
	at org.gradle.execution.DefaultBuildExecuter.execute(DefaultBuildExecuter.java:37)
	at org.gradle.execution.DefaultBuildExecuter.execute(DefaultBuildExecuter.java:30)
	at org.gradle.initialization.DefaultGradleLauncher$4.run(DefaultGradleLauncher.java:186)
	at org.gradle.internal.Factories$1.create(Factories.java:22)
	at org.gradle.internal.progress.DefaultBuildOperationExecutor.run(DefaultBuildOperationExecutor.java:91)
	at org.gradle.internal.progress.DefaultBuildOperationExecutor.run(DefaultBuildOperationExecutor.java:53)
	at org.gradle.initialization.DefaultGradleLauncher.doBuildStages(DefaultGradleLauncher.java:183)
	at org.gradle.initialization.DefaultGradleLauncher.access$200(DefaultGradleLauncher.java:33)
	at org.gradle.initialization.DefaultGradleLauncher$1.create(DefaultGradleLauncher.java:112)
	at org.gradle.initialization.DefaultGradleLauncher$1.create(DefaultGradleLauncher.java:106)
	at org.gradle.internal.progress.DefaultBuildOperationExecutor.run(DefaultBuildOperationExecutor.java:91)
	at org.gradle.internal.progress.DefaultBuildOperationExecutor.run(DefaultBuildOperationExecutor.java:63)
	at org.gradle.initialization.DefaultGradleLauncher.doBuild(DefaultGradleLauncher.java:106)
	at org.gradle.initialization.DefaultGradleLauncher.run(DefaultGradleLauncher.java:92)
	at org.gradle.launcher.exec.GradleBuildController.run(GradleBuildController.java:66)
	at org.gradle.tooling.internal.provider.ExecuteBuildActionRunner.run(ExecuteBuildActionRunner.java:28)
	at org.gradle.launcher.exec.ChainingBuildActionRunner.run(ChainingBuildActionRunner.java:35)
	at org.gradle.launcher.exec.InProcessBuildActionExecuter.execute(InProcessBuildActionExecuter.java:41)
	at org.gradle.launcher.exec.InProcessBuildActionExecuter.execute(InProcessBuildActionExecuter.java:26)
	at org.gradle.tooling.internal.provider.ContinuousBuildActionExecuter.execute(ContinuousBuildActionExecuter.java:79)
	at org.gradle.tooling.internal.provider.ContinuousBuildActionExecuter.execute(ContinuousBuildActionExecuter.java:51)
	at org.gradle.launcher.daemon.server.exec.ExecuteBuild.doBuild(ExecuteBuild.java:59)
	at org.gradle.launcher.daemon.server.exec.BuildCommandOnly.execute(BuildCommandOnly.java:36)
	at org.gradle.launcher.daemon.server.api.DaemonCommandExecution.proceed(DaemonCommandExecution.java:120)
	at org.gradle.launcher.daemon.server.exec.WatchForDisconnection.execute(WatchForDisconnection.java:47)
	at org.gradle.launcher.daemon.server.api.DaemonCommandExecution.proceed(DaemonCommandExecution.java:120)
	at org.gradle.launcher.daemon.server.exec.ResetDeprecationLogger.execute(ResetDeprecationLogger.java:26)
	at org.gradle.launcher.daemon.server.api.DaemonCommandExecution.proceed(DaemonCommandExecution.java:120)
	at org.gradle.launcher.daemon.server.exec.RequestStopIfSingleUsedDaemon.execute(RequestStopIfSingleUsedDaemon.java:34)
	at org.gradle.launcher.daemon.server.api.DaemonCommandExecution.proceed(DaemonCommandExecution.java:120)
	at org.gradle.launcher.daemon.server.exec.ForwardClientInput$2.call(ForwardClientInput.java:74)
	at org.gradle.launcher.daemon.server.exec.ForwardClientInput$2.call(ForwardClientInput.java:72)
	at org.gradle.util.Swapper.swap(Swapper.java:38)
	at org.gradle.launcher.daemon.server.exec.ForwardClientInput.execute(ForwardClientInput.java:72)
	at org.gradle.launcher.daemon.server.api.DaemonCommandExecution.proceed(DaemonCommandExecution.java:120)
	at org.gradle.launcher.daemon.server.exec.LogAndCheckHealth.execute(LogAndCheckHealth.java:55)
	at org.gradle.launcher.daemon.server.api.DaemonCommandExecution.proceed(DaemonCommandExecution.java:120)
	at org.gradle.launcher.daemon.server.exec.LogToClient.doBuild(LogToClient.java:60)
	at org.gradle.launcher.daemon.server.exec.BuildCommandOnly.execute(BuildCommandOnly.java:36)
	at org.gradle.launcher.daemon.server.api.DaemonCommandExecution.proceed(DaemonCommandExecution.java:120)
	at org.gradle.launcher.daemon.server.exec.EstablishBuildEnvironment.doBuild(EstablishBuildEnvironment.java:72)
	at org.gradle.launcher.daemon.server.exec.BuildCommandOnly.execute(BuildCommandOnly.java:36)
	at org.gradle.launcher.daemon.server.api.DaemonCommandExecution.proceed(DaemonCommandExecution.java:120)
	at org.gradle.launcher.daemon.server.exec.HintGCAfterBuild.execute(HintGCAfterBuild.java:44)
	at org.gradle.launcher.daemon.server.api.DaemonCommandExecution.proceed(DaemonCommandExecution.java:120)
	at org.gradle.launcher.daemon.server.exec.StartBuildOrRespondWithBusy$1.run(StartBuildOrRespondWithBusy.java:50)
	at org.gradle.launcher.daemon.server.DaemonStateCoordinator$1.run(DaemonStateCoordinator.java:293)
	at org.gradle.internal.concurrent.ExecutorPolicy$CatchAndRecordFailures.onExecute(ExecutorPolicy.java:54)
	at org.gradle.internal.concurrent.StoppableExecutorImpl$1.run(StoppableExecutorImpl.java:40)
Caused by: : jarsigner returned: 1
	at org.apache.tools.ant.taskdefs.ExecTask.runExecute(ExecTask.java:644)
	at org.apache.tools.ant.taskdefs.ExecTask.runExec(ExecTask.java:670)
	at org.apache.tools.ant.taskdefs.ExecTask.execute(ExecTask.java:496)
	at org.apache.tools.ant.taskdefs.SignJar.signOneJar(SignJar.java:534)
	at org.apache.tools.ant.taskdefs.SignJar.execute(SignJar.java:449)
	at org.apache.tools.ant.UnknownElement.execute(UnknownElement.java:293)
	at org.apache.tools.ant.dispatch.DispatchUtils.execute(DispatchUtils.java:106)
	at org.gradle.api.internal.project.ant.BasicAntBuilder.nodeCompleted(BasicAntBuilder.java:78)
	at org.gradle.api.internal.project.ant.BasicAntBuilder.doInvokeMethod(BasicAntBuilder.java:103)
	at build_9zzn1k8935lsp2criqq7xotsj$_signLocally_closure13.doCall(/jobs/genie.virgo/3.7.0.Milestones/workspace/org.eclipse.virgo.site/build.gradle:513)
	at build_9zzn1k8935lsp2criqq7xotsj.signLocally(/jobs/genie.virgo/3.7.0.Milestones/workspace/org.eclipse.virgo.site/build.gradle:522)
	at build_9zzn1k8935lsp2criqq7xotsj$_run_closure1$_closure18.doCall(/jobs/genie.virgo/3.7.0.Milestones/workspace/org.eclipse.virgo.site/build.gradle:27)
	at virgobuild.UpdateSitePlugin$_addTaskSignBundles_closure10$_closure24.doCall(UpdateSitePlugin.groovy:212)
	at org.gradle.api.internal.AbstractTask$ClosureTaskAction.execute(AbstractTask.java:587)
	at org.gradle.api.internal.AbstractTask$ClosureTaskAction.execute(AbstractTask.java:568)
	at org.gradle.api.internal.tasks.execution.ExecuteActionsTaskExecuter.executeAction(ExecuteActionsTaskExecuter.java:80)
	at org.gradle.api.internal.tasks.execution.ExecuteActionsTaskExecuter.executeActions(ExecuteActionsTaskExecuter.java:61)
	... 68 more


BUILD FAILED

Total time: 6 mins 48.455 secs
[locks-and-latches] Releasing all the locks
[locks-and-latches] All the locks released
Recording test results
Archiving artifacts
Sending e-mails to: fwaibel@eclipsesource.com
Finished: FAILURE