FailedConsole Output

Skipping 349 KB.. Full Log
rsistence.extension:check
:web:org.eclipse.virgo.web.enterprise.javax.persistence.extension:build
:web:org.eclipse.virgo.web.enterprise.javax.persistence.provider.initializer:compileTestJava
:web:org.eclipse.virgo.web.enterprise.javax.persistence.provider.initializer:processTestResources UP-TO-DATE
:web:org.eclipse.virgo.web.enterprise.javax.persistence.provider.initializer:testClasses
:web:org.eclipse.virgo.web.enterprise.javax.persistence.provider.initializer:test
:web:org.eclipse.virgo.web.enterprise.javax.persistence.provider.initializer:check
:web:org.eclipse.virgo.web.enterprise.javax.persistence.provider.initializer:build
:web:org.eclipse.virgo.web.enterprise.jsf.support:compileTestJava UP-TO-DATE
:web:org.eclipse.virgo.web.enterprise.jsf.support:processTestResources UP-TO-DATE
:web:org.eclipse.virgo.web.enterprise.jsf.support:testClasses UP-TO-DATE
:web:org.eclipse.virgo.web.enterprise.jsf.support:test UP-TO-DATE
:web:org.eclipse.virgo.web.enterprise.jsf.support:check UP-TO-DATE
:web:org.eclipse.virgo.web.enterprise.jsf.support:build
:web:org.eclipse.virgo.web.enterprise.openejb.fragment.bval:compileTestJava UP-TO-DATE
:web:org.eclipse.virgo.web.enterprise.openejb.fragment.bval:processTestResources UP-TO-DATE
:web:org.eclipse.virgo.web.enterprise.openejb.fragment.bval:testClasses UP-TO-DATE
:web:org.eclipse.virgo.web.enterprise.openejb.fragment.bval:test UP-TO-DATE
:web:org.eclipse.virgo.web.enterprise.openejb.fragment.bval:check UP-TO-DATE
:web:org.eclipse.virgo.web.enterprise.openejb.fragment.bval:build
:web:org.eclipse.virgo.web.enterprise.openejb.fragment.jotm:compileTestJava UP-TO-DATE
:web:org.eclipse.virgo.web.enterprise.openejb.fragment.jotm:processTestResources UP-TO-DATE
:web:org.eclipse.virgo.web.enterprise.openejb.fragment.jotm:testClasses UP-TO-DATE
:web:org.eclipse.virgo.web.enterprise.openejb.fragment.jotm:test UP-TO-DATE
:web:org.eclipse.virgo.web.enterprise.openejb.fragment.jotm:check UP-TO-DATE
:web:org.eclipse.virgo.web.enterprise.openejb.fragment.jotm:build
:web:org.eclipse.virgo.web.enterprise.openejb.fragment.jpa:compileTestJava UP-TO-DATE
:web:org.eclipse.virgo.web.enterprise.openejb.fragment.jpa:processTestResources UP-TO-DATE
:web:org.eclipse.virgo.web.enterprise.openejb.fragment.jpa:testClasses UP-TO-DATE
:web:org.eclipse.virgo.web.enterprise.openejb.fragment.jpa:test UP-TO-DATE
:web:org.eclipse.virgo.web.enterprise.openejb.fragment.jpa:check UP-TO-DATE
:web:org.eclipse.virgo.web.enterprise.openejb.fragment.jpa:build
:web:org.eclipse.virgo.web.enterprise.openejb.fragment.webbeans:compileTestJava UP-TO-DATE
:web:org.eclipse.virgo.web.enterprise.openejb.fragment.webbeans:processTestResources UP-TO-DATE
:web:org.eclipse.virgo.web.enterprise.openejb.fragment.webbeans:testClasses UP-TO-DATE
:web:org.eclipse.virgo.web.enterprise.openejb.fragment.webbeans:test UP-TO-DATE
:web:org.eclipse.virgo.web.enterprise.openejb.fragment.webbeans:check UP-TO-DATE
:web:org.eclipse.virgo.web.enterprise.openejb.fragment.webbeans:build
:web:org.eclipse.virgo.web.enterprise.openejb.initialiser:compileTestJava UP-TO-DATE
:web:org.eclipse.virgo.web.enterprise.openejb.initialiser:processTestResources UP-TO-DATE
:web:org.eclipse.virgo.web.enterprise.openejb.initialiser:testClasses UP-TO-DATE
:web:org.eclipse.virgo.web.enterprise.openejb.initialiser:test UP-TO-DATE
:web:org.eclipse.virgo.web.enterprise.openejb.initialiser:check UP-TO-DATE
:web:org.eclipse.virgo.web.enterprise.openejb.initialiser:build
:web:org.eclipse.virgo.web.enterprise.openejb.jpa.integration:compileTestJava UP-TO-DATE
:web:org.eclipse.virgo.web.enterprise.openejb.jpa.integration:processTestResources UP-TO-DATE
:web:org.eclipse.virgo.web.enterprise.openejb.jpa.integration:testClasses UP-TO-DATE
:web:org.eclipse.virgo.web.enterprise.openejb.jpa.integration:test UP-TO-DATE
:web:org.eclipse.virgo.web.enterprise.openejb.jpa.integration:check UP-TO-DATE
:web:org.eclipse.virgo.web.enterprise.openejb.jpa.integration:build
:web:org.eclipse.virgo.web.enterprise.openejb.tomcat.factory:compileTestJava
:web:org.eclipse.virgo.web.enterprise.openejb.tomcat.factory:processTestResources UP-TO-DATE
:web:org.eclipse.virgo.web.enterprise.openejb.tomcat.factory:testClasses
:web:org.eclipse.virgo.web.enterprise.openejb.tomcat.factory:test
:web:org.eclipse.virgo.web.enterprise.openejb.tomcat.factory:check
:web:org.eclipse.virgo.web.enterprise.openejb.tomcat.factory:build
:web:org.eclipse.virgo.web.enterprise.openwebbeans.initialiser:compileTestJava UP-TO-DATE
:web:org.eclipse.virgo.web.enterprise.openwebbeans.initialiser:processTestResources UP-TO-DATE
:web:org.eclipse.virgo.web.enterprise.openwebbeans.initialiser:testClasses UP-TO-DATE
:web:org.eclipse.virgo.web.enterprise.openwebbeans.initialiser:test UP-TO-DATE
:web:org.eclipse.virgo.web.enterprise.openwebbeans.initialiser:check UP-TO-DATE
:web:org.eclipse.virgo.web.enterprise.openwebbeans.initialiser:build
:web:org.eclipse.virgo.web.enterprise.persistence.openejb.classloading.hook:compileTestJava
:web:org.eclipse.virgo.web.enterprise.persistence.openejb.classloading.hook:processTestResources UP-TO-DATE
:web:org.eclipse.virgo.web.enterprise.persistence.openejb.classloading.hook:testClasses
:web:org.eclipse.virgo.web.enterprise.persistence.openejb.classloading.hook:test
:web:org.eclipse.virgo.web.enterprise.persistence.openejb.classloading.hook:check
:web:org.eclipse.virgo.web.enterprise.persistence.openejb.classloading.hook:build
:web:org.eclipse.virgo.web.enterprise.security:compileTestJava----------
1. WARNING in /jobs/genie.virgo/3.7.0.Milestones/workspace/web/org.eclipse.virgo.web.enterprise.security/src/test/java/org/eclipse/virgo/web/enterprise/security/StandardSecurityServiceTest.java (at line 193)
	ThreadLocal<Wrapper> wrapperLocal = (ThreadLocal<Wrapper>) wrapper; 
	                                    ^^^^^^^^^^^^^^^^^^^^^^^^^^^^^^
Type safety: Unchecked cast from Object to ThreadLocal<Wrapper>
----------
1 problem (1 warning)

:web:org.eclipse.virgo.web.enterprise.security:processTestResources UP-TO-DATE
:web:org.eclipse.virgo.web.enterprise.security:testClasses
:web:org.eclipse.virgo.web.enterprise.security:test
:web:org.eclipse.virgo.web.enterprise.security:check
:web:org.eclipse.virgo.web.enterprise.security:build
:web:org.eclipse.virgo.web.enterprise.security.openejb.classloading.hook:compileTestJava UP-TO-DATE
:web:org.eclipse.virgo.web.enterprise.security.openejb.classloading.hook:processTestResources UP-TO-DATE
:web:org.eclipse.virgo.web.enterprise.security.openejb.classloading.hook:testClasses UP-TO-DATE
:web:org.eclipse.virgo.web.enterprise.security.openejb.classloading.hook:test UP-TO-DATE
:web:org.eclipse.virgo.web.enterprise.security.openejb.classloading.hook:check UP-TO-DATE
:web:org.eclipse.virgo.web.enterprise.security.openejb.classloading.hook:build
:web:org.eclipse.virgo.web.enterprise.security.valve:compileTestJava UP-TO-DATE
:web:org.eclipse.virgo.web.enterprise.security.valve:processTestResources UP-TO-DATE
:web:org.eclipse.virgo.web.enterprise.security.valve:testClasses UP-TO-DATE
:web:org.eclipse.virgo.web.enterprise.security.valve:test UP-TO-DATE
:web:org.eclipse.virgo.web.enterprise.security.valve:check UP-TO-DATE
:web:org.eclipse.virgo.web.enterprise.security.valve:build
:web:org.eclipse.virgo.web.enterprise.services.accessor:compileTestJava----------
1. WARNING in /jobs/genie.virgo/3.7.0.Milestones/workspace/web/org.eclipse.virgo.web.enterprise.services.accessor/src/test/java/org/eclipse/virgo/web/enterprise/services/accessor/WebAppBundleClassloaderCustomizerTest.java (at line 94)
	assertTrue(((List<ClassLoaderDelegateHook>) field.get(PluggableDelegatingClassLoaderDelegateHook.getInstance())).contains(webAppBundleClassloaderCustomizer.getWebAppBundleClassLoaderDelegateHook()));
	           ^^^^^^^^^^^^^^^^^^^^^^^^^^^^^^^^^^^^^^^^^^^^^^^^^^^^^^^^^^^^^^^^^^^^^^^^^^^^^^^^^^^^^^^^^^^^^^^^^^^^^
Type safety: Unchecked cast from Object to List<ClassLoaderDelegateHook>
----------
2. WARNING in /jobs/genie.virgo/3.7.0.Milestones/workspace/web/org.eclipse.virgo.web.enterprise.services.accessor/src/test/java/org/eclipse/virgo/web/enterprise/services/accessor/WebAppBundleClassloaderCustomizerTest.java (at line 98)
	assertTrue(((Map<Bundle, Set<String>>) field2.get(webAppBundleClassloaderCustomizer.getWebAppBundleClassLoaderDelegateHook())).containsKey(webBundle));
	           ^^^^^^^^^^^^^^^^^^^^^^^^^^^^^^^^^^^^^^^^^^^^^^^^^^^^^^^^^^^^^^^^^^^^^^^^^^^^^^^^^^^^^^^^^^^^^^^^^^^^^^^^^^^^^^^^^^^
Type safety: Unchecked cast from Object to Map<Bundle,Set<String>>
----------
3. WARNING in /jobs/genie.virgo/3.7.0.Milestones/workspace/web/org.eclipse.virgo.web.enterprise.services.accessor/src/test/java/org/eclipse/virgo/web/enterprise/services/accessor/WebAppBundleClassloaderCustomizerTest.java (at line 104)
	assertTrue(((List<ClassLoaderDelegateHook>) field.get(PluggableDelegatingClassLoaderDelegateHook.getInstance())).isEmpty());
	           ^^^^^^^^^^^^^^^^^^^^^^^^^^^^^^^^^^^^^^^^^^^^^^^^^^^^^^^^^^^^^^^^^^^^^^^^^^^^^^^^^^^^^^^^^^^^^^^^^^^^^
Type safety: Unchecked cast from Object to List<ClassLoaderDelegateHook>
----------
3 problems (3 warnings)

:web:org.eclipse.virgo.web.enterprise.services.accessor:processTestResources UP-TO-DATE
:web:org.eclipse.virgo.web.enterprise.services.accessor:testClasses
:web:org.eclipse.virgo.web.enterprise.services.accessor:test
:web:org.eclipse.virgo.web.enterprise.services.accessor:check
:web:org.eclipse.virgo.web.enterprise.services.accessor:build
:web:org.eclipse.virgo.web.servlet.adapter:compileTestJava UP-TO-DATE
:web:org.eclipse.virgo.web.servlet.adapter:processTestResources UP-TO-DATE
:web:org.eclipse.virgo.web.servlet.adapter:testClasses UP-TO-DATE
:web:org.eclipse.virgo.web.servlet.adapter:test UP-TO-DATE
:web:org.eclipse.virgo.web.servlet.adapter:check UP-TO-DATE
:web:org.eclipse.virgo.web.servlet.adapter:build
:web:org.eclipse.virgo.web.spring.integration:compileTestJava UP-TO-DATE
:web:org.eclipse.virgo.web.spring.integration:processTestResources UP-TO-DATE
:web:org.eclipse.virgo.web.spring.integration:testClasses UP-TO-DATE
:web:org.eclipse.virgo.web.spring.integration:test UP-TO-DATE
:web:org.eclipse.virgo.web.spring.integration:check UP-TO-DATE
:web:org.eclipse.virgo.web.spring.integration:build
:web:org.eclipse.virgo.web.tomcat.support:compileTestJava UP-TO-DATE
:web:org.eclipse.virgo.web.tomcat.support:processTestResources UP-TO-DATE
:web:org.eclipse.virgo.web.tomcat.support:testClasses UP-TO-DATE
:web:org.eclipse.virgo.web.tomcat.support:test UP-TO-DATE
:web:org.eclipse.virgo.web.tomcat.support:check UP-TO-DATE
:web:org.eclipse.virgo.web.tomcat.support:build
:web:org.eclipse.virgo.web.war.deployer:compileTestJava
:web:org.eclipse.virgo.web.war.deployer:processTestResources
:web:org.eclipse.virgo.web.war.deployer:testClasses
:web:org.eclipse.virgo.web.war.deployer:test
:web:org.eclipse.virgo.web.war.deployer:check
:web:org.eclipse.virgo.web.war.deployer:build
:packaging:jetty-server:org.eclipse.virgo.jetty.smoketest:sourcesJar
:packaging:jetty-server:org.eclipse.virgo.jetty.smoketest:assemble
:packaging:jetty-server:org.eclipse.virgo.jetty.smoketest:compileTestJava UP-TO-DATE
:packaging:jetty-server:org.eclipse.virgo.jetty.smoketest:processTestResources UP-TO-DATE
:packaging:jetty-server:org.eclipse.virgo.jetty.smoketest:testClasses UP-TO-DATE
:packaging:jetty-server:org.eclipse.virgo.jetty.smoketest:test UP-TO-DATE
:packaging:jetty-server:org.eclipse.virgo.jetty.smoketest:check UP-TO-DATE
:packaging:jetty-server:org.eclipse.virgo.jetty.smoketest:build
:packaging:kernel:org.eclipse.virgo.kernel.smoketest:sourcesJar
:packaging:kernel:org.eclipse.virgo.kernel.smoketest:assemble
:packaging:kernel:org.eclipse.virgo.kernel.smoketest:compileTestJava UP-TO-DATE
:packaging:kernel:org.eclipse.virgo.kernel.smoketest:processTestResources UP-TO-DATE
:packaging:kernel:org.eclipse.virgo.kernel.smoketest:testClasses UP-TO-DATE
:packaging:kernel:org.eclipse.virgo.kernel.smoketest:test UP-TO-DATE
:packaging:kernel:org.eclipse.virgo.kernel.smoketest:check UP-TO-DATE
:packaging:kernel:org.eclipse.virgo.kernel.smoketest:build
:packaging:nano:org.eclipse.virgo.nano.smoketest:sourcesJar
:packaging:nano:org.eclipse.virgo.nano.smoketest:assemble
:packaging:nano:org.eclipse.virgo.nano.smoketest:compileTestJava UP-TO-DATE
:packaging:nano:org.eclipse.virgo.nano.smoketest:processTestResources UP-TO-DATE
:packaging:nano:org.eclipse.virgo.nano.smoketest:testClasses UP-TO-DATE
:packaging:nano:org.eclipse.virgo.nano.smoketest:test UP-TO-DATE
:packaging:nano:org.eclipse.virgo.nano.smoketest:check UP-TO-DATE
:packaging:nano:org.eclipse.virgo.nano.smoketest:build
:packaging:tomcat-server:org.eclipse.virgo.tomcat.smoketest:sourcesJar
:packaging:tomcat-server:org.eclipse.virgo.tomcat.smoketest:assemble
:packaging:tomcat-server:org.eclipse.virgo.tomcat.smoketest:compileTestJava UP-TO-DATE
:packaging:tomcat-server:org.eclipse.virgo.tomcat.smoketest:processTestResources UP-TO-DATE
:packaging:tomcat-server:org.eclipse.virgo.tomcat.smoketest:testClasses UP-TO-DATE
:packaging:tomcat-server:org.eclipse.virgo.tomcat.smoketest:test UP-TO-DATE
:packaging:tomcat-server:org.eclipse.virgo.tomcat.smoketest:check UP-TO-DATE
:packaging:tomcat-server:org.eclipse.virgo.tomcat.smoketest:build
:apps:org.eclipse.virgo.apps.repository.core:signing
|--> Signing Jar File: /jobs/genie.virgo/3.7.0.Milestones/workspace/apps/org.eclipse.virgo.apps.repository.core/build/libs/org.eclipse.virgo.apps.repository.core-3.7.0.RELEASE.jar
  % Total    % Received % Xferd  Average Speed   Time    Time     Time  Current
                                 Dload  Upload   Total   Spent    Left  Speed

  0     0    0     0    0     0      0      0 --:--:-- --:--:-- --:--:--     0
 43 58948    0     0  100 25602      0  25734 --:--:-- --:--:-- --:--:-- 25730
100 58948  100 33346  100 25602  33481  25706 --:--:-- --:--:-- --:--:-- 33479
:apps:org.eclipse.virgo.apps.repository.web:signing
|--> Signing Jar File: /jobs/genie.virgo/3.7.0.Milestones/workspace/apps/org.eclipse.virgo.apps.repository.web/build/libs/org.eclipse.virgo.apps.repository.web-3.7.0.RELEASE.jar
  % Total    % Received % Xferd  Average Speed   Time    Time     Time  Current
                                 Dload  Upload   Total   Spent    Left  Speed

  0     0    0     0    0     0      0      0 --:--:-- --:--:-- --:--:--     0
100  3594    0     0  100  3594      0   3569  0:00:01  0:00:01 --:--:--  3572
100 12771  100  9177  100  3594   8006   3135  0:00:01  0:00:01 --:--:--  8007
:apps:org.eclipse.virgo.apps.splash:signing
|--> Signing Jar File: /jobs/genie.virgo/3.7.0.Milestones/workspace/apps/org.eclipse.virgo.apps.splash/build/libs/org.eclipse.virgo.apps.splash-3.7.0.RELEASE.jar
  % Total    % Received % Xferd  Average Speed   Time    Time     Time  Current
                                 Dload  Upload   Total   Spent    Left  Speed

  0     0    0     0    0     0      0      0 --:--:-- --:--:-- --:--:--     0
100 85022    0     0  100 85022      0  84519  0:00:01  0:00:01 --:--:-- 84599
100 85022    0     0  100 85022      0  42361  0:00:02  0:00:02 --:--:-- 42383
100 85022    0     0  100 85022      0  28271  0:00:03  0:00:03 --:--:-- 28274
100 85022    0     0  100 85022      0  21210  0:00:04  0:00:04 --:--:-- 21213
100 85022    0     0  100 85022      0  16971  0:00:05  0:00:05 --:--:-- 16973
100 85022    0     0  100 85022      0  14144  0:00:06  0:00:06 --:--:--     0
100  173k  100 92567  100 85022  14690  13492  0:00:06  0:00:06 --:--:--  1757
:kernel:org.eclipse.virgo.kernel.agent.dm:signing
|--> Signing Jar File: /jobs/genie.virgo/3.7.0.Milestones/workspace/kernel/org.eclipse.virgo.kernel.agent.dm/build/libs/org.eclipse.virgo.kernel.agent.dm-3.7.0.RELEASE.jar
  % Total    % Received % Xferd  Average Speed   Time    Time     Time  Current
                                 Dload  Upload   Total   Spent    Left  Speed

  0     0    0     0    0     0      0      0 --:--:-- --:--:-- --:--:--     0
100 17756    0     0  100 17756      0  17647  0:00:01  0:00:01 --:--:-- 17650
100 42599  100 24843  100 17756  20722  14811  0:00:01  0:00:01 --:--:-- 20737
:kernel:org.eclipse.virgo.kernel.artifact:signing
|--> Signing Jar File: /jobs/genie.virgo/3.7.0.Milestones/workspace/kernel/org.eclipse.virgo.kernel.artifact/build/libs/org.eclipse.virgo.kernel.artifact-3.7.0.RELEASE.jar
  % Total    % Received % Xferd  Average Speed   Time    Time     Time  Current
                                 Dload  Upload   Total   Spent    Left  Speed

  0     0    0     0    0     0      0      0 --:--:-- --:--:-- --:--:--     0
100 48597    0     0  100 48597      0   231k --:--:-- --:--:-- --:--:--  231k
100  103k  100 57223  100 48597  59292  50354 --:--:-- --:--:-- --:--:-- 59298
:kernel:org.eclipse.virgo.kernel.deployer:signing
|--> Signing Jar File: /jobs/genie.virgo/3.7.0.Milestones/workspace/kernel/org.eclipse.virgo.kernel.deployer/build/libs/org.eclipse.virgo.kernel.deployer-3.7.0.RELEASE.jar
  % Total    % Received % Xferd  Average Speed   Time    Time     Time  Current
                                 Dload  Upload   Total   Spent    Left  Speed

  0     0    0     0    0     0      0      0 --:--:-- --:--:-- --:--:--     0
100  270k    0     0  100  270k      0   269k  0:00:01  0:00:01 --:--:--  269k
100  570k  100  299k  100  270k   265k   240k  0:00:01  0:00:01 --:--:--  265k
:kernel:org.eclipse.virgo.kernel.deployer.dm:signing
|--> Signing Jar File: /jobs/genie.virgo/3.7.0.Milestones/workspace/kernel/org.eclipse.virgo.kernel.deployer.dm/build/libs/org.eclipse.virgo.kernel.deployer.dm-3.7.0.RELEASE.jar
  % Total    % Received % Xferd  Average Speed   Time    Time     Time  Current
                                 Dload  Upload   Total   Spent    Left  Speed

  0     0    0     0    0     0      0      0 --:--:-- --:--:-- --:--:--     0
100  6901    0     0  100  6901      0  33674 --:--:-- --:--:-- --:--:-- 33663
100 19945  100 13044  100  6901  13177   6971 --:--:-- --:--:-- --:--:-- 13175
:kernel:org.eclipse.virgo.kernel.dmfragment:signing
|--> Signing Jar File: /jobs/genie.virgo/3.7.0.Milestones/workspace/kernel/org.eclipse.virgo.kernel.dmfragment/build/libs/org.eclipse.virgo.kernel.dmfragment-3.7.0.RELEASE.jar
  % Total    % Received % Xferd  Average Speed   Time    Time     Time  Current
                                 Dload  Upload   Total   Spent    Left  Speed

  0     0    0     0    0     0      0      0 --:--:-- --:--:-- --:--:--     0
100 17874    0     0  100 17874      0  87083 --:--:-- --:--:-- --:--:-- 86766
 41 43129    0     0  100 17874      0  16203  0:00:01  0:00:01 --:--:-- 16204
100 43129  100 25255  100 17874  22872  16187  0:00:01  0:00:01 --:--:-- 22855
:kernel:org.eclipse.virgo.kernel.equinox.extensions:signing
|--> Signing Jar File: /jobs/genie.virgo/3.7.0.Milestones/workspace/kernel/org.eclipse.virgo.kernel.equinox.extensions/build/libs/org.eclipse.virgo.kernel.equinox.extensions-3.7.0.RELEASE.jar
  % Total    % Received % Xferd  Average Speed   Time    Time     Time  Current
                                 Dload  Upload   Total   Spent    Left  Speed

  0     0    0     0    0     0      0      0 --:--:-- --:--:-- --:--:--     0
100 24097    0     0  100 24097      0  23948  0:00:01  0:00:01 --:--:-- 23953
100 55691  100 31594  100 24097  23887  18219  0:00:01  0:00:01 --:--:-- 23898
:kernel:org.eclipse.virgo.kernel.kerneldmfragment:signing
|--> Signing Jar File: /jobs/genie.virgo/3.7.0.Milestones/workspace/kernel/org.eclipse.virgo.kernel.kerneldmfragment/build/libs/org.eclipse.virgo.kernel.kerneldmfragment-3.7.0.RELEASE.jar
  % Total    % Received % Xferd  Average Speed   Time    Time     Time  Current
                                 Dload  Upload   Total   Spent    Left  Speed

  0     0    0     0    0     0      0      0 --:--:-- --:--:-- --:--:--     0
100  1481    0     0  100  1481      0   1472  0:00:01  0:00:01 --:--:--  1473
100  8472  100  6991  100  1481   5930   1256  0:00:01  0:00:01 --:--:--  5934
:kernel:org.eclipse.virgo.kernel.model:signing
|--> Signing Jar File: /jobs/genie.virgo/3.7.0.Milestones/workspace/kernel/org.eclipse.virgo.kernel.model/build/libs/org.eclipse.virgo.kernel.model-3.7.0.RELEASE.jar
  % Total    % Received % Xferd  Average Speed   Time    Time     Time  Current
                                 Dload  Upload   Total   Spent    Left  Speed

  0     0    0     0    0     0      0      0 --:--:-- --:--:-- --:--:--     0
100 66734    0     0  100 66734      0  66317  0:00:01  0:00:01 --:--:-- 66335
100  139k  100 76423  100 66734  75189  65656  0:00:01  0:00:01 --:--:-- 75219
:kernel:org.eclipse.virgo.kernel.osgi:signing
|--> Signing Jar File: /jobs/genie.virgo/3.7.0.Milestones/workspace/kernel/org.eclipse.virgo.kernel.osgi/build/libs/org.eclipse.virgo.kernel.osgi-3.7.0.RELEASE.jar
  % Total    % Received % Xferd  Average Speed   Time    Time     Time  Current
                                 Dload  Upload   Total   Spent    Left  Speed

  0     0    0     0    0     0      0      0 --:--:-- --:--:-- --:--:--     0
 44 87128    0     0  100 38650      0  38747 --:--:-- --:--:-- --:--:-- 38727
100 87128  100 48478  100 38650  48454  38631  0:00:01  0:00:01 --:--:-- 48478
:kernel:org.eclipse.virgo.kernel.services:signing
|--> Signing Jar File: /jobs/genie.virgo/3.7.0.Milestones/workspace/kernel/org.eclipse.virgo.kernel.services/build/libs/org.eclipse.virgo.kernel.services-3.7.0.RELEASE.jar
  % Total    % Received % Xferd  Average Speed   Time    Time     Time  Current
                                 Dload  Upload   Total   Spent    Left  Speed

  0     0    0     0    0     0      0      0 --:--:-- --:--:-- --:--:--     0
 44 72706    0     0  100 32092      0  32922 --:--:-- --:--:-- --:--:-- 32914
100 72706  100 40614  100 32092  41600  32871 --:--:-- --:--:-- --:--:-- 41570
:kernel:org.eclipse.virgo.kernel.userregion:signing
|--> Signing Jar File: /jobs/genie.virgo/3.7.0.Milestones/workspace/kernel/org.eclipse.virgo.kernel.userregion/build/libs/org.eclipse.virgo.kernel.userregion-3.7.0.RELEASE.jar
  % Total    % Received % Xferd  Average Speed   Time    Time     Time  Current
                                 Dload  Upload   Total   Spent    Left  Speed

  0     0    0     0    0     0      0      0 --:--:-- --:--:-- --:--:--     0
100  154k    0     0  100  154k      0   153k  0:00:01  0:00:01 --:--:--  153k
100  323k  100  168k  100  154k   143k   131k  0:00:01  0:00:01 --:--:--  144k
:kernel:org.eclipse.virgo.kernel.userregionfactory:signing
|--> Signing Jar File: /jobs/genie.virgo/3.7.0.Milestones/workspace/kernel/org.eclipse.virgo.kernel.userregionfactory/build/libs/org.eclipse.virgo.kernel.userregionfactory-3.7.0.RELEASE.jar
  % Total    % Received % Xferd  Average Speed   Time    Time     Time  Current
                                 Dload  Upload   Total   Spent    Left  Speed

  0     0    0     0    0     0      0      0 --:--:-- --:--:-- --:--:--     0
100 15214    0     0  100 15214      0  15118  0:00:01  0:00:01 --:--:-- 15123
100 36640  100 21426  100 15214  21015  14922  0:00:01  0:00:01 --:--:-- 21026
:kernel:org.eclipse.virgo.management.console:signing
|--> Signing Jar File: /jobs/genie.virgo/3.7.0.Milestones/workspace/kernel/org.eclipse.virgo.management.console/build/libs/org.eclipse.virgo.management.console-3.7.0.RELEASE.jar
  % Total    % Received % Xferd  Average Speed   Time    Time     Time  Current
                                 Dload  Upload   Total   Spent    Left  Speed

  0     0    0     0    0     0      0      0 --:--:-- --:--:-- --:--:--     0
100  318k    0     0  100  318k      0   316k  0:00:01  0:00:01 --:--:--  316k
 48  651k    0     0  100  318k      0   238k  0:00:01  0:00:01 --:--:--  238k
100  651k  100  332k  100  318k   247k   236k  0:00:01  0:00:01 --:--:--  247k
:kernel:org.eclipse.virgo.management.fragment:signing
|--> Signing Jar File: /jobs/genie.virgo/3.7.0.Milestones/workspace/kernel/org.eclipse.virgo.management.fragment/build/libs/org.eclipse.virgo.management.fragment-3.7.0.RELEASE.jar
  % Total    % Received % Xferd  Average Speed   Time    Time     Time  Current
                                 Dload  Upload   Total   Spent    Left  Speed

  0     0    0     0    0     0      0      0 --:--:-- --:--:-- --:--:--     0
100  2712    0     0  100  2712      0   2693  0:00:01  0:00:01 --:--:--  2695
100 10990  100  8278  100  2712   7155   2344  0:00:01  0:00:01 --:--:--  7160
:kernel:org.eclipse.virgo.shell.command:signing
|--> Signing Jar File: /jobs/genie.virgo/3.7.0.Milestones/workspace/kernel/org.eclipse.virgo.shell.command/build/libs/org.eclipse.virgo.shell.command-3.7.0.RELEASE.jar
  % Total    % Received % Xferd  Average Speed   Time    Time     Time  Current
                                 Dload  Upload   Total   Spent    Left  Speed

  0     0    0     0    0     0      0      0 --:--:-- --:--:-- --:--:--     0
100  122k    0     0  100  122k      0   121k  0:00:01  0:00:01 --:--:--  121k
100  259k  100  137k  100  122k   126k   111k  0:00:01  0:00:01 --:--:--  126k
:medic:org.eclipse.virgo.medic:signing
|--> Signing Jar File: /jobs/genie.virgo/3.7.0.Milestones/workspace/medic/org.eclipse.virgo.medic/build/libs/org.eclipse.virgo.medic-3.7.0.RELEASE.jar
  % Total    % Received % Xferd  Average Speed   Time    Time     Time  Current
                                 Dload  Upload   Total   Spent    Left  Speed

  0     0    0     0    0     0      0      0 --:--:-- --:--:-- --:--:--     0
100 15191    0     0  100 15191      0  15099  0:00:01  0:00:01 --:--:-- 15115
100 37549  100 22358  100 15191  22016  14959  0:00:01  0:00:01 --:--:-- 22027
:medic:org.eclipse.virgo.medic.core:signing
|--> Signing Jar File: /jobs/genie.virgo/3.7.0.Milestones/workspace/medic/org.eclipse.virgo.medic.core/build/libs/org.eclipse.virgo.medic.core-3.7.0.RELEASE.jar
  % Total    % Received % Xferd  Average Speed   Time    Time     Time  Current
                                 Dload  Upload   Total   Spent    Left  Speed

  0     0    0     0    0     0      0      0 --:--:-- --:--:-- --:--:--     0
100 89380    0     0  100 89380      0  88848  0:00:01  0:00:01 --:--:-- 88935
100  187k  100  100k  100 89380  76411  66411  0:00:01  0:00:01 --:--:-- 76459
:medic:org.eclipse.virgo.medic.logbackclassicfragment:signing
|--> Signing Jar File: /jobs/genie.virgo/3.7.0.Milestones/workspace/medic/org.eclipse.virgo.medic.logbackclassicfragment/build/libs/org.eclipse.virgo.medic.logbackclassicfragment-3.7.0.RELEASE.jar
  % Total    % Received % Xferd  Average Speed   Time    Time     Time  Current
                                 Dload  Upload   Total   Spent    Left  Speed

  0     0    0     0    0     0      0      0 --:--:-- --:--:-- --:--:--     0
100  1501    0     0  100  1501      0   1491  0:00:01  0:00:01 --:--:--  1492
100  8420  100  6919  100  1501   6401   1388  0:00:01  0:00:01 --:--:--  6406
:medic:org.eclipse.virgo.medic.logbackcorefragment:signing
|--> Signing Jar File: /jobs/genie.virgo/3.7.0.Milestones/workspace/medic/org.eclipse.virgo.medic.logbackcorefragment/build/libs/org.eclipse.virgo.medic.logbackcorefragment-3.7.0.RELEASE.jar
  % Total    % Received % Xferd  Average Speed   Time    Time     Time  Current
                                 Dload  Upload   Total   Spent    Left  Speed

  0     0    0     0    0     0      0      0 --:--:-- --:--:-- --:--:--     0
100  1495    0     0  100  1495      0   7295 --:--:-- --:--:-- --:--:--  7292
100  8412  100  6917  100  1495   6471   1398  0:00:01  0:00:01 --:--:--  6476
:nano:org.eclipse.virgo.nano.core:signing
|--> Signing Jar File: /jobs/genie.virgo/3.7.0.Milestones/workspace/nano/org.eclipse.virgo.nano.core/build/libs/org.eclipse.virgo.nano.core-3.7.0.RELEASE.jar
  % Total    % Received % Xferd  Average Speed   Time    Time     Time  Current
                                 Dload  Upload   Total   Spent    Left  Speed

  0     0    0     0    0     0      0      0 --:--:-- --:--:-- --:--:--     0
100  145k    0     0  100  145k      0   707k --:--:-- --:--:-- --:--:--  705k
 47  306k    0     0  100  145k      0   132k  0:00:01  0:00:01 --:--:--  132k
100  306k  100  160k  100  145k   145k   131k  0:00:01  0:00:01 --:--:--  145k
:nano:org.eclipse.virgo.nano.deployer:signing
|--> Signing Jar File: /jobs/genie.virgo/3.7.0.Milestones/workspace/nano/org.eclipse.virgo.nano.deployer/build/libs/org.eclipse.virgo.nano.deployer-3.7.0.RELEASE.jar
  % Total    % Received % Xferd  Average Speed   Time    Time     Time  Current
                                 Dload  Upload   Total   Spent    Left  Speed

  0     0    0     0    0     0      0      0 --:--:-- --:--:-- --:--:--     0
100 33739    0     0  100 33739      0  33534  0:00:01  0:00:01 --:--:-- 33537
100 74681  100 40942  100 33739  34836  28707  0:00:01  0:00:01 --:--:-- 34844
:nano:org.eclipse.virgo.nano.deployer.api:signing
|--> Signing Jar File: /jobs/genie.virgo/3.7.0.Milestones/workspace/nano/org.eclipse.virgo.nano.deployer.api/build/libs/org.eclipse.virgo.nano.deployer.api-3.7.0.RELEASE.jar
  % Total    % Received % Xferd  Average Speed   Time    Time     Time  Current
                                 Dload  Upload   Total   Spent    Left  Speed

  0     0    0     0    0     0      0      0 --:--:-- --:--:-- --:--:--     0
100 12734    0     0  100 12734      0  12656  0:00:01  0:00:01 --:--:-- 12658
100 32561  100 19827  100 12734  15529   9973  0:00:01  0:00:01 --:--:-- 15538
:nano:org.eclipse.virgo.nano.deployer.hot:signing
|--> Signing Jar File: /jobs/genie.virgo/3.7.0.Milestones/workspace/nano/org.eclipse.virgo.nano.deployer.hot/build/libs/org.eclipse.virgo.nano.deployer.hot-3.7.0.RELEASE.jar
  % Total    % Received % Xferd  Average Speed   Time    Time     Time  Current
                                 Dload  Upload   Total   Spent    Left  Speed

  0     0    0     0    0     0      0      0 --:--:-- --:--:-- --:--:--     0
 38 26433    0     0  100 10197      0  10196  0:00:01  0:00:01 --:--:-- 10197
100 26433  100 16236  100 10197  16224  10189  0:00:01  0:00:01 --:--:-- 16236
:nano:org.eclipse.virgo.nano.management:signing
|--> Signing Jar File: /jobs/genie.virgo/3.7.0.Milestones/workspace/nano/org.eclipse.virgo.nano.management/build/libs/org.eclipse.virgo.nano.management-3.7.0.RELEASE.jar
  % Total    % Received % Xferd  Average Speed   Time    Time     Time  Current
                                 Dload  Upload   Total   Spent    Left  Speed

  0     0    0     0    0     0      0      0 --:--:-- --:--:-- --:--:--     0
100  8389    0     0  100  8389      0   8332  0:00:01  0:00:01 --:--:--  8338
100 22985  100 14596  100  8389  10286   5911  0:00:01  0:00:01 --:--:-- 10293
:nano:org.eclipse.virgo.nano.management.controller:signing
|--> Signing Jar File: /jobs/genie.virgo/3.7.0.Milestones/workspace/nano/org.eclipse.virgo.nano.management.controller/build/libs/org.eclipse.virgo.nano.management.controller-3.7.0.RELEASE.jar
  % Total    % Received % Xferd  Average Speed   Time    Time     Time  Current
                                 Dload  Upload   Total   Spent    Left  Speed

  0     0    0     0    0     0      0      0 --:--:-- --:--:-- --:--:--     0
100  4153    0     0  100  4153      0  20269 --:--:-- --:--:-- --:--:-- 20258
 29 14149    0     0  100  4153      0   3236  0:00:01  0:00:01 --:--:--  3236
100 14149  100  9996  100  4153   7786   3234  0:00:01  0:00:01 --:--:--  7785
:nano:org.eclipse.virgo.nano.services.concurrent:signing
|--> Signing Jar File: /jobs/genie.virgo/3.7.0.Milestones/workspace/nano/org.eclipse.virgo.nano.services.concurrent/build/libs/org.eclipse.virgo.nano.services.concurrent-3.7.0.RELEASE.jar
  % Total    % Received % Xferd  Average Speed   Time    Time     Time  Current
                                 Dload  Upload   Total   Spent    Left  Speed

  0     0    0     0    0     0      0      0 --:--:-- --:--:-- --:--:--     0
100 10953    0     0  100 10953      0  10885  0:00:01  0:00:01 --:--:-- 10887
100 28341  100 17388  100 10953  14971   9430  0:00:01  0:00:01 --:--:-- 14976
:nano:org.eclipse.virgo.nano.services.ds:signing
|--> Signing Jar File: /jobs/genie.virgo/3.7.0.Milestones/workspace/nano/org.eclipse.virgo.nano.services.ds/build/libs/org.eclipse.virgo.nano.services.ds-3.7.0.RELEASE.jar
  % Total    % Received % Xferd  Average Speed   Time    Time     Time  Current
                                 Dload  Upload   Total   Spent    Left  Speed

  0     0    0     0    0     0      0      0 --:--:-- --:--:-- --:--:--     0
100  7971    0     0  100  7971      0   7924  0:00:01  0:00:01 --:--:--  7931
100 22226  100 14255  100  7971  12067   6747  0:00:01  0:00:01 --:--:-- 12070
:repository:org.eclipse.virgo.repository:signing
|--> Signing Jar File: /jobs/genie.virgo/3.7.0.Milestones/workspace/repository/org.eclipse.virgo.repository/build/libs/org.eclipse.virgo.repository-3.7.0.RELEASE.jar
  % Total    % Received % Xferd  Average Speed   Time    Time     Time  Current
                                 Dload  Upload   Total   Spent    Left  Speed

  0     0    0     0    0     0      0      0 --:--:-- --:--:-- --:--:--     0
100  135k    0     0  100  135k      0   134k  0:00:01  0:00:01 --:--:--  135k
100  288k  100  153k  100  135k   115k   102k  0:00:01  0:00:01 --:--:--  115k
:util:org.eclipse.virgo.util.common:signing
|--> Signing Jar File: /jobs/genie.virgo/3.7.0.Milestones/workspace/util/org.eclipse.virgo.util.common/build/libs/org.eclipse.virgo.util.common-3.7.0.RELEASE.jar
  % Total    % Received % Xferd  Average Speed   Time    Time     Time  Current
                                 Dload  Upload   Total   Spent    Left  Speed

  0     0    0     0    0     0      0      0 --:--:-- --:--:-- --:--:--     0
100 57264    0     0  100 57264      0   272k --:--:-- --:--:-- --:--:--  272k
100  121k  100 66838  100 57264  66826  57254  0:00:01  0:00:01 --:--:-- 66838
:util:org.eclipse.virgo.util.env:signing
|--> Signing Jar File: /jobs/genie.virgo/3.7.0.Milestones/workspace/util/org.eclipse.virgo.util.env/build/libs/org.eclipse.virgo.util.env-3.7.0.RELEASE.jar
  % Total    % Received % Xferd  Average Speed   Time    Time     Time  Current
                                 Dload  Upload   Total   Spent    Left  Speed

  0     0    0     0    0     0      0      0 --:--:-- --:--:-- --:--:--     0
100  4192    0     0  100  4192      0  20458 --:--:-- --:--:-- --:--:-- 20448
 29 14175    0     0  100  4192      0   3514  0:00:01  0:00:01 --:--:--  3513
100 14175  100  9983  100  4192   8366   3513  0:00:01  0:00:01 --:--:--  8360
:util:org.eclipse.virgo.util.io:signing
|--> Signing Jar File: /jobs/genie.virgo/3.7.0.Milestones/workspace/util/org.eclipse.virgo.util.io/build/libs/org.eclipse.virgo.util.io-3.7.0.RELEASE.jar
  % Total    % Received % Xferd  Average Speed   Time    Time     Time  Current
                                 Dload  Upload   Total   Spent    Left  Speed

  0     0    0     0    0     0      0      0 --:--:-- --:--:-- --:--:--     0
 44 68435    0     0  100 30531      0  31265 --:--:-- --:--:-- --:--:-- 31249
100 68435  100 37904  100 30531  38766  31226 --:--:-- --:--:-- --:--:-- 38756
:util:org.eclipse.virgo.util.jmx:signing
|--> Signing Jar File: /jobs/genie.virgo/3.7.0.Milestones/workspace/util/org.eclipse.virgo.util.jmx/build/libs/org.eclipse.virgo.util.jmx-3.7.0.RELEASE.jar
  % Total    % Received % Xferd  Average Speed   Time    Time     Time  Current
                                 Dload  Upload   Total   Spent    Left  Speed

  0     0    0     0    0     0      0      0 --:--:-- --:--:-- --:--:--     0
100  4757    0     0  100  4757      0   4724  0:00:01  0:00:01 --:--:--  4728
100 15337  100 10580  100  4757   9685   4354  0:00:01  0:00:01 --:--:--  9688
:util:org.eclipse.virgo.util.math:signing
|--> Signing Jar File: /jobs/genie.virgo/3.7.0.Milestones/workspace/util/org.eclipse.virgo.util.math/build/libs/org.eclipse.virgo.util.math-3.7.0.RELEASE.jar
  % Total    % Received % Xferd  Average Speed   Time    Time     Time  Current
                                 Dload  Upload   Total   Spent    Left  Speed

  0     0    0     0    0     0      0      0 --:--:-- --:--:-- --:--:--     0
100  9443    0     0  100  9443      0   9384  0:00:01  0:00:01 --:--:--  9386
100 25186  100 15743  100  9443  14660   8793  0:00:01  0:00:01 --:--:-- 14671
:util:org.eclipse.virgo.util.osgi:signing
|--> Signing Jar File: /jobs/genie.virgo/3.7.0.Milestones/workspace/util/org.eclipse.virgo.util.osgi/build/libs/org.eclipse.virgo.util.osgi-3.7.0.RELEASE.jar
  % Total    % Received % Xferd  Average Speed   Time    Time     Time  Current
                                 Dload  Upload   Total   Spent    Left  Speed

  0     0    0     0    0     0      0      0 --:--:-- --:--:-- --:--:--     0
100  3130    0     0  100  3130      0   3110  0:00:01  0:00:01 --:--:--  3111
100 11955  100  8825  100  3130   7603   2696  0:00:01  0:00:01 --:--:--  7607
:util:org.eclipse.virgo.util.osgi.manifest:signing
|--> Signing Jar File: /jobs/genie.virgo/3.7.0.Milestones/workspace/util/org.eclipse.virgo.util.osgi.manifest/build/libs/org.eclipse.virgo.util.osgi.manifest-3.7.0.RELEASE.jar
  % Total    % Received % Xferd  Average Speed   Time    Time     Time  Current
                                 Dload  Upload   Total   Spent    Left  Speed

  0     0    0     0    0     0      0      0 --:--:-- --:--:-- --:--:--     0
100 92833    0     0  100 92833      0  92270  0:00:01  0:00:01 --:--:-- 92371
100  194k  100  103k  100 92833  86134  75245  0:00:01  0:00:01 --:--:-- 86185
:util:org.eclipse.virgo.util.parser.launcher:signing
|--> Signing Jar File: /jobs/genie.virgo/3.7.0.Milestones/workspace/util/org.eclipse.virgo.util.parser.launcher/build/libs/org.eclipse.virgo.util.parser.launcher-3.7.0.RELEASE.jar
  % Total    % Received % Xferd  Average Speed   Time    Time     Time  Current
                                 Dload  Upload   Total   Spent    Left  Speed

  0     0    0     0    0     0      0      0 --:--:-- --:--:-- --:--:--     0
 36 22190    0     0  100  8081      0   8339 --:--:-- --:--:-- --:--:--  8339
100 22190  100 14109  100  8081  14550   8334 --:--:-- --:--:-- --:--:-- 14545
:util:org.eclipse.virgo.util.parser.manifest:signing
|--> Signing Jar File: /jobs/genie.virgo/3.7.0.Milestones/workspace/util/org.eclipse.virgo.util.parser.manifest/build/libs/org.eclipse.virgo.util.parser.manifest-3.7.0.RELEASE.jar
  % Total    % Received % Xferd  Average Speed   Time    Time     Time  Current
                                 Dload  Upload   Total   Spent    Left  Speed

  0     0    0     0    0     0      0      0 --:--:-- --:--:-- --:--:--     0
100 25688    0     0  100 25688      0  25538  0:00:01  0:00:01 --:--:-- 25560
 43 58618    0     0  100 25688      0  16352  0:00:01  0:00:01 --:--:-- 16351
100 58618  100 32930  100 25688  20942  16336  0:00:01  0:00:01 --:--:-- 20934
:web:org.eclipse.virgo.web.core:signing
|--> Signing Jar File: /jobs/genie.virgo/3.7.0.Milestones/workspace/web/org.eclipse.virgo.web.core/build/libs/org.eclipse.virgo.web.core-3.7.0.RELEASE.jar
  % Total    % Received % Xferd  Average Speed   Time    Time     Time  Current
                                 Dload  Upload   Total   Spent    Left  Speed

  0     0    0     0    0     0      0      0 --:--:-- --:--:-- --:--:--     0
100 25656    0     0  100 25656      0  25505  0:00:01  0:00:01 --:--:-- 25528
100 58761  100 33105  100 25656  31165  24153  0:00:01  0:00:01 --:--:-- 31172
:web:org.eclipse.virgo.web.dm:signing
|--> Signing Jar File: /jobs/genie.virgo/3.7.0.Milestones/workspace/web/org.eclipse.virgo.web.dm/build/libs/org.eclipse.virgo.web.dm-3.7.0.RELEASE.jar
  % Total    % Received % Xferd  Average Speed   Time    Time     Time  Current
                                 Dload  Upload   Total   Spent    Left  Speed

  0     0    0     0    0     0      0      0 --:--:-- --:--:-- --:--:--     0
100  5421    0     0  100  5421      0   5389  0:00:01  0:00:01 --:--:--  5394
100 16454  100 11033  100  5421   8867   4357  0:00:01  0:00:01 --:--:--  8868
:web:org.eclipse.virgo.web.enterprise.appdeployer:signing
|--> Signing Jar File: /jobs/genie.virgo/3.7.0.Milestones/workspace/web/org.eclipse.virgo.web.enterprise.appdeployer/build/libs/org.eclipse.virgo.web.enterprise.appdeployer-3.7.0.RELEASE.jar
  % Total    % Received % Xferd  Average Speed   Time    Time     Time  Current
                                 Dload  Upload   Total   Spent    Left  Speed

  0     0    0     0    0     0      0      0 --:--:-- --:--:-- --:--:--     0
 44 64256    0     0  100 28819      0  29375 --:--:-- --:--:-- --:--:-- 29377
100 64256  100 35437  100 28819  36078  29340 --:--:-- --:--:-- --:--:-- 36049
:web:org.eclipse.virgo.web.enterprise.applistener:signing
|--> Signing Jar File: /jobs/genie.virgo/3.7.0.Milestones/workspace/web/org.eclipse.virgo.web.enterprise.applistener/build/libs/org.eclipse.virgo.web.enterprise.applistener-3.7.0.RELEASE.jar
  % Total    % Received % Xferd  Average Speed   Time    Time     Time  Current
                                 Dload  Upload   Total   Spent    Left  Speed

  0     0    0     0    0     0      0      0 --:--:-- --:--:-- --:--:--     0
100  6285    0     0  100  6285      0   6248  0:00:01  0:00:01 --:--:--  6253
 34 18440    0     0  100  6285      0   4452  0:00:01  0:00:01 --:--:--  4451
100 18440  100 12155  100  6285   8608   4451  0:00:01  0:00:01 --:--:--  8608
:web:org.eclipse.virgo.web.enterprise.catalina.fragment.webbeans:signing
|--> Signing Jar File: /jobs/genie.virgo/3.7.0.Milestones/workspace/web/org.eclipse.virgo.web.enterprise.catalina.fragment.webbeans/build/libs/org.eclipse.virgo.web.enterprise.catalina.fragment.webbeans-3.7.0.RELEASE.jar
  % Total    % Received % Xferd  Average Speed   Time    Time     Time  Current
                                 Dload  Upload   Total   Spent    Left  Speed

  0     0    0     0    0     0      0      0 --:--:-- --:--:-- --:--:--     0
 18  8498    0     0  100  1546      0   1569 --:--:-- --:--:-- --:--:--  1569
100  8498  100  6952  100  1546   7052   1568 --:--:-- --:--:-- --:--:--  7050
:web:org.eclipse.virgo.web.enterprise.javax.persistence.extension:signing
|--> Signing Jar File: /jobs/genie.virgo/3.7.0.Milestones/workspace/web/org.eclipse.virgo.web.enterprise.javax.persistence.extension/build/libs/org.eclipse.virgo.web.enterprise.javax.persistence.extension-3.7.0.RELEASE.jar
  % Total    % Received % Xferd  Average Speed   Time    Time     Time  Current
                                 Dload  Upload   Total   Spent    Left  Speed

  0     0    0     0    0     0      0      0 --:--:-- --:--:-- --:--:--     0
100  9861    0     0  100  9861      0   9796  0:00:01  0:00:01 --:--:--  9802
100 25796  100 15935  100  9861  13977   8649  0:00:01  0:00:01 --:--:-- 13990
:web:org.eclipse.virgo.web.enterprise.javax.persistence.provider.initializer:signing
|--> Signing Jar File: /jobs/genie.virgo/3.7.0.Milestones/workspace/web/org.eclipse.virgo.web.enterprise.javax.persistence.provider.initializer/build/libs/org.eclipse.virgo.web.enterprise.javax.persistence.provider.initializer-3.7.0.RELEASE.jar
  % Total    % Received % Xferd  Average Speed   Time    Time     Time  Current
                                 Dload  Upload   Total   Spent    Left  Speed

  0     0    0     0    0     0      0      0 --:--:-- --:--:-- --:--:--     0
100  4028    0     0  100  4028      0   4000  0:00:01  0:00:01 --:--:--  4003
100 13800  100  9772  100  4028   8433   3476  0:00:01  0:00:01 --:--:--  8438
:web:org.eclipse.virgo.web.enterprise.jsf.support:signing
|--> Signing Jar File: /jobs/genie.virgo/3.7.0.Milestones/workspace/web/org.eclipse.virgo.web.enterprise.jsf.support/build/libs/org.eclipse.virgo.web.enterprise.jsf.support-3.7.0.RELEASE.jar
  % Total    % Received % Xferd  Average Speed   Time    Time     Time  Current
                                 Dload  Upload   Total   Spent    Left  Speed

  0     0    0     0    0     0      0      0 --:--:-- --:--:-- --:--:--     0
 35 20329    0     0  100  7297      0   7544 --:--:-- --:--:-- --:--:--  7538
100 20329  100 13032  100  7297  13465   7539 --:--:-- --:--:-- --:--:-- 13462
:web:org.eclipse.virgo.web.enterprise.openejb.fragment.bval:signing
|--> Signing Jar File: /jobs/genie.virgo/3.7.0.Milestones/workspace/web/org.eclipse.virgo.web.enterprise.openejb.fragment.bval/build/libs/org.eclipse.virgo.web.enterprise.openejb.fragment.bval-3.7.0.RELEASE.jar
  % Total    % Received % Xferd  Average Speed   Time    Time     Time  Current
                                 Dload  Upload   Total   Spent    Left  Speed

  0     0    0     0    0     0      0      0 --:--:-- --:--:-- --:--:--     0
100  1879    0     0  100  1879      0   1866  0:00:01  0:00:01 --:--:--  1867
100  9363  100  7484  100  1879   6501   1632  0:00:01  0:00:01 --:--:--  6507
:web:org.eclipse.virgo.web.enterprise.openejb.fragment.jotm:signing
|--> Signing Jar File: /jobs/genie.virgo/3.7.0.Milestones/workspace/web/org.eclipse.virgo.web.enterprise.openejb.fragment.jotm/build/libs/org.eclipse.virgo.web.enterprise.openejb.fragment.jotm-3.7.0.RELEASE.jar
  % Total    % Received % Xferd  Average Speed   Time    Time     Time  Current
                                 Dload  Upload   Total   Spent    Left  Speed

  0     0    0     0    0     0      0      0 --:--:-- --:--:-- --:--:--     0
 28 13673    0     0  100  3900      0   4178 --:--:-- --:--:-- --:--:--  4175
100 13673  100  9773  100  3900  10463   4175 --:--:-- --:--:-- --:--:-- 10463
:web:org.eclipse.virgo.web.enterprise.openejb.fragment.jpa:signing
|--> Signing Jar File: /jobs/genie.virgo/3.7.0.Milestones/workspace/web/org.eclipse.virgo.web.enterprise.openejb.fragment.jpa/build/libs/org.eclipse.virgo.web.enterprise.openejb.fragment.jpa-3.7.0.RELEASE.jar
  % Total    % Received % Xferd  Average Speed   Time    Time     Time  Current
                                 Dload  Upload   Total   Spent    Left  Speed

  0     0    0     0    0     0      0      0 --:--:-- --:--:-- --:--:--     0
100  1542    0     0  100  1542      0   1531  0:00:01  0:00:01 --:--:--  1532
100  8498  100  6956  100  1542   5432   1204  0:00:01  0:00:01 --:--:--  5434
:web:org.eclipse.virgo.web.enterprise.openejb.fragment.webbeans:signing
|--> Signing Jar File: /jobs/genie.virgo/3.7.0.Milestones/workspace/web/org.eclipse.virgo.web.enterprise.openejb.fragment.webbeans/build/libs/org.eclipse.virgo.web.enterprise.openejb.fragment.webbeans-3.7.0.RELEASE.jar
  % Total    % Received % Xferd  Average Speed   Time    Time     Time  Current
                                 Dload  Upload   Total   Spent    Left  Speed

  0     0    0     0    0     0      0      0 --:--:-- --:--:-- --:--:--     0
 20  9546    0     0  100  1971      0   2036 --:--:-- --:--:-- --:--:--  2036
100  9546  100  7575  100  1971   7821   2035 --:--:-- --:--:-- --:--:--  7817
:web:org.eclipse.virgo.web.enterprise.openejb.initialiser:signing
|--> Signing Jar File: /jobs/genie.virgo/3.7.0.Milestones/workspace/web/org.eclipse.virgo.web.enterprise.openejb.initialiser/build/libs/org.eclipse.virgo.web.enterprise.openejb.initialiser-3.7.0.RELEASE.jar
  % Total    % Received % Xferd  Average Speed   Time    Time     Time  Current
                                 Dload  Upload   Total   Spent    Left  Speed

  0     0    0     0    0     0      0      0 --:--:-- --:--:-- --:--:--     0
 37 24817    0     0  100  9306      0   9828 --:--:-- --:--:-- --:--:--  9826
100 24817  100 15511  100  9306  16370   9821 --:--:-- --:--:-- --:--:-- 16361
:web:org.eclipse.virgo.web.enterprise.openejb.jpa.integration:signing
|--> Signing Jar File: /jobs/genie.virgo/3.7.0.Milestones/workspace/web/org.eclipse.virgo.web.enterprise.openejb.jpa.integration/build/libs/org.eclipse.virgo.web.enterprise.openejb.jpa.integration-3.7.0.RELEASE.jar
  % Total    % Received % Xferd  Average Speed   Time    Time     Time  Current
                                 Dload  Upload   Total   Spent    Left  Speed

  0     0    0     0    0     0      0      0 --:--:-- --:--:-- --:--:--     0
100  5892    0     0  100  5892      0   5857  0:00:01  0:00:01 --:--:--  5862
100 17789  100 11897  100  5892  10291   5096  0:00:01  0:00:01 --:--:-- 10300
:web:org.eclipse.virgo.web.enterprise.openejb.tomcat.factory:signing
|--> Signing Jar File: /jobs/genie.virgo/3.7.0.Milestones/workspace/web/org.eclipse.virgo.web.enterprise.openejb.tomcat.factory/build/libs/org.eclipse.virgo.web.enterprise.openejb.tomcat.factory-3.7.0.RELEASE.jar
  % Total    % Received % Xferd  Average Speed   Time    Time     Time  Current
                                 Dload  Upload   Total   Spent    Left  Speed

  0     0    0     0    0     0      0      0 --:--:-- --:--:-- --:--:--     0
100  4425    0     0  100  4425      0  21619 --:--:-- --:--:-- --:--:-- 21585
100 14751  100 10326  100  4425   8917   3821  0:00:01  0:00:01 --:--:--  8924
:web:org.eclipse.virgo.web.enterprise.openwebbeans.initialiser:signing
|--> Signing Jar File: /jobs/genie.virgo/3.7.0.Milestones/workspace/web/org.eclipse.virgo.web.enterprise.openwebbeans.initialiser/build/libs/org.eclipse.virgo.web.enterprise.openwebbeans.initialiser-3.7.0.RELEASE.jar
  % Total    % Received % Xferd  Average Speed   Time    Time     Time  Current
                                 Dload  Upload   Total   Spent    Left  Speed

  0     0    0     0    0     0      0      0 --:--:-- --:--:-- --:--:--     0
100 11400    0     0  100 11400      0  55594 --:--:-- --:--:-- --:--:-- 55609
 39 29044    0     0  100 11400      0   9358  0:00:01  0:00:01 --:--:--  9351
100 29044  100 17644  100 11400  14477   9354  0:00:01  0:00:01 --:--:-- 14474
:web:org.eclipse.virgo.web.enterprise.persistence.openejb.classloading.hook:signing
|--> Signing Jar File: /jobs/genie.virgo/3.7.0.Milestones/workspace/web/org.eclipse.virgo.web.enterprise.persistence.openejb.classloading.hook/build/libs/org.eclipse.virgo.web.enterprise.persistence.openejb.classloading.hook-3.7.0.RELEASE.jar
  % Total    % Received % Xferd  Average Speed   Time    Time     Time  Current
                                 Dload  Upload   Total   Spent    Left  Speed

  0     0    0     0    0     0      0      0 --:--:-- --:--:-- --:--:--     0
100  8449    0     0  100  8449      0   8394  0:00:01  0:00:01 --:--:--  8398
100 23028  100 14579  100  8449  13600   7881  0:00:01  0:00:01 --:--:-- 13612
:web:org.eclipse.virgo.web.enterprise.security:signing
|--> Signing Jar File: /jobs/genie.virgo/3.7.0.Milestones/workspace/web/org.eclipse.virgo.web.enterprise.security/build/libs/org.eclipse.virgo.web.enterprise.security-3.7.0.RELEASE.jar
  % Total    % Received % Xferd  Average Speed   Time    Time     Time  Current
                                 Dload  Upload   Total   Spent    Left  Speed

  0     0    0     0    0     0      0      0 --:--:-- --:--:-- --:--:--     0
100 10044    0     0  100 10044      0   9985  0:00:01  0:00:01 --:--:--  9994
100 26405  100 16361  100 10044  15922   9774  0:00:01  0:00:01 --:--:-- 15930
:web:org.eclipse.virgo.web.enterprise.security.openejb.classloading.hook:signing
|--> Signing Jar File: /jobs/genie.virgo/3.7.0.Milestones/workspace/web/org.eclipse.virgo.web.enterprise.security.openejb.classloading.hook/build/libs/org.eclipse.virgo.web.enterprise.security.openejb.classloading.hook-3.7.0.RELEASE.jar
  % Total    % Received % Xferd  Average Speed   Time    Time     Time  Current
                                 Dload  Upload   Total   Spent    Left  Speed

  0     0    0     0    0     0      0      0 --:--:-- --:--:-- --:--:--     0
 31 15747    0     0  100  4914      0   5113 --:--:-- --:--:-- --:--:--  5113
100 15747  100 10833  100  4914  11267   5111 --:--:-- --:--:-- --:--:-- 11260
:web:org.eclipse.virgo.web.enterprise.security.valve:signing
|--> Signing Jar File: /jobs/genie.virgo/3.7.0.Milestones/workspace/web/org.eclipse.virgo.web.enterprise.security.valve/build/libs/org.eclipse.virgo.web.enterprise.security.valve-3.7.0.RELEASE.jar
  % Total    % Received % Xferd  Average Speed   Time    Time     Time  Current
                                 Dload  Upload   Total   Spent    Left  Speed

  0     0    0     0    0     0      0      0 --:--:-- --:--:-- --:--:--     0
100  3844    0     0  100  3844      0   3821  0:00:01  0:00:01 --:--:--  3824
100  3844    0     0  100  3844      0   1915  0:00:02  0:00:02 --:--:--  1915
100 13429  100  9585  100  3844   4445   1782  0:00:02  0:00:02 --:--:--  4445
:web:org.eclipse.virgo.web.enterprise.services.accessor:signing
|--> Signing Jar File: /jobs/genie.virgo/3.7.0.Milestones/workspace/web/org.eclipse.virgo.web.enterprise.services.accessor/build/libs/org.eclipse.virgo.web.enterprise.services.accessor-3.7.0.RELEASE.jar
  % Total    % Received % Xferd  Average Speed   Time    Time     Time  Current
                                 Dload  Upload   Total   Spent    Left  Speed

  0     0    0     0    0     0      0      0 --:--:-- --:--:-- --:--:--     0
100 32127    0     0  100 32127      0  31934  0:00:01  0:00:01 --:--:-- 31967
100 71253  100 39126  100 32127  34088  27990  0:00:01  0:00:01 --:--:-- 34111
:web:org.eclipse.virgo.web.servlet.adapter:signing
|--> Signing Jar File: /jobs/genie.virgo/3.7.0.Milestones/workspace/web/org.eclipse.virgo.web.servlet.adapter/build/libs/org.eclipse.virgo.web.servlet.adapter-3.7.0.RELEASE.jar
  % Total    % Received % Xferd  Average Speed   Time    Time     Time  Current
                                 Dload  Upload   Total   Spent    Left  Speed

  0     0    0     0    0     0      0      0 --:--:-- --:--:-- --:--:--     0
100  1501    0     0  100  1501      0   1490  0:00:01  0:00:01 --:--:--  1492
 17  8434    0     0  100  1501      0   1013  0:00:01  0:00:01 --:--:--  1013
100  8434  100  6933  100  1501   4677   1012  0:00:01  0:00:01 --:--:--  4678
:web:org.eclipse.virgo.web.spring.integration:signing
|--> Signing Jar File: /jobs/genie.virgo/3.7.0.Milestones/workspace/web/org.eclipse.virgo.web.spring.integration/build/libs/org.eclipse.virgo.web.spring.integration-3.7.0.RELEASE.jar
  % Total    % Received % Xferd  Average Speed   Time    Time     Time  Current
                                 Dload  Upload   Total   Spent    Left  Speed

  0     0    0     0    0     0      0      0 --:--:-- --:--:-- --:--:--     0
100  1469    0     0  100  1469      0   1459  0:00:01  0:00:01 --:--:--  1460
100  8365  100  6896  100  1469   5474   1166  0:00:01  0:00:01 --:--:--  5477
:web:org.eclipse.virgo.web.tomcat.support:signing
|--> Signing Jar File: /jobs/genie.virgo/3.7.0.Milestones/workspace/web/org.eclipse.virgo.web.tomcat.support/build/libs/org.eclipse.virgo.web.tomcat.support-3.7.0.RELEASE.jar
  % Total    % Received % Xferd  Average Speed   Time    Time     Time  Current
                                 Dload  Upload   Total   Spent    Left  Speed

  0     0    0     0    0     0      0      0 --:--:-- --:--:-- --:--:--     0
100 13926    0     0  100 13926      0  13840  0:00:01  0:00:01 --:--:-- 13842
100 34603  100 20677  100 13926  19833  13358  0:00:01  0:00:01 --:--:-- 19843
:web:org.eclipse.virgo.web.war.deployer:signing
|--> Signing Jar File: /jobs/genie.virgo/3.7.0.Milestones/workspace/web/org.eclipse.virgo.web.war.deployer/build/libs/org.eclipse.virgo.web.war.deployer-3.7.0.RELEASE.jar
  % Total    % Received % Xferd  Average Speed   Time    Time     Time  Current
                                 Dload  Upload   Total   Spent    Left  Speed

  0     0    0     0    0     0      0      0 --:--:-- --:--:-- --:--:--     0
100 23316    0     0  100 23316      0  23178  0:00:01  0:00:01 --:--:-- 23200
100 53046  100 29730  100 23316  24311  19066  0:00:01  0:00:01 --:--:-- 24328
:org.eclipse.virgo.site:uploadArchives
:apps:org.eclipse.virgo.apps.repository.core:uploadArchives
:apps:org.eclipse.virgo.apps.repository.web:uploadArchives
:apps:org.eclipse.virgo.apps.splash:uploadArchives
:kernel:org.eclipse.virgo.kernel.agent.dm:uploadArchives
:kernel:org.eclipse.virgo.kernel.artifact:uploadArchives
:kernel:org.eclipse.virgo.kernel.deployer:uploadArchives
:kernel:org.eclipse.virgo.kernel.deployer.dm:uploadArchives
:kernel:org.eclipse.virgo.kernel.dmfragment:uploadArchives
:kernel:org.eclipse.virgo.kernel.equinox.extensions:uploadArchives
:kernel:org.eclipse.virgo.kernel.kerneldmfragment:uploadArchives
:kernel:org.eclipse.virgo.kernel.model:uploadArchives
:kernel:org.eclipse.virgo.kernel.osgi:uploadArchives
:kernel:org.eclipse.virgo.kernel.services:uploadArchives
:kernel:org.eclipse.virgo.kernel.stubs:uploadArchives
:kernel:org.eclipse.virgo.kernel.userregion:uploadArchives
:kernel:org.eclipse.virgo.kernel.userregionfactory:uploadArchives
:kernel:org.eclipse.virgo.management.console:uploadArchives
:kernel:org.eclipse.virgo.management.fragment:uploadArchives
:kernel:org.eclipse.virgo.shell.command:uploadArchives
:medic:org.eclipse.virgo.medic:uploadArchives
:medic:org.eclipse.virgo.medic.core:uploadArchives
:medic:org.eclipse.virgo.medic.logbackclassicfragment:uploadArchives
:medic:org.eclipse.virgo.medic.logbackcorefragment:uploadArchives
:medic:org.eclipse.virgo.medic.test:uploadArchives
:nano:org.eclipse.virgo.nano.authentication:uploadArchives
:nano:org.eclipse.virgo.nano.core:uploadArchives
:nano:org.eclipse.virgo.nano.deployer:uploadArchives
:nano:org.eclipse.virgo.nano.deployer.api:uploadArchives
:nano:org.eclipse.virgo.nano.deployer.hot:uploadArchives
:nano:org.eclipse.virgo.nano.management:uploadArchives
:nano:org.eclipse.virgo.nano.management.controller:uploadArchives
:nano:org.eclipse.virgo.nano.services.concurrent:uploadArchives
:nano:org.eclipse.virgo.nano.services.ds:uploadArchives
:nano:org.eclipse.virgo.nano.shutdown:uploadArchives
:org.eclipse.virgo.site:org.eclipse.equinox.http.jetty:uploadArchives
:org.eclipse.virgo.site:org.eclipse.equinox.regions:uploadArchives
:org.eclipse.virgo.site:org.eclipse.gemini.web:uploadArchives
:org.eclipse.virgo.site:org.eclipse.rap:uploadArchives
:org.eclipse.virgo.site:org.eclipse.virgo.core:uploadArchives
:org.eclipse.virgo.site:org.eclipse.virgo.ds:uploadArchives
:org.eclipse.virgo.site:org.eclipse.virgo.enterprise:uploadArchives
:org.eclipse.virgo.site:org.eclipse.virgo.kernel:uploadArchives
:org.eclipse.virgo.site:org.eclipse.virgo.kernel.springintegration:uploadArchives
:org.eclipse.virgo.site:org.eclipse.virgo.management:uploadArchives
:org.eclipse.virgo.site:org.eclipse.virgo.medic:uploadArchives
:org.eclipse.virgo.site:org.eclipse.virgo.nano.deployer:uploadArchives
:org.eclipse.virgo.site:org.eclipse.virgo.nano.mbeans:uploadArchives
:org.eclipse.virgo.site:org.eclipse.virgo.nano.mbeans.controller:uploadArchives
:org.eclipse.virgo.site:org.eclipse.virgo.nano.war.deployer:uploadArchives
:org.eclipse.virgo.site:org.eclipse.virgo.p2.provisioning:uploadArchives
:org.eclipse.virgo.site:org.eclipse.virgo.services.concurrent:uploadArchives
:org.eclipse.virgo.site:org.eclipse.virgo.services.ds:uploadArchives
:org.eclipse.virgo.site:org.eclipse.virgo.shell:uploadArchives
:org.eclipse.virgo.site:org.eclipse.virgo.simpleconfigurator:uploadArchives
:org.eclipse.virgo.site:org.eclipse.virgo.springdm:uploadArchives
:org.eclipse.virgo.site:org.eclipse.virgo.tools:uploadArchives
:org.eclipse.virgo.site:org.eclipse.virgo.webconsole.deps:uploadArchives
:packaging:jetty-server:uploadArchives FAILED
:packaging:kernel:uploadArchives FAILED
:packaging:nano:uploadArchives FAILED
:packaging:tomcat-server:uploadArchives FAILED
:repository:org.eclipse.virgo.repository:uploadArchives
:test:org.eclipse.virgo.test.framework:uploadArchives
:test:org.eclipse.virgo.test.launcher:uploadArchives
:test:org.eclipse.virgo.test.stubs:uploadArchives
:test:org.eclipse.virgo.test.tools:uploadArchives
:util:org.eclipse.virgo.util.common:uploadArchives
:util:org.eclipse.virgo.util.env:uploadArchives
:util:org.eclipse.virgo.util.integrationtest:uploadArchives
:util:org.eclipse.virgo.util.io:uploadArchives
:util:org.eclipse.virgo.util.jmx:uploadArchives
:util:org.eclipse.virgo.util.math:uploadArchives
:util:org.eclipse.virgo.util.osgi:uploadArchives
:util:org.eclipse.virgo.util.osgi.manifest:uploadArchives
:util:org.eclipse.virgo.util.parser.launcher:uploadArchives
:util:org.eclipse.virgo.util.parser.manifest:uploadArchives
:web:org.eclipse.virgo.web.core:uploadArchives
:web:org.eclipse.virgo.web.dm:uploadArchives
:web:org.eclipse.virgo.web.enterprise.appdeployer:uploadArchives
:web:org.eclipse.virgo.web.enterprise.applistener:uploadArchives
:web:org.eclipse.virgo.web.enterprise.catalina.fragment.webbeans:uploadArchives
:web:org.eclipse.virgo.web.enterprise.javax.persistence.extension:uploadArchives
:web:org.eclipse.virgo.web.enterprise.javax.persistence.provider.initializer:uploadArchives
:web:org.eclipse.virgo.web.enterprise.jsf.support:uploadArchives
:web:org.eclipse.virgo.web.enterprise.openejb.fragment.bval:uploadArchives
:web:org.eclipse.virgo.web.enterprise.openejb.fragment.jotm:uploadArchives
:web:org.eclipse.virgo.web.enterprise.openejb.fragment.jpa:uploadArchives
:web:org.eclipse.virgo.web.enterprise.openejb.fragment.webbeans:uploadArchives
:web:org.eclipse.virgo.web.enterprise.openejb.initialiser:uploadArchives
:web:org.eclipse.virgo.web.enterprise.openejb.jpa.integration:uploadArchives
:web:org.eclipse.virgo.web.enterprise.openejb.tomcat.factory:uploadArchives
:web:org.eclipse.virgo.web.enterprise.openwebbeans.initialiser:uploadArchives
:web:org.eclipse.virgo.web.enterprise.persistence.openejb.classloading.hook:uploadArchives
:web:org.eclipse.virgo.web.enterprise.security:uploadArchives
:web:org.eclipse.virgo.web.enterprise.security.openejb.classloading.hook:uploadArchives
:web:org.eclipse.virgo.web.enterprise.security.valve:uploadArchives
:web:org.eclipse.virgo.web.enterprise.services.accessor:uploadArchives
:web:org.eclipse.virgo.web.servlet.adapter:uploadArchives
:web:org.eclipse.virgo.web.spring.integration:uploadArchives
:web:org.eclipse.virgo.web.tomcat.support:uploadArchives
:web:org.eclipse.virgo.web.war.deployer:uploadArchives
:packaging:jetty-server:org.eclipse.virgo.jetty.smoketest:uploadArchives
:packaging:kernel:org.eclipse.virgo.kernel.smoketest:uploadArchives
:packaging:nano:org.eclipse.virgo.nano.smoketest:uploadArchives
:packaging:tomcat-server:org.eclipse.virgo.tomcat.smoketest:uploadArchives
:packaging:jetty-server:installDist
:packaging:kernel:installDist
:packaging:nano:installDist
:packaging:tomcat-server:installDist
:packaging:nano:installFullDist
:packaging:nano:installRapDist
:org.eclipse.virgo.site:zipUpdateSite

FAILURE: Build completed with 4 failures.

1: Task failed with an exception.
-----------
* What went wrong:
Execution failed for task ':packaging:jetty-server:uploadArchives'.
> Could not publish configuration 'archives'
   > Cannot publish artifact 'virgo-jetty-server.tar (workspace.packaging:jetty-server:3.7.0.RELEASE)' (/jobs/genie.virgo/3.7.0.Milestones/workspace/packaging/jetty-server/build/distributions/virgo-jetty-server-3.7.0.RELEASE.tar) as it does not exist.

* Try:
Run with --info or --debug option to get more log output.

* Exception is:
org.gradle.api.tasks.TaskExecutionException: Execution failed for task ':packaging:jetty-server:uploadArchives'.
	at org.gradle.api.internal.tasks.execution.ExecuteActionsTaskExecuter.executeActions(ExecuteActionsTaskExecuter.java:69)
	at org.gradle.api.internal.tasks.execution.ExecuteActionsTaskExecuter.execute(ExecuteActionsTaskExecuter.java:46)
	at org.gradle.api.internal.tasks.execution.PostExecutionAnalysisTaskExecuter.execute(PostExecutionAnalysisTaskExecuter.java:35)
	at org.gradle.api.internal.tasks.execution.SkipUpToDateTaskExecuter.execute(SkipUpToDateTaskExecuter.java:64)
	at org.gradle.api.internal.tasks.execution.ValidatingTaskExecuter.execute(ValidatingTaskExecuter.java:58)
	at org.gradle.api.internal.tasks.execution.SkipEmptySourceFilesTaskExecuter.execute(SkipEmptySourceFilesTaskExecuter.java:52)
	at org.gradle.api.internal.tasks.execution.SkipTaskWithNoActionsExecuter.execute(SkipTaskWithNoActionsExecuter.java:52)
	at org.gradle.api.internal.tasks.execution.SkipOnlyIfTaskExecuter.execute(SkipOnlyIfTaskExecuter.java:53)
	at org.gradle.api.internal.tasks.execution.ExecuteAtMostOnceTaskExecuter.execute(ExecuteAtMostOnceTaskExecuter.java:43)
	at org.gradle.execution.taskgraph.DefaultTaskGraphExecuter$EventFiringTaskWorker.execute(DefaultTaskGraphExecuter.java:233)
	at org.gradle.execution.taskgraph.DefaultTaskGraphExecuter$EventFiringTaskWorker.execute(DefaultTaskGraphExecuter.java:215)
	at org.gradle.execution.taskgraph.AbstractTaskPlanExecutor$TaskExecutorWorker.processTask(AbstractTaskPlanExecutor.java:74)
	at org.gradle.execution.taskgraph.AbstractTaskPlanExecutor$TaskExecutorWorker.run(AbstractTaskPlanExecutor.java:55)
	at org.gradle.execution.taskgraph.DefaultTaskPlanExecutor.process(DefaultTaskPlanExecutor.java:32)
	at org.gradle.execution.taskgraph.DefaultTaskGraphExecuter.execute(DefaultTaskGraphExecuter.java:113)
	at org.gradle.execution.SelectedTaskExecutionAction.execute(SelectedTaskExecutionAction.java:37)
	at org.gradle.execution.DefaultBuildExecuter.execute(DefaultBuildExecuter.java:37)
	at org.gradle.execution.DefaultBuildExecuter.access$000(DefaultBuildExecuter.java:23)
	at org.gradle.execution.DefaultBuildExecuter$1.proceed(DefaultBuildExecuter.java:43)
	at org.gradle.execution.DryRunBuildExecutionAction.execute(DryRunBuildExecutionAction.java:32)
	at org.gradle.execution.DefaultBuildExecuter.execute(DefaultBuildExecuter.java:37)
	at org.gradle.execution.DefaultBuildExecuter.execute(DefaultBuildExecuter.java:30)
	at org.gradle.initialization.DefaultGradleLauncher$4.run(DefaultGradleLauncher.java:186)
	at org.gradle.internal.Factories$1.create(Factories.java:22)
	at org.gradle.internal.progress.DefaultBuildOperationExecutor.run(DefaultBuildOperationExecutor.java:91)
	at org.gradle.internal.progress.DefaultBuildOperationExecutor.run(DefaultBuildOperationExecutor.java:53)
	at org.gradle.initialization.DefaultGradleLauncher.doBuildStages(DefaultGradleLauncher.java:183)
	at org.gradle.initialization.DefaultGradleLauncher.access$200(DefaultGradleLauncher.java:33)
	at org.gradle.initialization.DefaultGradleLauncher$1.create(DefaultGradleLauncher.java:112)
	at org.gradle.initialization.DefaultGradleLauncher$1.create(DefaultGradleLauncher.java:106)
	at org.gradle.internal.progress.DefaultBuildOperationExecutor.run(DefaultBuildOperationExecutor.java:91)
	at org.gradle.internal.progress.DefaultBuildOperationExecutor.run(DefaultBuildOperationExecutor.java:63)
	at org.gradle.initialization.DefaultGradleLauncher.doBuild(DefaultGradleLauncher.java:106)
	at org.gradle.initialization.DefaultGradleLauncher.run(DefaultGradleLauncher.java:92)
	at org.gradle.launcher.exec.GradleBuildController.run(GradleBuildController.java:66)
	at org.gradle.tooling.internal.provider.ExecuteBuildActionRunner.run(ExecuteBuildActionRunner.java:28)
	at org.gradle.launcher.exec.ChainingBuildActionRunner.run(ChainingBuildActionRunner.java:35)
	at org.gradle.launcher.exec.InProcessBuildActionExecuter.execute(InProcessBuildActionExecuter.java:41)
	at org.gradle.launcher.exec.InProcessBuildActionExecuter.execute(InProcessBuildActionExecuter.java:26)
	at org.gradle.tooling.internal.provider.ContinuousBuildActionExecuter.execute(ContinuousBuildActionExecuter.java:79)
	at org.gradle.tooling.internal.provider.ContinuousBuildActionExecuter.execute(ContinuousBuildActionExecuter.java:51)
	at org.gradle.launcher.daemon.server.exec.ExecuteBuild.doBuild(ExecuteBuild.java:59)
	at org.gradle.launcher.daemon.server.exec.BuildCommandOnly.execute(BuildCommandOnly.java:36)
	at org.gradle.launcher.daemon.server.api.DaemonCommandExecution.proceed(DaemonCommandExecution.java:120)
	at org.gradle.launcher.daemon.server.exec.WatchForDisconnection.execute(WatchForDisconnection.java:47)
	at org.gradle.launcher.daemon.server.api.DaemonCommandExecution.proceed(DaemonCommandExecution.java:120)
	at org.gradle.launcher.daemon.server.exec.ResetDeprecationLogger.execute(ResetDeprecationLogger.java:26)
	at org.gradle.launcher.daemon.server.api.DaemonCommandExecution.proceed(DaemonCommandExecution.java:120)
	at org.gradle.launcher.daemon.server.exec.RequestStopIfSingleUsedDaemon.execute(RequestStopIfSingleUsedDaemon.java:34)
	at org.gradle.launcher.daemon.server.api.DaemonCommandExecution.proceed(DaemonCommandExecution.java:120)
	at org.gradle.launcher.daemon.server.exec.ForwardClientInput$2.call(ForwardClientInput.java:74)
	at org.gradle.launcher.daemon.server.exec.ForwardClientInput$2.call(ForwardClientInput.java:72)
	at org.gradle.util.Swapper.swap(Swapper.java:38)
	at org.gradle.launcher.daemon.server.exec.ForwardClientInput.execute(ForwardClientInput.java:72)
	at org.gradle.launcher.daemon.server.api.DaemonCommandExecution.proceed(DaemonCommandExecution.java:120)
	at org.gradle.launcher.daemon.server.exec.LogAndCheckHealth.execute(LogAndCheckHealth.java:55)
	at org.gradle.launcher.daemon.server.api.DaemonCommandExecution.proceed(DaemonCommandExecution.java:120)
	at org.gradle.launcher.daemon.server.exec.LogToClient.doBuild(LogToClient.java:60)
	at org.gradle.launcher.daemon.server.exec.BuildCommandOnly.execute(BuildCommandOnly.java:36)
	at org.gradle.launcher.daemon.server.api.DaemonCommandExecution.proceed(DaemonCommandExecution.java:120)
	at org.gradle.launcher.daemon.server.exec.EstablishBuildEnvironment.doBuild(EstablishBuildEnvironment.java:72)
	at org.gradle.launcher.daemon.server.exec.BuildCommandOnly.execute(BuildCommandOnly.java:36)
	at org.gradle.launcher.daemon.server.api.DaemonCommandExecution.proceed(DaemonCommandExecution.java:120)
	at org.gradle.launcher.daemon.server.exec.HintGCAfterBuild.execute(HintGCAfterBuild.java:44)
	at org.gradle.launcher.daemon.server.api.DaemonCommandExecution.proceed(DaemonCommandExecution.java:120)
	at org.gradle.launcher.daemon.server.exec.StartBuildOrRespondWithBusy$1.run(StartBuildOrRespondWithBusy.java:50)
	at org.gradle.launcher.daemon.server.DaemonStateCoordinator$1.run(DaemonStateCoordinator.java:293)
	at org.gradle.internal.concurrent.ExecutorPolicy$CatchAndRecordFailures.onExecute(ExecutorPolicy.java:54)
	at org.gradle.internal.concurrent.StoppableExecutorImpl$1.run(StoppableExecutorImpl.java:40)
Caused by: org.gradle.api.artifacts.PublishException: Could not publish configuration 'archives'
	at org.gradle.api.tasks.Upload.upload(Upload.java:66)
	at org.gradle.internal.reflect.JavaMethod.invoke(JavaMethod.java:75)
	at org.gradle.api.internal.project.taskfactory.DefaultTaskClassInfoStore$StandardTaskAction.doExecute(DefaultTaskClassInfoStore.java:136)
	at org.gradle.api.internal.project.taskfactory.DefaultTaskClassInfoStore$StandardTaskAction.execute(DefaultTaskClassInfoStore.java:129)
	at org.gradle.api.internal.project.taskfactory.DefaultTaskClassInfoStore$StandardTaskAction.execute(DefaultTaskClassInfoStore.java:118)
	at org.gradle.api.internal.AbstractTask$TaskActionWrapper.execute(AbstractTask.java:623)
	at org.gradle.api.internal.AbstractTask$TaskActionWrapper.execute(AbstractTask.java:606)
	at org.gradle.api.internal.tasks.execution.ExecuteActionsTaskExecuter.executeAction(ExecuteActionsTaskExecuter.java:80)
	at org.gradle.api.internal.tasks.execution.ExecuteActionsTaskExecuter.executeActions(ExecuteActionsTaskExecuter.java:61)
	... 68 more
Caused by: org.gradle.api.artifacts.PublishException: Cannot publish artifact 'virgo-jetty-server.tar (workspace.packaging:jetty-server:3.7.0.RELEASE)' (/jobs/genie.virgo/3.7.0.Milestones/workspace/packaging/jetty-server/build/distributions/virgo-jetty-server-3.7.0.RELEASE.tar) as it does not exist.
	at org.gradle.api.internal.artifacts.ivyservice.publisher.DefaultIvyDependencyPublisher.checkArtifactFileExists(DefaultIvyDependencyPublisher.java:64)
	at org.gradle.api.internal.artifacts.ivyservice.publisher.DefaultIvyDependencyPublisher.addPublishedArtifact(DefaultIvyDependencyPublisher.java:53)
	at org.gradle.api.internal.artifacts.ivyservice.publisher.DefaultIvyDependencyPublisher.publish(DefaultIvyDependencyPublisher.java:41)
	at org.gradle.api.internal.artifacts.ivyservice.publisher.IvyBackedArtifactPublisher.publish(IvyBackedArtifactPublisher.java:74)
	at org.gradle.api.internal.artifacts.ivyservice.IvyContextualArtifactPublisher$1.execute(IvyContextualArtifactPublisher.java:43)
	at org.gradle.api.internal.artifacts.ivyservice.IvyContextualArtifactPublisher$1.execute(IvyContextualArtifactPublisher.java:40)
	at org.gradle.internal.Transformers$4.transform(Transformers.java:169)
	at org.gradle.api.internal.artifacts.ivyservice.DefaultIvyContextManager.withIvy(DefaultIvyContextManager.java:61)
	at org.gradle.api.internal.artifacts.ivyservice.DefaultIvyContextManager.withIvy(DefaultIvyContextManager.java:39)
	at org.gradle.api.internal.artifacts.ivyservice.IvyContextualArtifactPublisher.publish(IvyContextualArtifactPublisher.java:40)
	at org.gradle.api.tasks.Upload.upload(Upload.java:64)
	... 76 more

==============================================================================

2: Task failed with an exception.
-----------
* What went wrong:
Execution failed for task ':packaging:kernel:uploadArchives'.
> Could not publish configuration 'archives'
   > Cannot publish artifact 'virgo-kernel.tar (workspace.packaging:kernel:3.7.0.RELEASE)' (/jobs/genie.virgo/3.7.0.Milestones/workspace/packaging/kernel/build/distributions/virgo-kernel-3.7.0.RELEASE.tar) as it does not exist.

* Try:
Run with --info or --debug option to get more log output.

* Exception is:
org.gradle.api.tasks.TaskExecutionException: Execution failed for task ':packaging:kernel:uploadArchives'.
	at org.gradle.api.internal.tasks.execution.ExecuteActionsTaskExecuter.executeActions(ExecuteActionsTaskExecuter.java:69)
	at org.gradle.api.internal.tasks.execution.ExecuteActionsTaskExecuter.execute(ExecuteActionsTaskExecuter.java:46)
	at org.gradle.api.internal.tasks.execution.PostExecutionAnalysisTaskExecuter.execute(PostExecutionAnalysisTaskExecuter.java:35)
	at org.gradle.api.internal.tasks.execution.SkipUpToDateTaskExecuter.execute(SkipUpToDateTaskExecuter.java:64)
	at org.gradle.api.internal.tasks.execution.ValidatingTaskExecuter.execute(ValidatingTaskExecuter.java:58)
	at org.gradle.api.internal.tasks.execution.SkipEmptySourceFilesTaskExecuter.execute(SkipEmptySourceFilesTaskExecuter.java:52)
	at org.gradle.api.internal.tasks.execution.SkipTaskWithNoActionsExecuter.execute(SkipTaskWithNoActionsExecuter.java:52)
	at org.gradle.api.internal.tasks.execution.SkipOnlyIfTaskExecuter.execute(SkipOnlyIfTaskExecuter.java:53)
	at org.gradle.api.internal.tasks.execution.ExecuteAtMostOnceTaskExecuter.execute(ExecuteAtMostOnceTaskExecuter.java:43)
	at org.gradle.execution.taskgraph.DefaultTaskGraphExecuter$EventFiringTaskWorker.execute(DefaultTaskGraphExecuter.java:233)
	at org.gradle.execution.taskgraph.DefaultTaskGraphExecuter$EventFiringTaskWorker.execute(DefaultTaskGraphExecuter.java:215)
	at org.gradle.execution.taskgraph.AbstractTaskPlanExecutor$TaskExecutorWorker.processTask(AbstractTaskPlanExecutor.java:74)
	at org.gradle.execution.taskgraph.AbstractTaskPlanExecutor$TaskExecutorWorker.run(AbstractTaskPlanExecutor.java:55)
	at org.gradle.execution.taskgraph.DefaultTaskPlanExecutor.process(DefaultTaskPlanExecutor.java:32)
	at org.gradle.execution.taskgraph.DefaultTaskGraphExecuter.execute(DefaultTaskGraphExecuter.java:113)
	at org.gradle.execution.SelectedTaskExecutionAction.execute(SelectedTaskExecutionAction.java:37)
	at org.gradle.execution.DefaultBuildExecuter.execute(DefaultBuildExecuter.java:37)
	at org.gradle.execution.DefaultBuildExecuter.access$000(DefaultBuildExecuter.java:23)
	at org.gradle.execution.DefaultBuildExecuter$1.proceed(DefaultBuildExecuter.java:43)
	at org.gradle.execution.DryRunBuildExecutionAction.execute(DryRunBuildExecutionAction.java:32)
	at org.gradle.execution.DefaultBuildExecuter.execute(DefaultBuildExecuter.java:37)
	at org.gradle.execution.DefaultBuildExecuter.execute(DefaultBuildExecuter.java:30)
	at org.gradle.initialization.DefaultGradleLauncher$4.run(DefaultGradleLauncher.java:186)
	at org.gradle.internal.Factories$1.create(Factories.java:22)
	at org.gradle.internal.progress.DefaultBuildOperationExecutor.run(DefaultBuildOperationExecutor.java:91)
	at org.gradle.internal.progress.DefaultBuildOperationExecutor.run(DefaultBuildOperationExecutor.java:53)
	at org.gradle.initialization.DefaultGradleLauncher.doBuildStages(DefaultGradleLauncher.java:183)
	at org.gradle.initialization.DefaultGradleLauncher.access$200(DefaultGradleLauncher.java:33)
	at org.gradle.initialization.DefaultGradleLauncher$1.create(DefaultGradleLauncher.java:112)
	at org.gradle.initialization.DefaultGradleLauncher$1.create(DefaultGradleLauncher.java:106)
	at org.gradle.internal.progress.DefaultBuildOperationExecutor.run(DefaultBuildOperationExecutor.java:91)
	at org.gradle.internal.progress.DefaultBuildOperationExecutor.run(DefaultBuildOperationExecutor.java:63)
	at org.gradle.initialization.DefaultGradleLauncher.doBuild(DefaultGradleLauncher.java:106)
	at org.gradle.initialization.DefaultGradleLauncher.run(DefaultGradleLauncher.java:92)
	at org.gradle.launcher.exec.GradleBuildController.run(GradleBuildController.java:66)
	at org.gradle.tooling.internal.provider.ExecuteBuildActionRunner.run(ExecuteBuildActionRunner.java:28)
	at org.gradle.launcher.exec.ChainingBuildActionRunner.run(ChainingBuildActionRunner.java:35)
	at org.gradle.launcher.exec.InProcessBuildActionExecuter.execute(InProcessBuildActionExecuter.java:41)
	at org.gradle.launcher.exec.InProcessBuildActionExecuter.execute(InProcessBuildActionExecuter.java:26)
	at org.gradle.tooling.internal.provider.ContinuousBuildActionExecuter.execute(ContinuousBuildActionExecuter.java:79)
	at org.gradle.tooling.internal.provider.ContinuousBuildActionExecuter.execute(ContinuousBuildActionExecuter.java:51)
	at org.gradle.launcher.daemon.server.exec.ExecuteBuild.doBuild(ExecuteBuild.java:59)
	at org.gradle.launcher.daemon.server.exec.BuildCommandOnly.execute(BuildCommandOnly.java:36)
	at org.gradle.launcher.daemon.server.api.DaemonCommandExecution.proceed(DaemonCommandExecution.java:120)
	at org.gradle.launcher.daemon.server.exec.WatchForDisconnection.execute(WatchForDisconnection.java:47)
	at org.gradle.launcher.daemon.server.api.DaemonCommandExecution.proceed(DaemonCommandExecution.java:120)
	at org.gradle.launcher.daemon.server.exec.ResetDeprecationLogger.execute(ResetDeprecationLogger.java:26)
	at org.gradle.launcher.daemon.server.api.DaemonCommandExecution.proceed(DaemonCommandExecution.java:120)
	at org.gradle.launcher.daemon.server.exec.RequestStopIfSingleUsedDaemon.execute(RequestStopIfSingleUsedDaemon.java:34)
	at org.gradle.launcher.daemon.server.api.DaemonCommandExecution.proceed(DaemonCommandExecution.java:120)
	at org.gradle.launcher.daemon.server.exec.ForwardClientInput$2.call(ForwardClientInput.java:74)
	at org.gradle.launcher.daemon.server.exec.ForwardClientInput$2.call(ForwardClientInput.java:72)
	at org.gradle.util.Swapper.swap(Swapper.java:38)
	at org.gradle.launcher.daemon.server.exec.ForwardClientInput.execute(ForwardClientInput.java:72)
	at org.gradle.launcher.daemon.server.api.DaemonCommandExecution.proceed(DaemonCommandExecution.java:120)
	at org.gradle.launcher.daemon.server.exec.LogAndCheckHealth.execute(LogAndCheckHealth.java:55)
	at org.gradle.launcher.daemon.server.api.DaemonCommandExecution.proceed(DaemonCommandExecution.java:120)
	at org.gradle.launcher.daemon.server.exec.LogToClient.doBuild(LogToClient.java:60)
	at org.gradle.launcher.daemon.server.exec.BuildCommandOnly.execute(BuildCommandOnly.java:36)
	at org.gradle.launcher.daemon.server.api.DaemonCommandExecution.proceed(DaemonCommandExecution.java:120)
	at org.gradle.launcher.daemon.server.exec.EstablishBuildEnvironment.doBuild(EstablishBuildEnvironment.java:72)
	at org.gradle.launcher.daemon.server.exec.BuildCommandOnly.execute(BuildCommandOnly.java:36)
	at org.gradle.launcher.daemon.server.api.DaemonCommandExecution.proceed(DaemonCommandExecution.java:120)
	at org.gradle.launcher.daemon.server.exec.HintGCAfterBuild.execute(HintGCAfterBuild.java:44)
	at org.gradle.launcher.daemon.server.api.DaemonCommandExecution.proceed(DaemonCommandExecution.java:120)
	at org.gradle.launcher.daemon.server.exec.StartBuildOrRespondWithBusy$1.run(StartBuildOrRespondWithBusy.java:50)
	at org.gradle.launcher.daemon.server.DaemonStateCoordinator$1.run(DaemonStateCoordinator.java:293)
	at org.gradle.internal.concurrent.ExecutorPolicy$CatchAndRecordFailures.onExecute(ExecutorPolicy.java:54)
	at org.gradle.internal.concurrent.StoppableExecutorImpl$1.run(StoppableExecutorImpl.java:40)
	at java.util.concurrent.ThreadPoolExecutor.runWorker(ThreadPoolExecutor.java:1142)
	at java.util.concurrent.ThreadPoolExecutor$Worker.run(ThreadPoolExecutor.java:617)
	at java.lang.Thread.run(Thread.java:745)
Caused by: org.gradle.api.artifacts.PublishException: Could not publish configuration 'archives'
	at org.gradle.api.tasks.Upload.upload(Upload.java:66)
	at sun.reflect.GeneratedMethodAccessor426.invoke(Unknown Source)
	at sun.reflect.DelegatingMethodAccessorImpl.invoke(DelegatingMethodAccessorImpl.java:43)
	at java.lang.reflect.Method.invoke(Method.java:498)
	at org.gradle.internal.reflect.JavaMethod.invoke(JavaMethod.java:75)
	at org.gradle.api.internal.project.taskfactory.DefaultTaskClassInfoStore$StandardTaskAction.doExecute(DefaultTaskClassInfoStore.java:136)
	at org.gradle.api.internal.project.taskfactory.DefaultTaskClassInfoStore$StandardTaskAction.execute(DefaultTaskClassInfoStore.java:129)
	at org.gradle.api.internal.project.taskfactory.DefaultTaskClassInfoStore$StandardTaskAction.execute(DefaultTaskClassInfoStore.java:118)
	at org.gradle.api.internal.AbstractTask$TaskActionWrapper.execute(AbstractTask.java:623)
	at org.gradle.api.internal.AbstractTask$TaskActionWrapper.execute(AbstractTask.java:606)
	at org.gradle.api.internal.tasks.execution.ExecuteActionsTaskExecuter.executeAction(ExecuteActionsTaskExecuter.java:80)
	at org.gradle.api.internal.tasks.execution.ExecuteActionsTaskExecuter.executeActions(ExecuteActionsTaskExecuter.java:61)
	... 71 more
Caused by: org.gradle.api.artifacts.PublishException: Cannot publish artifact 'virgo-kernel.tar (workspace.packaging:kernel:3.7.0.RELEASE)' (/jobs/genie.virgo/3.7.0.Milestones/workspace/packaging/kernel/build/distributions/virgo-kernel-3.7.0.RELEASE.tar) as it does not exist.
	at org.gradle.api.internal.artifacts.ivyservice.publisher.DefaultIvyDependencyPublisher.checkArtifactFileExists(DefaultIvyDependencyPublisher.java:64)
	at org.gradle.api.internal.artifacts.ivyservice.publisher.DefaultIvyDependencyPublisher.addPublishedArtifact(DefaultIvyDependencyPublisher.java:53)
	at org.gradle.api.internal.artifacts.ivyservice.publisher.DefaultIvyDependencyPublisher.publish(DefaultIvyDependencyPublisher.java:41)
	at org.gradle.api.internal.artifacts.ivyservice.publisher.IvyBackedArtifactPublisher.publish(IvyBackedArtifactPublisher.java:74)
	at org.gradle.api.internal.artifacts.ivyservice.IvyContextualArtifactPublisher$1.execute(IvyContextualArtifactPublisher.java:43)
	at org.gradle.api.internal.artifacts.ivyservice.IvyContextualArtifactPublisher$1.execute(IvyContextualArtifactPublisher.java:40)
	at org.gradle.internal.Transformers$4.transform(Transformers.java:169)
	at org.gradle.api.internal.artifacts.ivyservice.DefaultIvyContextManager.withIvy(DefaultIvyContextManager.java:61)
	at org.gradle.api.internal.artifacts.ivyservice.DefaultIvyContextManager.withIvy(DefaultIvyContextManager.java:39)
	at org.gradle.api.internal.artifacts.ivyservice.IvyContextualArtifactPublisher.publish(IvyContextualArtifactPublisher.java:40)
	at org.gradle.api.tasks.Upload.upload(Upload.java:64)
	... 82 more

==============================================================================

3: Task failed with an exception.
-----------
* What went wrong:
Execution failed for task ':packaging:nano:uploadArchives'.
> Could not publish configuration 'archives'
   > Cannot publish artifact 'virgo-nano.tar (workspace.packaging:nano:3.7.0.RELEASE)' (/jobs/genie.virgo/3.7.0.Milestones/workspace/packaging/nano/build/distributions/virgo-nano-3.7.0.RELEASE.tar) as it does not exist.

* Try:
Run with --info or --debug option to get more log output.

* Exception is:
org.gradle.api.tasks.TaskExecutionException: Execution failed for task ':packaging:nano:uploadArchives'.
	at org.gradle.api.internal.tasks.execution.ExecuteActionsTaskExecuter.executeActions(ExecuteActionsTaskExecuter.java:69)
	at org.gradle.api.internal.tasks.execution.ExecuteActionsTaskExecuter.execute(ExecuteActionsTaskExecuter.java:46)
	at org.gradle.api.internal.tasks.execution.PostExecutionAnalysisTaskExecuter.execute(PostExecutionAnalysisTaskExecuter.java:35)
	at org.gradle.api.internal.tasks.execution.SkipUpToDateTaskExecuter.execute(SkipUpToDateTaskExecuter.java:64)
	at org.gradle.api.internal.tasks.execution.ValidatingTaskExecuter.execute(ValidatingTaskExecuter.java:58)
	at org.gradle.api.internal.tasks.execution.SkipEmptySourceFilesTaskExecuter.execute(SkipEmptySourceFilesTaskExecuter.java:52)
	at org.gradle.api.internal.tasks.execution.SkipTaskWithNoActionsExecuter.execute(SkipTaskWithNoActionsExecuter.java:52)
	at org.gradle.api.internal.tasks.execution.SkipOnlyIfTaskExecuter.execute(SkipOnlyIfTaskExecuter.java:53)
	at org.gradle.api.internal.tasks.execution.ExecuteAtMostOnceTaskExecuter.execute(ExecuteAtMostOnceTaskExecuter.java:43)
	at org.gradle.execution.taskgraph.DefaultTaskGraphExecuter$EventFiringTaskWorker.execute(DefaultTaskGraphExecuter.java:233)
	at org.gradle.execution.taskgraph.DefaultTaskGraphExecuter$EventFiringTaskWorker.execute(DefaultTaskGraphExecuter.java:215)
	at org.gradle.execution.taskgraph.AbstractTaskPlanExecutor$TaskExecutorWorker.processTask(AbstractTaskPlanExecutor.java:74)
	at org.gradle.execution.taskgraph.AbstractTaskPlanExecutor$TaskExecutorWorker.run(AbstractTaskPlanExecutor.java:55)
	at org.gradle.execution.taskgraph.DefaultTaskPlanExecutor.process(DefaultTaskPlanExecutor.java:32)
	at org.gradle.execution.taskgraph.DefaultTaskGraphExecuter.execute(DefaultTaskGraphExecuter.java:113)
	at org.gradle.execution.SelectedTaskExecutionAction.execute(SelectedTaskExecutionAction.java:37)
	at org.gradle.execution.DefaultBuildExecuter.execute(DefaultBuildExecuter.java:37)
	at org.gradle.execution.DefaultBuildExecuter.access$000(DefaultBuildExecuter.java:23)
	at org.gradle.execution.DefaultBuildExecuter$1.proceed(DefaultBuildExecuter.java:43)
	at org.gradle.execution.DryRunBuildExecutionAction.execute(DryRunBuildExecutionAction.java:32)
	at org.gradle.execution.DefaultBuildExecuter.execute(DefaultBuildExecuter.java:37)
	at org.gradle.execution.DefaultBuildExecuter.execute(DefaultBuildExecuter.java:30)
	at org.gradle.initialization.DefaultGradleLauncher$4.run(DefaultGradleLauncher.java:186)
	at org.gradle.internal.Factories$1.create(Factories.java:22)
	at org.gradle.internal.progress.DefaultBuildOperationExecutor.run(DefaultBuildOperationExecutor.java:91)
	at org.gradle.internal.progress.DefaultBuildOperationExecutor.run(DefaultBuildOperationExecutor.java:53)
	at org.gradle.initialization.DefaultGradleLauncher.doBuildStages(DefaultGradleLauncher.java:183)
	at org.gradle.initialization.DefaultGradleLauncher.access$200(DefaultGradleLauncher.java:33)
	at org.gradle.initialization.DefaultGradleLauncher$1.create(DefaultGradleLauncher.java:112)
	at org.gradle.initialization.DefaultGradleLauncher$1.create(DefaultGradleLauncher.java:106)
	at org.gradle.internal.progress.DefaultBuildOperationExecutor.run(DefaultBuildOperationExecutor.java:91)
	at org.gradle.internal.progress.DefaultBuildOperationExecutor.run(DefaultBuildOperationExecutor.java:63)
	at org.gradle.initialization.DefaultGradleLauncher.doBuild(DefaultGradleLauncher.java:106)
	at org.gradle.initialization.DefaultGradleLauncher.run(DefaultGradleLauncher.java:92)
	at org.gradle.launcher.exec.GradleBuildController.run(GradleBuildController.java:66)
	at org.gradle.tooling.internal.provider.ExecuteBuildActionRunner.run(ExecuteBuildActionRunner.java:28)
	at org.gradle.launcher.exec.ChainingBuildActionRunner.run(ChainingBuildActionRunner.java:35)
	at org.gradle.launcher.exec.InProcessBuildActionExecuter.execute(InProcessBuildActionExecuter.java:41)
	at org.gradle.launcher.exec.InProcessBuildActionExecuter.execute(InProcessBuildActionExecuter.java:26)
	at org.gradle.tooling.internal.provider.ContinuousBuildActionExecuter.execute(ContinuousBuildActionExecuter.java:79)
	at org.gradle.tooling.internal.provider.ContinuousBuildActionExecuter.execute(ContinuousBuildActionExecuter.java:51)
	at org.gradle.launcher.daemon.server.exec.ExecuteBuild.doBuild(ExecuteBuild.java:59)
	at org.gradle.launcher.daemon.server.exec.BuildCommandOnly.execute(BuildCommandOnly.java:36)
	at org.gradle.launcher.daemon.server.api.DaemonCommandExecution.proceed(DaemonCommandExecution.java:120)
	at org.gradle.launcher.daemon.server.exec.WatchForDisconnection.execute(WatchForDisconnection.java:47)
	at org.gradle.launcher.daemon.server.api.DaemonCommandExecution.proceed(DaemonCommandExecution.java:120)
	at org.gradle.launcher.daemon.server.exec.ResetDeprecationLogger.execute(ResetDeprecationLogger.java:26)
	at org.gradle.launcher.daemon.server.api.DaemonCommandExecution.proceed(DaemonCommandExecution.java:120)
	at org.gradle.launcher.daemon.server.exec.RequestStopIfSingleUsedDaemon.execute(RequestStopIfSingleUsedDaemon.java:34)
	at org.gradle.launcher.daemon.server.api.DaemonCommandExecution.proceed(DaemonCommandExecution.java:120)
	at org.gradle.launcher.daemon.server.exec.ForwardClientInput$2.call(ForwardClientInput.java:74)
	at org.gradle.launcher.daemon.server.exec.ForwardClientInput$2.call(ForwardClientInput.java:72)
	at org.gradle.util.Swapper.swap(Swapper.java:38)
	at org.gradle.launcher.daemon.server.exec.ForwardClientInput.execute(ForwardClientInput.java:72)
	at org.gradle.launcher.daemon.server.api.DaemonCommandExecution.proceed(DaemonCommandExecution.java:120)
	at org.gradle.launcher.daemon.server.exec.LogAndCheckHealth.execute(LogAndCheckHealth.java:55)
	at org.gradle.launcher.daemon.server.api.DaemonCommandExecution.proceed(DaemonCommandExecution.java:120)
	at org.gradle.launcher.daemon.server.exec.LogToClient.doBuild(LogToClient.java:60)
	at org.gradle.launcher.daemon.server.exec.BuildCommandOnly.execute(BuildCommandOnly.java:36)
	at org.gradle.launcher.daemon.server.api.DaemonCommandExecution.proceed(DaemonCommandExecution.java:120)
	at org.gradle.launcher.daemon.server.exec.EstablishBuildEnvironment.doBuild(EstablishBuildEnvironment.java:72)
	at org.gradle.launcher.daemon.server.exec.BuildCommandOnly.execute(BuildCommandOnly.java:36)
	at org.gradle.launcher.daemon.server.api.DaemonCommandExecution.proceed(DaemonCommandExecution.java:120)
	at org.gradle.launcher.daemon.server.exec.HintGCAfterBuild.execute(HintGCAfterBuild.java:44)
	at org.gradle.launcher.daemon.server.api.DaemonCommandExecution.proceed(DaemonCommandExecution.java:120)
	at org.gradle.launcher.daemon.server.exec.StartBuildOrRespondWithBusy$1.run(StartBuildOrRespondWithBusy.java:50)
	at org.gradle.launcher.daemon.server.DaemonStateCoordinator$1.run(DaemonStateCoordinator.java:293)
	at org.gradle.internal.concurrent.ExecutorPolicy$CatchAndRecordFailures.onExecute(ExecutorPolicy.java:54)
	at org.gradle.internal.concurrent.StoppableExecutorImpl$1.run(StoppableExecutorImpl.java:40)
	at java.util.concurrent.ThreadPoolExecutor.runWorker(ThreadPoolExecutor.java:1142)
	at java.util.concurrent.ThreadPoolExecutor$Worker.run(ThreadPoolExecutor.java:617)
	at java.lang.Thread.run(Thread.java:745)
Caused by: org.gradle.api.artifacts.PublishException: Could not publish configuration 'archives'
	at org.gradle.api.tasks.Upload.upload(Upload.java:66)
	at sun.reflect.GeneratedMethodAccessor426.invoke(Unknown Source)
	at sun.reflect.DelegatingMethodAccessorImpl.invoke(DelegatingMethodAccessorImpl.java:43)
	at java.lang.reflect.Method.invoke(Method.java:498)
	at org.gradle.internal.reflect.JavaMethod.invoke(JavaMethod.java:75)
	at org.gradle.api.internal.project.taskfactory.DefaultTaskClassInfoStore$StandardTaskAction.doExecute(DefaultTaskClassInfoStore.java:136)
	at org.gradle.api.internal.project.taskfactory.DefaultTaskClassInfoStore$StandardTaskAction.execute(DefaultTaskClassInfoStore.java:129)
	at org.gradle.api.internal.project.taskfactory.DefaultTaskClassInfoStore$StandardTaskAction.execute(DefaultTaskClassInfoStore.java:118)
	at org.gradle.api.internal.AbstractTask$TaskActionWrapper.execute(AbstractTask.java:623)
	at org.gradle.api.internal.AbstractTask$TaskActionWrapper.execute(AbstractTask.java:606)
	at org.gradle.api.internal.tasks.execution.ExecuteActionsTaskExecuter.executeAction(ExecuteActionsTaskExecuter.java:80)
	at org.gradle.api.internal.tasks.execution.ExecuteActionsTaskExecuter.executeActions(ExecuteActionsTaskExecuter.java:61)
	... 71 more
Caused by: org.gradle.api.artifacts.PublishException: Cannot publish artifact 'virgo-nano.tar (workspace.packaging:nano:3.7.0.RELEASE)' (/jobs/genie.virgo/3.7.0.Milestones/workspace/packaging/nano/build/distributions/virgo-nano-3.7.0.RELEASE.tar) as it does not exist.
	at org.gradle.api.internal.artifacts.ivyservice.publisher.DefaultIvyDependencyPublisher.checkArtifactFileExists(DefaultIvyDependencyPublisher.java:64)
	at org.gradle.api.internal.artifacts.ivyservice.publisher.DefaultIvyDependencyPublisher.addPublishedArtifact(DefaultIvyDependencyPublisher.java:53)
	at org.gradle.api.internal.artifacts.ivyservice.publisher.DefaultIvyDependencyPublisher.publish(DefaultIvyDependencyPublisher.java:41)
	at org.gradle.api.internal.artifacts.ivyservice.publisher.IvyBackedArtifactPublisher.publish(IvyBackedArtifactPublisher.java:74)
	at org.gradle.api.internal.artifacts.ivyservice.IvyContextualArtifactPublisher$1.execute(IvyContextualArtifactPublisher.java:43)
	at org.gradle.api.internal.artifacts.ivyservice.IvyContextualArtifactPublisher$1.execute(IvyContextualArtifactPublisher.java:40)
	at org.gradle.internal.Transformers$4.transform(Transformers.java:169)
	at org.gradle.api.internal.artifacts.ivyservice.DefaultIvyContextManager.withIvy(DefaultIvyContextManager.java:61)
	at org.gradle.api.internal.artifacts.ivyservice.DefaultIvyContextManager.withIvy(DefaultIvyContextManager.java:39)
	at org.gradle.api.internal.artifacts.ivyservice.IvyContextualArtifactPublisher.publish(IvyContextualArtifactPublisher.java:40)
	at org.gradle.api.tasks.Upload.upload(Upload.java:64)
	... 82 more

==============================================================================

4: Task failed with an exception.
-----------
* What went wrong:
Execution failed for task ':packaging:tomcat-server:uploadArchives'.
> Could not publish configuration 'archives'
   > Cannot publish artifact 'virgo-tomcat-server.tar (workspace.packaging:tomcat-server:3.7.0.RELEASE)' (/jobs/genie.virgo/3.7.0.Milestones/workspace/packaging/tomcat-server/build/distributions/virgo-tomcat-server-3.7.0.RELEASE.tar) as it does not exist.

* Try:
Run with --info or --debug option to get more log output.

* Exception is:
org.gradle.api.tasks.TaskExecutionException: Execution failed for task ':packaging:tomcat-server:uploadArchives'.
	at org.gradle.api.internal.tasks.execution.ExecuteActionsTaskExecuter.executeActions(ExecuteActionsTaskExecuter.java:69)
	at org.gradle.api.internal.tasks.execution.ExecuteActionsTaskExecuter.execute(ExecuteActionsTaskExecuter.java:46)
	at org.gradle.api.internal.tasks.execution.PostExecutionAnalysisTaskExecuter.execute(PostExecutionAnalysisTaskExecuter.java:35)
	at org.gradle.api.internal.tasks.execution.SkipUpToDateTaskExecuter.execute(SkipUpToDateTaskExecuter.java:64)
	at org.gradle.api.internal.tasks.execution.ValidatingTaskExecuter.execute(ValidatingTaskExecuter.java:58)
	at org.gradle.api.internal.tasks.execution.SkipEmptySourceFilesTaskExecuter.execute(SkipEmptySourceFilesTaskExecuter.java:52)
	at org.gradle.api.internal.tasks.execution.SkipTaskWithNoActionsExecuter.execute(SkipTaskWithNoActionsExecuter.java:52)
	at org.gradle.api.internal.tasks.execution.SkipOnlyIfTaskExecuter.execute(SkipOnlyIfTaskExecuter.java:53)
	at org.gradle.api.internal.tasks.execution.ExecuteAtMostOnceTaskExecuter.execute(ExecuteAtMostOnceTaskExecuter.java:43)
	at org.gradle.execution.taskgraph.DefaultTaskGraphExecuter$EventFiringTaskWorker.execute(DefaultTaskGraphExecuter.java:233)
	at org.gradle.execution.taskgraph.DefaultTaskGraphExecuter$EventFiringTaskWorker.execute(DefaultTaskGraphExecuter.java:215)
	at org.gradle.execution.taskgraph.AbstractTaskPlanExecutor$TaskExecutorWorker.processTask(AbstractTaskPlanExecutor.java:74)
	at org.gradle.execution.taskgraph.AbstractTaskPlanExecutor$TaskExecutorWorker.run(AbstractTaskPlanExecutor.java:55)
	at org.gradle.execution.taskgraph.DefaultTaskPlanExecutor.process(DefaultTaskPlanExecutor.java:32)
	at org.gradle.execution.taskgraph.DefaultTaskGraphExecuter.execute(DefaultTaskGraphExecuter.java:113)
	at org.gradle.execution.SelectedTaskExecutionAction.execute(SelectedTaskExecutionAction.java:37)
	at org.gradle.execution.DefaultBuildExecuter.execute(DefaultBuildExecuter.java:37)
	at org.gradle.execution.DefaultBuildExecuter.access$000(DefaultBuildExecuter.java:23)
	at org.gradle.execution.DefaultBuildExecuter$1.proceed(DefaultBuildExecuter.java:43)
	at org.gradle.execution.DryRunBuildExecutionAction.execute(DryRunBuildExecutionAction.java:32)
	at org.gradle.execution.DefaultBuildExecuter.execute(DefaultBuildExecuter.java:37)
	at org.gradle.execution.DefaultBuildExecuter.execute(DefaultBuildExecuter.java:30)
	at org.gradle.initialization.DefaultGradleLauncher$4.run(DefaultGradleLauncher.java:186)
	at org.gradle.internal.Factories$1.create(Factories.java:22)
	at org.gradle.internal.progress.DefaultBuildOperationExecutor.run(DefaultBuildOperationExecutor.java:91)
	at org.gradle.internal.progress.DefaultBuildOperationExecutor.run(DefaultBuildOperationExecutor.java:53)
	at org.gradle.initialization.DefaultGradleLauncher.doBuildStages(DefaultGradleLauncher.java:183)
	at org.gradle.initialization.DefaultGradleLauncher.access$200(DefaultGradleLauncher.java:33)
	at org.gradle.initialization.DefaultGradleLauncher$1.create(DefaultGradleLauncher.java:112)
	at org.gradle.initialization.DefaultGradleLauncher$1.create(DefaultGradleLauncher.java:106)
	at org.gradle.internal.progress.DefaultBuildOperationExecutor.run(DefaultBuildOperationExecutor.java:91)
	at org.gradle.internal.progress.DefaultBuildOperationExecutor.run(DefaultBuildOperationExecutor.java:63)
	at org.gradle.initialization.DefaultGradleLauncher.doBuild(DefaultGradleLauncher.java:106)
	at org.gradle.initialization.DefaultGradleLauncher.run(DefaultGradleLauncher.java:92)
	at org.gradle.launcher.exec.GradleBuildController.run(GradleBuildController.java:66)
	at org.gradle.tooling.internal.provider.ExecuteBuildActionRunner.run(ExecuteBuildActionRunner.java:28)
	at org.gradle.launcher.exec.ChainingBuildActionRunner.run(ChainingBuildActionRunner.java:35)
	at org.gradle.launcher.exec.InProcessBuildActionExecuter.execute(InProcessBuildActionExecuter.java:41)
	at org.gradle.launcher.exec.InProcessBuildActionExecuter.execute(InProcessBuildActionExecuter.java:26)
	at org.gradle.tooling.internal.provider.ContinuousBuildActionExecuter.execute(ContinuousBuildActionExecuter.java:79)
	at org.gradle.tooling.internal.provider.ContinuousBuildActionExecuter.execute(ContinuousBuildActionExecuter.java:51)
	at org.gradle.launcher.daemon.server.exec.ExecuteBuild.doBuild(ExecuteBuild.java:59)
	at org.gradle.launcher.daemon.server.exec.BuildCommandOnly.execute(BuildCommandOnly.java:36)
	at org.gradle.launcher.daemon.server.api.DaemonCommandExecution.proceed(DaemonCommandExecution.java:120)
	at org.gradle.launcher.daemon.server.exec.WatchForDisconnection.execute(WatchForDisconnection.java:47)
	at org.gradle.launcher.daemon.server.api.DaemonCommandExecution.proceed(DaemonCommandExecution.java:120)
	at org.gradle.launcher.daemon.server.exec.ResetDeprecationLogger.execute(ResetDeprecationLogger.java:26)
	at org.gradle.launcher.daemon.server.api.DaemonCommandExecution.proceed(DaemonCommandExecution.java:120)
	at org.gradle.launcher.daemon.server.exec.RequestStopIfSingleUsedDaemon.execute(RequestStopIfSingleUsedDaemon.java:34)
	at org.gradle.launcher.daemon.server.api.DaemonCommandExecution.proceed(DaemonCommandExecution.java:120)
	at org.gradle.launcher.daemon.server.exec.ForwardClientInput$2.call(ForwardClientInput.java:74)
	at org.gradle.launcher.daemon.server.exec.ForwardClientInput$2.call(ForwardClientInput.java:72)
	at org.gradle.util.Swapper.swap(Swapper.java:38)
	at org.gradle.launcher.daemon.server.exec.ForwardClientInput.execute(ForwardClientInput.java:72)
	at org.gradle.launcher.daemon.server.api.DaemonCommandExecution.proceed(DaemonCommandExecution.java:120)
	at org.gradle.launcher.daemon.server.exec.LogAndCheckHealth.execute(LogAndCheckHealth.java:55)
	at org.gradle.launcher.daemon.server.api.DaemonCommandExecution.proceed(DaemonCommandExecution.java:120)
	at org.gradle.launcher.daemon.server.exec.LogToClient.doBuild(LogToClient.java:60)
	at org.gradle.launcher.daemon.server.exec.BuildCommandOnly.execute(BuildCommandOnly.java:36)
	at org.gradle.launcher.daemon.server.api.DaemonCommandExecution.proceed(DaemonCommandExecution.java:120)
	at org.gradle.launcher.daemon.server.exec.EstablishBuildEnvironment.doBuild(EstablishBuildEnvironment.java:72)
	at org.gradle.launcher.daemon.server.exec.BuildCommandOnly.execute(BuildCommandOnly.java:36)
	at org.gradle.launcher.daemon.server.api.DaemonCommandExecution.proceed(DaemonCommandExecution.java:120)
	at org.gradle.launcher.daemon.server.exec.HintGCAfterBuild.execute(HintGCAfterBuild.java:44)
	at org.gradle.launcher.daemon.server.api.DaemonCommandExecution.proceed(DaemonCommandExecution.java:120)
	at org.gradle.launcher.daemon.server.exec.StartBuildOrRespondWithBusy$1.run(StartBuildOrRespondWithBusy.java:50)
	at org.gradle.launcher.daemon.server.DaemonStateCoordinator$1.run(DaemonStateCoordinator.java:293)
	at org.gradle.internal.concurrent.ExecutorPolicy$CatchAndRecordFailures.onExecute(ExecutorPolicy.java:54)
	at org.gradle.internal.concurrent.StoppableExecutorImpl$1.run(StoppableExecutorImpl.java:40)
	at java.util.concurrent.ThreadPoolExecutor.runWorker(ThreadPoolExecutor.java:1142)
	at java.util.concurrent.ThreadPoolExecutor$Worker.run(ThreadPoolExecutor.java:617)
	at java.lang.Thread.run(Thread.java:745)
Caused by: org.gradle.api.artifacts.PublishException: Could not publish configuration 'archives'
	at org.gradle.api.tasks.Upload.upload(Upload.java:66)
	at sun.reflect.GeneratedMethodAccessor426.invoke(Unknown Source)
	at sun.reflect.DelegatingMethodAccessorImpl.invoke(DelegatingMethodAccessorImpl.java:43)
	at java.lang.reflect.Method.invoke(Method.java:498)
	at org.gradle.internal.reflect.JavaMethod.invoke(JavaMethod.java:75)
	at org.gradle.api.internal.project.taskfactory.DefaultTaskClassInfoStore$StandardTaskAction.doExecute(DefaultTaskClassInfoStore.java:136)
	at org.gradle.api.internal.project.taskfactory.DefaultTaskClassInfoStore$StandardTaskAction.execute(DefaultTaskClassInfoStore.java:129)
	at org.gradle.api.internal.project.taskfactory.DefaultTaskClassInfoStore$StandardTaskAction.execute(DefaultTaskClassInfoStore.java:118)
	at org.gradle.api.internal.AbstractTask$TaskActionWrapper.execute(AbstractTask.java:623)
	at org.gradle.api.internal.AbstractTask$TaskActionWrapper.execute(AbstractTask.java:606)
	at org.gradle.api.internal.tasks.execution.ExecuteActionsTaskExecuter.executeAction(ExecuteActionsTaskExecuter.java:80)
	at org.gradle.api.internal.tasks.execution.ExecuteActionsTaskExecuter.executeActions(ExecuteActionsTaskExecuter.java:61)
	... 71 more
Caused by: org.gradle.api.artifacts.PublishException: Cannot publish artifact 'virgo-tomcat-server.tar (workspace.packaging:tomcat-server:3.7.0.RELEASE)' (/jobs/genie.virgo/3.7.0.Milestones/workspace/packaging/tomcat-server/build/distributions/virgo-tomcat-server-3.7.0.RELEASE.tar) as it does not exist.
	at org.gradle.api.internal.artifacts.ivyservice.publisher.DefaultIvyDependencyPublisher.checkArtifactFileExists(DefaultIvyDependencyPublisher.java:64)
	at org.gradle.api.internal.artifacts.ivyservice.publisher.DefaultIvyDependencyPublisher.addPublishedArtifact(DefaultIvyDependencyPublisher.java:53)
	at org.gradle.api.internal.artifacts.ivyservice.publisher.DefaultIvyDependencyPublisher.publish(DefaultIvyDependencyPublisher.java:41)
	at org.gradle.api.internal.artifacts.ivyservice.publisher.IvyBackedArtifactPublisher.publish(IvyBackedArtifactPublisher.java:74)
	at org.gradle.api.internal.artifacts.ivyservice.IvyContextualArtifactPublisher$1.execute(IvyContextualArtifactPublisher.java:43)
	at org.gradle.api.internal.artifacts.ivyservice.IvyContextualArtifactPublisher$1.execute(IvyContextualArtifactPublisher.java:40)
	at org.gradle.internal.Transformers$4.transform(Transformers.java:169)
	at org.gradle.api.internal.artifacts.ivyservice.DefaultIvyContextManager.withIvy(DefaultIvyContextManager.java:61)
	at org.gradle.api.internal.artifacts.ivyservice.DefaultIvyContextManager.withIvy(DefaultIvyContextManager.java:39)
	at org.gradle.api.internal.artifacts.ivyservice.IvyContextualArtifactPublisher.publish(IvyContextualArtifactPublisher.java:40)
	at org.gradle.api.tasks.Upload.upload(Upload.java:64)
	... 82 more

==============================================================================

BUILD FAILED

Total time: 9 mins 31.168 secs
[locks-and-latches] Releasing all the locks
[locks-and-latches] All the locks released
Recording test results
Archiving artifacts
Sending e-mails to: fwaibel@eclipsesource.com
Finished: FAILURE