FailedConsole Output

Skipping 268 KB.. Full Log
lipse.virgo.enterprise:processTestResources UP-TO-DATE
:org.eclipse.virgo.site:org.eclipse.virgo.enterprise:testClasses UP-TO-DATE
:org.eclipse.virgo.site:org.eclipse.virgo.enterprise:test UP-TO-DATE
:org.eclipse.virgo.site:org.eclipse.virgo.enterprise:check UP-TO-DATE
:org.eclipse.virgo.site:org.eclipse.virgo.enterprise:build
:org.eclipse.virgo.site:org.eclipse.virgo.kernel:assemble
:org.eclipse.virgo.site:org.eclipse.virgo.kernel:compileTestJava UP-TO-DATE
:org.eclipse.virgo.site:org.eclipse.virgo.kernel:processTestResources UP-TO-DATE
:org.eclipse.virgo.site:org.eclipse.virgo.kernel:testClasses UP-TO-DATE
:org.eclipse.virgo.site:org.eclipse.virgo.kernel:test UP-TO-DATE
:org.eclipse.virgo.site:org.eclipse.virgo.kernel:check UP-TO-DATE
:org.eclipse.virgo.site:org.eclipse.virgo.kernel:build
:org.eclipse.virgo.site:org.eclipse.virgo.kernel.springintegration:assemble
:org.eclipse.virgo.site:org.eclipse.virgo.kernel.springintegration:compileTestJava UP-TO-DATE
:org.eclipse.virgo.site:org.eclipse.virgo.kernel.springintegration:processTestResources UP-TO-DATE
:org.eclipse.virgo.site:org.eclipse.virgo.kernel.springintegration:testClasses UP-TO-DATE
:org.eclipse.virgo.site:org.eclipse.virgo.kernel.springintegration:test UP-TO-DATE
:org.eclipse.virgo.site:org.eclipse.virgo.kernel.springintegration:check UP-TO-DATE
:org.eclipse.virgo.site:org.eclipse.virgo.kernel.springintegration:build
:org.eclipse.virgo.site:org.eclipse.virgo.management:assemble
:org.eclipse.virgo.site:org.eclipse.virgo.management:compileTestJava UP-TO-DATE
:org.eclipse.virgo.site:org.eclipse.virgo.management:processTestResources UP-TO-DATE
:org.eclipse.virgo.site:org.eclipse.virgo.management:testClasses UP-TO-DATE
:org.eclipse.virgo.site:org.eclipse.virgo.management:test UP-TO-DATE
:org.eclipse.virgo.site:org.eclipse.virgo.management:check UP-TO-DATE
:org.eclipse.virgo.site:org.eclipse.virgo.management:build
:org.eclipse.virgo.site:org.eclipse.virgo.medic:assemble
:org.eclipse.virgo.site:org.eclipse.virgo.medic:compileTestJava UP-TO-DATE
:org.eclipse.virgo.site:org.eclipse.virgo.medic:processTestResources UP-TO-DATE
:org.eclipse.virgo.site:org.eclipse.virgo.medic:testClasses UP-TO-DATE
:org.eclipse.virgo.site:org.eclipse.virgo.medic:test UP-TO-DATE
:org.eclipse.virgo.site:org.eclipse.virgo.medic:check UP-TO-DATE
:org.eclipse.virgo.site:org.eclipse.virgo.medic:build
:org.eclipse.virgo.site:org.eclipse.virgo.nano.deployer:assemble
:org.eclipse.virgo.site:org.eclipse.virgo.nano.deployer:compileTestJava UP-TO-DATE
:org.eclipse.virgo.site:org.eclipse.virgo.nano.deployer:processTestResources UP-TO-DATE
:org.eclipse.virgo.site:org.eclipse.virgo.nano.deployer:testClasses UP-TO-DATE
:org.eclipse.virgo.site:org.eclipse.virgo.nano.deployer:test UP-TO-DATE
:org.eclipse.virgo.site:org.eclipse.virgo.nano.deployer:check UP-TO-DATE
:org.eclipse.virgo.site:org.eclipse.virgo.nano.deployer:build
:org.eclipse.virgo.site:org.eclipse.virgo.nano.mbeans:assemble
:org.eclipse.virgo.site:org.eclipse.virgo.nano.mbeans:compileTestJava UP-TO-DATE
:org.eclipse.virgo.site:org.eclipse.virgo.nano.mbeans:processTestResources UP-TO-DATE
:org.eclipse.virgo.site:org.eclipse.virgo.nano.mbeans:testClasses UP-TO-DATE
:org.eclipse.virgo.site:org.eclipse.virgo.nano.mbeans:test UP-TO-DATE
:org.eclipse.virgo.site:org.eclipse.virgo.nano.mbeans:check UP-TO-DATE
:org.eclipse.virgo.site:org.eclipse.virgo.nano.mbeans:build
:org.eclipse.virgo.site:org.eclipse.virgo.nano.mbeans.controller:assemble
:org.eclipse.virgo.site:org.eclipse.virgo.nano.mbeans.controller:compileTestJava UP-TO-DATE
:org.eclipse.virgo.site:org.eclipse.virgo.nano.mbeans.controller:processTestResources UP-TO-DATE
:org.eclipse.virgo.site:org.eclipse.virgo.nano.mbeans.controller:testClasses UP-TO-DATE
:org.eclipse.virgo.site:org.eclipse.virgo.nano.mbeans.controller:test UP-TO-DATE
:org.eclipse.virgo.site:org.eclipse.virgo.nano.mbeans.controller:check UP-TO-DATE
:org.eclipse.virgo.site:org.eclipse.virgo.nano.mbeans.controller:build
:org.eclipse.virgo.site:org.eclipse.virgo.nano.war.deployer:assemble
:org.eclipse.virgo.site:org.eclipse.virgo.nano.war.deployer:compileTestJava UP-TO-DATE
:org.eclipse.virgo.site:org.eclipse.virgo.nano.war.deployer:processTestResources UP-TO-DATE
:org.eclipse.virgo.site:org.eclipse.virgo.nano.war.deployer:testClasses UP-TO-DATE
:org.eclipse.virgo.site:org.eclipse.virgo.nano.war.deployer:test UP-TO-DATE
:org.eclipse.virgo.site:org.eclipse.virgo.nano.war.deployer:check UP-TO-DATE
:org.eclipse.virgo.site:org.eclipse.virgo.nano.war.deployer:build
:org.eclipse.virgo.site:org.eclipse.virgo.p2.provisioning:assemble
:org.eclipse.virgo.site:org.eclipse.virgo.p2.provisioning:compileTestJava UP-TO-DATE
:org.eclipse.virgo.site:org.eclipse.virgo.p2.provisioning:processTestResources UP-TO-DATE
:org.eclipse.virgo.site:org.eclipse.virgo.p2.provisioning:testClasses UP-TO-DATE
:org.eclipse.virgo.site:org.eclipse.virgo.p2.provisioning:test UP-TO-DATE
:org.eclipse.virgo.site:org.eclipse.virgo.p2.provisioning:check UP-TO-DATE
:org.eclipse.virgo.site:org.eclipse.virgo.p2.provisioning:build
:org.eclipse.virgo.site:org.eclipse.virgo.services.concurrent:assemble
:org.eclipse.virgo.site:org.eclipse.virgo.services.concurrent:compileTestJava UP-TO-DATE
:org.eclipse.virgo.site:org.eclipse.virgo.services.concurrent:processTestResources UP-TO-DATE
:org.eclipse.virgo.site:org.eclipse.virgo.services.concurrent:testClasses UP-TO-DATE
:org.eclipse.virgo.site:org.eclipse.virgo.services.concurrent:test UP-TO-DATE
:org.eclipse.virgo.site:org.eclipse.virgo.services.concurrent:check UP-TO-DATE
:org.eclipse.virgo.site:org.eclipse.virgo.services.concurrent:build
:org.eclipse.virgo.site:org.eclipse.virgo.services.ds:assemble
:org.eclipse.virgo.site:org.eclipse.virgo.services.ds:compileTestJava UP-TO-DATE
:org.eclipse.virgo.site:org.eclipse.virgo.services.ds:processTestResources UP-TO-DATE
:org.eclipse.virgo.site:org.eclipse.virgo.services.ds:testClasses UP-TO-DATE
:org.eclipse.virgo.site:org.eclipse.virgo.services.ds:test UP-TO-DATE
:org.eclipse.virgo.site:org.eclipse.virgo.services.ds:check UP-TO-DATE
:org.eclipse.virgo.site:org.eclipse.virgo.services.ds:build
:org.eclipse.virgo.site:org.eclipse.virgo.shell:assemble
:org.eclipse.virgo.site:org.eclipse.virgo.shell:compileTestJava UP-TO-DATE
:org.eclipse.virgo.site:org.eclipse.virgo.shell:processTestResources UP-TO-DATE
:org.eclipse.virgo.site:org.eclipse.virgo.shell:testClasses UP-TO-DATE
:org.eclipse.virgo.site:org.eclipse.virgo.shell:test UP-TO-DATE
:org.eclipse.virgo.site:org.eclipse.virgo.shell:check UP-TO-DATE
:org.eclipse.virgo.site:org.eclipse.virgo.shell:build
:org.eclipse.virgo.site:org.eclipse.virgo.simpleconfigurator:assemble
:org.eclipse.virgo.site:org.eclipse.virgo.simpleconfigurator:compileTestJava UP-TO-DATE
:org.eclipse.virgo.site:org.eclipse.virgo.simpleconfigurator:processTestResources UP-TO-DATE
:org.eclipse.virgo.site:org.eclipse.virgo.simpleconfigurator:testClasses UP-TO-DATE
:org.eclipse.virgo.site:org.eclipse.virgo.simpleconfigurator:test UP-TO-DATE
:org.eclipse.virgo.site:org.eclipse.virgo.simpleconfigurator:check UP-TO-DATE
:org.eclipse.virgo.site:org.eclipse.virgo.simpleconfigurator:build
:org.eclipse.virgo.site:org.eclipse.virgo.springdm:assemble
:org.eclipse.virgo.site:org.eclipse.virgo.springdm:compileTestJava UP-TO-DATE
:org.eclipse.virgo.site:org.eclipse.virgo.springdm:processTestResources UP-TO-DATE
:org.eclipse.virgo.site:org.eclipse.virgo.springdm:testClasses UP-TO-DATE
:org.eclipse.virgo.site:org.eclipse.virgo.springdm:test UP-TO-DATE
:org.eclipse.virgo.site:org.eclipse.virgo.springdm:check UP-TO-DATE
:org.eclipse.virgo.site:org.eclipse.virgo.springdm:build
:org.eclipse.virgo.site:org.eclipse.virgo.tools:assemble
:org.eclipse.virgo.site:org.eclipse.virgo.tools:compileTestJava UP-TO-DATE
:org.eclipse.virgo.site:org.eclipse.virgo.tools:processTestResources UP-TO-DATE
:org.eclipse.virgo.site:org.eclipse.virgo.tools:testClasses UP-TO-DATE
:org.eclipse.virgo.site:org.eclipse.virgo.tools:test UP-TO-DATE
:org.eclipse.virgo.site:org.eclipse.virgo.tools:check UP-TO-DATE
:org.eclipse.virgo.site:org.eclipse.virgo.tools:build
:org.eclipse.virgo.site:org.eclipse.virgo.webconsole.deps:assemble
:org.eclipse.virgo.site:org.eclipse.virgo.webconsole.deps:compileTestJava UP-TO-DATE
:org.eclipse.virgo.site:org.eclipse.virgo.webconsole.deps:processTestResources UP-TO-DATE
:org.eclipse.virgo.site:org.eclipse.virgo.webconsole.deps:testClasses UP-TO-DATE
:org.eclipse.virgo.site:org.eclipse.virgo.webconsole.deps:test UP-TO-DATE
:org.eclipse.virgo.site:org.eclipse.virgo.webconsole.deps:check UP-TO-DATE
:org.eclipse.virgo.site:org.eclipse.virgo.webconsole.deps:build
:packaging:jetty-server:packageResourcesAndProducts
Copy the lib artifacts:
org.eclipse.virgo.kernel.equinox.extensions-3.7.0.RELEASE.jar
org.eclipse.virgo.nano.authentication-3.7.0.RELEASE.jar
org.eclipse.virgo.nano.shutdown-3.7.0.RELEASE.jar
org.eclipse.virgo.util.env-3.7.0.RELEASE.jar
org.eclipse.equinox.launcher-1.3.0.v20130327-1440.jar
to '/jobs/genie.virgo/3.7.0.Milestones/workspace/packaging/jetty-server/build/common_resources/lib'.
Copy the libPersistence artifacts:
org.eclipse.virgo.web.enterprise.openejb.jpa.integration-3.7.0.RELEASE.jar
to '/jobs/genie.virgo/3.7.0.Milestones/workspace/packaging/jetty-server/build/common_resources/lib/persistence'.
Copy the libEndorsed artifacts:
javax.annotation-1.2.0.v201401042248.jar
javax.interceptor-api-1.2.jar
javax.transaction-api-1.2.jar
to '/jobs/genie.virgo/3.7.0.Milestones/workspace/packaging/jetty-server/build/common_resources/lib/endorsed'.
Copy the pluginsExtras artifacts:
org.eclipse.virgo.kernel.userregion-3.7.0.RELEASE.jar
to '/jobs/genie.virgo/3.7.0.Milestones/workspace/packaging/jetty-server/build/common_resources/plugins'.
Copy the repositoryExt artifacts:
org.eclipse.osgi.services-3.3.100.v20130513-1956.jar
osgi.enterprise-4.2.0.v201108120515.jar
org.eclipse.equinox.ds-1.4.200.v20131126-2331.jar
org.eclipse.equinox.util-1.0.500.v20130404-1337.jar
org.eclipse.equinox.region-1.1.101.v20130722-1314.jar
oevm.org.aopalliance-1.0.0.jar
org.apache.commons.codec-1.10.0.jar
org.springframework.aop-4.2.9.RELEASE.jar
org.springframework.beans-4.2.9.RELEASE.jar
org.springframework.context-4.2.9.RELEASE.jar
org.springframework.core-4.2.9.RELEASE.jar
org.springframework.expression-4.2.9.RELEASE.jar
gemini-blueprint-io-2.0.0.RELEASE.jar
gemini-blueprint-core-2.0.0.RELEASE.jar
gemini-blueprint-extender-2.0.0.RELEASE.jar
org.eclipse.gemini.management-1.0.5.RELEASE.jar
org.eclipse.virgo.management.fragment-3.7.0.RELEASE.jar
org.eclipse.virgo.kernel.agent.dm-3.7.0.RELEASE.jar
org.eclipse.virgo.kernel.deployer.dm-3.7.0.RELEASE.jar
org.eclipse.virgo.kernel.dmfragment-3.7.0.RELEASE.jar
commons-io-2.2.jar
commons-fileupload-1.3.2.jar
jolokia-osgi-1.3.3.jar
org.eclipse.virgo.medic-3.7.0.RELEASE.jar
org.eclipse.virgo.medic.core-3.7.0.RELEASE.jar
org.eclipse.virgo.web.dm-3.7.0.RELEASE.jar
javax.jms-1.1.0.v201205091237.jar
javax.servlet-3.1.0.20170128.jar
org.springframework.aspects-4.2.9.RELEASE.jar
org.springframework.context.support-4.2.9.RELEASE.jar
org.springframework.jdbc-4.2.9.RELEASE.jar
org.springframework.messaging-4.2.9.RELEASE.jar
org.springframework.jms-4.2.9.RELEASE.jar
org.springframework.orm-4.2.9.RELEASE.jar
org.springframework.oxm-4.2.9.RELEASE.jar
org.springframework.transaction-4.2.9.RELEASE.jar
org.springframework.web-4.2.9.RELEASE.jar
org.springframework.webmvc-4.2.9.RELEASE.jar
org.springframework.webmvc.portlet-4.2.9.RELEASE.jar
org.springframework.websocket-4.2.9.RELEASE.jar
org.aspectj.weaver-1.8.10.jar
oevm.javax.portlet-2.0.0.jar
javax.servlet.jsp.jstl-api-1.2.1.jar
javax.servlet.jsp.jstl-1.2.5-b03.jar
org.eclipse.virgo.web.servlet.adapter-3.7.0.RELEASE.jar
org.eclipse.jetty.continuation-8.1.16.v20140903.jar
org.eclipse.jetty.deploy-8.1.16.v20140903.jar
org.eclipse.jetty.http-8.1.16.v20140903.jar
org.eclipse.jetty.io-8.1.16.v20140903.jar
org.eclipse.jetty.osgi.boot-8.1.16.v20140903.jar
org.eclipse.jetty.security-8.1.16.v20140903.jar
org.eclipse.jetty.server-8.1.16.v20140903.jar
org.eclipse.jetty.servlet-8.1.16.v20140903.jar
org.eclipse.jetty.util-8.1.16.v20140903.jar
org.eclipse.jetty.webapp-8.1.16.v20140903.jar
org.eclipse.jetty.xml-8.1.16.v20140903.jar
to '/jobs/genie.virgo/3.7.0.Milestones/workspace/packaging/jetty-server/build/common_resources/repository/ext'.
Copy the pickup artifacts:
org.eclipse.virgo.management.console-3.7.0.RELEASE.jar
org.eclipse.virgo.apps.splash-3.7.0.RELEASE.jar
to '/jobs/genie.virgo/3.7.0.Milestones/workspace/packaging/jetty-server/build/common_resources/pickup'.
:packaging:jetty-server:check UP-TO-DATE
:packaging:kernel:packageResourcesAndProducts
Copy the lib artifacts:
org.eclipse.virgo.kernel.equinox.extensions-3.7.0.RELEASE.jar
org.eclipse.virgo.nano.authentication-3.7.0.RELEASE.jar
org.eclipse.virgo.nano.shutdown-3.7.0.RELEASE.jar
org.eclipse.virgo.util.env-3.7.0.RELEASE.jar
org.eclipse.equinox.launcher-1.3.0.v20130327-1440.jar
to '/jobs/genie.virgo/3.7.0.Milestones/workspace/packaging/kernel/build/common_resources/lib'.
Copy the libPersistence artifacts:
org.eclipse.virgo.web.enterprise.openejb.jpa.integration-3.7.0.RELEASE.jar
to '/jobs/genie.virgo/3.7.0.Milestones/workspace/packaging/kernel/build/common_resources/lib/persistence'.
Copy the libEndorsed artifacts:
javax.annotation-1.2.0.v201401042248.jar
javax.interceptor-api-1.2.jar
javax.transaction-api-1.2.jar
to '/jobs/genie.virgo/3.7.0.Milestones/workspace/packaging/kernel/build/common_resources/lib/endorsed'.
Copy the pluginsExtras artifacts:
org.eclipse.virgo.kernel.userregion-3.7.0.RELEASE.jar
to '/jobs/genie.virgo/3.7.0.Milestones/workspace/packaging/kernel/build/common_resources/plugins'.
Copy the repositoryExt artifacts:
org.eclipse.osgi.services-3.3.100.v20130513-1956.jar
osgi.enterprise-4.2.0.v201108120515.jar
org.eclipse.equinox.ds-1.4.200.v20131126-2331.jar
org.eclipse.equinox.util-1.0.500.v20130404-1337.jar
org.eclipse.equinox.region-1.1.101.v20130722-1314.jar
oevm.org.aopalliance-1.0.0.jar
org.apache.commons.codec-1.10.0.jar
org.springframework.aop-4.2.9.RELEASE.jar
org.springframework.beans-4.2.9.RELEASE.jar
org.springframework.context-4.2.9.RELEASE.jar
org.springframework.core-4.2.9.RELEASE.jar
org.springframework.expression-4.2.9.RELEASE.jar
gemini-blueprint-io-2.0.0.RELEASE.jar
gemini-blueprint-core-2.0.0.RELEASE.jar
gemini-blueprint-extender-2.0.0.RELEASE.jar
org.eclipse.gemini.management-1.0.5.RELEASE.jar
org.eclipse.virgo.management.fragment-3.7.0.RELEASE.jar
org.eclipse.virgo.kernel.agent.dm-3.7.0.RELEASE.jar
org.eclipse.virgo.kernel.deployer.dm-3.7.0.RELEASE.jar
org.eclipse.virgo.kernel.dmfragment-3.7.0.RELEASE.jar
commons-io-2.2.jar
commons-fileupload-1.3.2.jar
jolokia-osgi-1.3.3.jar
to '/jobs/genie.virgo/3.7.0.Milestones/workspace/packaging/kernel/build/common_resources/repository/ext'.
Copy the pickup artifacts:
org.eclipse.virgo.management.console-3.7.0.RELEASE.jar
to '/jobs/genie.virgo/3.7.0.Milestones/workspace/packaging/kernel/build/common_resources/pickup'.
:packaging:kernel:check UP-TO-DATE
:packaging:nano:packageResourcesAndProducts
Copy the lib artifacts:
org.eclipse.virgo.kernel.equinox.extensions-3.7.0.RELEASE.jar
org.eclipse.virgo.nano.authentication-3.7.0.RELEASE.jar
org.eclipse.virgo.nano.shutdown-3.7.0.RELEASE.jar
org.eclipse.virgo.util.env-3.7.0.RELEASE.jar
org.eclipse.equinox.launcher-1.3.0.v20130327-1440.jar
to '/jobs/genie.virgo/3.7.0.Milestones/workspace/packaging/nano/build/common_resources/lib'.
Copy the libPersistence artifacts:
org.eclipse.virgo.web.enterprise.openejb.jpa.integration-3.7.0.RELEASE.jar
to '/jobs/genie.virgo/3.7.0.Milestones/workspace/packaging/nano/build/common_resources/lib/persistence'.
Copy the libEndorsed artifacts:
javax.annotation-1.2.0.v201401042248.jar
javax.interceptor-api-1.2.jar
javax.transaction-api-1.2.jar
to '/jobs/genie.virgo/3.7.0.Milestones/workspace/packaging/nano/build/common_resources/lib/endorsed'.
Copy the pickup artifacts:
org.eclipse.virgo.management.console-3.7.0.RELEASE.jar
to '/jobs/genie.virgo/3.7.0.Milestones/workspace/packaging/nano/build/common_resources/pickup'.
:packaging:nano:check UP-TO-DATE
:packaging:tomcat-server:packageResourcesAndProducts
Copy the lib artifacts:
org.eclipse.virgo.kernel.equinox.extensions-3.7.0.RELEASE.jar
org.eclipse.virgo.nano.authentication-3.7.0.RELEASE.jar
org.eclipse.virgo.nano.shutdown-3.7.0.RELEASE.jar
org.eclipse.virgo.util.env-3.7.0.RELEASE.jar
org.eclipse.equinox.launcher-1.3.0.v20130327-1440.jar
to '/jobs/genie.virgo/3.7.0.Milestones/workspace/packaging/tomcat-server/build/common_resources/lib'.
Copy the libPersistence artifacts:
org.eclipse.virgo.web.enterprise.openejb.jpa.integration-3.7.0.RELEASE.jar
to '/jobs/genie.virgo/3.7.0.Milestones/workspace/packaging/tomcat-server/build/common_resources/lib/persistence'.
Copy the libEndorsed artifacts:
javax.annotation-1.2.0.v201401042248.jar
javax.interceptor-api-1.2.jar
javax.transaction-api-1.2.jar
to '/jobs/genie.virgo/3.7.0.Milestones/workspace/packaging/tomcat-server/build/common_resources/lib/endorsed'.
Copy the pluginsExtras artifacts:
org.eclipse.virgo.kernel.userregion-3.7.0.RELEASE.jar
to '/jobs/genie.virgo/3.7.0.Milestones/workspace/packaging/tomcat-server/build/common_resources/plugins'.
Copy the repositoryExt artifacts:
org.eclipse.osgi.services-3.3.100.v20130513-1956.jar
osgi.enterprise-4.2.0.v201108120515.jar
org.eclipse.equinox.ds-1.4.200.v20131126-2331.jar
org.eclipse.equinox.util-1.0.500.v20130404-1337.jar
org.eclipse.equinox.region-1.1.101.v20130722-1314.jar
oevm.org.aopalliance-1.0.0.jar
org.apache.commons.codec-1.10.0.jar
org.springframework.aop-4.2.9.RELEASE.jar
org.springframework.beans-4.2.9.RELEASE.jar
org.springframework.context-4.2.9.RELEASE.jar
org.springframework.core-4.2.9.RELEASE.jar
org.springframework.expression-4.2.9.RELEASE.jar
gemini-blueprint-io-2.0.0.RELEASE.jar
gemini-blueprint-core-2.0.0.RELEASE.jar
gemini-blueprint-extender-2.0.0.RELEASE.jar
org.eclipse.gemini.management-1.0.5.RELEASE.jar
org.eclipse.virgo.management.fragment-3.7.0.RELEASE.jar
org.eclipse.virgo.kernel.agent.dm-3.7.0.RELEASE.jar
org.eclipse.virgo.kernel.deployer.dm-3.7.0.RELEASE.jar
org.eclipse.virgo.kernel.dmfragment-3.7.0.RELEASE.jar
commons-io-2.2.jar
commons-fileupload-1.3.2.jar
jolokia-osgi-1.3.3.jar
org.eclipse.virgo.medic-3.7.0.RELEASE.jar
org.eclipse.virgo.medic.core-3.7.0.RELEASE.jar
org.eclipse.virgo.web.dm-3.7.0.RELEASE.jar
javax.jms-1.1.0.v201205091237.jar
javax.servlet-3.1.0.20170128.jar
org.springframework.aspects-4.2.9.RELEASE.jar
org.springframework.context.support-4.2.9.RELEASE.jar
org.springframework.jdbc-4.2.9.RELEASE.jar
org.springframework.messaging-4.2.9.RELEASE.jar
org.springframework.jms-4.2.9.RELEASE.jar
org.springframework.orm-4.2.9.RELEASE.jar
org.springframework.oxm-4.2.9.RELEASE.jar
org.springframework.transaction-4.2.9.RELEASE.jar
org.springframework.web-4.2.9.RELEASE.jar
org.springframework.webmvc-4.2.9.RELEASE.jar
org.springframework.webmvc.portlet-4.2.9.RELEASE.jar
org.springframework.websocket-4.2.9.RELEASE.jar
org.aspectj.weaver-1.8.10.jar
oevm.javax.portlet-2.0.0.jar
javax.servlet.jsp.jstl-api-1.2.1.jar
javax.servlet.jsp.jstl-1.2.5-b03.jar
org.eclipse.virgo.web.core-3.7.0.RELEASE.jar
org.eclipse.virgo.web.tomcat.support-3.7.0.RELEASE.jar
org.eclipse.virgo.web.servlet.adapter-3.7.0.RELEASE.jar
org.eclipse.virgo.web.spring.integration-3.7.0.RELEASE.jar
javax.annotation-1.2.0.v201401042248.jar
javax.ejb-3.1.1.v201204261316.jar
javax.el-3.0.0.20170128.jar
javax.mail-1.5.5.jar
javax.persistence-2.1.0.v201304241213.jar
javax.servlet.jsp-2.3.0.20170128.jar
javax.security.auth.message-1.1.0.20170128.jar
javax.xml.rpc-1.1.0.v201005080400.jar
javax.websocket-1.1.0.20170128.jar
org.eclipse.equinox.event-1.3.0.v20130327-1442.jar
oevm.org.apache.taglibs.standard-1.1.2.v20110517.jar
slf4j-api-1.7.22.jar
slf4j-jcl-1.7.22.jar
jul-to-slf4j-1.7.22.jar
slf4j-log4j12-1.7.22.jar
org.eclipse.jdt.core.compiler.batch-3.10.0.v20140604-1726.jar
org.apache.catalina-8.5.11.jar
org.apache.catalina.ha-8.5.11.jar
org.apache.catalina.tribes-8.5.11.jar
org.apache.coyote-8.5.11.jar
org.apache.el-8.5.11.jar
org.apache.jasper-8.5.11.jar
org.apache.juli-8.5.11.jar
org.apache.tomcat.api-8.5.11.jar
org.apache.tomcat.util-8.5.11.jar
org.apache.tomcat.util.scan-8.5.11.jar
org.apache.tomcat.jni-8.5.11.jar
org.apache.tomcat.websocket-8.5.11.jar
org.eclipse.gemini.web.core-3.0.0.RELEASE.jar
org.eclipse.gemini.web.tomcat-3.0.0.RELEASE.jar
org.eclipse.gemini.web.jaspic.fragment-3.0.0.RELEASE.jar
to '/jobs/genie.virgo/3.7.0.Milestones/workspace/packaging/tomcat-server/build/common_resources/repository/ext'.
Copy the pickup artifacts:
org.eclipse.virgo.management.console-3.7.0.RELEASE.jar
org.eclipse.virgo.apps.splash-3.7.0.RELEASE.jar
to '/jobs/genie.virgo/3.7.0.Milestones/workspace/packaging/tomcat-server/build/common_resources/pickup'.
:packaging:tomcat-server:check UP-TO-DATE
:repository:org.eclipse.virgo.repository:sourcesJar
:repository:org.eclipse.virgo.repository:assemble
:repository:org.eclipse.virgo.repository:compileTestJava
:repository:org.eclipse.virgo.repository:processTestResources
:repository:org.eclipse.virgo.repository:testClasses
:repository:org.eclipse.virgo.repository:test
:repository:org.eclipse.virgo.repository:check
:repository:org.eclipse.virgo.repository:build
|--> Signing Jar File: /jobs/genie.virgo/3.7.0.Milestones/workspace/repository/org.eclipse.virgo.repository/build/libs/org.eclipse.virgo.repository-3.7.0.RELEASE.jar
  % Total    % Received % Xferd  Average Speed   Time    Time     Time  Current
                                 Dload  Upload   Total   Spent    Left  Speed

  0     0    0     0    0     0      0      0 --:--:-- --:--:-- --:--:--     0
100  135k    0     0  100  135k      0   134k  0:00:01  0:00:01 --:--:--  135k
100  288k  100  153k  100  135k   122k   108k  0:00:01  0:00:01 --:--:--  122k
:test:org.eclipse.virgo.test.framework:sourcesJar
:test:org.eclipse.virgo.test.framework:assemble
:test:org.eclipse.virgo.test.framework:compileTestJava
:test:org.eclipse.virgo.test.framework:processTestResources
:test:org.eclipse.virgo.test.framework:testClasses
:test:org.eclipse.virgo.test.framework:test
:test:org.eclipse.virgo.test.framework:check
:test:org.eclipse.virgo.test.framework:build
|--> Signing Jar File: /jobs/genie.virgo/3.7.0.Milestones/workspace/test/org.eclipse.virgo.test.framework/build/libs/org.eclipse.virgo.test.framework-3.7.0.RELEASE.jar
  % Total    % Received % Xferd  Average Speed   Time    Time     Time  Current
                                 Dload  Upload   Total   Spent    Left  Speed

  0     0    0     0    0     0      0      0 --:--:-- --:--:-- --:--:--     0
100 23549    0     0  100 23549      0  23407  0:00:01  0:00:01 --:--:-- 23431
100 54641  100 31092  100 23549  26653  20187  0:00:01  0:00:01 --:--:-- 26665
:test:org.eclipse.virgo.test.launcher:sourcesJar
:test:org.eclipse.virgo.test.launcher:assemble
:test:org.eclipse.virgo.test.launcher:compileTestJava
:test:org.eclipse.virgo.test.launcher:processTestResources
:test:org.eclipse.virgo.test.launcher:testClasses
:test:org.eclipse.virgo.test.launcher:test
:test:org.eclipse.virgo.test.launcher:check
:test:org.eclipse.virgo.test.launcher:build
|--> Signing Jar File: /jobs/genie.virgo/3.7.0.Milestones/workspace/test/org.eclipse.virgo.test.launcher/build/libs/org.eclipse.virgo.test.launcher-3.7.0.RELEASE.jar
  % Total    % Received % Xferd  Average Speed   Time    Time     Time  Current
                                 Dload  Upload   Total   Spent    Left  Speed

  0     0    0     0    0     0      0      0 --:--:-- --:--:-- --:--:--     0
100 16909    0     0  100 16909      0  16802  0:00:01  0:00:01 --:--:-- 16808
100 40605  100 23696  100 16909  23090  16476  0:00:01  0:00:01 --:--:-- 23095
:test:org.eclipse.virgo.test.stubs:sourcesJar
:test:org.eclipse.virgo.test.stubs:assemble
:test:org.eclipse.virgo.test.stubs:compileTestAspect
:test:org.eclipse.virgo.test.stubs:compileTestJava
:test:org.eclipse.virgo.test.stubs:processTestResources
:test:org.eclipse.virgo.test.stubs:testClasses
:test:org.eclipse.virgo.test.stubs:test
:test:org.eclipse.virgo.test.stubs:check
:test:org.eclipse.virgo.test.stubs:build
|--> Signing Jar File: /jobs/genie.virgo/3.7.0.Milestones/workspace/test/org.eclipse.virgo.test.stubs/build/libs/org.eclipse.virgo.test.stubs-3.7.0.RELEASE.jar
  % Total    % Received % Xferd  Average Speed   Time    Time     Time  Current
                                 Dload  Upload   Total   Spent    Left  Speed

  0     0    0     0    0     0      0      0 --:--:-- --:--:-- --:--:--     0
100 69500    0     0  100 69500      0  69026  0:00:01  0:00:01 --:--:-- 69085
100  144k  100 78531  100 69500  64673  57236  0:00:01  0:00:01 --:--:-- 64687
:test:org.eclipse.virgo.test.tools:sourcesJar
:test:org.eclipse.virgo.test.tools:assemble
:test:org.eclipse.virgo.test.tools:compileTestJava UP-TO-DATE
:test:org.eclipse.virgo.test.tools:processTestResources UP-TO-DATE
:test:org.eclipse.virgo.test.tools:testClasses UP-TO-DATE
:test:org.eclipse.virgo.test.tools:test UP-TO-DATE
:test:org.eclipse.virgo.test.tools:check UP-TO-DATE
:test:org.eclipse.virgo.test.tools:build
|--> Signing Jar File: /jobs/genie.virgo/3.7.0.Milestones/workspace/test/org.eclipse.virgo.test.tools/build/libs/org.eclipse.virgo.test.tools-3.7.0.RELEASE.jar
  % Total    % Received % Xferd  Average Speed   Time    Time     Time  Current
                                 Dload  Upload   Total   Spent    Left  Speed

  0     0    0     0    0     0      0      0 --:--:-- --:--:-- --:--:--     0
100 17270    0     0  100 17270      0  84328 --:--:-- --:--:-- --:--:-- 84243
 42 40916    0     0  100 17270      0  14504  0:00:01  0:00:01 --:--:-- 14500
100 40916  100 23646  100 17270  19839  14490  0:00:01  0:00:01 --:--:-- 19837
:util:org.eclipse.virgo.util.common:sourcesJar
:util:org.eclipse.virgo.util.common:assemble
:util:org.eclipse.virgo.util.common:compileTestJava
:util:org.eclipse.virgo.util.common:processTestResources UP-TO-DATE
:util:org.eclipse.virgo.util.common:testClasses
:util:org.eclipse.virgo.util.common:test
:util:org.eclipse.virgo.util.common:check
:util:org.eclipse.virgo.util.common:build
|--> Signing Jar File: /jobs/genie.virgo/3.7.0.Milestones/workspace/util/org.eclipse.virgo.util.common/build/libs/org.eclipse.virgo.util.common-3.7.0.RELEASE.jar
  % Total    % Received % Xferd  Average Speed   Time    Time     Time  Current
                                 Dload  Upload   Total   Spent    Left  Speed

  0     0    0     0    0     0      0      0 --:--:-- --:--:-- --:--:--     0
100 57264    0     0  100 57264      0  56886  0:00:01  0:00:01 --:--:-- 56922
100  121k  100 66838  100 57264  61399  52604  0:00:01  0:00:01 --:--:-- 61431
:util:org.eclipse.virgo.util.env:sourcesJar
:util:org.eclipse.virgo.util.env:assemble
:util:org.eclipse.virgo.util.env:compileTestJava
:util:org.eclipse.virgo.util.env:processTestResources UP-TO-DATE
:util:org.eclipse.virgo.util.env:testClasses
:util:org.eclipse.virgo.util.env:test
:util:org.eclipse.virgo.util.env:check
:util:org.eclipse.virgo.util.env:build
|--> Signing Jar File: /jobs/genie.virgo/3.7.0.Milestones/workspace/util/org.eclipse.virgo.util.env/build/libs/org.eclipse.virgo.util.env-3.7.0.RELEASE.jar
  % Total    % Received % Xferd  Average Speed   Time    Time     Time  Current
                                 Dload  Upload   Total   Spent    Left  Speed

  0     0    0     0    0     0      0      0 --:--:-- --:--:-- --:--:--     0
100  4192    0     0  100  4192      0   4165  0:00:01  0:00:01 --:--:--  4166
100 14176  100  9984  100  4192   8467   3555  0:00:01  0:00:01 --:--:--  8468
:util:org.eclipse.virgo.util.integrationtest:sourcesJar
:util:org.eclipse.virgo.util.integrationtest:assemble
:util:org.eclipse.virgo.util.integrationtest:compileTestJavaincorrect classpath: /jobs/genie.virgo/3.7.0.Milestones/workspace/util/org.eclipse.virgo.util.integrationtest/build/classes/main
incorrect classpath: /jobs/genie.virgo/3.7.0.Milestones/workspace/util/org.eclipse.virgo.util.integrationtest/build/resources/main
----------
1. WARNING in /jobs/genie.virgo/3.7.0.Milestones/workspace/util/org.eclipse.virgo.util.integrationtest/src/test/java/org/eclipse/virgo/util/test/UtilBundlesResolutionPaxExamTests.java (at line 109)
	Dictionary<String, String> headers = bundle.getHeaders();
	                                     ^^^^^^^^^^^^^^^^^^^
Type safety: The expression of type Dictionary needs unchecked conversion to conform to Dictionary<String,String>
----------
1 problem (1 warning)

:util:org.eclipse.virgo.util.integrationtest:processTestResources UP-TO-DATE
:util:org.eclipse.virgo.util.integrationtest:testClasses
:util:org.eclipse.virgo.util.integrationtest:test
:util:org.eclipse.virgo.util.integrationtest:check
:util:org.eclipse.virgo.util.integrationtest:build
|--> Signing Jar File: /jobs/genie.virgo/3.7.0.Milestones/workspace/util/org.eclipse.virgo.util.integrationtest/build/libs/org.eclipse.virgo.util.integrationtest-3.7.0.RELEASE.jar
  % Total    % Received % Xferd  Average Speed   Time    Time     Time  Current
                                 Dload  Upload   Total   Spent    Left  Speed

  0     0    0     0    0     0      0      0 --:--:-- --:--:-- --:--:--     0
  0   509    0     0    0     0      0      0 --:--:-- --:--:-- --:--:--     0
100   509    0     0  100   509      0    505  0:00:01  0:00:01 --:--:--   504
100  6262  100  5753  100   509   4881    431  0:00:01  0:00:01 --:--:--  4879
:util:org.eclipse.virgo.util.io:sourcesJar
:util:org.eclipse.virgo.util.io:assemble
:util:org.eclipse.virgo.util.io:compileTestJava
:util:org.eclipse.virgo.util.io:processTestResources
:util:org.eclipse.virgo.util.io:testClasses
:util:org.eclipse.virgo.util.io:test
:util:org.eclipse.virgo.util.io:check
:util:org.eclipse.virgo.util.io:build
|--> Signing Jar File: /jobs/genie.virgo/3.7.0.Milestones/workspace/util/org.eclipse.virgo.util.io/build/libs/org.eclipse.virgo.util.io-3.7.0.RELEASE.jar
  % Total    % Received % Xferd  Average Speed   Time    Time     Time  Current
                                 Dload  Upload   Total   Spent    Left  Speed

  0     0    0     0    0     0      0      0 --:--:-- --:--:-- --:--:--     0
100 30531    0     0  100 30531      0   145k --:--:-- --:--:-- --:--:--  145k
100 68433  100 37902  100 30531  37164  29936  0:00:01  0:00:01 --:--:-- 37195
:util:org.eclipse.virgo.util.jmx:sourcesJar
:util:org.eclipse.virgo.util.jmx:assemble
:util:org.eclipse.virgo.util.jmx:compileTestAspect
:util:org.eclipse.virgo.util.jmx:compileTestJava
:util:org.eclipse.virgo.util.jmx:processTestResources UP-TO-DATE
:util:org.eclipse.virgo.util.jmx:testClasses
:util:org.eclipse.virgo.util.jmx:test
:util:org.eclipse.virgo.util.jmx:check
:util:org.eclipse.virgo.util.jmx:build
|--> Signing Jar File: /jobs/genie.virgo/3.7.0.Milestones/workspace/util/org.eclipse.virgo.util.jmx/build/libs/org.eclipse.virgo.util.jmx-3.7.0.RELEASE.jar
  % Total    % Received % Xferd  Average Speed   Time    Time     Time  Current
                                 Dload  Upload   Total   Spent    Left  Speed

  0     0    0     0    0     0      0      0 --:--:-- --:--:-- --:--:--     0
100  4757    0     0  100  4757      0  23226 --:--:-- --:--:-- --:--:-- 23204
100 15336  100 10579  100  4757  11154   5015 --:--:-- --:--:-- --:--:-- 11147
:util:org.eclipse.virgo.util.math:sourcesJar
:util:org.eclipse.virgo.util.math:assemble
:util:org.eclipse.virgo.util.math:compileTestJava
:util:org.eclipse.virgo.util.math:processTestResources UP-TO-DATE
:util:org.eclipse.virgo.util.math:testClasses
:util:org.eclipse.virgo.util.math:test
:util:org.eclipse.virgo.util.math:check
:util:org.eclipse.virgo.util.math:build
|--> Signing Jar File: /jobs/genie.virgo/3.7.0.Milestones/workspace/util/org.eclipse.virgo.util.math/build/libs/org.eclipse.virgo.util.math-3.7.0.RELEASE.jar
  % Total    % Received % Xferd  Average Speed   Time    Time     Time  Current
                                 Dload  Upload   Total   Spent    Left  Speed

  0     0    0     0    0     0      0      0 --:--:-- --:--:-- --:--:--     0
100  9443    0     0  100  9443      0   9379  0:00:01  0:00:01 --:--:--  9386
100 25192  100 15749  100  9443  13657   8188  0:00:01  0:00:01 --:--:-- 13659
:util:org.eclipse.virgo.util.osgi:sourcesJar
:util:org.eclipse.virgo.util.osgi:assemble
:util:org.eclipse.virgo.util.osgi:compileTestJava
:util:org.eclipse.virgo.util.osgi:processTestResources
:util:org.eclipse.virgo.util.osgi:testClasses
:util:org.eclipse.virgo.util.osgi:test
:util:org.eclipse.virgo.util.osgi:check
:util:org.eclipse.virgo.util.osgi:build
|--> Signing Jar File: /jobs/genie.virgo/3.7.0.Milestones/workspace/util/org.eclipse.virgo.util.osgi/build/libs/org.eclipse.virgo.util.osgi-3.7.0.RELEASE.jar
  % Total    % Received % Xferd  Average Speed   Time    Time     Time  Current
                                 Dload  Upload   Total   Spent    Left  Speed

  0     0    0     0    0     0      0      0 --:--:-- --:--:-- --:--:--     0
100  3130    0     0  100  3130      0   3108  0:00:01  0:00:01 --:--:--  3111
100 11950  100  8820  100  3130   8725   3096  0:00:01  0:00:01 --:--:--  8732
:util:org.eclipse.virgo.util.osgi.manifest:sourcesJar
:util:org.eclipse.virgo.util.osgi.manifest:assemble
:util:org.eclipse.virgo.util.osgi.manifest:compileTestJava
:util:org.eclipse.virgo.util.osgi.manifest:processTestResources
:util:org.eclipse.virgo.util.osgi.manifest:testClasses
:util:org.eclipse.virgo.util.osgi.manifest:test
:util:org.eclipse.virgo.util.osgi.manifest:check
:util:org.eclipse.virgo.util.osgi.manifest:build
|--> Signing Jar File: /jobs/genie.virgo/3.7.0.Milestones/workspace/util/org.eclipse.virgo.util.osgi.manifest/build/libs/org.eclipse.virgo.util.osgi.manifest-3.7.0.RELEASE.jar
  % Total    % Received % Xferd  Average Speed   Time    Time     Time  Current
                                 Dload  Upload   Total   Spent    Left  Speed

  0     0    0     0    0     0      0      0 --:--:-- --:--:-- --:--:--     0
100 92833    0     0  100 92833      0   442k --:--:-- --:--:-- --:--:--  442k
 46  194k    0     0  100 92833      0  77131  0:00:01  0:00:01 --:--:-- 77103
100  194k  100  103k  100 92833  88051  76923  0:00:01  0:00:01 --:--:-- 88038
:util:org.eclipse.virgo.util.parser.launcher:sourcesJar
:util:org.eclipse.virgo.util.parser.launcher:assemble
:util:org.eclipse.virgo.util.parser.launcher:compileTestJava
:util:org.eclipse.virgo.util.parser.launcher:processTestResources
:util:org.eclipse.virgo.util.parser.launcher:testClasses
:util:org.eclipse.virgo.util.parser.launcher:test
:util:org.eclipse.virgo.util.parser.launcher:check
:util:org.eclipse.virgo.util.parser.launcher:build
|--> Signing Jar File: /jobs/genie.virgo/3.7.0.Milestones/workspace/util/org.eclipse.virgo.util.parser.launcher/build/libs/org.eclipse.virgo.util.parser.launcher-3.7.0.RELEASE.jar
  % Total    % Received % Xferd  Average Speed   Time    Time     Time  Current
                                 Dload  Upload   Total   Spent    Left  Speed

  0     0    0     0    0     0      0      0 --:--:-- --:--:-- --:--:--     0
100  8081    0     0  100  8081      0   8026  0:00:01  0:00:01 --:--:--  8032
100 22195  100 14114  100  8081  11623   6655  0:00:01  0:00:01 --:--:-- 11626
:util:org.eclipse.virgo.util.parser.manifest:sourcesJar
:util:org.eclipse.virgo.util.parser.manifest:assemble
:util:org.eclipse.virgo.util.parser.manifest:compileTestJava
:util:org.eclipse.virgo.util.parser.manifest:processTestResources
:util:org.eclipse.virgo.util.parser.manifest:testClasses
:util:org.eclipse.virgo.util.parser.manifest:test
:util:org.eclipse.virgo.util.parser.manifest:check
:util:org.eclipse.virgo.util.parser.manifest:build
|--> Signing Jar File: /jobs/genie.virgo/3.7.0.Milestones/workspace/util/org.eclipse.virgo.util.parser.manifest/build/libs/org.eclipse.virgo.util.parser.manifest-3.7.0.RELEASE.jar
  % Total    % Received % Xferd  Average Speed   Time    Time     Time  Current
                                 Dload  Upload   Total   Spent    Left  Speed

  0     0    0     0    0     0      0      0 --:--:-- --:--:-- --:--:--     0
 43 58616    0     0  100 25688      0  27527 --:--:-- --:--:-- --:--:-- 27503
100 58616  100 32928  100 25688  35251  27500 --:--:-- --:--:-- --:--:-- 35254
:web:org.eclipse.virgo.web.core:sourcesJar
:web:org.eclipse.virgo.web.core:assemble
:web:org.eclipse.virgo.web.core:compileTestJava
:web:org.eclipse.virgo.web.core:processTestResources UP-TO-DATE
:web:org.eclipse.virgo.web.core:testClasses
:web:org.eclipse.virgo.web.core:test
:web:org.eclipse.virgo.web.core:check
:web:org.eclipse.virgo.web.core:build
|--> Signing Jar File: /jobs/genie.virgo/3.7.0.Milestones/workspace/web/org.eclipse.virgo.web.core/build/libs/org.eclipse.virgo.web.core-3.7.0.RELEASE.jar
  % Total    % Received % Xferd  Average Speed   Time    Time     Time  Current
                                 Dload  Upload   Total   Spent    Left  Speed

  0     0    0     0    0     0      0      0 --:--:-- --:--:-- --:--:--     0
 43 58758    0     0  100 25656      0  27149 --:--:-- --:--:-- --:--:-- 27149
100 58758  100 33102  100 25656  34989  27119 --:--:-- --:--:-- --:--:-- 34991
:web:org.eclipse.virgo.web.dm:sourcesJar
:web:org.eclipse.virgo.web.dm:assemble
:web:org.eclipse.virgo.web.dm:compileTestJavaincorrect classpath: /jobs/genie.virgo/3.7.0.Milestones/workspace/web/org.eclipse.virgo.web.dm/build/resources/main

:web:org.eclipse.virgo.web.dm:processTestResources UP-TO-DATE
:web:org.eclipse.virgo.web.dm:testClasses
:web:org.eclipse.virgo.web.dm:test
:web:org.eclipse.virgo.web.dm:check
:web:org.eclipse.virgo.web.dm:build
|--> Signing Jar File: /jobs/genie.virgo/3.7.0.Milestones/workspace/web/org.eclipse.virgo.web.dm/build/libs/org.eclipse.virgo.web.dm-3.7.0.RELEASE.jar
  % Total    % Received % Xferd  Average Speed   Time    Time     Time  Current
                                 Dload  Upload   Total   Spent    Left  Speed

  0     0    0     0    0     0      0      0 --:--:-- --:--:-- --:--:--     0
100  5421    0     0  100  5421      0  26469 --:--:-- --:--:-- --:--:-- 26443
100 16452  100 11031  100  5421  11288   5547 --:--:-- --:--:-- --:--:-- 11279
:web:org.eclipse.virgo.web.enterprise.appdeployer:sourcesJar
:web:org.eclipse.virgo.web.enterprise.appdeployer:assemble
:web:org.eclipse.virgo.web.enterprise.appdeployer:compileTestJava UP-TO-DATE
:web:org.eclipse.virgo.web.enterprise.appdeployer:processTestResources UP-TO-DATE
:web:org.eclipse.virgo.web.enterprise.appdeployer:testClasses UP-TO-DATE
:web:org.eclipse.virgo.web.enterprise.appdeployer:test UP-TO-DATE
:web:org.eclipse.virgo.web.enterprise.appdeployer:check UP-TO-DATE
:web:org.eclipse.virgo.web.enterprise.appdeployer:build
|--> Signing Jar File: /jobs/genie.virgo/3.7.0.Milestones/workspace/web/org.eclipse.virgo.web.enterprise.appdeployer/build/libs/org.eclipse.virgo.web.enterprise.appdeployer-3.7.0.RELEASE.jar
  % Total    % Received % Xferd  Average Speed   Time    Time     Time  Current
                                 Dload  Upload   Total   Spent    Left  Speed

  0     0    0     0    0     0      0      0 --:--:-- --:--:-- --:--:--     0
100 28819    0     0  100 28819      0   137k --:--:-- --:--:-- --:--:--  136k
100 64259  100 35440  100 28819  35575  28928 --:--:-- --:--:-- --:--:-- 35546
:web:org.eclipse.virgo.web.enterprise.applistener:sourcesJar
:web:org.eclipse.virgo.web.enterprise.applistener:assemble
:web:org.eclipse.virgo.web.enterprise.applistener:compileTestJava UP-TO-DATE
:web:org.eclipse.virgo.web.enterprise.applistener:processTestResources UP-TO-DATE
:web:org.eclipse.virgo.web.enterprise.applistener:testClasses UP-TO-DATE
:web:org.eclipse.virgo.web.enterprise.applistener:test UP-TO-DATE
:web:org.eclipse.virgo.web.enterprise.applistener:check UP-TO-DATE
:web:org.eclipse.virgo.web.enterprise.applistener:build
|--> Signing Jar File: /jobs/genie.virgo/3.7.0.Milestones/workspace/web/org.eclipse.virgo.web.enterprise.applistener/build/libs/org.eclipse.virgo.web.enterprise.applistener-3.7.0.RELEASE.jar
  % Total    % Received % Xferd  Average Speed   Time    Time     Time  Current
                                 Dload  Upload   Total   Spent    Left  Speed

  0     0    0     0    0     0      0      0 --:--:-- --:--:-- --:--:--     0
100  6285    0     0  100  6285      0  30715 --:--:-- --:--:-- --:--:-- 30658
100 18436  100 12151  100  6285  12849   6646 --:--:-- --:--:-- --:--:-- 12844
:web:org.eclipse.virgo.web.enterprise.catalina.fragment.webbeans:sourcesJar
:web:org.eclipse.virgo.web.enterprise.catalina.fragment.webbeans:assemble
:web:org.eclipse.virgo.web.enterprise.catalina.fragment.webbeans:compileTestJava UP-TO-DATE
:web:org.eclipse.virgo.web.enterprise.catalina.fragment.webbeans:processTestResources UP-TO-DATE
:web:org.eclipse.virgo.web.enterprise.catalina.fragment.webbeans:testClasses UP-TO-DATE
:web:org.eclipse.virgo.web.enterprise.catalina.fragment.webbeans:test UP-TO-DATE
:web:org.eclipse.virgo.web.enterprise.catalina.fragment.webbeans:check UP-TO-DATE
:web:org.eclipse.virgo.web.enterprise.catalina.fragment.webbeans:build
|--> Signing Jar File: /jobs/genie.virgo/3.7.0.Milestones/workspace/web/org.eclipse.virgo.web.enterprise.catalina.fragment.webbeans/build/libs/org.eclipse.virgo.web.enterprise.catalina.fragment.webbeans-3.7.0.RELEASE.jar
  % Total    % Received % Xferd  Average Speed   Time    Time     Time  Current
                                 Dload  Upload   Total   Spent    Left  Speed

  0     0    0     0    0     0      0      0 --:--:-- --:--:-- --:--:--     0
100  1546    0     0  100  1546      0   1535  0:00:01  0:00:01 --:--:--  1536
100  8502  100  6956  100  1546   5791   1287  0:00:01  0:00:01 --:--:--  5796
:web:org.eclipse.virgo.web.enterprise.javax.persistence.extension:sourcesJar
:web:org.eclipse.virgo.web.enterprise.javax.persistence.extension:assemble
:web:org.eclipse.virgo.web.enterprise.javax.persistence.extension:compileTestJava----------
1. WARNING in /jobs/genie.virgo/3.7.0.Milestones/workspace/web/org.eclipse.virgo.web.enterprise.javax.persistence.extension/src/test/java/org/eclipse/virgo/web/enterprise/javax/persistence/extension/TestPersistenceProvider.java (at line 40)
	public boolean generateSchema(String arg0, Map arg1) {
	                                           ^^^
Map is a raw type. References to generic type Map<K,V> should be parameterized
----------
2. WARNING in /jobs/genie.virgo/3.7.0.Milestones/workspace/web/org.eclipse.virgo.web.enterprise.javax.persistence.extension/src/test/java/org/eclipse/virgo/web/enterprise/javax/persistence/extension/TestPersistenceProvider.java (at line 45)
	public void generateSchema(PersistenceUnitInfo arg0, Map arg1) {
	                                                     ^^^
Map is a raw type. References to generic type Map<K,V> should be parameterized
----------
2 problems (2 warnings)

:web:org.eclipse.virgo.web.enterprise.javax.persistence.extension:processTestResources UP-TO-DATE
:web:org.eclipse.virgo.web.enterprise.javax.persistence.extension:testClasses
:web:org.eclipse.virgo.web.enterprise.javax.persistence.extension:test
:web:org.eclipse.virgo.web.enterprise.javax.persistence.extension:check
:web:org.eclipse.virgo.web.enterprise.javax.persistence.extension:build
|--> Signing Jar File: /jobs/genie.virgo/3.7.0.Milestones/workspace/web/org.eclipse.virgo.web.enterprise.javax.persistence.extension/build/libs/org.eclipse.virgo.web.enterprise.javax.persistence.extension-3.7.0.RELEASE.jar
  % Total    % Received % Xferd  Average Speed   Time    Time     Time  Current
                                 Dload  Upload   Total   Spent    Left  Speed

  0     0    0     0    0     0      0      0 --:--:-- --:--:-- --:--:--     0
100  9861    0     0  100  9861      0   9795  0:00:01  0:00:01 --:--:--  9802
100 25799  100 15938  100  9861  15099   9342  0:00:01  0:00:01 --:--:-- 15107
:web:org.eclipse.virgo.web.enterprise.javax.persistence.provider.initializer:sourcesJar
:web:org.eclipse.virgo.web.enterprise.javax.persistence.provider.initializer:assemble
:web:org.eclipse.virgo.web.enterprise.javax.persistence.provider.initializer:compileTestJava
:web:org.eclipse.virgo.web.enterprise.javax.persistence.provider.initializer:processTestResources UP-TO-DATE
:web:org.eclipse.virgo.web.enterprise.javax.persistence.provider.initializer:testClasses
:web:org.eclipse.virgo.web.enterprise.javax.persistence.provider.initializer:test
:web:org.eclipse.virgo.web.enterprise.javax.persistence.provider.initializer:check
:web:org.eclipse.virgo.web.enterprise.javax.persistence.provider.initializer:build
|--> Signing Jar File: /jobs/genie.virgo/3.7.0.Milestones/workspace/web/org.eclipse.virgo.web.enterprise.javax.persistence.provider.initializer/build/libs/org.eclipse.virgo.web.enterprise.javax.persistence.provider.initializer-3.7.0.RELEASE.jar
  % Total    % Received % Xferd  Average Speed   Time    Time     Time  Current
                                 Dload  Upload   Total   Spent    Left  Speed

  0     0    0     0    0     0      0      0 --:--:-- --:--:-- --:--:--     0
100  4028    0     0  100  4028      0   4004  0:00:01  0:00:01 --:--:--  4007
100 13808  100  9780  100  4028   8492   3497  0:00:01  0:00:01 --:--:--  8496
:web:org.eclipse.virgo.web.enterprise.jsf.support:sourcesJar
:web:org.eclipse.virgo.web.enterprise.jsf.support:assemble
:web:org.eclipse.virgo.web.enterprise.jsf.support:compileTestJava UP-TO-DATE
:web:org.eclipse.virgo.web.enterprise.jsf.support:processTestResources UP-TO-DATE
:web:org.eclipse.virgo.web.enterprise.jsf.support:testClasses UP-TO-DATE
:web:org.eclipse.virgo.web.enterprise.jsf.support:test UP-TO-DATE
:web:org.eclipse.virgo.web.enterprise.jsf.support:check UP-TO-DATE
:web:org.eclipse.virgo.web.enterprise.jsf.support:build
|--> Signing Jar File: /jobs/genie.virgo/3.7.0.Milestones/workspace/web/org.eclipse.virgo.web.enterprise.jsf.support/build/libs/org.eclipse.virgo.web.enterprise.jsf.support-3.7.0.RELEASE.jar
  % Total    % Received % Xferd  Average Speed   Time    Time     Time  Current
                                 Dload  Upload   Total   Spent    Left  Speed

  0     0    0     0    0     0      0      0 --:--:-- --:--:-- --:--:--     0
100  7297    0     0  100  7297      0   7247  0:00:01  0:00:01 --:--:--  7253
100 20335  100 13038  100  7297  11323   6337  0:00:01  0:00:01 --:--:-- 11327
:web:org.eclipse.virgo.web.enterprise.openejb.fragment.bval:sourcesJar
:web:org.eclipse.virgo.web.enterprise.openejb.fragment.bval:assemble
:web:org.eclipse.virgo.web.enterprise.openejb.fragment.bval:compileTestJava UP-TO-DATE
:web:org.eclipse.virgo.web.enterprise.openejb.fragment.bval:processTestResources UP-TO-DATE
:web:org.eclipse.virgo.web.enterprise.openejb.fragment.bval:testClasses UP-TO-DATE
:web:org.eclipse.virgo.web.enterprise.openejb.fragment.bval:test UP-TO-DATE
:web:org.eclipse.virgo.web.enterprise.openejb.fragment.bval:check UP-TO-DATE
:web:org.eclipse.virgo.web.enterprise.openejb.fragment.bval:build
|--> Signing Jar File: /jobs/genie.virgo/3.7.0.Milestones/workspace/web/org.eclipse.virgo.web.enterprise.openejb.fragment.bval/build/libs/org.eclipse.virgo.web.enterprise.openejb.fragment.bval-3.7.0.RELEASE.jar
  % Total    % Received % Xferd  Average Speed   Time    Time     Time  Current
                                 Dload  Upload   Total   Spent    Left  Speed

  0     0    0     0    0     0      0      0 --:--:-- --:--:-- --:--:--     0
 20  9360    0     0  100  1879      0   1867  0:00:01  0:00:01 --:--:--  1869
100  9360  100  7481  100  1879   7429   1865  0:00:01  0:00:01 --:--:--  7436
:web:org.eclipse.virgo.web.enterprise.openejb.fragment.jotm:sourcesJar
:web:org.eclipse.virgo.web.enterprise.openejb.fragment.jotm:assemble
:web:org.eclipse.virgo.web.enterprise.openejb.fragment.jotm:compileTestJava UP-TO-DATE
:web:org.eclipse.virgo.web.enterprise.openejb.fragment.jotm:processTestResources UP-TO-DATE
:web:org.eclipse.virgo.web.enterprise.openejb.fragment.jotm:testClasses UP-TO-DATE
:web:org.eclipse.virgo.web.enterprise.openejb.fragment.jotm:test UP-TO-DATE
:web:org.eclipse.virgo.web.enterprise.openejb.fragment.jotm:check UP-TO-DATE
:web:org.eclipse.virgo.web.enterprise.openejb.fragment.jotm:build
|--> Signing Jar File: /jobs/genie.virgo/3.7.0.Milestones/workspace/web/org.eclipse.virgo.web.enterprise.openejb.fragment.jotm/build/libs/org.eclipse.virgo.web.enterprise.openejb.fragment.jotm-3.7.0.RELEASE.jar
  % Total    % Received % Xferd  Average Speed   Time    Time     Time  Current
                                 Dload  Upload   Total   Spent    Left  Speed

  0     0    0     0    0     0      0      0 --:--:-- --:--:-- --:--:--     0
100  3900    0     0  100  3900      0   3874  0:00:01  0:00:01 --:--:--  3876
100 13677  100  9777  100  3900   8688   3465  0:00:01  0:00:01 --:--:--  8690
:web:org.eclipse.virgo.web.enterprise.openejb.fragment.jpa:sourcesJar
:web:org.eclipse.virgo.web.enterprise.openejb.fragment.jpa:assemble
:web:org.eclipse.virgo.web.enterprise.openejb.fragment.jpa:compileTestJava UP-TO-DATE
:web:org.eclipse.virgo.web.enterprise.openejb.fragment.jpa:processTestResources UP-TO-DATE
:web:org.eclipse.virgo.web.enterprise.openejb.fragment.jpa:testClasses UP-TO-DATE
:web:org.eclipse.virgo.web.enterprise.openejb.fragment.jpa:test UP-TO-DATE
:web:org.eclipse.virgo.web.enterprise.openejb.fragment.jpa:check UP-TO-DATE
:web:org.eclipse.virgo.web.enterprise.openejb.fragment.jpa:build
|--> Signing Jar File: /jobs/genie.virgo/3.7.0.Milestones/workspace/web/org.eclipse.virgo.web.enterprise.openejb.fragment.jpa/build/libs/org.eclipse.virgo.web.enterprise.openejb.fragment.jpa-3.7.0.RELEASE.jar
  % Total    % Received % Xferd  Average Speed   Time    Time     Time  Current
                                 Dload  Upload   Total   Spent    Left  Speed

  0     0    0     0    0     0      0      0 --:--:-- --:--:-- --:--:--     0
100  1542    0     0  100  1542      0   1531  0:00:01  0:00:01 --:--:--  1532
100  8497  100  6955  100  1542   5887   1305  0:00:01  0:00:01 --:--:--  5889
:web:org.eclipse.virgo.web.enterprise.openejb.fragment.webbeans:sourcesJar
:web:org.eclipse.virgo.web.enterprise.openejb.fragment.webbeans:assemble
:web:org.eclipse.virgo.web.enterprise.openejb.fragment.webbeans:compileTestJava UP-TO-DATE
:web:org.eclipse.virgo.web.enterprise.openejb.fragment.webbeans:processTestResources UP-TO-DATE
:web:org.eclipse.virgo.web.enterprise.openejb.fragment.webbeans:testClasses UP-TO-DATE
:web:org.eclipse.virgo.web.enterprise.openejb.fragment.webbeans:test UP-TO-DATE
:web:org.eclipse.virgo.web.enterprise.openejb.fragment.webbeans:check UP-TO-DATE
:web:org.eclipse.virgo.web.enterprise.openejb.fragment.webbeans:build
|--> Signing Jar File: /jobs/genie.virgo/3.7.0.Milestones/workspace/web/org.eclipse.virgo.web.enterprise.openejb.fragment.webbeans/build/libs/org.eclipse.virgo.web.enterprise.openejb.fragment.webbeans-3.7.0.RELEASE.jar
  % Total    % Received % Xferd  Average Speed   Time    Time     Time  Current
                                 Dload  Upload   Total   Spent    Left  Speed

  0     0    0     0    0     0      0      0 --:--:-- --:--:-- --:--:--     0
100  1971    0     0  100  1971      0   1958  0:00:01  0:00:01 --:--:--  1959
100  1971    0     0  100  1971      0    981  0:00:02  0:00:02 --:--:--   982
100  9547  100  7576  100  1971   3551    924  0:00:02  0:00:02 --:--:--  3553
:web:org.eclipse.virgo.web.enterprise.openejb.initialiser:sourcesJar
:web:org.eclipse.virgo.web.enterprise.openejb.initialiser:assemble
:web:org.eclipse.virgo.web.enterprise.openejb.initialiser:compileTestJava UP-TO-DATE
:web:org.eclipse.virgo.web.enterprise.openejb.initialiser:processTestResources UP-TO-DATE
:web:org.eclipse.virgo.web.enterprise.openejb.initialiser:testClasses UP-TO-DATE
:web:org.eclipse.virgo.web.enterprise.openejb.initialiser:test UP-TO-DATE
:web:org.eclipse.virgo.web.enterprise.openejb.initialiser:check UP-TO-DATE
:web:org.eclipse.virgo.web.enterprise.openejb.initialiser:build
|--> Signing Jar File: /jobs/genie.virgo/3.7.0.Milestones/workspace/web/org.eclipse.virgo.web.enterprise.openejb.initialiser/build/libs/org.eclipse.virgo.web.enterprise.openejb.initialiser-3.7.0.RELEASE.jar
  % Total    % Received % Xferd  Average Speed   Time    Time     Time  Current
                                 Dload  Upload   Total   Spent    Left  Speed

  0     0    0     0    0     0      0      0 --:--:-- --:--:-- --:--:--     0
100  9306    0     0  100  9306      0  45488 --:--:-- --:--:-- --:--:-- 45395
100 24819  100 15513  100  9306  16801  10078 --:--:-- --:--:-- --:--:-- 16788
:web:org.eclipse.virgo.web.enterprise.openejb.jpa.integration:sourcesJar
:web:org.eclipse.virgo.web.enterprise.openejb.jpa.integration:assemble
:web:org.eclipse.virgo.web.enterprise.openejb.jpa.integration:compileTestJava UP-TO-DATE
:web:org.eclipse.virgo.web.enterprise.openejb.jpa.integration:processTestResources UP-TO-DATE
:web:org.eclipse.virgo.web.enterprise.openejb.jpa.integration:testClasses UP-TO-DATE
:web:org.eclipse.virgo.web.enterprise.openejb.jpa.integration:test UP-TO-DATE
:web:org.eclipse.virgo.web.enterprise.openejb.jpa.integration:check UP-TO-DATE
:web:org.eclipse.virgo.web.enterprise.openejb.jpa.integration:build
|--> Signing Jar File: /jobs/genie.virgo/3.7.0.Milestones/workspace/web/org.eclipse.virgo.web.enterprise.openejb.jpa.integration/build/libs/org.eclipse.virgo.web.enterprise.openejb.jpa.integration-3.7.0.RELEASE.jar
  % Total    % Received % Xferd  Average Speed   Time    Time     Time  Current
                                 Dload  Upload   Total   Spent    Left  Speed

  0     0    0     0    0     0      0      0 --:--:-- --:--:-- --:--:--     0
100  5892    0     0  100  5892      0  28781 --:--:-- --:--:-- --:--:-- 28741
100 17794  100 11902  100  5892  10427   5162  0:00:01  0:00:01 --:--:-- 10431
:web:org.eclipse.virgo.web.enterprise.openejb.tomcat.factory:sourcesJar
:web:org.eclipse.virgo.web.enterprise.openejb.tomcat.factory:assemble
:web:org.eclipse.virgo.web.enterprise.openejb.tomcat.factory:compileTestJava
:web:org.eclipse.virgo.web.enterprise.openejb.tomcat.factory:processTestResources UP-TO-DATE
:web:org.eclipse.virgo.web.enterprise.openejb.tomcat.factory:testClasses
:web:org.eclipse.virgo.web.enterprise.openejb.tomcat.factory:test
:web:org.eclipse.virgo.web.enterprise.openejb.tomcat.factory:check
:web:org.eclipse.virgo.web.enterprise.openejb.tomcat.factory:build
|--> Signing Jar File: /jobs/genie.virgo/3.7.0.Milestones/workspace/web/org.eclipse.virgo.web.enterprise.openejb.tomcat.factory/build/libs/org.eclipse.virgo.web.enterprise.openejb.tomcat.factory-3.7.0.RELEASE.jar
  % Total    % Received % Xferd  Average Speed   Time    Time     Time  Current
                                 Dload  Upload   Total   Spent    Left  Speed

  0     0    0     0    0     0      0      0 --:--:-- --:--:-- --:--:--     0
100  4425    0     0  100  4425      0   4395  0:00:01  0:00:01 --:--:--  4398
100 14747  100 10322  100  4425   9007   3861  0:00:01  0:00:01 --:--:--  9014
:web:org.eclipse.virgo.web.enterprise.openwebbeans.initialiser:sourcesJar
:web:org.eclipse.virgo.web.enterprise.openwebbeans.initialiser:assemble
:web:org.eclipse.virgo.web.enterprise.openwebbeans.initialiser:compileTestJava UP-TO-DATE
:web:org.eclipse.virgo.web.enterprise.openwebbeans.initialiser:processTestResources UP-TO-DATE
:web:org.eclipse.virgo.web.enterprise.openwebbeans.initialiser:testClasses UP-TO-DATE
:web:org.eclipse.virgo.web.enterprise.openwebbeans.initialiser:test UP-TO-DATE
:web:org.eclipse.virgo.web.enterprise.openwebbeans.initialiser:check UP-TO-DATE
:web:org.eclipse.virgo.web.enterprise.openwebbeans.initialiser:build
|--> Signing Jar File: /jobs/genie.virgo/3.7.0.Milestones/workspace/web/org.eclipse.virgo.web.enterprise.openwebbeans.initialiser/build/libs/org.eclipse.virgo.web.enterprise.openwebbeans.initialiser-3.7.0.RELEASE.jar
  % Total    % Received % Xferd  Average Speed   Time    Time     Time  Current
                                 Dload  Upload   Total   Spent    Left  Speed

  0     0    0     0    0     0      0      0 --:--:-- --:--:-- --:--:--     0
100 11400    0     0  100 11400      0  11331  0:00:01  0:00:01 --:--:-- 11343
100 29041  100 17641  100 11400  13670   8834  0:00:01  0:00:01 --:--:-- 13675
:web:org.eclipse.virgo.web.enterprise.persistence.openejb.classloading.hook:sourcesJar
:web:org.eclipse.virgo.web.enterprise.persistence.openejb.classloading.hook:assemble
:web:org.eclipse.virgo.web.enterprise.persistence.openejb.classloading.hook:compileTestJava
:web:org.eclipse.virgo.web.enterprise.persistence.openejb.classloading.hook:processTestResources UP-TO-DATE
:web:org.eclipse.virgo.web.enterprise.persistence.openejb.classloading.hook:testClasses
:web:org.eclipse.virgo.web.enterprise.persistence.openejb.classloading.hook:test
:web:org.eclipse.virgo.web.enterprise.persistence.openejb.classloading.hook:check
:web:org.eclipse.virgo.web.enterprise.persistence.openejb.classloading.hook:build
|--> Signing Jar File: /jobs/genie.virgo/3.7.0.Milestones/workspace/web/org.eclipse.virgo.web.enterprise.persistence.openejb.classloading.hook/build/libs/org.eclipse.virgo.web.enterprise.persistence.openejb.classloading.hook-3.7.0.RELEASE.jar
  % Total    % Received % Xferd  Average Speed   Time    Time     Time  Current
                                 Dload  Upload   Total   Spent    Left  Speed

  0     0    0     0    0     0      0      0 --:--:-- --:--:-- --:--:--     0
100  8449    0     0  100  8449      0   8393  0:00:01  0:00:01 --:--:--  8398
100 23030  100 14581  100  8449  12832   7435  0:00:01  0:00:01 --:--:-- 12835
:web:org.eclipse.virgo.web.enterprise.security:sourcesJar
:web:org.eclipse.virgo.web.enterprise.security:assemble
:web:org.eclipse.virgo.web.enterprise.security:compileTestJava----------
1. WARNING in /jobs/genie.virgo/3.7.0.Milestones/workspace/web/org.eclipse.virgo.web.enterprise.security/src/test/java/org/eclipse/virgo/web/enterprise/security/StandardSecurityServiceTest.java (at line 193)
	ThreadLocal<Wrapper> wrapperLocal = (ThreadLocal<Wrapper>) wrapper; 
	                                    ^^^^^^^^^^^^^^^^^^^^^^^^^^^^^^
Type safety: Unchecked cast from Object to ThreadLocal<Wrapper>
----------
1 problem (1 warning)

:web:org.eclipse.virgo.web.enterprise.security:processTestResources UP-TO-DATE
:web:org.eclipse.virgo.web.enterprise.security:testClasses
:web:org.eclipse.virgo.web.enterprise.security:test
:web:org.eclipse.virgo.web.enterprise.security:check
:web:org.eclipse.virgo.web.enterprise.security:build
|--> Signing Jar File: /jobs/genie.virgo/3.7.0.Milestones/workspace/web/org.eclipse.virgo.web.enterprise.security/build/libs/org.eclipse.virgo.web.enterprise.security-3.7.0.RELEASE.jar
  % Total    % Received % Xferd  Average Speed   Time    Time     Time  Current
                                 Dload  Upload   Total   Spent    Left  Speed

  0     0    0     0    0     0      0      0 --:--:-- --:--:-- --:--:--     0
100 10044    0     0  100 10044      0  49066 --:--:-- --:--:-- --:--:-- 48995
 38 26409    0     0  100 10044      0   8097  0:00:01  0:00:01 --:--:--  8093
100 26409  100 16365  100 10044  13184   8091  0:00:01  0:00:01 --:--:-- 13176
:web:org.eclipse.virgo.web.enterprise.security.openejb.classloading.hook:sourcesJar
:web:org.eclipse.virgo.web.enterprise.security.openejb.classloading.hook:assemble
:web:org.eclipse.virgo.web.enterprise.security.openejb.classloading.hook:compileTestJava UP-TO-DATE
:web:org.eclipse.virgo.web.enterprise.security.openejb.classloading.hook:processTestResources UP-TO-DATE
:web:org.eclipse.virgo.web.enterprise.security.openejb.classloading.hook:testClasses UP-TO-DATE
:web:org.eclipse.virgo.web.enterprise.security.openejb.classloading.hook:test UP-TO-DATE
:web:org.eclipse.virgo.web.enterprise.security.openejb.classloading.hook:check UP-TO-DATE
:web:org.eclipse.virgo.web.enterprise.security.openejb.classloading.hook:build
|--> Signing Jar File: /jobs/genie.virgo/3.7.0.Milestones/workspace/web/org.eclipse.virgo.web.enterprise.security.openejb.classloading.hook/build/libs/org.eclipse.virgo.web.enterprise.security.openejb.classloading.hook-3.7.0.RELEASE.jar
  % Total    % Received % Xferd  Average Speed   Time    Time     Time  Current
                                 Dload  Upload   Total   Spent    Left  Speed

  0     0    0     0    0     0      0      0 --:--:-- --:--:-- --:--:--     0
 31 15742    0     0  100  4914      0   5159 --:--:-- --:--:-- --:--:--  5156
100 15742  100 10828  100  4914  11362   5156 --:--:-- --:--:-- --:--:-- 11362
:web:org.eclipse.virgo.web.enterprise.security.valve:sourcesJar
:web:org.eclipse.virgo.web.enterprise.security.valve:assemble
:web:org.eclipse.virgo.web.enterprise.security.valve:compileTestJava UP-TO-DATE
:web:org.eclipse.virgo.web.enterprise.security.valve:processTestResources UP-TO-DATE
:web:org.eclipse.virgo.web.enterprise.security.valve:testClasses UP-TO-DATE
:web:org.eclipse.virgo.web.enterprise.security.valve:test UP-TO-DATE
:web:org.eclipse.virgo.web.enterprise.security.valve:check UP-TO-DATE
:web:org.eclipse.virgo.web.enterprise.security.valve:build
|--> Signing Jar File: /jobs/genie.virgo/3.7.0.Milestones/workspace/web/org.eclipse.virgo.web.enterprise.security.valve/build/libs/org.eclipse.virgo.web.enterprise.security.valve-3.7.0.RELEASE.jar
  % Total    % Received % Xferd  Average Speed   Time    Time     Time  Current
                                 Dload  Upload   Total   Spent    Left  Speed

  0     0    0     0    0     0      0      0 --:--:-- --:--:-- --:--:--     0
100  3844    0     0  100  3844      0   3818  0:00:01  0:00:01 --:--:--  3821
100 13427  100  9583  100  3844   8239   3305  0:00:01  0:00:01 --:--:--  8246
:web:org.eclipse.virgo.web.enterprise.services.accessor:sourcesJar
:web:org.eclipse.virgo.web.enterprise.services.accessor:assemble
:web:org.eclipse.virgo.web.enterprise.services.accessor:compileTestJava----------
1. WARNING in /jobs/genie.virgo/3.7.0.Milestones/workspace/web/org.eclipse.virgo.web.enterprise.services.accessor/src/test/java/org/eclipse/virgo/web/enterprise/services/accessor/WebAppBundleClassloaderCustomizerTest.java (at line 94)
	assertTrue(((List<ClassLoaderDelegateHook>) field.get(PluggableDelegatingClassLoaderDelegateHook.getInstance())).contains(webAppBundleClassloaderCustomizer.getWebAppBundleClassLoaderDelegateHook()));
	           ^^^^^^^^^^^^^^^^^^^^^^^^^^^^^^^^^^^^^^^^^^^^^^^^^^^^^^^^^^^^^^^^^^^^^^^^^^^^^^^^^^^^^^^^^^^^^^^^^^^^^
Type safety: Unchecked cast from Object to List<ClassLoaderDelegateHook>
----------
2. WARNING in /jobs/genie.virgo/3.7.0.Milestones/workspace/web/org.eclipse.virgo.web.enterprise.services.accessor/src/test/java/org/eclipse/virgo/web/enterprise/services/accessor/WebAppBundleClassloaderCustomizerTest.java (at line 98)
	assertTrue(((Map<Bundle, Set<String>>) field2.get(webAppBundleClassloaderCustomizer.getWebAppBundleClassLoaderDelegateHook())).containsKey(webBundle));
	           ^^^^^^^^^^^^^^^^^^^^^^^^^^^^^^^^^^^^^^^^^^^^^^^^^^^^^^^^^^^^^^^^^^^^^^^^^^^^^^^^^^^^^^^^^^^^^^^^^^^^^^^^^^^^^^^^^^^
Type safety: Unchecked cast from Object to Map<Bundle,Set<String>>
----------
3. WARNING in /jobs/genie.virgo/3.7.0.Milestones/workspace/web/org.eclipse.virgo.web.enterprise.services.accessor/src/test/java/org/eclipse/virgo/web/enterprise/services/accessor/WebAppBundleClassloaderCustomizerTest.java (at line 104)
	assertTrue(((List<ClassLoaderDelegateHook>) field.get(PluggableDelegatingClassLoaderDelegateHook.getInstance())).isEmpty());
	           ^^^^^^^^^^^^^^^^^^^^^^^^^^^^^^^^^^^^^^^^^^^^^^^^^^^^^^^^^^^^^^^^^^^^^^^^^^^^^^^^^^^^^^^^^^^^^^^^^^^^^
Type safety: Unchecked cast from Object to List<ClassLoaderDelegateHook>
----------
3 problems (3 warnings)

:web:org.eclipse.virgo.web.enterprise.services.accessor:processTestResources UP-TO-DATE
:web:org.eclipse.virgo.web.enterprise.services.accessor:testClasses
:web:org.eclipse.virgo.web.enterprise.services.accessor:test
:web:org.eclipse.virgo.web.enterprise.services.accessor:check
:web:org.eclipse.virgo.web.enterprise.services.accessor:build
|--> Signing Jar File: /jobs/genie.virgo/3.7.0.Milestones/workspace/web/org.eclipse.virgo.web.enterprise.services.accessor/build/libs/org.eclipse.virgo.web.enterprise.services.accessor-3.7.0.RELEASE.jar
  % Total    % Received % Xferd  Average Speed   Time    Time     Time  Current
                                 Dload  Upload   Total   Spent    Left  Speed

  0     0    0     0    0     0      0      0 --:--:-- --:--:-- --:--:--     0
100 32127    0     0  100 32127      0   153k --:--:-- --:--:-- --:--:--  153k
 45 71256    0     0  100 32127      0  26807  0:00:01  0:00:01 --:--:-- 26794
100 71256  100 39129  100 32127  32623  26785  0:00:01  0:00:01 --:--:-- 32607
:web:org.eclipse.virgo.web.servlet.adapter:sourcesJar
:web:org.eclipse.virgo.web.servlet.adapter:assemble
:web:org.eclipse.virgo.web.servlet.adapter:compileTestJava UP-TO-DATE
:web:org.eclipse.virgo.web.servlet.adapter:processTestResources UP-TO-DATE
:web:org.eclipse.virgo.web.servlet.adapter:testClasses UP-TO-DATE
:web:org.eclipse.virgo.web.servlet.adapter:test UP-TO-DATE
:web:org.eclipse.virgo.web.servlet.adapter:check UP-TO-DATE
:web:org.eclipse.virgo.web.servlet.adapter:build
|--> Signing Jar File: /jobs/genie.virgo/3.7.0.Milestones/workspace/web/org.eclipse.virgo.web.servlet.adapter/build/libs/org.eclipse.virgo.web.servlet.adapter-3.7.0.RELEASE.jar
  % Total    % Received % Xferd  Average Speed   Time    Time     Time  Current
                                 Dload  Upload   Total   Spent    Left  Speed

  0     0    0     0    0     0      0      0 --:--:-- --:--:-- --:--:--     0
 17  8431    0     0  100  1501      0   1495  0:00:01  0:00:01 --:--:--  1496
100  8431  100  6930  100  1501   6896   1493  0:00:01  0:00:01 --:--:--  6902
:web:org.eclipse.virgo.web.spring.integration:sourcesJar
:web:org.eclipse.virgo.web.spring.integration:assemble
:web:org.eclipse.virgo.web.spring.integration:compileTestJava UP-TO-DATE
:web:org.eclipse.virgo.web.spring.integration:processTestResources UP-TO-DATE
:web:org.eclipse.virgo.web.spring.integration:testClasses UP-TO-DATE
:web:org.eclipse.virgo.web.spring.integration:test UP-TO-DATE
:web:org.eclipse.virgo.web.spring.integration:check UP-TO-DATE
:web:org.eclipse.virgo.web.spring.integration:build
|--> Signing Jar File: /jobs/genie.virgo/3.7.0.Milestones/workspace/web/org.eclipse.virgo.web.spring.integration/build/libs/org.eclipse.virgo.web.spring.integration-3.7.0.RELEASE.jar
  % Total    % Received % Xferd  Average Speed   Time    Time     Time  Current
                                 Dload  Upload   Total   Spent    Left  Speed

  0     0    0     0    0     0      0      0 --:--:-- --:--:-- --:--:--     0
100  1469    0     0  100  1469      0   1459  0:00:01  0:00:01 --:--:--  1460
100  8363  100  6894  100  1469   5702   1215  0:00:01  0:00:01 --:--:--  5706
:web:org.eclipse.virgo.web.tomcat.support:sourcesJar
:web:org.eclipse.virgo.web.tomcat.support:assemble
:web:org.eclipse.virgo.web.tomcat.support:compileTestJava UP-TO-DATE
:web:org.eclipse.virgo.web.tomcat.support:processTestResources UP-TO-DATE
:web:org.eclipse.virgo.web.tomcat.support:testClasses UP-TO-DATE
:web:org.eclipse.virgo.web.tomcat.support:test UP-TO-DATE
:web:org.eclipse.virgo.web.tomcat.support:check UP-TO-DATE
:web:org.eclipse.virgo.web.tomcat.support:build
|--> Signing Jar File: /jobs/genie.virgo/3.7.0.Milestones/workspace/web/org.eclipse.virgo.web.tomcat.support/build/libs/org.eclipse.virgo.web.tomcat.support-3.7.0.RELEASE.jar
  % Total    % Received % Xferd  Average Speed   Time    Time     Time  Current
                                 Dload  Upload   Total   Spent    Left  Speed

  0     0    0     0    0     0      0      0 --:--:-- --:--:-- --:--:--     0
100 13926    0     0  100 13926      0  13831  0:00:01  0:00:01 --:--:-- 13842
100 34609  100 20683  100 13926  17317  11659  0:00:01  0:00:01 --:--:-- 17322
:web:org.eclipse.virgo.web.war.deployer:sourcesJar
:web:org.eclipse.virgo.web.war.deployer:assemble
:web:org.eclipse.virgo.web.war.deployer:compileTestJava
:web:org.eclipse.virgo.web.war.deployer:processTestResources
:web:org.eclipse.virgo.web.war.deployer:testClasses
:web:org.eclipse.virgo.web.war.deployer:test
:web:org.eclipse.virgo.web.war.deployer:check
:web:org.eclipse.virgo.web.war.deployer:build
|--> Signing Jar File: /jobs/genie.virgo/3.7.0.Milestones/workspace/web/org.eclipse.virgo.web.war.deployer/build/libs/org.eclipse.virgo.web.war.deployer-3.7.0.RELEASE.jar
  % Total    % Received % Xferd  Average Speed   Time    Time     Time  Current
                                 Dload  Upload   Total   Spent    Left  Speed

  0     0    0     0    0     0      0      0 --:--:-- --:--:-- --:--:--     0
100 23316    0     0  100 23316      0   111k --:--:-- --:--:-- --:--:--  111k
 43 53049    0     0  100 23316      0  18866  0:00:01  0:00:01 --:--:-- 18864
100 53049  100 29733  100 23316  24040  18852  0:00:01  0:00:01 --:--:-- 24036
:packaging:jetty-server:org.eclipse.virgo.jetty.smoketest:sourcesJar
:packaging:jetty-server:org.eclipse.virgo.jetty.smoketest:assemble
:packaging:jetty-server:org.eclipse.virgo.jetty.smoketest:compileTestJava UP-TO-DATE
:packaging:jetty-server:org.eclipse.virgo.jetty.smoketest:processTestResources UP-TO-DATE
:packaging:jetty-server:org.eclipse.virgo.jetty.smoketest:testClasses UP-TO-DATE
:packaging:jetty-server:org.eclipse.virgo.jetty.smoketest:test UP-TO-DATE
:packaging:jetty-server:org.eclipse.virgo.jetty.smoketest:check UP-TO-DATE
:packaging:jetty-server:org.eclipse.virgo.jetty.smoketest:build
|--> Signing Jar File: /jobs/genie.virgo/3.7.0.Milestones/workspace/packaging/jetty-server/org.eclipse.virgo.jetty.smoketest/build/libs/org.eclipse.virgo.jetty.smoketest-3.7.0.RELEASE.jar
  % Total    % Received % Xferd  Average Speed   Time    Time     Time  Current
                                 Dload  Upload   Total   Spent    Left  Speed

  0     0    0     0    0     0      0      0 --:--:-- --:--:-- --:--:--     0
  8  6255    0     0  100   504      0    519 --:--:-- --:--:-- --:--:--   519
100  6255  100  5751  100   504   5925    519 --:--:-- --:--:-- --:--:--  5922
:packaging:kernel:org.eclipse.virgo.kernel.smoketest:sourcesJar
:packaging:kernel:org.eclipse.virgo.kernel.smoketest:assemble
:packaging:kernel:org.eclipse.virgo.kernel.smoketest:compileTestJava UP-TO-DATE
:packaging:kernel:org.eclipse.virgo.kernel.smoketest:processTestResources UP-TO-DATE
:packaging:kernel:org.eclipse.virgo.kernel.smoketest:testClasses UP-TO-DATE
:packaging:kernel:org.eclipse.virgo.kernel.smoketest:test UP-TO-DATE
:packaging:kernel:org.eclipse.virgo.kernel.smoketest:check UP-TO-DATE
:packaging:kernel:org.eclipse.virgo.kernel.smoketest:build
|--> Signing Jar File: /jobs/genie.virgo/3.7.0.Milestones/workspace/packaging/kernel/org.eclipse.virgo.kernel.smoketest/build/libs/org.eclipse.virgo.kernel.smoketest-3.7.0.RELEASE.jar
  % Total    % Received % Xferd  Average Speed   Time    Time     Time  Current
                                 Dload  Upload   Total   Spent    Left  Speed

  0     0    0     0    0     0      0      0 --:--:-- --:--:-- --:--:--     0
  8  6257    0     0  100   505      0    521 --:--:-- --:--:-- --:--:--   521
100  6257  100  5752  100   505   5937    521 --:--:-- --:--:-- --:--:--  5936
:packaging:nano:org.eclipse.virgo.nano.smoketest:sourcesJar
:packaging:nano:org.eclipse.virgo.nano.smoketest:assemble
:packaging:nano:org.eclipse.virgo.nano.smoketest:compileTestJava UP-TO-DATE
:packaging:nano:org.eclipse.virgo.nano.smoketest:processTestResources UP-TO-DATE
:packaging:nano:org.eclipse.virgo.nano.smoketest:testClasses UP-TO-DATE
:packaging:nano:org.eclipse.virgo.nano.smoketest:test UP-TO-DATE
:packaging:nano:org.eclipse.virgo.nano.smoketest:check UP-TO-DATE
:packaging:nano:org.eclipse.virgo.nano.smoketest:build
|--> Signing Jar File: /jobs/genie.virgo/3.7.0.Milestones/workspace/packaging/nano/org.eclipse.virgo.nano.smoketest/build/libs/org.eclipse.virgo.nano.smoketest-3.7.0.RELEASE.jar
  % Total    % Received % Xferd  Average Speed   Time    Time     Time  Current
                                 Dload  Upload   Total   Spent    Left  Speed

  0     0    0     0    0     0      0      0 --:--:-- --:--:-- --:--:--     0
  8  6258    0     0  100   503      0    509 --:--:-- --:--:-- --:--:--   509
100  6258  100  5755  100   503   5829    509 --:--:-- --:--:-- --:--:--  5824
:packaging:tomcat-server:org.eclipse.virgo.tomcat.smoketest:sourcesJar
:packaging:tomcat-server:org.eclipse.virgo.tomcat.smoketest:assemble
:packaging:tomcat-server:org.eclipse.virgo.tomcat.smoketest:compileTestJava UP-TO-DATE
:packaging:tomcat-server:org.eclipse.virgo.tomcat.smoketest:processTestResources UP-TO-DATE
:packaging:tomcat-server:org.eclipse.virgo.tomcat.smoketest:testClasses UP-TO-DATE
:packaging:tomcat-server:org.eclipse.virgo.tomcat.smoketest:test UP-TO-DATE
:packaging:tomcat-server:org.eclipse.virgo.tomcat.smoketest:check UP-TO-DATE
:packaging:tomcat-server:org.eclipse.virgo.tomcat.smoketest:build
|--> Signing Jar File: /jobs/genie.virgo/3.7.0.Milestones/workspace/packaging/tomcat-server/org.eclipse.virgo.tomcat.smoketest/build/libs/org.eclipse.virgo.tomcat.smoketest-3.7.0.RELEASE.jar
  % Total    % Received % Xferd  Average Speed   Time    Time     Time  Current
                                 Dload  Upload   Total   Spent    Left  Speed

  0     0    0     0    0     0      0      0 --:--:-- --:--:-- --:--:--     0
100   505    0     0  100   505      0    501  0:00:01  0:00:01 --:--:--   501
100  6260  100  5755  100   505   5623    493  0:00:01  0:00:01 --:--:--  5625

FAILURE: Build failed with an exception.

* Where:
Build file '/jobs/genie.virgo/3.7.0.Milestones/workspace/org.eclipse.virgo.site/build.gradle' line: 513

* What went wrong:
Execution failed for task ':org.eclipse.virgo.site:signBundles'.
> jarsigner returned: 1

* Try:
Run with --info or --debug option to get more log output.

* Exception is:
org.gradle.api.tasks.TaskExecutionException: Execution failed for task ':org.eclipse.virgo.site:signBundles'.
	at org.gradle.api.internal.tasks.execution.ExecuteActionsTaskExecuter.executeActions(ExecuteActionsTaskExecuter.java:69)
	at org.gradle.api.internal.tasks.execution.ExecuteActionsTaskExecuter.execute(ExecuteActionsTaskExecuter.java:46)
	at org.gradle.api.internal.tasks.execution.PostExecutionAnalysisTaskExecuter.execute(PostExecutionAnalysisTaskExecuter.java:35)
	at org.gradle.api.internal.tasks.execution.SkipUpToDateTaskExecuter.execute(SkipUpToDateTaskExecuter.java:64)
	at org.gradle.api.internal.tasks.execution.ValidatingTaskExecuter.execute(ValidatingTaskExecuter.java:58)
	at org.gradle.api.internal.tasks.execution.SkipEmptySourceFilesTaskExecuter.execute(SkipEmptySourceFilesTaskExecuter.java:52)
	at org.gradle.api.internal.tasks.execution.SkipTaskWithNoActionsExecuter.execute(SkipTaskWithNoActionsExecuter.java:52)
	at org.gradle.api.internal.tasks.execution.SkipOnlyIfTaskExecuter.execute(SkipOnlyIfTaskExecuter.java:53)
	at org.gradle.api.internal.tasks.execution.ExecuteAtMostOnceTaskExecuter.execute(ExecuteAtMostOnceTaskExecuter.java:43)
	at org.gradle.execution.taskgraph.DefaultTaskGraphExecuter$EventFiringTaskWorker.execute(DefaultTaskGraphExecuter.java:233)
	at org.gradle.execution.taskgraph.DefaultTaskGraphExecuter$EventFiringTaskWorker.execute(DefaultTaskGraphExecuter.java:215)
	at org.gradle.execution.taskgraph.AbstractTaskPlanExecutor$TaskExecutorWorker.processTask(AbstractTaskPlanExecutor.java:74)
	at org.gradle.execution.taskgraph.AbstractTaskPlanExecutor$TaskExecutorWorker.run(AbstractTaskPlanExecutor.java:55)
	at org.gradle.execution.taskgraph.DefaultTaskPlanExecutor.process(DefaultTaskPlanExecutor.java:32)
	at org.gradle.execution.taskgraph.DefaultTaskGraphExecuter.execute(DefaultTaskGraphExecuter.java:113)
	at org.gradle.execution.SelectedTaskExecutionAction.execute(SelectedTaskExecutionAction.java:37)
	at org.gradle.execution.DefaultBuildExecuter.execute(DefaultBuildExecuter.java:37)
	at org.gradle.execution.DefaultBuildExecuter.access$000(DefaultBuildExecuter.java:23)
	at org.gradle.execution.DefaultBuildExecuter$1.proceed(DefaultBuildExecuter.java:43)
	at org.gradle.execution.DryRunBuildExecutionAction.execute(DryRunBuildExecutionAction.java:32)
	at org.gradle.execution.DefaultBuildExecuter.execute(DefaultBuildExecuter.java:37)
	at org.gradle.execution.DefaultBuildExecuter.execute(DefaultBuildExecuter.java:30)
	at org.gradle.initialization.DefaultGradleLauncher$4.run(DefaultGradleLauncher.java:186)
	at org.gradle.internal.Factories$1.create(Factories.java:22)
	at org.gradle.internal.progress.DefaultBuildOperationExecutor.run(DefaultBuildOperationExecutor.java:91)
	at org.gradle.internal.progress.DefaultBuildOperationExecutor.run(DefaultBuildOperationExecutor.java:53)
	at org.gradle.initialization.DefaultGradleLauncher.doBuildStages(DefaultGradleLauncher.java:183)
	at org.gradle.initialization.DefaultGradleLauncher.access$200(DefaultGradleLauncher.java:33)
	at org.gradle.initialization.DefaultGradleLauncher$1.create(DefaultGradleLauncher.java:112)
	at org.gradle.initialization.DefaultGradleLauncher$1.create(DefaultGradleLauncher.java:106)
	at org.gradle.internal.progress.DefaultBuildOperationExecutor.run(DefaultBuildOperationExecutor.java:91)
	at org.gradle.internal.progress.DefaultBuildOperationExecutor.run(DefaultBuildOperationExecutor.java:63)
	at org.gradle.initialization.DefaultGradleLauncher.doBuild(DefaultGradleLauncher.java:106)
	at org.gradle.initialization.DefaultGradleLauncher.run(DefaultGradleLauncher.java:92)
	at org.gradle.launcher.exec.GradleBuildController.run(GradleBuildController.java:66)
	at org.gradle.tooling.internal.provider.ExecuteBuildActionRunner.run(ExecuteBuildActionRunner.java:28)
	at org.gradle.launcher.exec.ChainingBuildActionRunner.run(ChainingBuildActionRunner.java:35)
	at org.gradle.launcher.exec.InProcessBuildActionExecuter.execute(InProcessBuildActionExecuter.java:41)
	at org.gradle.launcher.exec.InProcessBuildActionExecuter.execute(InProcessBuildActionExecuter.java:26)
	at org.gradle.tooling.internal.provider.ContinuousBuildActionExecuter.execute(ContinuousBuildActionExecuter.java:79)
	at org.gradle.tooling.internal.provider.ContinuousBuildActionExecuter.execute(ContinuousBuildActionExecuter.java:51)
	at org.gradle.launcher.daemon.server.exec.ExecuteBuild.doBuild(ExecuteBuild.java:59)
	at org.gradle.launcher.daemon.server.exec.BuildCommandOnly.execute(BuildCommandOnly.java:36)
	at org.gradle.launcher.daemon.server.api.DaemonCommandExecution.proceed(DaemonCommandExecution.java:120)
	at org.gradle.launcher.daemon.server.exec.WatchForDisconnection.execute(WatchForDisconnection.java:47)
	at org.gradle.launcher.daemon.server.api.DaemonCommandExecution.proceed(DaemonCommandExecution.java:120)
	at org.gradle.launcher.daemon.server.exec.ResetDeprecationLogger.execute(ResetDeprecationLogger.java:26)
	at org.gradle.launcher.daemon.server.api.DaemonCommandExecution.proceed(DaemonCommandExecution.java:120)
	at org.gradle.launcher.daemon.server.exec.RequestStopIfSingleUsedDaemon.execute(RequestStopIfSingleUsedDaemon.java:34)
	at org.gradle.launcher.daemon.server.api.DaemonCommandExecution.proceed(DaemonCommandExecution.java:120)
	at org.gradle.launcher.daemon.server.exec.ForwardClientInput$2.call(ForwardClientInput.java:74)
	at org.gradle.launcher.daemon.server.exec.ForwardClientInput$2.call(ForwardClientInput.java:72)
	at org.gradle.util.Swapper.swap(Swapper.java:38)
	at org.gradle.launcher.daemon.server.exec.ForwardClientInput.execute(ForwardClientInput.java:72)
	at org.gradle.launcher.daemon.server.api.DaemonCommandExecution.proceed(DaemonCommandExecution.java:120)
	at org.gradle.launcher.daemon.server.exec.LogAndCheckHealth.execute(LogAndCheckHealth.java:55)
	at org.gradle.launcher.daemon.server.api.DaemonCommandExecution.proceed(DaemonCommandExecution.java:120)
	at org.gradle.launcher.daemon.server.exec.LogToClient.doBuild(LogToClient.java:60)
	at org.gradle.launcher.daemon.server.exec.BuildCommandOnly.execute(BuildCommandOnly.java:36)
	at org.gradle.launcher.daemon.server.api.DaemonCommandExecution.proceed(DaemonCommandExecution.java:120)
	at org.gradle.launcher.daemon.server.exec.EstablishBuildEnvironment.doBuild(EstablishBuildEnvironment.java:72)
	at org.gradle.launcher.daemon.server.exec.BuildCommandOnly.execute(BuildCommandOnly.java:36)
	at org.gradle.launcher.daemon.server.api.DaemonCommandExecution.proceed(DaemonCommandExecution.java:120)
	at org.gradle.launcher.daemon.server.exec.HintGCAfterBuild.execute(HintGCAfterBuild.java:44)
	at org.gradle.launcher.daemon.server.api.DaemonCommandExecution.proceed(DaemonCommandExecution.java:120)
	at org.gradle.launcher.daemon.server.exec.StartBuildOrRespondWithBusy$1.run(StartBuildOrRespondWithBusy.java:50)
	at org.gradle.launcher.daemon.server.DaemonStateCoordinator$1.run(DaemonStateCoordinator.java:293)
	at org.gradle.internal.concurrent.ExecutorPolicy$CatchAndRecordFailures.onExecute(ExecutorPolicy.java:54)
	at org.gradle.internal.concurrent.StoppableExecutorImpl$1.run(StoppableExecutorImpl.java:40)
Caused by: : jarsigner returned: 1
	at org.apache.tools.ant.taskdefs.ExecTask.runExecute(ExecTask.java:644)
	at org.apache.tools.ant.taskdefs.ExecTask.runExec(ExecTask.java:670)
	at org.apache.tools.ant.taskdefs.ExecTask.execute(ExecTask.java:496)
	at org.apache.tools.ant.taskdefs.SignJar.signOneJar(SignJar.java:534)
	at org.apache.tools.ant.taskdefs.SignJar.execute(SignJar.java:449)
	at org.apache.tools.ant.UnknownElement.execute(UnknownElement.java:293)
	at org.apache.tools.ant.dispatch.DispatchUtils.execute(DispatchUtils.java:106)
	at org.gradle.api.internal.project.ant.BasicAntBuilder.nodeCompleted(BasicAntBuilder.java:78)
	at org.gradle.api.internal.project.ant.BasicAntBuilder.doInvokeMethod(BasicAntBuilder.java:103)
	at build_9zzn1k8935lsp2criqq7xotsj$_signLocally_closure13.doCall(/jobs/genie.virgo/3.7.0.Milestones/workspace/org.eclipse.virgo.site/build.gradle:513)
	at build_9zzn1k8935lsp2criqq7xotsj.signLocally(/jobs/genie.virgo/3.7.0.Milestones/workspace/org.eclipse.virgo.site/build.gradle:522)
	at build_9zzn1k8935lsp2criqq7xotsj$_run_closure1$_closure18.doCall(/jobs/genie.virgo/3.7.0.Milestones/workspace/org.eclipse.virgo.site/build.gradle:27)
	at virgobuild.UpdateSitePlugin$_addTaskSignBundles_closure10$_closure24.doCall(UpdateSitePlugin.groovy:212)
	at org.gradle.api.internal.AbstractTask$ClosureTaskAction.execute(AbstractTask.java:587)
	at org.gradle.api.internal.AbstractTask$ClosureTaskAction.execute(AbstractTask.java:568)
	at org.gradle.api.internal.tasks.execution.ExecuteActionsTaskExecuter.executeAction(ExecuteActionsTaskExecuter.java:80)
	at org.gradle.api.internal.tasks.execution.ExecuteActionsTaskExecuter.executeActions(ExecuteActionsTaskExecuter.java:61)
	... 68 more


BUILD FAILED

Total time: 7 mins 25.058 secs
[locks-and-latches] Releasing all the locks
[locks-and-latches] All the locks released
Recording test results
Archiving artifacts
Sending e-mails to: fwaibel@eclipsesource.com
Finished: FAILURE