FailedConsole Output

Skipping 267 KB.. Full Log
site:org.eclipse.virgo.enterprise:compileTestJava UP-TO-DATE
:org.eclipse.virgo.site:org.eclipse.virgo.enterprise:processTestResources UP-TO-DATE
:org.eclipse.virgo.site:org.eclipse.virgo.enterprise:testClasses UP-TO-DATE
:org.eclipse.virgo.site:org.eclipse.virgo.enterprise:test UP-TO-DATE
:org.eclipse.virgo.site:org.eclipse.virgo.enterprise:check UP-TO-DATE
:org.eclipse.virgo.site:org.eclipse.virgo.enterprise:build
:org.eclipse.virgo.site:org.eclipse.virgo.kernel:assemble
:org.eclipse.virgo.site:org.eclipse.virgo.kernel:compileTestJava UP-TO-DATE
:org.eclipse.virgo.site:org.eclipse.virgo.kernel:processTestResources UP-TO-DATE
:org.eclipse.virgo.site:org.eclipse.virgo.kernel:testClasses UP-TO-DATE
:org.eclipse.virgo.site:org.eclipse.virgo.kernel:test UP-TO-DATE
:org.eclipse.virgo.site:org.eclipse.virgo.kernel:check UP-TO-DATE
:org.eclipse.virgo.site:org.eclipse.virgo.kernel:build
:org.eclipse.virgo.site:org.eclipse.virgo.kernel.springintegration:assemble
:org.eclipse.virgo.site:org.eclipse.virgo.kernel.springintegration:compileTestJava UP-TO-DATE
:org.eclipse.virgo.site:org.eclipse.virgo.kernel.springintegration:processTestResources UP-TO-DATE
:org.eclipse.virgo.site:org.eclipse.virgo.kernel.springintegration:testClasses UP-TO-DATE
:org.eclipse.virgo.site:org.eclipse.virgo.kernel.springintegration:test UP-TO-DATE
:org.eclipse.virgo.site:org.eclipse.virgo.kernel.springintegration:check UP-TO-DATE
:org.eclipse.virgo.site:org.eclipse.virgo.kernel.springintegration:build
:org.eclipse.virgo.site:org.eclipse.virgo.management:assemble
:org.eclipse.virgo.site:org.eclipse.virgo.management:compileTestJava UP-TO-DATE
:org.eclipse.virgo.site:org.eclipse.virgo.management:processTestResources UP-TO-DATE
:org.eclipse.virgo.site:org.eclipse.virgo.management:testClasses UP-TO-DATE
:org.eclipse.virgo.site:org.eclipse.virgo.management:test UP-TO-DATE
:org.eclipse.virgo.site:org.eclipse.virgo.management:check UP-TO-DATE
:org.eclipse.virgo.site:org.eclipse.virgo.management:build
:org.eclipse.virgo.site:org.eclipse.virgo.medic:assemble
:org.eclipse.virgo.site:org.eclipse.virgo.medic:compileTestJava UP-TO-DATE
:org.eclipse.virgo.site:org.eclipse.virgo.medic:processTestResources UP-TO-DATE
:org.eclipse.virgo.site:org.eclipse.virgo.medic:testClasses UP-TO-DATE
:org.eclipse.virgo.site:org.eclipse.virgo.medic:test UP-TO-DATE
:org.eclipse.virgo.site:org.eclipse.virgo.medic:check UP-TO-DATE
:org.eclipse.virgo.site:org.eclipse.virgo.medic:build
:org.eclipse.virgo.site:org.eclipse.virgo.nano.deployer:assemble
:org.eclipse.virgo.site:org.eclipse.virgo.nano.deployer:compileTestJava UP-TO-DATE
:org.eclipse.virgo.site:org.eclipse.virgo.nano.deployer:processTestResources UP-TO-DATE
:org.eclipse.virgo.site:org.eclipse.virgo.nano.deployer:testClasses UP-TO-DATE
:org.eclipse.virgo.site:org.eclipse.virgo.nano.deployer:test UP-TO-DATE
:org.eclipse.virgo.site:org.eclipse.virgo.nano.deployer:check UP-TO-DATE
:org.eclipse.virgo.site:org.eclipse.virgo.nano.deployer:build
:org.eclipse.virgo.site:org.eclipse.virgo.nano.mbeans:assemble
:org.eclipse.virgo.site:org.eclipse.virgo.nano.mbeans:compileTestJava UP-TO-DATE
:org.eclipse.virgo.site:org.eclipse.virgo.nano.mbeans:processTestResources UP-TO-DATE
:org.eclipse.virgo.site:org.eclipse.virgo.nano.mbeans:testClasses UP-TO-DATE
:org.eclipse.virgo.site:org.eclipse.virgo.nano.mbeans:test UP-TO-DATE
:org.eclipse.virgo.site:org.eclipse.virgo.nano.mbeans:check UP-TO-DATE
:org.eclipse.virgo.site:org.eclipse.virgo.nano.mbeans:build
:org.eclipse.virgo.site:org.eclipse.virgo.nano.mbeans.controller:assemble
:org.eclipse.virgo.site:org.eclipse.virgo.nano.mbeans.controller:compileTestJava UP-TO-DATE
:org.eclipse.virgo.site:org.eclipse.virgo.nano.mbeans.controller:processTestResources UP-TO-DATE
:org.eclipse.virgo.site:org.eclipse.virgo.nano.mbeans.controller:testClasses UP-TO-DATE
:org.eclipse.virgo.site:org.eclipse.virgo.nano.mbeans.controller:test UP-TO-DATE
:org.eclipse.virgo.site:org.eclipse.virgo.nano.mbeans.controller:check UP-TO-DATE
:org.eclipse.virgo.site:org.eclipse.virgo.nano.mbeans.controller:build
:org.eclipse.virgo.site:org.eclipse.virgo.nano.war.deployer:assemble
:org.eclipse.virgo.site:org.eclipse.virgo.nano.war.deployer:compileTestJava UP-TO-DATE
:org.eclipse.virgo.site:org.eclipse.virgo.nano.war.deployer:processTestResources UP-TO-DATE
:org.eclipse.virgo.site:org.eclipse.virgo.nano.war.deployer:testClasses UP-TO-DATE
:org.eclipse.virgo.site:org.eclipse.virgo.nano.war.deployer:test UP-TO-DATE
:org.eclipse.virgo.site:org.eclipse.virgo.nano.war.deployer:check UP-TO-DATE
:org.eclipse.virgo.site:org.eclipse.virgo.nano.war.deployer:build
:org.eclipse.virgo.site:org.eclipse.virgo.p2.provisioning:assemble
:org.eclipse.virgo.site:org.eclipse.virgo.p2.provisioning:compileTestJava UP-TO-DATE
:org.eclipse.virgo.site:org.eclipse.virgo.p2.provisioning:processTestResources UP-TO-DATE
:org.eclipse.virgo.site:org.eclipse.virgo.p2.provisioning:testClasses UP-TO-DATE
:org.eclipse.virgo.site:org.eclipse.virgo.p2.provisioning:test UP-TO-DATE
:org.eclipse.virgo.site:org.eclipse.virgo.p2.provisioning:check UP-TO-DATE
:org.eclipse.virgo.site:org.eclipse.virgo.p2.provisioning:build
:org.eclipse.virgo.site:org.eclipse.virgo.services.concurrent:assemble
:org.eclipse.virgo.site:org.eclipse.virgo.services.concurrent:compileTestJava UP-TO-DATE
:org.eclipse.virgo.site:org.eclipse.virgo.services.concurrent:processTestResources UP-TO-DATE
:org.eclipse.virgo.site:org.eclipse.virgo.services.concurrent:testClasses UP-TO-DATE
:org.eclipse.virgo.site:org.eclipse.virgo.services.concurrent:test UP-TO-DATE
:org.eclipse.virgo.site:org.eclipse.virgo.services.concurrent:check UP-TO-DATE
:org.eclipse.virgo.site:org.eclipse.virgo.services.concurrent:build
:org.eclipse.virgo.site:org.eclipse.virgo.services.ds:assemble
:org.eclipse.virgo.site:org.eclipse.virgo.services.ds:compileTestJava UP-TO-DATE
:org.eclipse.virgo.site:org.eclipse.virgo.services.ds:processTestResources UP-TO-DATE
:org.eclipse.virgo.site:org.eclipse.virgo.services.ds:testClasses UP-TO-DATE
:org.eclipse.virgo.site:org.eclipse.virgo.services.ds:test UP-TO-DATE
:org.eclipse.virgo.site:org.eclipse.virgo.services.ds:check UP-TO-DATE
:org.eclipse.virgo.site:org.eclipse.virgo.services.ds:build
:org.eclipse.virgo.site:org.eclipse.virgo.shell:assemble
:org.eclipse.virgo.site:org.eclipse.virgo.shell:compileTestJava UP-TO-DATE
:org.eclipse.virgo.site:org.eclipse.virgo.shell:processTestResources UP-TO-DATE
:org.eclipse.virgo.site:org.eclipse.virgo.shell:testClasses UP-TO-DATE
:org.eclipse.virgo.site:org.eclipse.virgo.shell:test UP-TO-DATE
:org.eclipse.virgo.site:org.eclipse.virgo.shell:check UP-TO-DATE
:org.eclipse.virgo.site:org.eclipse.virgo.shell:build
:org.eclipse.virgo.site:org.eclipse.virgo.simpleconfigurator:assemble
:org.eclipse.virgo.site:org.eclipse.virgo.simpleconfigurator:compileTestJava UP-TO-DATE
:org.eclipse.virgo.site:org.eclipse.virgo.simpleconfigurator:processTestResources UP-TO-DATE
:org.eclipse.virgo.site:org.eclipse.virgo.simpleconfigurator:testClasses UP-TO-DATE
:org.eclipse.virgo.site:org.eclipse.virgo.simpleconfigurator:test UP-TO-DATE
:org.eclipse.virgo.site:org.eclipse.virgo.simpleconfigurator:check UP-TO-DATE
:org.eclipse.virgo.site:org.eclipse.virgo.simpleconfigurator:build
:org.eclipse.virgo.site:org.eclipse.virgo.springdm:assemble
:org.eclipse.virgo.site:org.eclipse.virgo.springdm:compileTestJava UP-TO-DATE
:org.eclipse.virgo.site:org.eclipse.virgo.springdm:processTestResources UP-TO-DATE
:org.eclipse.virgo.site:org.eclipse.virgo.springdm:testClasses UP-TO-DATE
:org.eclipse.virgo.site:org.eclipse.virgo.springdm:test UP-TO-DATE
:org.eclipse.virgo.site:org.eclipse.virgo.springdm:check UP-TO-DATE
:org.eclipse.virgo.site:org.eclipse.virgo.springdm:build
:org.eclipse.virgo.site:org.eclipse.virgo.tools:assemble
:org.eclipse.virgo.site:org.eclipse.virgo.tools:compileTestJava UP-TO-DATE
:org.eclipse.virgo.site:org.eclipse.virgo.tools:processTestResources UP-TO-DATE
:org.eclipse.virgo.site:org.eclipse.virgo.tools:testClasses UP-TO-DATE
:org.eclipse.virgo.site:org.eclipse.virgo.tools:test UP-TO-DATE
:org.eclipse.virgo.site:org.eclipse.virgo.tools:check UP-TO-DATE
:org.eclipse.virgo.site:org.eclipse.virgo.tools:build
:org.eclipse.virgo.site:org.eclipse.virgo.webconsole.deps:assemble
:org.eclipse.virgo.site:org.eclipse.virgo.webconsole.deps:compileTestJava UP-TO-DATE
:org.eclipse.virgo.site:org.eclipse.virgo.webconsole.deps:processTestResources UP-TO-DATE
:org.eclipse.virgo.site:org.eclipse.virgo.webconsole.deps:testClasses UP-TO-DATE
:org.eclipse.virgo.site:org.eclipse.virgo.webconsole.deps:test UP-TO-DATE
:org.eclipse.virgo.site:org.eclipse.virgo.webconsole.deps:check UP-TO-DATE
:org.eclipse.virgo.site:org.eclipse.virgo.webconsole.deps:build
:packaging:jetty-server:packageResourcesAndProducts
Copy the lib artifacts:
org.eclipse.virgo.kernel.equinox.extensions-3.7.0.RELEASE.jar
org.eclipse.virgo.nano.authentication-3.7.0.RELEASE.jar
org.eclipse.virgo.nano.shutdown-3.7.0.RELEASE.jar
org.eclipse.virgo.util.env-3.7.0.RELEASE.jar
org.eclipse.equinox.launcher-1.3.0.v20130327-1440.jar
to '/jobs/genie.virgo/3.7.0.Milestones/workspace/packaging/jetty-server/build/common_resources/lib'.
Copy the libPersistence artifacts:
org.eclipse.virgo.web.enterprise.openejb.jpa.integration-3.7.0.RELEASE.jar
to '/jobs/genie.virgo/3.7.0.Milestones/workspace/packaging/jetty-server/build/common_resources/lib/persistence'.
Copy the libEndorsed artifacts:
javax.annotation-1.2.0.v201401042248.jar
javax.interceptor-api-1.2.jar
javax.transaction-api-1.2.jar
to '/jobs/genie.virgo/3.7.0.Milestones/workspace/packaging/jetty-server/build/common_resources/lib/endorsed'.
Copy the pluginsExtras artifacts:
org.eclipse.virgo.kernel.userregion-3.7.0.RELEASE.jar
to '/jobs/genie.virgo/3.7.0.Milestones/workspace/packaging/jetty-server/build/common_resources/plugins'.
Copy the repositoryExt artifacts:
org.eclipse.osgi.services-3.3.100.v20130513-1956.jar
osgi.enterprise-4.2.0.v201108120515.jar
org.eclipse.equinox.ds-1.4.200.v20131126-2331.jar
org.eclipse.equinox.util-1.0.500.v20130404-1337.jar
org.eclipse.equinox.region-1.1.101.v20130722-1314.jar
oevm.org.aopalliance-1.0.0.jar
org.apache.commons.codec-1.10.0.jar
org.springframework.aop-4.2.9.RELEASE.jar
org.springframework.beans-4.2.9.RELEASE.jar
org.springframework.context-4.2.9.RELEASE.jar
org.springframework.core-4.2.9.RELEASE.jar
org.springframework.expression-4.2.9.RELEASE.jar
gemini-blueprint-io-2.0.0.RELEASE.jar
gemini-blueprint-core-2.0.0.RELEASE.jar
gemini-blueprint-extender-2.0.0.RELEASE.jar
org.eclipse.gemini.management-1.0.5.RELEASE.jar
org.eclipse.virgo.management.fragment-3.7.0.RELEASE.jar
org.eclipse.virgo.kernel.agent.dm-3.7.0.RELEASE.jar
org.eclipse.virgo.kernel.deployer.dm-3.7.0.RELEASE.jar
org.eclipse.virgo.kernel.dmfragment-3.7.0.RELEASE.jar
commons-io-2.2.jar
commons-fileupload-1.3.2.jar
jolokia-osgi-1.3.3.jar
org.eclipse.virgo.medic-3.7.0.RELEASE.jar
org.eclipse.virgo.medic.core-3.7.0.RELEASE.jar
org.eclipse.virgo.web.dm-3.7.0.RELEASE.jar
javax.jms-1.1.0.v201205091237.jar
javax.servlet-3.1.0.20170128.jar
org.springframework.aspects-4.2.9.RELEASE.jar
org.springframework.context.support-4.2.9.RELEASE.jar
org.springframework.jdbc-4.2.9.RELEASE.jar
org.springframework.messaging-4.2.9.RELEASE.jar
org.springframework.jms-4.2.9.RELEASE.jar
org.springframework.orm-4.2.9.RELEASE.jar
org.springframework.oxm-4.2.9.RELEASE.jar
org.springframework.transaction-4.2.9.RELEASE.jar
org.springframework.web-4.2.9.RELEASE.jar
org.springframework.webmvc-4.2.9.RELEASE.jar
org.springframework.webmvc.portlet-4.2.9.RELEASE.jar
org.springframework.websocket-4.2.9.RELEASE.jar
org.aspectj.weaver-1.8.10.jar
oevm.javax.portlet-2.0.0.jar
javax.servlet.jsp.jstl-api-1.2.1.jar
javax.servlet.jsp.jstl-1.2.5-b03.jar
org.eclipse.virgo.web.servlet.adapter-3.7.0.RELEASE.jar
org.eclipse.jetty.continuation-8.1.16.v20140903.jar
org.eclipse.jetty.deploy-8.1.16.v20140903.jar
org.eclipse.jetty.http-8.1.16.v20140903.jar
org.eclipse.jetty.io-8.1.16.v20140903.jar
org.eclipse.jetty.osgi.boot-8.1.16.v20140903.jar
org.eclipse.jetty.security-8.1.16.v20140903.jar
org.eclipse.jetty.server-8.1.16.v20140903.jar
org.eclipse.jetty.servlet-8.1.16.v20140903.jar
org.eclipse.jetty.util-8.1.16.v20140903.jar
org.eclipse.jetty.webapp-8.1.16.v20140903.jar
org.eclipse.jetty.xml-8.1.16.v20140903.jar
to '/jobs/genie.virgo/3.7.0.Milestones/workspace/packaging/jetty-server/build/common_resources/repository/ext'.
Copy the pickup artifacts:
org.eclipse.virgo.management.console-3.7.0.RELEASE.jar
org.eclipse.virgo.apps.splash-3.7.0.RELEASE.jar
to '/jobs/genie.virgo/3.7.0.Milestones/workspace/packaging/jetty-server/build/common_resources/pickup'.
:packaging:jetty-server:check UP-TO-DATE
:packaging:kernel:packageResourcesAndProducts
Copy the lib artifacts:
org.eclipse.virgo.kernel.equinox.extensions-3.7.0.RELEASE.jar
org.eclipse.virgo.nano.authentication-3.7.0.RELEASE.jar
org.eclipse.virgo.nano.shutdown-3.7.0.RELEASE.jar
org.eclipse.virgo.util.env-3.7.0.RELEASE.jar
org.eclipse.equinox.launcher-1.3.0.v20130327-1440.jar
to '/jobs/genie.virgo/3.7.0.Milestones/workspace/packaging/kernel/build/common_resources/lib'.
Copy the libPersistence artifacts:
org.eclipse.virgo.web.enterprise.openejb.jpa.integration-3.7.0.RELEASE.jar
to '/jobs/genie.virgo/3.7.0.Milestones/workspace/packaging/kernel/build/common_resources/lib/persistence'.
Copy the libEndorsed artifacts:
javax.annotation-1.2.0.v201401042248.jar
javax.interceptor-api-1.2.jar
javax.transaction-api-1.2.jar
to '/jobs/genie.virgo/3.7.0.Milestones/workspace/packaging/kernel/build/common_resources/lib/endorsed'.
Copy the pluginsExtras artifacts:
org.eclipse.virgo.kernel.userregion-3.7.0.RELEASE.jar
to '/jobs/genie.virgo/3.7.0.Milestones/workspace/packaging/kernel/build/common_resources/plugins'.
Copy the repositoryExt artifacts:
org.eclipse.osgi.services-3.3.100.v20130513-1956.jar
osgi.enterprise-4.2.0.v201108120515.jar
org.eclipse.equinox.ds-1.4.200.v20131126-2331.jar
org.eclipse.equinox.util-1.0.500.v20130404-1337.jar
org.eclipse.equinox.region-1.1.101.v20130722-1314.jar
oevm.org.aopalliance-1.0.0.jar
org.apache.commons.codec-1.10.0.jar
org.springframework.aop-4.2.9.RELEASE.jar
org.springframework.beans-4.2.9.RELEASE.jar
org.springframework.context-4.2.9.RELEASE.jar
org.springframework.core-4.2.9.RELEASE.jar
org.springframework.expression-4.2.9.RELEASE.jar
gemini-blueprint-io-2.0.0.RELEASE.jar
gemini-blueprint-core-2.0.0.RELEASE.jar
gemini-blueprint-extender-2.0.0.RELEASE.jar
org.eclipse.gemini.management-1.0.5.RELEASE.jar
org.eclipse.virgo.management.fragment-3.7.0.RELEASE.jar
org.eclipse.virgo.kernel.agent.dm-3.7.0.RELEASE.jar
org.eclipse.virgo.kernel.deployer.dm-3.7.0.RELEASE.jar
org.eclipse.virgo.kernel.dmfragment-3.7.0.RELEASE.jar
commons-io-2.2.jar
commons-fileupload-1.3.2.jar
jolokia-osgi-1.3.3.jar
to '/jobs/genie.virgo/3.7.0.Milestones/workspace/packaging/kernel/build/common_resources/repository/ext'.
Copy the pickup artifacts:
org.eclipse.virgo.management.console-3.7.0.RELEASE.jar
to '/jobs/genie.virgo/3.7.0.Milestones/workspace/packaging/kernel/build/common_resources/pickup'.
:packaging:kernel:check UP-TO-DATE
:packaging:nano:packageResourcesAndProducts
Copy the lib artifacts:
org.eclipse.virgo.kernel.equinox.extensions-3.7.0.RELEASE.jar
org.eclipse.virgo.nano.authentication-3.7.0.RELEASE.jar
org.eclipse.virgo.nano.shutdown-3.7.0.RELEASE.jar
org.eclipse.virgo.util.env-3.7.0.RELEASE.jar
org.eclipse.equinox.launcher-1.3.0.v20130327-1440.jar
to '/jobs/genie.virgo/3.7.0.Milestones/workspace/packaging/nano/build/common_resources/lib'.
Copy the libPersistence artifacts:
org.eclipse.virgo.web.enterprise.openejb.jpa.integration-3.7.0.RELEASE.jar
to '/jobs/genie.virgo/3.7.0.Milestones/workspace/packaging/nano/build/common_resources/lib/persistence'.
Copy the libEndorsed artifacts:
javax.annotation-1.2.0.v201401042248.jar
javax.interceptor-api-1.2.jar
javax.transaction-api-1.2.jar
to '/jobs/genie.virgo/3.7.0.Milestones/workspace/packaging/nano/build/common_resources/lib/endorsed'.
Copy the pickup artifacts:
org.eclipse.virgo.management.console-3.7.0.RELEASE.jar
to '/jobs/genie.virgo/3.7.0.Milestones/workspace/packaging/nano/build/common_resources/pickup'.
:packaging:nano:check UP-TO-DATE
:packaging:tomcat-server:packageResourcesAndProducts
Copy the lib artifacts:
org.eclipse.virgo.kernel.equinox.extensions-3.7.0.RELEASE.jar
org.eclipse.virgo.nano.authentication-3.7.0.RELEASE.jar
org.eclipse.virgo.nano.shutdown-3.7.0.RELEASE.jar
org.eclipse.virgo.util.env-3.7.0.RELEASE.jar
org.eclipse.equinox.launcher-1.3.0.v20130327-1440.jar
to '/jobs/genie.virgo/3.7.0.Milestones/workspace/packaging/tomcat-server/build/common_resources/lib'.
Copy the libPersistence artifacts:
org.eclipse.virgo.web.enterprise.openejb.jpa.integration-3.7.0.RELEASE.jar
to '/jobs/genie.virgo/3.7.0.Milestones/workspace/packaging/tomcat-server/build/common_resources/lib/persistence'.
Copy the libEndorsed artifacts:
javax.annotation-1.2.0.v201401042248.jar
javax.interceptor-api-1.2.jar
javax.transaction-api-1.2.jar
to '/jobs/genie.virgo/3.7.0.Milestones/workspace/packaging/tomcat-server/build/common_resources/lib/endorsed'.
Copy the pluginsExtras artifacts:
org.eclipse.virgo.kernel.userregion-3.7.0.RELEASE.jar
to '/jobs/genie.virgo/3.7.0.Milestones/workspace/packaging/tomcat-server/build/common_resources/plugins'.
Copy the repositoryExt artifacts:
org.eclipse.osgi.services-3.3.100.v20130513-1956.jar
osgi.enterprise-4.2.0.v201108120515.jar
org.eclipse.equinox.ds-1.4.200.v20131126-2331.jar
org.eclipse.equinox.util-1.0.500.v20130404-1337.jar
org.eclipse.equinox.region-1.1.101.v20130722-1314.jar
oevm.org.aopalliance-1.0.0.jar
org.apache.commons.codec-1.10.0.jar
org.springframework.aop-4.2.9.RELEASE.jar
org.springframework.beans-4.2.9.RELEASE.jar
org.springframework.context-4.2.9.RELEASE.jar
org.springframework.core-4.2.9.RELEASE.jar
org.springframework.expression-4.2.9.RELEASE.jar
gemini-blueprint-io-2.0.0.RELEASE.jar
gemini-blueprint-core-2.0.0.RELEASE.jar
gemini-blueprint-extender-2.0.0.RELEASE.jar
org.eclipse.gemini.management-1.0.5.RELEASE.jar
org.eclipse.virgo.management.fragment-3.7.0.RELEASE.jar
org.eclipse.virgo.kernel.agent.dm-3.7.0.RELEASE.jar
org.eclipse.virgo.kernel.deployer.dm-3.7.0.RELEASE.jar
org.eclipse.virgo.kernel.dmfragment-3.7.0.RELEASE.jar
commons-io-2.2.jar
commons-fileupload-1.3.2.jar
jolokia-osgi-1.3.3.jar
org.eclipse.virgo.medic-3.7.0.RELEASE.jar
org.eclipse.virgo.medic.core-3.7.0.RELEASE.jar
org.eclipse.virgo.web.dm-3.7.0.RELEASE.jar
javax.jms-1.1.0.v201205091237.jar
javax.servlet-3.1.0.20170128.jar
org.springframework.aspects-4.2.9.RELEASE.jar
org.springframework.context.support-4.2.9.RELEASE.jar
org.springframework.jdbc-4.2.9.RELEASE.jar
org.springframework.messaging-4.2.9.RELEASE.jar
org.springframework.jms-4.2.9.RELEASE.jar
org.springframework.orm-4.2.9.RELEASE.jar
org.springframework.oxm-4.2.9.RELEASE.jar
org.springframework.transaction-4.2.9.RELEASE.jar
org.springframework.web-4.2.9.RELEASE.jar
org.springframework.webmvc-4.2.9.RELEASE.jar
org.springframework.webmvc.portlet-4.2.9.RELEASE.jar
org.springframework.websocket-4.2.9.RELEASE.jar
org.aspectj.weaver-1.8.10.jar
oevm.javax.portlet-2.0.0.jar
javax.servlet.jsp.jstl-api-1.2.1.jar
javax.servlet.jsp.jstl-1.2.5-b03.jar
org.eclipse.virgo.web.core-3.7.0.RELEASE.jar
org.eclipse.virgo.web.tomcat.support-3.7.0.RELEASE.jar
org.eclipse.virgo.web.servlet.adapter-3.7.0.RELEASE.jar
org.eclipse.virgo.web.spring.integration-3.7.0.RELEASE.jar
javax.annotation-1.2.0.v201401042248.jar
javax.ejb-3.1.1.v201204261316.jar
javax.el-3.0.0.20170128.jar
javax.mail-1.5.5.jar
javax.persistence-2.1.0.v201304241213.jar
javax.servlet.jsp-2.3.0.20170128.jar
javax.security.auth.message-1.1.0.20170128.jar
javax.xml.rpc-1.1.0.v201005080400.jar
javax.websocket-1.1.0.20170128.jar
org.eclipse.equinox.event-1.3.0.v20130327-1442.jar
oevm.org.apache.taglibs.standard-1.1.2.v20110517.jar
slf4j-api-1.7.22.jar
slf4j-jcl-1.7.22.jar
jul-to-slf4j-1.7.22.jar
slf4j-log4j12-1.7.22.jar
org.eclipse.jdt.core.compiler.batch-3.10.0.v20140604-1726.jar
org.apache.catalina-8.5.11.jar
org.apache.catalina.ha-8.5.11.jar
org.apache.catalina.tribes-8.5.11.jar
org.apache.coyote-8.5.11.jar
org.apache.el-8.5.11.jar
org.apache.jasper-8.5.11.jar
org.apache.juli-8.5.11.jar
org.apache.tomcat.api-8.5.11.jar
org.apache.tomcat.util-8.5.11.jar
org.apache.tomcat.util.scan-8.5.11.jar
org.apache.tomcat.jni-8.5.11.jar
org.apache.tomcat.websocket-8.5.11.jar
org.eclipse.gemini.web.core-3.0.0.RELEASE.jar
org.eclipse.gemini.web.tomcat-3.0.0.RELEASE.jar
org.eclipse.gemini.web.jaspic.fragment-3.0.0.RELEASE.jar
to '/jobs/genie.virgo/3.7.0.Milestones/workspace/packaging/tomcat-server/build/common_resources/repository/ext'.
Copy the pickup artifacts:
org.eclipse.virgo.management.console-3.7.0.RELEASE.jar
org.eclipse.virgo.apps.splash-3.7.0.RELEASE.jar
to '/jobs/genie.virgo/3.7.0.Milestones/workspace/packaging/tomcat-server/build/common_resources/pickup'.
:packaging:tomcat-server:check UP-TO-DATE
:repository:org.eclipse.virgo.repository:sourcesJar
:repository:org.eclipse.virgo.repository:assemble
:repository:org.eclipse.virgo.repository:compileTestJava
:repository:org.eclipse.virgo.repository:processTestResources
:repository:org.eclipse.virgo.repository:testClasses
:repository:org.eclipse.virgo.repository:test
:repository:org.eclipse.virgo.repository:check
:repository:org.eclipse.virgo.repository:build
|--> Signing Jar File: /jobs/genie.virgo/3.7.0.Milestones/workspace/repository/org.eclipse.virgo.repository/build/libs/org.eclipse.virgo.repository-3.7.0.RELEASE.jar
  % Total    % Received % Xferd  Average Speed   Time    Time     Time  Current
                                 Dload  Upload   Total   Spent    Left  Speed

  0     0    0     0    0     0      0      0 --:--:-- --:--:-- --:--:--     0
100  135k    0     0  100  135k      0   135k  0:00:01  0:00:01 --:--:--  135k
100  288k  100  153k  100  135k   135k   120k  0:00:01  0:00:01 --:--:--  135k
:test:org.eclipse.virgo.test.framework:sourcesJar
:test:org.eclipse.virgo.test.framework:assemble
:test:org.eclipse.virgo.test.framework:compileTestJava
:test:org.eclipse.virgo.test.framework:processTestResources
:test:org.eclipse.virgo.test.framework:testClasses
:test:org.eclipse.virgo.test.framework:test
:test:org.eclipse.virgo.test.framework:check
:test:org.eclipse.virgo.test.framework:build
|--> Signing Jar File: /jobs/genie.virgo/3.7.0.Milestones/workspace/test/org.eclipse.virgo.test.framework/build/libs/org.eclipse.virgo.test.framework-3.7.0.RELEASE.jar
  % Total    % Received % Xferd  Average Speed   Time    Time     Time  Current
                                 Dload  Upload   Total   Spent    Left  Speed

  0     0    0     0    0     0      0      0 --:--:-- --:--:-- --:--:--     0
100 23549    0     0  100 23549      0  23412  0:00:01  0:00:01 --:--:-- 23431
100 54641  100 31092  100 23549  27193  20596  0:00:01  0:00:01 --:--:-- 27202
:test:org.eclipse.virgo.test.launcher:sourcesJar
:test:org.eclipse.virgo.test.launcher:assemble
:test:org.eclipse.virgo.test.launcher:compileTestJava
:test:org.eclipse.virgo.test.launcher:processTestResources
:test:org.eclipse.virgo.test.launcher:testClasses
:test:org.eclipse.virgo.test.launcher:test
:test:org.eclipse.virgo.test.launcher:check
:test:org.eclipse.virgo.test.launcher:build
|--> Signing Jar File: /jobs/genie.virgo/3.7.0.Milestones/workspace/test/org.eclipse.virgo.test.launcher/build/libs/org.eclipse.virgo.test.launcher-3.7.0.RELEASE.jar
  % Total    % Received % Xferd  Average Speed   Time    Time     Time  Current
                                 Dload  Upload   Total   Spent    Left  Speed

  0     0    0     0    0     0      0      0 --:--:-- --:--:-- --:--:--     0
100 16909    0     0  100 16909      0  82496 --:--:-- --:--:-- --:--:-- 82482
100 40611  100 23702  100 16909  26131  18642 --:--:-- --:--:-- --:--:-- 26132
:test:org.eclipse.virgo.test.stubs:sourcesJar
:test:org.eclipse.virgo.test.stubs:assemble
:test:org.eclipse.virgo.test.stubs:compileTestAspect
:test:org.eclipse.virgo.test.stubs:compileTestJava
:test:org.eclipse.virgo.test.stubs:processTestResources
:test:org.eclipse.virgo.test.stubs:testClasses
:test:org.eclipse.virgo.test.stubs:test
:test:org.eclipse.virgo.test.stubs:check
:test:org.eclipse.virgo.test.stubs:build
|--> Signing Jar File: /jobs/genie.virgo/3.7.0.Milestones/workspace/test/org.eclipse.virgo.test.stubs/build/libs/org.eclipse.virgo.test.stubs-3.7.0.RELEASE.jar
  % Total    % Received % Xferd  Average Speed   Time    Time     Time  Current
                                 Dload  Upload   Total   Spent    Left  Speed

  0     0    0     0    0     0      0      0 --:--:-- --:--:-- --:--:--     0
100 69500    0     0  100 69500      0  69086  0:00:01  0:00:01 --:--:-- 69154
100  144k  100 78535  100 69500  65882  58303  0:00:01  0:00:01 --:--:-- 65940
:test:org.eclipse.virgo.test.tools:sourcesJar
:test:org.eclipse.virgo.test.tools:assemble
:test:org.eclipse.virgo.test.tools:compileTestJava UP-TO-DATE
:test:org.eclipse.virgo.test.tools:processTestResources UP-TO-DATE
:test:org.eclipse.virgo.test.tools:testClasses UP-TO-DATE
:test:org.eclipse.virgo.test.tools:test UP-TO-DATE
:test:org.eclipse.virgo.test.tools:check UP-TO-DATE
:test:org.eclipse.virgo.test.tools:build
|--> Signing Jar File: /jobs/genie.virgo/3.7.0.Milestones/workspace/test/org.eclipse.virgo.test.tools/build/libs/org.eclipse.virgo.test.tools-3.7.0.RELEASE.jar
  % Total    % Received % Xferd  Average Speed   Time    Time     Time  Current
                                 Dload  Upload   Total   Spent    Left  Speed

  0     0    0     0    0     0      0      0 --:--:-- --:--:-- --:--:--     0
100 17270    0     0  100 17270      0  17163  0:00:01  0:00:01 --:--:-- 17166
100 40917  100 23647  100 17270  20970  15315  0:00:01  0:00:01 --:--:-- 20982
:util:org.eclipse.virgo.util.common:sourcesJar
:util:org.eclipse.virgo.util.common:assemble
:util:org.eclipse.virgo.util.common:compileTestJava
:util:org.eclipse.virgo.util.common:processTestResources UP-TO-DATE
:util:org.eclipse.virgo.util.common:testClasses
:util:org.eclipse.virgo.util.common:test
:util:org.eclipse.virgo.util.common:check
:util:org.eclipse.virgo.util.common:build
|--> Signing Jar File: /jobs/genie.virgo/3.7.0.Milestones/workspace/util/org.eclipse.virgo.util.common/build/libs/org.eclipse.virgo.util.common-3.7.0.RELEASE.jar
  % Total    % Received % Xferd  Average Speed   Time    Time     Time  Current
                                 Dload  Upload   Total   Spent    Left  Speed

  0     0    0     0    0     0      0      0 --:--:-- --:--:-- --:--:--     0
100 57264    0     0  100 57264      0  56929  0:00:01  0:00:01 --:--:-- 56979
100  121k  100 66846  100 57264  56773  48635  0:00:01  0:00:01 --:--:-- 56793
:util:org.eclipse.virgo.util.env:sourcesJar
:util:org.eclipse.virgo.util.env:assemble
:util:org.eclipse.virgo.util.env:compileTestJava
:util:org.eclipse.virgo.util.env:processTestResources UP-TO-DATE
:util:org.eclipse.virgo.util.env:testClasses
:util:org.eclipse.virgo.util.env:test
:util:org.eclipse.virgo.util.env:check
:util:org.eclipse.virgo.util.env:build
|--> Signing Jar File: /jobs/genie.virgo/3.7.0.Milestones/workspace/util/org.eclipse.virgo.util.env/build/libs/org.eclipse.virgo.util.env-3.7.0.RELEASE.jar
  % Total    % Received % Xferd  Average Speed   Time    Time     Time  Current
                                 Dload  Upload   Total   Spent    Left  Speed

  0     0    0     0    0     0      0      0 --:--:-- --:--:-- --:--:--     0
100  4192    0     0  100  4192      0  20479 --:--:-- --:--:-- --:--:-- 20448
100 14178  100  9986  100  4192   8810   3698  0:00:01  0:00:01 --:--:--  8813
:util:org.eclipse.virgo.util.integrationtest:sourcesJar
:util:org.eclipse.virgo.util.integrationtest:assemble
:util:org.eclipse.virgo.util.integrationtest:compileTestJavaincorrect classpath: /jobs/genie.virgo/3.7.0.Milestones/workspace/util/org.eclipse.virgo.util.integrationtest/build/classes/main
incorrect classpath: /jobs/genie.virgo/3.7.0.Milestones/workspace/util/org.eclipse.virgo.util.integrationtest/build/resources/main
----------
1. WARNING in /jobs/genie.virgo/3.7.0.Milestones/workspace/util/org.eclipse.virgo.util.integrationtest/src/test/java/org/eclipse/virgo/util/test/UtilBundlesResolutionPaxExamTests.java (at line 109)
	Dictionary<String, String> headers = bundle.getHeaders();
	                                     ^^^^^^^^^^^^^^^^^^^
Type safety: The expression of type Dictionary needs unchecked conversion to conform to Dictionary<String,String>
----------
1 problem (1 warning)

:util:org.eclipse.virgo.util.integrationtest:processTestResources UP-TO-DATE
:util:org.eclipse.virgo.util.integrationtest:testClasses
:util:org.eclipse.virgo.util.integrationtest:test
:util:org.eclipse.virgo.util.integrationtest:check
:util:org.eclipse.virgo.util.integrationtest:build
|--> Signing Jar File: /jobs/genie.virgo/3.7.0.Milestones/workspace/util/org.eclipse.virgo.util.integrationtest/build/libs/org.eclipse.virgo.util.integrationtest-3.7.0.RELEASE.jar
  % Total    % Received % Xferd  Average Speed   Time    Time     Time  Current
                                 Dload  Upload   Total   Spent    Left  Speed

  0     0    0     0    0     0      0      0 --:--:-- --:--:-- --:--:--     0
100   509    0     0  100   509      0   2485 --:--:-- --:--:-- --:--:--  2482
100  6260  100  5751  100   509   5898    522 --:--:-- --:--:-- --:--:--  5898
:util:org.eclipse.virgo.util.io:sourcesJar
:util:org.eclipse.virgo.util.io:assemble
:util:org.eclipse.virgo.util.io:compileTestJava
:util:org.eclipse.virgo.util.io:processTestResources
:util:org.eclipse.virgo.util.io:testClasses
:util:org.eclipse.virgo.util.io:test
:util:org.eclipse.virgo.util.io:check
:util:org.eclipse.virgo.util.io:build
|--> Signing Jar File: /jobs/genie.virgo/3.7.0.Milestones/workspace/util/org.eclipse.virgo.util.io/build/libs/org.eclipse.virgo.util.io-3.7.0.RELEASE.jar
  % Total    % Received % Xferd  Average Speed   Time    Time     Time  Current
                                 Dload  Upload   Total   Spent    Left  Speed

  0     0    0     0    0     0      0      0 --:--:-- --:--:-- --:--:--     0
 44 68437    0     0  100 30531      0  32152 --:--:-- --:--:-- --:--:-- 32137
100 68437  100 37906  100 30531  39859  32104 --:--:-- --:--:-- --:--:-- 39859
:util:org.eclipse.virgo.util.jmx:sourcesJar
:util:org.eclipse.virgo.util.jmx:assemble
:util:org.eclipse.virgo.util.jmx:compileTestAspect
:util:org.eclipse.virgo.util.jmx:compileTestJava
:util:org.eclipse.virgo.util.jmx:processTestResources UP-TO-DATE
:util:org.eclipse.virgo.util.jmx:testClasses
:util:org.eclipse.virgo.util.jmx:test
:util:org.eclipse.virgo.util.jmx:check
:util:org.eclipse.virgo.util.jmx:build
|--> Signing Jar File: /jobs/genie.virgo/3.7.0.Milestones/workspace/util/org.eclipse.virgo.util.jmx/build/libs/org.eclipse.virgo.util.jmx-3.7.0.RELEASE.jar
  % Total    % Received % Xferd  Average Speed   Time    Time     Time  Current
                                 Dload  Upload   Total   Spent    Left  Speed

  0     0    0     0    0     0      0      0 --:--:-- --:--:-- --:--:--     0
 31 15337    0     0  100  4757      0   5104 --:--:-- --:--:-- --:--:--  5104
100 15337  100 10580  100  4757  11347   5101 --:--:-- --:--:-- --:--:-- 11339
:util:org.eclipse.virgo.util.math:sourcesJar
:util:org.eclipse.virgo.util.math:assemble
:util:org.eclipse.virgo.util.math:compileTestJava
:util:org.eclipse.virgo.util.math:processTestResources UP-TO-DATE
:util:org.eclipse.virgo.util.math:testClasses
:util:org.eclipse.virgo.util.math:test
:util:org.eclipse.virgo.util.math:check
:util:org.eclipse.virgo.util.math:build
|--> Signing Jar File: /jobs/genie.virgo/3.7.0.Milestones/workspace/util/org.eclipse.virgo.util.math/build/libs/org.eclipse.virgo.util.math-3.7.0.RELEASE.jar
  % Total    % Received % Xferd  Average Speed   Time    Time     Time  Current
                                 Dload  Upload   Total   Spent    Left  Speed

  0     0    0     0    0     0      0      0 --:--:-- --:--:-- --:--:--     0
 37 25191    0     0  100  9443      0   9911 --:--:-- --:--:-- --:--:--  9908
100 25191  100 15748  100  9443  16517   9904 --:--:-- --:--:-- --:--:-- 16507
:util:org.eclipse.virgo.util.osgi:sourcesJar
:util:org.eclipse.virgo.util.osgi:assemble
:util:org.eclipse.virgo.util.osgi:compileTestJava
:util:org.eclipse.virgo.util.osgi:processTestResources
:util:org.eclipse.virgo.util.osgi:testClasses
:util:org.eclipse.virgo.util.osgi:test
:util:org.eclipse.virgo.util.osgi:check
:util:org.eclipse.virgo.util.osgi:build
|--> Signing Jar File: /jobs/genie.virgo/3.7.0.Milestones/workspace/util/org.eclipse.virgo.util.osgi/build/libs/org.eclipse.virgo.util.osgi-3.7.0.RELEASE.jar
  % Total    % Received % Xferd  Average Speed   Time    Time     Time  Current
                                 Dload  Upload   Total   Spent    Left  Speed

  0     0    0     0    0     0      0      0 --:--:-- --:--:-- --:--:--     0
100  3130    0     0  100  3130      0  15287 --:--:-- --:--:-- --:--:-- 15268
 26 11953    0     0  100  3130      0   2597  0:00:01  0:00:01 --:--:--  2597
100 11953  100  8823  100  3130   7318   2596  0:00:01  0:00:01 --:--:--  7315
:util:org.eclipse.virgo.util.osgi.manifest:sourcesJar
:util:org.eclipse.virgo.util.osgi.manifest:assemble
:util:org.eclipse.virgo.util.osgi.manifest:compileTestJava
:util:org.eclipse.virgo.util.osgi.manifest:processTestResources
:util:org.eclipse.virgo.util.osgi.manifest:testClasses
:util:org.eclipse.virgo.util.osgi.manifest:test
:util:org.eclipse.virgo.util.osgi.manifest:check
:util:org.eclipse.virgo.util.osgi.manifest:build
|--> Signing Jar File: /jobs/genie.virgo/3.7.0.Milestones/workspace/util/org.eclipse.virgo.util.osgi.manifest/build/libs/org.eclipse.virgo.util.osgi.manifest-3.7.0.RELEASE.jar
  % Total    % Received % Xferd  Average Speed   Time    Time     Time  Current
                                 Dload  Upload   Total   Spent    Left  Speed

  0     0    0     0    0     0      0      0 --:--:-- --:--:-- --:--:--     0
100 92833    0     0  100 92833      0  92210  0:00:01  0:00:01 --:--:-- 92279
100  194k  100  103k  100 92833  89207  77932  0:00:01  0:00:01 --:--:-- 89221
:util:org.eclipse.virgo.util.parser.launcher:sourcesJar
:util:org.eclipse.virgo.util.parser.launcher:assemble
:util:org.eclipse.virgo.util.parser.launcher:compileTestJava
:util:org.eclipse.virgo.util.parser.launcher:processTestResources
:util:org.eclipse.virgo.util.parser.launcher:testClasses
:util:org.eclipse.virgo.util.parser.launcher:test
:util:org.eclipse.virgo.util.parser.launcher:check
:util:org.eclipse.virgo.util.parser.launcher:build
|--> Signing Jar File: /jobs/genie.virgo/3.7.0.Milestones/workspace/util/org.eclipse.virgo.util.parser.launcher/build/libs/org.eclipse.virgo.util.parser.launcher-3.7.0.RELEASE.jar
  % Total    % Received % Xferd  Average Speed   Time    Time     Time  Current
                                 Dload  Upload   Total   Spent    Left  Speed

  0     0    0     0    0     0      0      0 --:--:-- --:--:-- --:--:--     0
100  8081    0     0  100  8081      0  39467 --:--:-- --:--:-- --:--:-- 39419
 36 22195    0     0  100  8081      0   6973  0:00:01  0:00:01 --:--:--  6972
100 22195  100 14114  100  8081  12172   6969  0:00:01  0:00:01 --:--:-- 12167
:util:org.eclipse.virgo.util.parser.manifest:sourcesJar
:util:org.eclipse.virgo.util.parser.manifest:assemble
:util:org.eclipse.virgo.util.parser.manifest:compileTestJava
:util:org.eclipse.virgo.util.parser.manifest:processTestResources
:util:org.eclipse.virgo.util.parser.manifest:testClasses
:util:org.eclipse.virgo.util.parser.manifest:test
:util:org.eclipse.virgo.util.parser.manifest:check
:util:org.eclipse.virgo.util.parser.manifest:build
|--> Signing Jar File: /jobs/genie.virgo/3.7.0.Milestones/workspace/util/org.eclipse.virgo.util.parser.manifest/build/libs/org.eclipse.virgo.util.parser.manifest-3.7.0.RELEASE.jar
  % Total    % Received % Xferd  Average Speed   Time    Time     Time  Current
                                 Dload  Upload   Total   Spent    Left  Speed

  0     0    0     0    0     0      0      0 --:--:-- --:--:-- --:--:--     0
 43 58614    0     0  100 25688      0  26459 --:--:-- --:--:-- --:--:-- 26455
100 58614  100 32926  100 25688  33863  26419 --:--:-- --:--:-- --:--:-- 33839
:web:org.eclipse.virgo.web.core:sourcesJar
:web:org.eclipse.virgo.web.core:assemble
:web:org.eclipse.virgo.web.core:compileTestJava
:web:org.eclipse.virgo.web.core:processTestResources UP-TO-DATE
:web:org.eclipse.virgo.web.core:testClasses
:web:org.eclipse.virgo.web.core:test
:web:org.eclipse.virgo.web.core:check
:web:org.eclipse.virgo.web.core:build
|--> Signing Jar File: /jobs/genie.virgo/3.7.0.Milestones/workspace/web/org.eclipse.virgo.web.core/build/libs/org.eclipse.virgo.web.core-3.7.0.RELEASE.jar
  % Total    % Received % Xferd  Average Speed   Time    Time     Time  Current
                                 Dload  Upload   Total   Spent    Left  Speed

  0     0    0     0    0     0      0      0 --:--:-- --:--:-- --:--:--     0
100 25656    0     0  100 25656      0  25503  0:00:01  0:00:01 --:--:-- 25528
100 58762  100 33106  100 25656  28087  21766  0:00:01  0:00:01 --:--:-- 28103
:web:org.eclipse.virgo.web.dm:sourcesJar
:web:org.eclipse.virgo.web.dm:assemble
:web:org.eclipse.virgo.web.dm:compileTestJavaincorrect classpath: /jobs/genie.virgo/3.7.0.Milestones/workspace/web/org.eclipse.virgo.web.dm/build/resources/main

:web:org.eclipse.virgo.web.dm:processTestResources UP-TO-DATE
:web:org.eclipse.virgo.web.dm:testClasses
:web:org.eclipse.virgo.web.dm:test
:web:org.eclipse.virgo.web.dm:check
:web:org.eclipse.virgo.web.dm:build
|--> Signing Jar File: /jobs/genie.virgo/3.7.0.Milestones/workspace/web/org.eclipse.virgo.web.dm/build/libs/org.eclipse.virgo.web.dm-3.7.0.RELEASE.jar
  % Total    % Received % Xferd  Average Speed   Time    Time     Time  Current
                                 Dload  Upload   Total   Spent    Left  Speed

  0     0    0     0    0     0      0      0 --:--:-- --:--:-- --:--:--     0
100  5421    0     0  100  5421      0   5385  0:00:01  0:00:01 --:--:--  5388
100 16452  100 11031  100  5421   9648   4741  0:00:01  0:00:01 --:--:--  9650
:web:org.eclipse.virgo.web.enterprise.appdeployer:sourcesJar
:web:org.eclipse.virgo.web.enterprise.appdeployer:assemble
:web:org.eclipse.virgo.web.enterprise.appdeployer:compileTestJava UP-TO-DATE
:web:org.eclipse.virgo.web.enterprise.appdeployer:processTestResources UP-TO-DATE
:web:org.eclipse.virgo.web.enterprise.appdeployer:testClasses UP-TO-DATE
:web:org.eclipse.virgo.web.enterprise.appdeployer:test UP-TO-DATE
:web:org.eclipse.virgo.web.enterprise.appdeployer:check UP-TO-DATE
:web:org.eclipse.virgo.web.enterprise.appdeployer:build
|--> Signing Jar File: /jobs/genie.virgo/3.7.0.Milestones/workspace/web/org.eclipse.virgo.web.enterprise.appdeployer/build/libs/org.eclipse.virgo.web.enterprise.appdeployer-3.7.0.RELEASE.jar
  % Total    % Received % Xferd  Average Speed   Time    Time     Time  Current
                                 Dload  Upload   Total   Spent    Left  Speed

  0     0    0     0    0     0      0      0 --:--:-- --:--:-- --:--:--     0
 44 64256    0     0  100 28819      0  29202 --:--:-- --:--:-- --:--:-- 29198
100 64256  100 35437  100 28819  35873  29174 --:--:-- --:--:-- --:--:-- 35867
:web:org.eclipse.virgo.web.enterprise.applistener:sourcesJar
:web:org.eclipse.virgo.web.enterprise.applistener:assemble
:web:org.eclipse.virgo.web.enterprise.applistener:compileTestJava UP-TO-DATE
:web:org.eclipse.virgo.web.enterprise.applistener:processTestResources UP-TO-DATE
:web:org.eclipse.virgo.web.enterprise.applistener:testClasses UP-TO-DATE
:web:org.eclipse.virgo.web.enterprise.applistener:test UP-TO-DATE
:web:org.eclipse.virgo.web.enterprise.applistener:check UP-TO-DATE
:web:org.eclipse.virgo.web.enterprise.applistener:build
|--> Signing Jar File: /jobs/genie.virgo/3.7.0.Milestones/workspace/web/org.eclipse.virgo.web.enterprise.applistener/build/libs/org.eclipse.virgo.web.enterprise.applistener-3.7.0.RELEASE.jar
  % Total    % Received % Xferd  Average Speed   Time    Time     Time  Current
                                 Dload  Upload   Total   Spent    Left  Speed

  0     0    0     0    0     0      0      0 --:--:-- --:--:-- --:--:--     0
 34 18439    0     0  100  6285      0   6911 --:--:-- --:--:-- --:--:--  6906
100 18439  100 12154  100  6285  13358   6907 --:--:-- --:--:-- --:--:-- 13356
:web:org.eclipse.virgo.web.enterprise.catalina.fragment.webbeans:sourcesJar
:web:org.eclipse.virgo.web.enterprise.catalina.fragment.webbeans:assemble
:web:org.eclipse.virgo.web.enterprise.catalina.fragment.webbeans:compileTestJava UP-TO-DATE
:web:org.eclipse.virgo.web.enterprise.catalina.fragment.webbeans:processTestResources UP-TO-DATE
:web:org.eclipse.virgo.web.enterprise.catalina.fragment.webbeans:testClasses UP-TO-DATE
:web:org.eclipse.virgo.web.enterprise.catalina.fragment.webbeans:test UP-TO-DATE
:web:org.eclipse.virgo.web.enterprise.catalina.fragment.webbeans:check UP-TO-DATE
:web:org.eclipse.virgo.web.enterprise.catalina.fragment.webbeans:build
|--> Signing Jar File: /jobs/genie.virgo/3.7.0.Milestones/workspace/web/org.eclipse.virgo.web.enterprise.catalina.fragment.webbeans/build/libs/org.eclipse.virgo.web.enterprise.catalina.fragment.webbeans-3.7.0.RELEASE.jar
  % Total    % Received % Xferd  Average Speed   Time    Time     Time  Current
                                 Dload  Upload   Total   Spent    Left  Speed

  0     0    0     0    0     0      0      0 --:--:-- --:--:-- --:--:--     0
 18  8501    0     0  100  1546      0   1574 --:--:-- --:--:-- --:--:--  1574
100  8501  100  6955  100  1546   7074   1572 --:--:-- --:--:-- --:--:--  7075
:web:org.eclipse.virgo.web.enterprise.javax.persistence.extension:sourcesJar
:web:org.eclipse.virgo.web.enterprise.javax.persistence.extension:assemble
:web:org.eclipse.virgo.web.enterprise.javax.persistence.extension:compileTestJava----------
1. WARNING in /jobs/genie.virgo/3.7.0.Milestones/workspace/web/org.eclipse.virgo.web.enterprise.javax.persistence.extension/src/test/java/org/eclipse/virgo/web/enterprise/javax/persistence/extension/TestPersistenceProvider.java (at line 40)
	public boolean generateSchema(String arg0, Map arg1) {
	                                           ^^^
Map is a raw type. References to generic type Map<K,V> should be parameterized
----------
2. WARNING in /jobs/genie.virgo/3.7.0.Milestones/workspace/web/org.eclipse.virgo.web.enterprise.javax.persistence.extension/src/test/java/org/eclipse/virgo/web/enterprise/javax/persistence/extension/TestPersistenceProvider.java (at line 45)
	public void generateSchema(PersistenceUnitInfo arg0, Map arg1) {
	                                                     ^^^
Map is a raw type. References to generic type Map<K,V> should be parameterized
----------
2 problems (2 warnings)

:web:org.eclipse.virgo.web.enterprise.javax.persistence.extension:processTestResources UP-TO-DATE
:web:org.eclipse.virgo.web.enterprise.javax.persistence.extension:testClasses
:web:org.eclipse.virgo.web.enterprise.javax.persistence.extension:test
:web:org.eclipse.virgo.web.enterprise.javax.persistence.extension:check
:web:org.eclipse.virgo.web.enterprise.javax.persistence.extension:build
|--> Signing Jar File: /jobs/genie.virgo/3.7.0.Milestones/workspace/web/org.eclipse.virgo.web.enterprise.javax.persistence.extension/build/libs/org.eclipse.virgo.web.enterprise.javax.persistence.extension-3.7.0.RELEASE.jar
  % Total    % Received % Xferd  Average Speed   Time    Time     Time  Current
                                 Dload  Upload   Total   Spent    Left  Speed

  0     0    0     0    0     0      0      0 --:--:-- --:--:-- --:--:--     0
 38 25796    0     0  100  9861      0  10232 --:--:-- --:--:-- --:--:-- 10229
100 25796  100 15935  100  9861  16524  10225 --:--:-- --:--:-- --:--:-- 16512
:web:org.eclipse.virgo.web.enterprise.javax.persistence.provider.initializer:sourcesJar
:web:org.eclipse.virgo.web.enterprise.javax.persistence.provider.initializer:assemble
:web:org.eclipse.virgo.web.enterprise.javax.persistence.provider.initializer:compileTestJava
:web:org.eclipse.virgo.web.enterprise.javax.persistence.provider.initializer:processTestResources UP-TO-DATE
:web:org.eclipse.virgo.web.enterprise.javax.persistence.provider.initializer:testClasses
:web:org.eclipse.virgo.web.enterprise.javax.persistence.provider.initializer:test
:web:org.eclipse.virgo.web.enterprise.javax.persistence.provider.initializer:check
:web:org.eclipse.virgo.web.enterprise.javax.persistence.provider.initializer:build
|--> Signing Jar File: /jobs/genie.virgo/3.7.0.Milestones/workspace/web/org.eclipse.virgo.web.enterprise.javax.persistence.provider.initializer/build/libs/org.eclipse.virgo.web.enterprise.javax.persistence.provider.initializer-3.7.0.RELEASE.jar
  % Total    % Received % Xferd  Average Speed   Time    Time     Time  Current
                                 Dload  Upload   Total   Spent    Left  Speed

  0     0    0     0    0     0      0      0 --:--:-- --:--:-- --:--:--     0
100  4028    0     0  100  4028      0  19585 --:--:-- --:--:-- --:--:-- 19553
 29 13801    0     0  100  4028      0   3434  0:00:01  0:00:01 --:--:--  3433
100 13801  100  9773  100  4028   8328   3432  0:00:01  0:00:01 --:--:--  8324
:web:org.eclipse.virgo.web.enterprise.jsf.support:sourcesJar
:web:org.eclipse.virgo.web.enterprise.jsf.support:assemble
:web:org.eclipse.virgo.web.enterprise.jsf.support:compileTestJava UP-TO-DATE
:web:org.eclipse.virgo.web.enterprise.jsf.support:processTestResources UP-TO-DATE
:web:org.eclipse.virgo.web.enterprise.jsf.support:testClasses UP-TO-DATE
:web:org.eclipse.virgo.web.enterprise.jsf.support:test UP-TO-DATE
:web:org.eclipse.virgo.web.enterprise.jsf.support:check UP-TO-DATE
:web:org.eclipse.virgo.web.enterprise.jsf.support:build
|--> Signing Jar File: /jobs/genie.virgo/3.7.0.Milestones/workspace/web/org.eclipse.virgo.web.enterprise.jsf.support/build/libs/org.eclipse.virgo.web.enterprise.jsf.support-3.7.0.RELEASE.jar
  % Total    % Received % Xferd  Average Speed   Time    Time     Time  Current
                                 Dload  Upload   Total   Spent    Left  Speed

  0     0    0     0    0     0      0      0 --:--:-- --:--:-- --:--:--     0
 35 20325    0     0  100  7297      0   7601 --:--:-- --:--:-- --:--:--  7601
100 20325  100 13028  100  7297  13564   7597 --:--:-- --:--:-- --:--:-- 13556
:web:org.eclipse.virgo.web.enterprise.openejb.fragment.bval:sourcesJar
:web:org.eclipse.virgo.web.enterprise.openejb.fragment.bval:assemble
:web:org.eclipse.virgo.web.enterprise.openejb.fragment.bval:compileTestJava UP-TO-DATE
:web:org.eclipse.virgo.web.enterprise.openejb.fragment.bval:processTestResources UP-TO-DATE
:web:org.eclipse.virgo.web.enterprise.openejb.fragment.bval:testClasses UP-TO-DATE
:web:org.eclipse.virgo.web.enterprise.openejb.fragment.bval:test UP-TO-DATE
:web:org.eclipse.virgo.web.enterprise.openejb.fragment.bval:check UP-TO-DATE
:web:org.eclipse.virgo.web.enterprise.openejb.fragment.bval:build
|--> Signing Jar File: /jobs/genie.virgo/3.7.0.Milestones/workspace/web/org.eclipse.virgo.web.enterprise.openejb.fragment.bval/build/libs/org.eclipse.virgo.web.enterprise.openejb.fragment.bval-3.7.0.RELEASE.jar
  % Total    % Received % Xferd  Average Speed   Time    Time     Time  Current
                                 Dload  Upload   Total   Spent    Left  Speed

  0     0    0     0    0     0      0      0 --:--:-- --:--:-- --:--:--     0
100  1879    0     0  100  1879      0   1866  0:00:01  0:00:01 --:--:--  1867
100  9363  100  7484  100  1879   6562   1647  0:00:01  0:00:01 --:--:--  6564
:web:org.eclipse.virgo.web.enterprise.openejb.fragment.jotm:sourcesJar
:web:org.eclipse.virgo.web.enterprise.openejb.fragment.jotm:assemble
:web:org.eclipse.virgo.web.enterprise.openejb.fragment.jotm:compileTestJava UP-TO-DATE
:web:org.eclipse.virgo.web.enterprise.openejb.fragment.jotm:processTestResources UP-TO-DATE
:web:org.eclipse.virgo.web.enterprise.openejb.fragment.jotm:testClasses UP-TO-DATE
:web:org.eclipse.virgo.web.enterprise.openejb.fragment.jotm:test UP-TO-DATE
:web:org.eclipse.virgo.web.enterprise.openejb.fragment.jotm:check UP-TO-DATE
:web:org.eclipse.virgo.web.enterprise.openejb.fragment.jotm:build
|--> Signing Jar File: /jobs/genie.virgo/3.7.0.Milestones/workspace/web/org.eclipse.virgo.web.enterprise.openejb.fragment.jotm/build/libs/org.eclipse.virgo.web.enterprise.openejb.fragment.jotm-3.7.0.RELEASE.jar
  % Total    % Received % Xferd  Average Speed   Time    Time     Time  Current
                                 Dload  Upload   Total   Spent    Left  Speed

  0     0    0     0    0     0      0      0 --:--:-- --:--:-- --:--:--     0
100  3900    0     0  100  3900      0   3876  0:00:01  0:00:01 --:--:--  3880
100 13679  100  9779  100  3900   8402   3351  0:00:01  0:00:01 --:--:--  8408
:web:org.eclipse.virgo.web.enterprise.openejb.fragment.jpa:sourcesJar
:web:org.eclipse.virgo.web.enterprise.openejb.fragment.jpa:assemble
:web:org.eclipse.virgo.web.enterprise.openejb.fragment.jpa:compileTestJava UP-TO-DATE
:web:org.eclipse.virgo.web.enterprise.openejb.fragment.jpa:processTestResources UP-TO-DATE
:web:org.eclipse.virgo.web.enterprise.openejb.fragment.jpa:testClasses UP-TO-DATE
:web:org.eclipse.virgo.web.enterprise.openejb.fragment.jpa:test UP-TO-DATE
:web:org.eclipse.virgo.web.enterprise.openejb.fragment.jpa:check UP-TO-DATE
:web:org.eclipse.virgo.web.enterprise.openejb.fragment.jpa:build
|--> Signing Jar File: /jobs/genie.virgo/3.7.0.Milestones/workspace/web/org.eclipse.virgo.web.enterprise.openejb.fragment.jpa/build/libs/org.eclipse.virgo.web.enterprise.openejb.fragment.jpa-3.7.0.RELEASE.jar
  % Total    % Received % Xferd  Average Speed   Time    Time     Time  Current
                                 Dload  Upload   Total   Spent    Left  Speed

  0     0    0     0    0     0      0      0 --:--:-- --:--:-- --:--:--     0
100  1542    0     0  100  1542      0   1531  0:00:01  0:00:01 --:--:--  1532
100  8495  100  6953  100  1542   5855   1298  0:00:01  0:00:01 --:--:--  5857
:web:org.eclipse.virgo.web.enterprise.openejb.fragment.webbeans:sourcesJar
:web:org.eclipse.virgo.web.enterprise.openejb.fragment.webbeans:assemble
:web:org.eclipse.virgo.web.enterprise.openejb.fragment.webbeans:compileTestJava UP-TO-DATE
:web:org.eclipse.virgo.web.enterprise.openejb.fragment.webbeans:processTestResources UP-TO-DATE
:web:org.eclipse.virgo.web.enterprise.openejb.fragment.webbeans:testClasses UP-TO-DATE
:web:org.eclipse.virgo.web.enterprise.openejb.fragment.webbeans:test UP-TO-DATE
:web:org.eclipse.virgo.web.enterprise.openejb.fragment.webbeans:check UP-TO-DATE
:web:org.eclipse.virgo.web.enterprise.openejb.fragment.webbeans:build
|--> Signing Jar File: /jobs/genie.virgo/3.7.0.Milestones/workspace/web/org.eclipse.virgo.web.enterprise.openejb.fragment.webbeans/build/libs/org.eclipse.virgo.web.enterprise.openejb.fragment.webbeans-3.7.0.RELEASE.jar
  % Total    % Received % Xferd  Average Speed   Time    Time     Time  Current
                                 Dload  Upload   Total   Spent    Left  Speed

  0     0    0     0    0     0      0      0 --:--:-- --:--:-- --:--:--     0
 20  9546    0     0  100  1971      0   2014 --:--:-- --:--:-- --:--:--  2013
100  9546  100  7575  100  1971   7736   2012 --:--:-- --:--:-- --:--:--  7729
:web:org.eclipse.virgo.web.enterprise.openejb.initialiser:sourcesJar
:web:org.eclipse.virgo.web.enterprise.openejb.initialiser:assemble
:web:org.eclipse.virgo.web.enterprise.openejb.initialiser:compileTestJava UP-TO-DATE
:web:org.eclipse.virgo.web.enterprise.openejb.initialiser:processTestResources UP-TO-DATE
:web:org.eclipse.virgo.web.enterprise.openejb.initialiser:testClasses UP-TO-DATE
:web:org.eclipse.virgo.web.enterprise.openejb.initialiser:test UP-TO-DATE
:web:org.eclipse.virgo.web.enterprise.openejb.initialiser:check UP-TO-DATE
:web:org.eclipse.virgo.web.enterprise.openejb.initialiser:build
|--> Signing Jar File: /jobs/genie.virgo/3.7.0.Milestones/workspace/web/org.eclipse.virgo.web.enterprise.openejb.initialiser/build/libs/org.eclipse.virgo.web.enterprise.openejb.initialiser-3.7.0.RELEASE.jar
  % Total    % Received % Xferd  Average Speed   Time    Time     Time  Current
                                 Dload  Upload   Total   Spent    Left  Speed

  0     0    0     0    0     0      0      0 --:--:-- --:--:-- --:--:--     0
100  9306    0     0  100  9306      0   9252  0:00:01  0:00:01 --:--:--  9259
100 24822  100 15516  100  9306  13078   7844  0:00:01  0:00:01 --:--:-- 13082
:web:org.eclipse.virgo.web.enterprise.openejb.jpa.integration:sourcesJar
:web:org.eclipse.virgo.web.enterprise.openejb.jpa.integration:assemble
:web:org.eclipse.virgo.web.enterprise.openejb.jpa.integration:compileTestJava UP-TO-DATE
:web:org.eclipse.virgo.web.enterprise.openejb.jpa.integration:processTestResources UP-TO-DATE
:web:org.eclipse.virgo.web.enterprise.openejb.jpa.integration:testClasses UP-TO-DATE
:web:org.eclipse.virgo.web.enterprise.openejb.jpa.integration:test UP-TO-DATE
:web:org.eclipse.virgo.web.enterprise.openejb.jpa.integration:check UP-TO-DATE
:web:org.eclipse.virgo.web.enterprise.openejb.jpa.integration:build
|--> Signing Jar File: /jobs/genie.virgo/3.7.0.Milestones/workspace/web/org.eclipse.virgo.web.enterprise.openejb.jpa.integration/build/libs/org.eclipse.virgo.web.enterprise.openejb.jpa.integration-3.7.0.RELEASE.jar
  % Total    % Received % Xferd  Average Speed   Time    Time     Time  Current
                                 Dload  Upload   Total   Spent    Left  Speed

  0     0    0     0    0     0      0      0 --:--:-- --:--:-- --:--:--     0
100  5892    0     0  100  5892      0  28779 --:--:-- --:--:-- --:--:-- 28741
100 17786  100 11894  100  5892  12638   6261 --:--:-- --:--:-- --:--:-- 12639
:web:org.eclipse.virgo.web.enterprise.openejb.tomcat.factory:sourcesJar
:web:org.eclipse.virgo.web.enterprise.openejb.tomcat.factory:assemble
:web:org.eclipse.virgo.web.enterprise.openejb.tomcat.factory:compileTestJava
:web:org.eclipse.virgo.web.enterprise.openejb.tomcat.factory:processTestResources UP-TO-DATE
:web:org.eclipse.virgo.web.enterprise.openejb.tomcat.factory:testClasses
:web:org.eclipse.virgo.web.enterprise.openejb.tomcat.factory:test
:web:org.eclipse.virgo.web.enterprise.openejb.tomcat.factory:check
:web:org.eclipse.virgo.web.enterprise.openejb.tomcat.factory:build
|--> Signing Jar File: /jobs/genie.virgo/3.7.0.Milestones/workspace/web/org.eclipse.virgo.web.enterprise.openejb.tomcat.factory/build/libs/org.eclipse.virgo.web.enterprise.openejb.tomcat.factory-3.7.0.RELEASE.jar
  % Total    % Received % Xferd  Average Speed   Time    Time     Time  Current
                                 Dload  Upload   Total   Spent    Left  Speed

  0     0    0     0    0     0      0      0 --:--:-- --:--:-- --:--:--     0
 30 14743    0     0  100  4425      0   4738 --:--:-- --:--:-- --:--:--  4737
100 14743  100 10318  100  4425  11043   4736 --:--:-- --:--:-- --:--:-- 11035
:web:org.eclipse.virgo.web.enterprise.openwebbeans.initialiser:sourcesJar
:web:org.eclipse.virgo.web.enterprise.openwebbeans.initialiser:assemble
:web:org.eclipse.virgo.web.enterprise.openwebbeans.initialiser:compileTestJava UP-TO-DATE
:web:org.eclipse.virgo.web.enterprise.openwebbeans.initialiser:processTestResources UP-TO-DATE
:web:org.eclipse.virgo.web.enterprise.openwebbeans.initialiser:testClasses UP-TO-DATE
:web:org.eclipse.virgo.web.enterprise.openwebbeans.initialiser:test UP-TO-DATE
:web:org.eclipse.virgo.web.enterprise.openwebbeans.initialiser:check UP-TO-DATE
:web:org.eclipse.virgo.web.enterprise.openwebbeans.initialiser:build
|--> Signing Jar File: /jobs/genie.virgo/3.7.0.Milestones/workspace/web/org.eclipse.virgo.web.enterprise.openwebbeans.initialiser/build/libs/org.eclipse.virgo.web.enterprise.openwebbeans.initialiser-3.7.0.RELEASE.jar
  % Total    % Received % Xferd  Average Speed   Time    Time     Time  Current
                                 Dload  Upload   Total   Spent    Left  Speed

  0     0    0     0    0     0      0      0 --:--:-- --:--:-- --:--:--     0
100 11400    0     0  100 11400      0  11333  0:00:01  0:00:01 --:--:-- 11343
100 29042  100 17642  100 11400  14878   9614  0:00:01  0:00:01 --:--:-- 14887
:web:org.eclipse.virgo.web.enterprise.persistence.openejb.classloading.hook:sourcesJar
:web:org.eclipse.virgo.web.enterprise.persistence.openejb.classloading.hook:assemble
:web:org.eclipse.virgo.web.enterprise.persistence.openejb.classloading.hook:compileTestJava
:web:org.eclipse.virgo.web.enterprise.persistence.openejb.classloading.hook:processTestResources UP-TO-DATE
:web:org.eclipse.virgo.web.enterprise.persistence.openejb.classloading.hook:testClasses
:web:org.eclipse.virgo.web.enterprise.persistence.openejb.classloading.hook:test
:web:org.eclipse.virgo.web.enterprise.persistence.openejb.classloading.hook:check
:web:org.eclipse.virgo.web.enterprise.persistence.openejb.classloading.hook:build
|--> Signing Jar File: /jobs/genie.virgo/3.7.0.Milestones/workspace/web/org.eclipse.virgo.web.enterprise.persistence.openejb.classloading.hook/build/libs/org.eclipse.virgo.web.enterprise.persistence.openejb.classloading.hook-3.7.0.RELEASE.jar
  % Total    % Received % Xferd  Average Speed   Time    Time     Time  Current
                                 Dload  Upload   Total   Spent    Left  Speed

  0     0    0     0    0     0      0      0 --:--:-- --:--:-- --:--:--     0
100  8449    0     0  100  8449      0  41270 --:--:-- --:--:-- --:--:-- 41214
100 23023  100 14574  100  8449  14691   8517 --:--:-- --:--:-- --:--:-- 14691
:web:org.eclipse.virgo.web.enterprise.security:sourcesJar
:web:org.eclipse.virgo.web.enterprise.security:assemble
:web:org.eclipse.virgo.web.enterprise.security:compileTestJava----------
1. WARNING in /jobs/genie.virgo/3.7.0.Milestones/workspace/web/org.eclipse.virgo.web.enterprise.security/src/test/java/org/eclipse/virgo/web/enterprise/security/StandardSecurityServiceTest.java (at line 193)
	ThreadLocal<Wrapper> wrapperLocal = (ThreadLocal<Wrapper>) wrapper; 
	                                    ^^^^^^^^^^^^^^^^^^^^^^^^^^^^^^
Type safety: Unchecked cast from Object to ThreadLocal<Wrapper>
----------
1 problem (1 warning)

:web:org.eclipse.virgo.web.enterprise.security:processTestResources UP-TO-DATE
:web:org.eclipse.virgo.web.enterprise.security:testClasses
:web:org.eclipse.virgo.web.enterprise.security:test
:web:org.eclipse.virgo.web.enterprise.security:check
:web:org.eclipse.virgo.web.enterprise.security:build
|--> Signing Jar File: /jobs/genie.virgo/3.7.0.Milestones/workspace/web/org.eclipse.virgo.web.enterprise.security/build/libs/org.eclipse.virgo.web.enterprise.security-3.7.0.RELEASE.jar
  % Total    % Received % Xferd  Average Speed   Time    Time     Time  Current
                                 Dload  Upload   Total   Spent    Left  Speed

  0     0    0     0    0     0      0      0 --:--:-- --:--:-- --:--:--     0
 38 26404    0     0  100 10044      0  10359 --:--:-- --:--:-- --:--:-- 10354
100 26404  100 16360  100 10044  16864  10353 --:--:-- --:--:-- --:--:-- 16848
:web:org.eclipse.virgo.web.enterprise.security.openejb.classloading.hook:sourcesJar
:web:org.eclipse.virgo.web.enterprise.security.openejb.classloading.hook:assemble
:web:org.eclipse.virgo.web.enterprise.security.openejb.classloading.hook:compileTestJava UP-TO-DATE
:web:org.eclipse.virgo.web.enterprise.security.openejb.classloading.hook:processTestResources UP-TO-DATE
:web:org.eclipse.virgo.web.enterprise.security.openejb.classloading.hook:testClasses UP-TO-DATE
:web:org.eclipse.virgo.web.enterprise.security.openejb.classloading.hook:test UP-TO-DATE
:web:org.eclipse.virgo.web.enterprise.security.openejb.classloading.hook:check UP-TO-DATE
:web:org.eclipse.virgo.web.enterprise.security.openejb.classloading.hook:build
|--> Signing Jar File: /jobs/genie.virgo/3.7.0.Milestones/workspace/web/org.eclipse.virgo.web.enterprise.security.openejb.classloading.hook/build/libs/org.eclipse.virgo.web.enterprise.security.openejb.classloading.hook-3.7.0.RELEASE.jar
  % Total    % Received % Xferd  Average Speed   Time    Time     Time  Current
                                 Dload  Upload   Total   Spent    Left  Speed

  0     0    0     0    0     0      0      0 --:--:-- --:--:-- --:--:--     0
 31 15741    0     0  100  4914      0   5376 --:--:-- --:--:-- --:--:--  5376
100 15741  100 10827  100  4914  11838   5373 --:--:-- --:--:-- --:--:-- 11832
:web:org.eclipse.virgo.web.enterprise.security.valve:sourcesJar
:web:org.eclipse.virgo.web.enterprise.security.valve:assemble
:web:org.eclipse.virgo.web.enterprise.security.valve:compileTestJava UP-TO-DATE
:web:org.eclipse.virgo.web.enterprise.security.valve:processTestResources UP-TO-DATE
:web:org.eclipse.virgo.web.enterprise.security.valve:testClasses UP-TO-DATE
:web:org.eclipse.virgo.web.enterprise.security.valve:test UP-TO-DATE
:web:org.eclipse.virgo.web.enterprise.security.valve:check UP-TO-DATE
:web:org.eclipse.virgo.web.enterprise.security.valve:build
|--> Signing Jar File: /jobs/genie.virgo/3.7.0.Milestones/workspace/web/org.eclipse.virgo.web.enterprise.security.valve/build/libs/org.eclipse.virgo.web.enterprise.security.valve-3.7.0.RELEASE.jar
  % Total    % Received % Xferd  Average Speed   Time    Time     Time  Current
                                 Dload  Upload   Total   Spent    Left  Speed

  0     0    0     0    0     0      0      0 --:--:-- --:--:-- --:--:--     0
 28 13426    0     0  100  3844      0   4319 --:--:-- --:--:-- --:--:--  4319
100 13426  100  9582  100  3844  10762   4317 --:--:-- --:--:-- --:--:-- 10754
:web:org.eclipse.virgo.web.enterprise.services.accessor:sourcesJar
:web:org.eclipse.virgo.web.enterprise.services.accessor:assemble
:web:org.eclipse.virgo.web.enterprise.services.accessor:compileTestJava----------
1. WARNING in /jobs/genie.virgo/3.7.0.Milestones/workspace/web/org.eclipse.virgo.web.enterprise.services.accessor/src/test/java/org/eclipse/virgo/web/enterprise/services/accessor/WebAppBundleClassloaderCustomizerTest.java (at line 94)
	assertTrue(((List<ClassLoaderDelegateHook>) field.get(PluggableDelegatingClassLoaderDelegateHook.getInstance())).contains(webAppBundleClassloaderCustomizer.getWebAppBundleClassLoaderDelegateHook()));
	           ^^^^^^^^^^^^^^^^^^^^^^^^^^^^^^^^^^^^^^^^^^^^^^^^^^^^^^^^^^^^^^^^^^^^^^^^^^^^^^^^^^^^^^^^^^^^^^^^^^^^^
Type safety: Unchecked cast from Object to List<ClassLoaderDelegateHook>
----------
2. WARNING in /jobs/genie.virgo/3.7.0.Milestones/workspace/web/org.eclipse.virgo.web.enterprise.services.accessor/src/test/java/org/eclipse/virgo/web/enterprise/services/accessor/WebAppBundleClassloaderCustomizerTest.java (at line 98)
	assertTrue(((Map<Bundle, Set<String>>) field2.get(webAppBundleClassloaderCustomizer.getWebAppBundleClassLoaderDelegateHook())).containsKey(webBundle));
	           ^^^^^^^^^^^^^^^^^^^^^^^^^^^^^^^^^^^^^^^^^^^^^^^^^^^^^^^^^^^^^^^^^^^^^^^^^^^^^^^^^^^^^^^^^^^^^^^^^^^^^^^^^^^^^^^^^^^
Type safety: Unchecked cast from Object to Map<Bundle,Set<String>>
----------
3. WARNING in /jobs/genie.virgo/3.7.0.Milestones/workspace/web/org.eclipse.virgo.web.enterprise.services.accessor/src/test/java/org/eclipse/virgo/web/enterprise/services/accessor/WebAppBundleClassloaderCustomizerTest.java (at line 104)
	assertTrue(((List<ClassLoaderDelegateHook>) field.get(PluggableDelegatingClassLoaderDelegateHook.getInstance())).isEmpty());
	           ^^^^^^^^^^^^^^^^^^^^^^^^^^^^^^^^^^^^^^^^^^^^^^^^^^^^^^^^^^^^^^^^^^^^^^^^^^^^^^^^^^^^^^^^^^^^^^^^^^^^^
Type safety: Unchecked cast from Object to List<ClassLoaderDelegateHook>
----------
3 problems (3 warnings)

:web:org.eclipse.virgo.web.enterprise.services.accessor:processTestResources UP-TO-DATE
:web:org.eclipse.virgo.web.enterprise.services.accessor:testClasses
:web:org.eclipse.virgo.web.enterprise.services.accessor:test
:web:org.eclipse.virgo.web.enterprise.services.accessor:check
:web:org.eclipse.virgo.web.enterprise.services.accessor:build
|--> Signing Jar File: /jobs/genie.virgo/3.7.0.Milestones/workspace/web/org.eclipse.virgo.web.enterprise.services.accessor/build/libs/org.eclipse.virgo.web.enterprise.services.accessor-3.7.0.RELEASE.jar
  % Total    % Received % Xferd  Average Speed   Time    Time     Time  Current
                                 Dload  Upload   Total   Spent    Left  Speed

  0     0    0     0    0     0      0      0 --:--:-- --:--:-- --:--:--     0
 45 71250    0     0  100 32127      0  33374 --:--:-- --:--:-- --:--:-- 33361
100 71250  100 39123  100 32127  40580  33323 --:--:-- --:--:-- --:--:-- 40584
:web:org.eclipse.virgo.web.servlet.adapter:sourcesJar
:web:org.eclipse.virgo.web.servlet.adapter:assemble
:web:org.eclipse.virgo.web.servlet.adapter:compileTestJava UP-TO-DATE
:web:org.eclipse.virgo.web.servlet.adapter:processTestResources UP-TO-DATE
:web:org.eclipse.virgo.web.servlet.adapter:testClasses UP-TO-DATE
:web:org.eclipse.virgo.web.servlet.adapter:test UP-TO-DATE
:web:org.eclipse.virgo.web.servlet.adapter:check UP-TO-DATE
:web:org.eclipse.virgo.web.servlet.adapter:build
|--> Signing Jar File: /jobs/genie.virgo/3.7.0.Milestones/workspace/web/org.eclipse.virgo.web.servlet.adapter/build/libs/org.eclipse.virgo.web.servlet.adapter-3.7.0.RELEASE.jar
  % Total    % Received % Xferd  Average Speed   Time    Time     Time  Current
                                 Dload  Upload   Total   Spent    Left  Speed

  0     0    0     0    0     0      0      0 --:--:-- --:--:-- --:--:--     0
 17  8434    0     0  100  1501      0   1549 --:--:-- --:--:-- --:--:--  1549
100  8434  100  6933  100  1501   7148   1547 --:--:-- --:--:-- --:--:--  7147
:web:org.eclipse.virgo.web.spring.integration:sourcesJar
:web:org.eclipse.virgo.web.spring.integration:assemble
:web:org.eclipse.virgo.web.spring.integration:compileTestJava UP-TO-DATE
:web:org.eclipse.virgo.web.spring.integration:processTestResources UP-TO-DATE
:web:org.eclipse.virgo.web.spring.integration:testClasses UP-TO-DATE
:web:org.eclipse.virgo.web.spring.integration:test UP-TO-DATE
:web:org.eclipse.virgo.web.spring.integration:check UP-TO-DATE
:web:org.eclipse.virgo.web.spring.integration:build
|--> Signing Jar File: /jobs/genie.virgo/3.7.0.Milestones/workspace/web/org.eclipse.virgo.web.spring.integration/build/libs/org.eclipse.virgo.web.spring.integration-3.7.0.RELEASE.jar
  % Total    % Received % Xferd  Average Speed   Time    Time     Time  Current
                                 Dload  Upload   Total   Spent    Left  Speed

  0     0    0     0    0     0      0      0 --:--:-- --:--:-- --:--:--     0
100  1469    0     0  100  1469      0   1459  0:00:01  0:00:01 --:--:--  1460
100  8363  100  6894  100  1469   6034   1285  0:00:01  0:00:01 --:--:--  6036
:web:org.eclipse.virgo.web.tomcat.support:sourcesJar
:web:org.eclipse.virgo.web.tomcat.support:assemble
:web:org.eclipse.virgo.web.tomcat.support:compileTestJava UP-TO-DATE
:web:org.eclipse.virgo.web.tomcat.support:processTestResources UP-TO-DATE
:web:org.eclipse.virgo.web.tomcat.support:testClasses UP-TO-DATE
:web:org.eclipse.virgo.web.tomcat.support:test UP-TO-DATE
:web:org.eclipse.virgo.web.tomcat.support:check UP-TO-DATE
:web:org.eclipse.virgo.web.tomcat.support:build
|--> Signing Jar File: /jobs/genie.virgo/3.7.0.Milestones/workspace/web/org.eclipse.virgo.web.tomcat.support/build/libs/org.eclipse.virgo.web.tomcat.support-3.7.0.RELEASE.jar
  % Total    % Received % Xferd  Average Speed   Time    Time     Time  Current
                                 Dload  Upload   Total   Spent    Left  Speed

  0     0    0     0    0     0      0      0 --:--:-- --:--:-- --:--:--     0
100 13926    0     0  100 13926      0  67978 --:--:-- --:--:-- --:--:-- 67931
100 34601  100 20675  100 13926  19961  13445  0:00:01  0:00:01 --:--:-- 19975
:web:org.eclipse.virgo.web.war.deployer:sourcesJar
:web:org.eclipse.virgo.web.war.deployer:assemble
:web:org.eclipse.virgo.web.war.deployer:compileTestJava
:web:org.eclipse.virgo.web.war.deployer:processTestResources
:web:org.eclipse.virgo.web.war.deployer:testClasses
:web:org.eclipse.virgo.web.war.deployer:test
:web:org.eclipse.virgo.web.war.deployer:check
:web:org.eclipse.virgo.web.war.deployer:build
|--> Signing Jar File: /jobs/genie.virgo/3.7.0.Milestones/workspace/web/org.eclipse.virgo.web.war.deployer/build/libs/org.eclipse.virgo.web.war.deployer-3.7.0.RELEASE.jar
  % Total    % Received % Xferd  Average Speed   Time    Time     Time  Current
                                 Dload  Upload   Total   Spent    Left  Speed

  0     0    0     0    0     0      0      0 --:--:-- --:--:-- --:--:--     0
100 23316    0     0  100 23316      0  23161  0:00:01  0:00:01 --:--:-- 23176
100 53044  100 29728  100 23316  24284  19046  0:00:01  0:00:01 --:--:-- 24287
:packaging:jetty-server:org.eclipse.virgo.jetty.smoketest:sourcesJar
:packaging:jetty-server:org.eclipse.virgo.jetty.smoketest:assemble
:packaging:jetty-server:org.eclipse.virgo.jetty.smoketest:compileTestJava UP-TO-DATE
:packaging:jetty-server:org.eclipse.virgo.jetty.smoketest:processTestResources UP-TO-DATE
:packaging:jetty-server:org.eclipse.virgo.jetty.smoketest:testClasses UP-TO-DATE
:packaging:jetty-server:org.eclipse.virgo.jetty.smoketest:test UP-TO-DATE
:packaging:jetty-server:org.eclipse.virgo.jetty.smoketest:check UP-TO-DATE
:packaging:jetty-server:org.eclipse.virgo.jetty.smoketest:build
|--> Signing Jar File: /jobs/genie.virgo/3.7.0.Milestones/workspace/packaging/jetty-server/org.eclipse.virgo.jetty.smoketest/build/libs/org.eclipse.virgo.jetty.smoketest-3.7.0.RELEASE.jar
  % Total    % Received % Xferd  Average Speed   Time    Time     Time  Current
                                 Dload  Upload   Total   Spent    Left  Speed

  0     0    0     0    0     0      0      0 --:--:-- --:--:-- --:--:--     0
100   504    0     0  100   504      0    500  0:00:01  0:00:01 --:--:--   500
100  6257  100  5753  100   504   3930    344  0:00:01  0:00:01 --:--:--  3932
:packaging:kernel:org.eclipse.virgo.kernel.smoketest:sourcesJar
:packaging:kernel:org.eclipse.virgo.kernel.smoketest:assemble
:packaging:kernel:org.eclipse.virgo.kernel.smoketest:compileTestJava UP-TO-DATE
:packaging:kernel:org.eclipse.virgo.kernel.smoketest:processTestResources UP-TO-DATE
:packaging:kernel:org.eclipse.virgo.kernel.smoketest:testClasses UP-TO-DATE
:packaging:kernel:org.eclipse.virgo.kernel.smoketest:test UP-TO-DATE
:packaging:kernel:org.eclipse.virgo.kernel.smoketest:check UP-TO-DATE
:packaging:kernel:org.eclipse.virgo.kernel.smoketest:build
|--> Signing Jar File: /jobs/genie.virgo/3.7.0.Milestones/workspace/packaging/kernel/org.eclipse.virgo.kernel.smoketest/build/libs/org.eclipse.virgo.kernel.smoketest-3.7.0.RELEASE.jar
  % Total    % Received % Xferd  Average Speed   Time    Time     Time  Current
                                 Dload  Upload   Total   Spent    Left  Speed

  0     0    0     0    0     0      0      0 --:--:-- --:--:-- --:--:--     0
100   505    0     0  100   505      0   2466 --:--:-- --:--:-- --:--:--  2463
  8  6256    0     0  100   505      0    377  0:00:01  0:00:01 --:--:--   377
100  6256  100  5751  100   505   4296    377  0:00:01  0:00:01 --:--:--  4294
:packaging:nano:org.eclipse.virgo.nano.smoketest:sourcesJar
:packaging:nano:org.eclipse.virgo.nano.smoketest:assemble
:packaging:nano:org.eclipse.virgo.nano.smoketest:compileTestJava UP-TO-DATE
:packaging:nano:org.eclipse.virgo.nano.smoketest:processTestResources UP-TO-DATE
:packaging:nano:org.eclipse.virgo.nano.smoketest:testClasses UP-TO-DATE
:packaging:nano:org.eclipse.virgo.nano.smoketest:test UP-TO-DATE
:packaging:nano:org.eclipse.virgo.nano.smoketest:check UP-TO-DATE
:packaging:nano:org.eclipse.virgo.nano.smoketest:build
|--> Signing Jar File: /jobs/genie.virgo/3.7.0.Milestones/workspace/packaging/nano/org.eclipse.virgo.nano.smoketest/build/libs/org.eclipse.virgo.nano.smoketest-3.7.0.RELEASE.jar
  % Total    % Received % Xferd  Average Speed   Time    Time     Time  Current
                                 Dload  Upload   Total   Spent    Left  Speed

  0     0    0     0    0     0      0      0 --:--:-- --:--:-- --:--:--     0
100   503    0     0  100   503      0    499  0:00:01  0:00:01 --:--:--   500
100  6257  100  5754  100   503   5026    439  0:00:01  0:00:01 --:--:--  5029
:packaging:tomcat-server:org.eclipse.virgo.tomcat.smoketest:sourcesJar
:packaging:tomcat-server:org.eclipse.virgo.tomcat.smoketest:assemble
:packaging:tomcat-server:org.eclipse.virgo.tomcat.smoketest:compileTestJava UP-TO-DATE
:packaging:tomcat-server:org.eclipse.virgo.tomcat.smoketest:processTestResources UP-TO-DATE
:packaging:tomcat-server:org.eclipse.virgo.tomcat.smoketest:testClasses UP-TO-DATE
:packaging:tomcat-server:org.eclipse.virgo.tomcat.smoketest:test UP-TO-DATE
:packaging:tomcat-server:org.eclipse.virgo.tomcat.smoketest:check UP-TO-DATE
:packaging:tomcat-server:org.eclipse.virgo.tomcat.smoketest:build
|--> Signing Jar File: /jobs/genie.virgo/3.7.0.Milestones/workspace/packaging/tomcat-server/org.eclipse.virgo.tomcat.smoketest/build/libs/org.eclipse.virgo.tomcat.smoketest-3.7.0.RELEASE.jar
  % Total    % Received % Xferd  Average Speed   Time    Time     Time  Current
                                 Dload  Upload   Total   Spent    Left  Speed

  0     0    0     0    0     0      0      0 --:--:-- --:--:-- --:--:--     0
100   505    0     0  100   505      0    501  0:00:01  0:00:01 --:--:--   501
100  6265  100  5760  100   505   4310    377  0:00:01  0:00:01 --:--:--  4311

FAILURE: Build failed with an exception.

* Where:
Build file '/jobs/genie.virgo/3.7.0.Milestones/workspace/org.eclipse.virgo.site/build.gradle' line: 513

* What went wrong:
Execution failed for task ':org.eclipse.virgo.site:signBundles'.
> jarsigner returned: 1

* Try:
Run with --info or --debug option to get more log output.

* Exception is:
org.gradle.api.tasks.TaskExecutionException: Execution failed for task ':org.eclipse.virgo.site:signBundles'.
	at org.gradle.api.internal.tasks.execution.ExecuteActionsTaskExecuter.executeActions(ExecuteActionsTaskExecuter.java:69)
	at org.gradle.api.internal.tasks.execution.ExecuteActionsTaskExecuter.execute(ExecuteActionsTaskExecuter.java:46)
	at org.gradle.api.internal.tasks.execution.PostExecutionAnalysisTaskExecuter.execute(PostExecutionAnalysisTaskExecuter.java:35)
	at org.gradle.api.internal.tasks.execution.SkipUpToDateTaskExecuter.execute(SkipUpToDateTaskExecuter.java:64)
	at org.gradle.api.internal.tasks.execution.ValidatingTaskExecuter.execute(ValidatingTaskExecuter.java:58)
	at org.gradle.api.internal.tasks.execution.SkipEmptySourceFilesTaskExecuter.execute(SkipEmptySourceFilesTaskExecuter.java:52)
	at org.gradle.api.internal.tasks.execution.SkipTaskWithNoActionsExecuter.execute(SkipTaskWithNoActionsExecuter.java:52)
	at org.gradle.api.internal.tasks.execution.SkipOnlyIfTaskExecuter.execute(SkipOnlyIfTaskExecuter.java:53)
	at org.gradle.api.internal.tasks.execution.ExecuteAtMostOnceTaskExecuter.execute(ExecuteAtMostOnceTaskExecuter.java:43)
	at org.gradle.execution.taskgraph.DefaultTaskGraphExecuter$EventFiringTaskWorker.execute(DefaultTaskGraphExecuter.java:233)
	at org.gradle.execution.taskgraph.DefaultTaskGraphExecuter$EventFiringTaskWorker.execute(DefaultTaskGraphExecuter.java:215)
	at org.gradle.execution.taskgraph.AbstractTaskPlanExecutor$TaskExecutorWorker.processTask(AbstractTaskPlanExecutor.java:74)
	at org.gradle.execution.taskgraph.AbstractTaskPlanExecutor$TaskExecutorWorker.run(AbstractTaskPlanExecutor.java:55)
	at org.gradle.execution.taskgraph.DefaultTaskPlanExecutor.process(DefaultTaskPlanExecutor.java:32)
	at org.gradle.execution.taskgraph.DefaultTaskGraphExecuter.execute(DefaultTaskGraphExecuter.java:113)
	at org.gradle.execution.SelectedTaskExecutionAction.execute(SelectedTaskExecutionAction.java:37)
	at org.gradle.execution.DefaultBuildExecuter.execute(DefaultBuildExecuter.java:37)
	at org.gradle.execution.DefaultBuildExecuter.access$000(DefaultBuildExecuter.java:23)
	at org.gradle.execution.DefaultBuildExecuter$1.proceed(DefaultBuildExecuter.java:43)
	at org.gradle.execution.DryRunBuildExecutionAction.execute(DryRunBuildExecutionAction.java:32)
	at org.gradle.execution.DefaultBuildExecuter.execute(DefaultBuildExecuter.java:37)
	at org.gradle.execution.DefaultBuildExecuter.execute(DefaultBuildExecuter.java:30)
	at org.gradle.initialization.DefaultGradleLauncher$4.run(DefaultGradleLauncher.java:186)
	at org.gradle.internal.Factories$1.create(Factories.java:22)
	at org.gradle.internal.progress.DefaultBuildOperationExecutor.run(DefaultBuildOperationExecutor.java:91)
	at org.gradle.internal.progress.DefaultBuildOperationExecutor.run(DefaultBuildOperationExecutor.java:53)
	at org.gradle.initialization.DefaultGradleLauncher.doBuildStages(DefaultGradleLauncher.java:183)
	at org.gradle.initialization.DefaultGradleLauncher.access$200(DefaultGradleLauncher.java:33)
	at org.gradle.initialization.DefaultGradleLauncher$1.create(DefaultGradleLauncher.java:112)
	at org.gradle.initialization.DefaultGradleLauncher$1.create(DefaultGradleLauncher.java:106)
	at org.gradle.internal.progress.DefaultBuildOperationExecutor.run(DefaultBuildOperationExecutor.java:91)
	at org.gradle.internal.progress.DefaultBuildOperationExecutor.run(DefaultBuildOperationExecutor.java:63)
	at org.gradle.initialization.DefaultGradleLauncher.doBuild(DefaultGradleLauncher.java:106)
	at org.gradle.initialization.DefaultGradleLauncher.run(DefaultGradleLauncher.java:92)
	at org.gradle.launcher.exec.GradleBuildController.run(GradleBuildController.java:66)
	at org.gradle.tooling.internal.provider.ExecuteBuildActionRunner.run(ExecuteBuildActionRunner.java:28)
	at org.gradle.launcher.exec.ChainingBuildActionRunner.run(ChainingBuildActionRunner.java:35)
	at org.gradle.launcher.exec.InProcessBuildActionExecuter.execute(InProcessBuildActionExecuter.java:41)
	at org.gradle.launcher.exec.InProcessBuildActionExecuter.execute(InProcessBuildActionExecuter.java:26)
	at org.gradle.tooling.internal.provider.ContinuousBuildActionExecuter.execute(ContinuousBuildActionExecuter.java:79)
	at org.gradle.tooling.internal.provider.ContinuousBuildActionExecuter.execute(ContinuousBuildActionExecuter.java:51)
	at org.gradle.launcher.daemon.server.exec.ExecuteBuild.doBuild(ExecuteBuild.java:59)
	at org.gradle.launcher.daemon.server.exec.BuildCommandOnly.execute(BuildCommandOnly.java:36)
	at org.gradle.launcher.daemon.server.api.DaemonCommandExecution.proceed(DaemonCommandExecution.java:120)
	at org.gradle.launcher.daemon.server.exec.WatchForDisconnection.execute(WatchForDisconnection.java:47)
	at org.gradle.launcher.daemon.server.api.DaemonCommandExecution.proceed(DaemonCommandExecution.java:120)
	at org.gradle.launcher.daemon.server.exec.ResetDeprecationLogger.execute(ResetDeprecationLogger.java:26)
	at org.gradle.launcher.daemon.server.api.DaemonCommandExecution.proceed(DaemonCommandExecution.java:120)
	at org.gradle.launcher.daemon.server.exec.RequestStopIfSingleUsedDaemon.execute(RequestStopIfSingleUsedDaemon.java:34)
	at org.gradle.launcher.daemon.server.api.DaemonCommandExecution.proceed(DaemonCommandExecution.java:120)
	at org.gradle.launcher.daemon.server.exec.ForwardClientInput$2.call(ForwardClientInput.java:74)
	at org.gradle.launcher.daemon.server.exec.ForwardClientInput$2.call(ForwardClientInput.java:72)
	at org.gradle.util.Swapper.swap(Swapper.java:38)
	at org.gradle.launcher.daemon.server.exec.ForwardClientInput.execute(ForwardClientInput.java:72)
	at org.gradle.launcher.daemon.server.api.DaemonCommandExecution.proceed(DaemonCommandExecution.java:120)
	at org.gradle.launcher.daemon.server.exec.LogAndCheckHealth.execute(LogAndCheckHealth.java:55)
	at org.gradle.launcher.daemon.server.api.DaemonCommandExecution.proceed(DaemonCommandExecution.java:120)
	at org.gradle.launcher.daemon.server.exec.LogToClient.doBuild(LogToClient.java:60)
	at org.gradle.launcher.daemon.server.exec.BuildCommandOnly.execute(BuildCommandOnly.java:36)
	at org.gradle.launcher.daemon.server.api.DaemonCommandExecution.proceed(DaemonCommandExecution.java:120)
	at org.gradle.launcher.daemon.server.exec.EstablishBuildEnvironment.doBuild(EstablishBuildEnvironment.java:72)
	at org.gradle.launcher.daemon.server.exec.BuildCommandOnly.execute(BuildCommandOnly.java:36)
	at org.gradle.launcher.daemon.server.api.DaemonCommandExecution.proceed(DaemonCommandExecution.java:120)
	at org.gradle.launcher.daemon.server.exec.HintGCAfterBuild.execute(HintGCAfterBuild.java:44)
	at org.gradle.launcher.daemon.server.api.DaemonCommandExecution.proceed(DaemonCommandExecution.java:120)
	at org.gradle.launcher.daemon.server.exec.StartBuildOrRespondWithBusy$1.run(StartBuildOrRespondWithBusy.java:50)
	at org.gradle.launcher.daemon.server.DaemonStateCoordinator$1.run(DaemonStateCoordinator.java:293)
	at org.gradle.internal.concurrent.ExecutorPolicy$CatchAndRecordFailures.onExecute(ExecutorPolicy.java:54)
	at org.gradle.internal.concurrent.StoppableExecutorImpl$1.run(StoppableExecutorImpl.java:40)
Caused by: : jarsigner returned: 1
	at org.apache.tools.ant.taskdefs.ExecTask.runExecute(ExecTask.java:644)
	at org.apache.tools.ant.taskdefs.ExecTask.runExec(ExecTask.java:670)
	at org.apache.tools.ant.taskdefs.ExecTask.execute(ExecTask.java:496)
	at org.apache.tools.ant.taskdefs.SignJar.signOneJar(SignJar.java:534)
	at org.apache.tools.ant.taskdefs.SignJar.execute(SignJar.java:449)
	at org.apache.tools.ant.UnknownElement.execute(UnknownElement.java:293)
	at org.apache.tools.ant.dispatch.DispatchUtils.execute(DispatchUtils.java:106)
	at org.gradle.api.internal.project.ant.BasicAntBuilder.nodeCompleted(BasicAntBuilder.java:78)
	at org.gradle.api.internal.project.ant.BasicAntBuilder.doInvokeMethod(BasicAntBuilder.java:103)
	at build_9zzn1k8935lsp2criqq7xotsj$_signLocally_closure13.doCall(/jobs/genie.virgo/3.7.0.Milestones/workspace/org.eclipse.virgo.site/build.gradle:513)
	at build_9zzn1k8935lsp2criqq7xotsj.signLocally(/jobs/genie.virgo/3.7.0.Milestones/workspace/org.eclipse.virgo.site/build.gradle:522)
	at build_9zzn1k8935lsp2criqq7xotsj$_run_closure1$_closure18.doCall(/jobs/genie.virgo/3.7.0.Milestones/workspace/org.eclipse.virgo.site/build.gradle:27)
	at virgobuild.UpdateSitePlugin$_addTaskSignBundles_closure10$_closure24.doCall(UpdateSitePlugin.groovy:212)
	at org.gradle.api.internal.AbstractTask$ClosureTaskAction.execute(AbstractTask.java:587)
	at org.gradle.api.internal.AbstractTask$ClosureTaskAction.execute(AbstractTask.java:568)
	at org.gradle.api.internal.tasks.execution.ExecuteActionsTaskExecuter.executeAction(ExecuteActionsTaskExecuter.java:80)
	at org.gradle.api.internal.tasks.execution.ExecuteActionsTaskExecuter.executeActions(ExecuteActionsTaskExecuter.java:61)
	... 68 more


BUILD FAILED

Total time: 7 mins 15.04 secs
[locks-and-latches] Releasing all the locks
[locks-and-latches] All the locks released
Recording test results
Archiving artifacts
Sending e-mails to: fwaibel@eclipsesource.com
Finished: FAILURE