FailedConsole Output

Skipping 12,525 KB.. Full Log
:medic:org.eclipse.virgo.medic:testClasses UP-TO-DATE
:medic:org.eclipse.virgo.medic:test UP-TO-DATE
:medic:org.eclipse.virgo.medic:check UP-TO-DATE
:medic:org.eclipse.virgo.medic:build
:medic:org.eclipse.virgo.medic.core:assemble
:medic:org.eclipse.virgo.medic.core:compileTestJava
:medic:org.eclipse.virgo.medic.core:processTestResources
:medic:org.eclipse.virgo.medic.core:testClasses
:medic:org.eclipse.virgo.medic.core:test
:medic:org.eclipse.virgo.medic.core:check
:medic:org.eclipse.virgo.medic.core:build
:medic:org.eclipse.virgo.medic.logbackclassicfragment:assemble
:medic:org.eclipse.virgo.medic.logbackclassicfragment:compileTestJava UP-TO-DATE
:medic:org.eclipse.virgo.medic.logbackclassicfragment:processTestResources UP-TO-DATE
:medic:org.eclipse.virgo.medic.logbackclassicfragment:testClasses UP-TO-DATE
:medic:org.eclipse.virgo.medic.logbackclassicfragment:test UP-TO-DATE
:medic:org.eclipse.virgo.medic.logbackclassicfragment:check UP-TO-DATE
:medic:org.eclipse.virgo.medic.logbackclassicfragment:build
:medic:org.eclipse.virgo.medic.logbackcorefragment:assemble
:medic:org.eclipse.virgo.medic.logbackcorefragment:compileTestJava UP-TO-DATE
:medic:org.eclipse.virgo.medic.logbackcorefragment:processTestResources UP-TO-DATE
:medic:org.eclipse.virgo.medic.logbackcorefragment:testClasses UP-TO-DATE
:medic:org.eclipse.virgo.medic.logbackcorefragment:test UP-TO-DATE
:medic:org.eclipse.virgo.medic.logbackcorefragment:check UP-TO-DATE
:medic:org.eclipse.virgo.medic.logbackcorefragment:build
:medic:org.eclipse.virgo.medic.slf4japifragment:assemble
:medic:org.eclipse.virgo.medic.slf4japifragment:compileTestJava UP-TO-DATE
:medic:org.eclipse.virgo.medic.slf4japifragment:processTestResources UP-TO-DATE
:medic:org.eclipse.virgo.medic.slf4japifragment:testClasses UP-TO-DATE
:medic:org.eclipse.virgo.medic.slf4japifragment:test UP-TO-DATE
:medic:org.eclipse.virgo.medic.slf4japifragment:check UP-TO-DATE
:medic:org.eclipse.virgo.medic.slf4japifragment:build
:medic:org.eclipse.virgo.medic.test:assemble
:medic:org.eclipse.virgo.medic.test:compileTestJavaincorrect classpath: /jobs/genie.virgo/3.7.0.Milestones/workspace/medic/org.eclipse.virgo.medic.test/build/resources/main

:medic:org.eclipse.virgo.medic.test:processTestResources UP-TO-DATE
:medic:org.eclipse.virgo.medic.test:testClasses
:medic:org.eclipse.virgo.medic.test:test
:medic:org.eclipse.virgo.medic.test:check
:medic:org.eclipse.virgo.medic.test:build
:nano:org.eclipse.virgo.nano.authentication:assemble
:nano:org.eclipse.virgo.nano.authentication:compileTestJava
:nano:org.eclipse.virgo.nano.authentication:processTestResources
:nano:org.eclipse.virgo.nano.authentication:testClasses
:nano:org.eclipse.virgo.nano.authentication:test
:nano:org.eclipse.virgo.nano.authentication:check
:nano:org.eclipse.virgo.nano.authentication:build
:nano:org.eclipse.virgo.nano.core:assemble
:nano:org.eclipse.virgo.nano.core:compileTestAspect
:nano:org.eclipse.virgo.nano.core:compileTestJava
:nano:org.eclipse.virgo.nano.core:processTestResources
:nano:org.eclipse.virgo.nano.core:testClasses
:nano:org.eclipse.virgo.nano.core:test
:nano:org.eclipse.virgo.nano.core:check
:nano:org.eclipse.virgo.nano.core:build
:nano:org.eclipse.virgo.nano.deployer:assemble
:nano:org.eclipse.virgo.nano.deployer:compileTestJava
:nano:org.eclipse.virgo.nano.deployer:processTestResources
:nano:org.eclipse.virgo.nano.deployer:testClasses
:nano:org.eclipse.virgo.nano.deployer:test
:nano:org.eclipse.virgo.nano.deployer:check
:nano:org.eclipse.virgo.nano.deployer:build
:nano:org.eclipse.virgo.nano.deployer.api:assemble
:nano:org.eclipse.virgo.nano.deployer.api:compileTestJava
:nano:org.eclipse.virgo.nano.deployer.api:processTestResources UP-TO-DATE
:nano:org.eclipse.virgo.nano.deployer.api:testClasses
:nano:org.eclipse.virgo.nano.deployer.api:test
:nano:org.eclipse.virgo.nano.deployer.api:check
:nano:org.eclipse.virgo.nano.deployer.api:build
:nano:org.eclipse.virgo.nano.deployer.hot:assemble
:nano:org.eclipse.virgo.nano.deployer.hot:compileTestJava
:nano:org.eclipse.virgo.nano.deployer.hot:processTestResources UP-TO-DATE
:nano:org.eclipse.virgo.nano.deployer.hot:testClasses
:nano:org.eclipse.virgo.nano.deployer.hot:test
:nano:org.eclipse.virgo.nano.deployer.hot:check
:nano:org.eclipse.virgo.nano.deployer.hot:build
:nano:org.eclipse.virgo.nano.management:assemble
:nano:org.eclipse.virgo.nano.management:compileTestJava
:nano:org.eclipse.virgo.nano.management:processTestResources UP-TO-DATE
:nano:org.eclipse.virgo.nano.management:testClasses
:nano:org.eclipse.virgo.nano.management:test
:nano:org.eclipse.virgo.nano.management:check
:nano:org.eclipse.virgo.nano.management:build
:nano:org.eclipse.virgo.nano.management.controller:assemble
:nano:org.eclipse.virgo.nano.management.controller:compileTestJava UP-TO-DATE
:nano:org.eclipse.virgo.nano.management.controller:processTestResources UP-TO-DATE
:nano:org.eclipse.virgo.nano.management.controller:testClasses UP-TO-DATE
:nano:org.eclipse.virgo.nano.management.controller:test UP-TO-DATE
:nano:org.eclipse.virgo.nano.management.controller:check UP-TO-DATE
:nano:org.eclipse.virgo.nano.management.controller:build
:nano:org.eclipse.virgo.nano.services.concurrent:assemble
:nano:org.eclipse.virgo.nano.services.concurrent:compileTestJava
:nano:org.eclipse.virgo.nano.services.concurrent:processTestResources UP-TO-DATE
:nano:org.eclipse.virgo.nano.services.concurrent:testClasses
:nano:org.eclipse.virgo.nano.services.concurrent:test
:nano:org.eclipse.virgo.nano.services.concurrent:check
:nano:org.eclipse.virgo.nano.services.concurrent:build
:nano:org.eclipse.virgo.nano.services.ds:assemble
:nano:org.eclipse.virgo.nano.services.ds:compileTestJava UP-TO-DATE
:nano:org.eclipse.virgo.nano.services.ds:processTestResources UP-TO-DATE
:nano:org.eclipse.virgo.nano.services.ds:testClasses UP-TO-DATE
:nano:org.eclipse.virgo.nano.services.ds:test UP-TO-DATE
:nano:org.eclipse.virgo.nano.services.ds:check UP-TO-DATE
:nano:org.eclipse.virgo.nano.services.ds:build
:nano:org.eclipse.virgo.nano.shutdown:assemble
:nano:org.eclipse.virgo.nano.shutdown:compileTestJava
:nano:org.eclipse.virgo.nano.shutdown:processTestResources
:nano:org.eclipse.virgo.nano.shutdown:testClasses
:nano:org.eclipse.virgo.nano.shutdown:test
:nano:org.eclipse.virgo.nano.shutdown:check
:nano:org.eclipse.virgo.nano.shutdown:build
:org.eclipse.virgo.site:org.eclipse.equinox.http.jetty:assemble
:org.eclipse.virgo.site:org.eclipse.equinox.http.jetty:compileTestJava UP-TO-DATE
:org.eclipse.virgo.site:org.eclipse.equinox.http.jetty:processTestResources UP-TO-DATE
:org.eclipse.virgo.site:org.eclipse.equinox.http.jetty:testClasses UP-TO-DATE
:org.eclipse.virgo.site:org.eclipse.equinox.http.jetty:test UP-TO-DATE
:org.eclipse.virgo.site:org.eclipse.equinox.http.jetty:check UP-TO-DATE
:org.eclipse.virgo.site:org.eclipse.equinox.http.jetty:build
:org.eclipse.virgo.site:org.eclipse.equinox.regions:assemble
:org.eclipse.virgo.site:org.eclipse.equinox.regions:compileTestJava UP-TO-DATE
:org.eclipse.virgo.site:org.eclipse.equinox.regions:processTestResources UP-TO-DATE
:org.eclipse.virgo.site:org.eclipse.equinox.regions:testClasses UP-TO-DATE
:org.eclipse.virgo.site:org.eclipse.equinox.regions:test UP-TO-DATE
:org.eclipse.virgo.site:org.eclipse.equinox.regions:check UP-TO-DATE
:org.eclipse.virgo.site:org.eclipse.equinox.regions:build
:org.eclipse.virgo.site:org.eclipse.gemini.web:assemble
:org.eclipse.virgo.site:org.eclipse.gemini.web:compileTestJava UP-TO-DATE
:org.eclipse.virgo.site:org.eclipse.gemini.web:processTestResources UP-TO-DATE
:org.eclipse.virgo.site:org.eclipse.gemini.web:testClasses UP-TO-DATE
:org.eclipse.virgo.site:org.eclipse.gemini.web:test UP-TO-DATE
:org.eclipse.virgo.site:org.eclipse.gemini.web:check UP-TO-DATE
:org.eclipse.virgo.site:org.eclipse.gemini.web:build
:org.eclipse.virgo.site:org.eclipse.rap:assemble
:org.eclipse.virgo.site:org.eclipse.rap:compileTestJava UP-TO-DATE
:org.eclipse.virgo.site:org.eclipse.rap:processTestResources UP-TO-DATE
:org.eclipse.virgo.site:org.eclipse.rap:testClasses UP-TO-DATE
:org.eclipse.virgo.site:org.eclipse.rap:test UP-TO-DATE
:org.eclipse.virgo.site:org.eclipse.rap:check UP-TO-DATE
:org.eclipse.virgo.site:org.eclipse.rap:build
:org.eclipse.virgo.site:org.eclipse.virgo.core:assemble
:org.eclipse.virgo.site:org.eclipse.virgo.core:compileTestJava UP-TO-DATE
:org.eclipse.virgo.site:org.eclipse.virgo.core:processTestResources UP-TO-DATE
:org.eclipse.virgo.site:org.eclipse.virgo.core:testClasses UP-TO-DATE
:org.eclipse.virgo.site:org.eclipse.virgo.core:test UP-TO-DATE
:org.eclipse.virgo.site:org.eclipse.virgo.core:check UP-TO-DATE
:org.eclipse.virgo.site:org.eclipse.virgo.core:build
:org.eclipse.virgo.site:org.eclipse.virgo.ds:assemble
:org.eclipse.virgo.site:org.eclipse.virgo.ds:compileTestJava UP-TO-DATE
:org.eclipse.virgo.site:org.eclipse.virgo.ds:processTestResources UP-TO-DATE
:org.eclipse.virgo.site:org.eclipse.virgo.ds:testClasses UP-TO-DATE
:org.eclipse.virgo.site:org.eclipse.virgo.ds:test UP-TO-DATE
:org.eclipse.virgo.site:org.eclipse.virgo.ds:check UP-TO-DATE
:org.eclipse.virgo.site:org.eclipse.virgo.ds:build
:org.eclipse.virgo.site:org.eclipse.virgo.enterprise:assemble
:org.eclipse.virgo.site:org.eclipse.virgo.enterprise:compileTestJava UP-TO-DATE
:org.eclipse.virgo.site:org.eclipse.virgo.enterprise:processTestResources UP-TO-DATE
:org.eclipse.virgo.site:org.eclipse.virgo.enterprise:testClasses UP-TO-DATE
:org.eclipse.virgo.site:org.eclipse.virgo.enterprise:test UP-TO-DATE
:org.eclipse.virgo.site:org.eclipse.virgo.enterprise:check UP-TO-DATE
:org.eclipse.virgo.site:org.eclipse.virgo.enterprise:build
:org.eclipse.virgo.site:org.eclipse.virgo.kernel:assemble
:org.eclipse.virgo.site:org.eclipse.virgo.kernel:compileTestJava UP-TO-DATE
:org.eclipse.virgo.site:org.eclipse.virgo.kernel:processTestResources UP-TO-DATE
:org.eclipse.virgo.site:org.eclipse.virgo.kernel:testClasses UP-TO-DATE
:org.eclipse.virgo.site:org.eclipse.virgo.kernel:test UP-TO-DATE
:org.eclipse.virgo.site:org.eclipse.virgo.kernel:check UP-TO-DATE
:org.eclipse.virgo.site:org.eclipse.virgo.kernel:build
:org.eclipse.virgo.site:org.eclipse.virgo.kernel.springintegration:assemble
:org.eclipse.virgo.site:org.eclipse.virgo.kernel.springintegration:compileTestJava UP-TO-DATE
:org.eclipse.virgo.site:org.eclipse.virgo.kernel.springintegration:processTestResources UP-TO-DATE
:org.eclipse.virgo.site:org.eclipse.virgo.kernel.springintegration:testClasses UP-TO-DATE
:org.eclipse.virgo.site:org.eclipse.virgo.kernel.springintegration:test UP-TO-DATE
:org.eclipse.virgo.site:org.eclipse.virgo.kernel.springintegration:check UP-TO-DATE
:org.eclipse.virgo.site:org.eclipse.virgo.kernel.springintegration:build
:org.eclipse.virgo.site:org.eclipse.virgo.management:assemble
:org.eclipse.virgo.site:org.eclipse.virgo.management:compileTestJava UP-TO-DATE
:org.eclipse.virgo.site:org.eclipse.virgo.management:processTestResources UP-TO-DATE
:org.eclipse.virgo.site:org.eclipse.virgo.management:testClasses UP-TO-DATE
:org.eclipse.virgo.site:org.eclipse.virgo.management:test UP-TO-DATE
:org.eclipse.virgo.site:org.eclipse.virgo.management:check UP-TO-DATE
:org.eclipse.virgo.site:org.eclipse.virgo.management:build
:org.eclipse.virgo.site:org.eclipse.virgo.medic:assemble
:org.eclipse.virgo.site:org.eclipse.virgo.medic:compileTestJava UP-TO-DATE
:org.eclipse.virgo.site:org.eclipse.virgo.medic:processTestResources UP-TO-DATE
:org.eclipse.virgo.site:org.eclipse.virgo.medic:testClasses UP-TO-DATE
:org.eclipse.virgo.site:org.eclipse.virgo.medic:test UP-TO-DATE
:org.eclipse.virgo.site:org.eclipse.virgo.medic:check UP-TO-DATE
:org.eclipse.virgo.site:org.eclipse.virgo.medic:build
:org.eclipse.virgo.site:org.eclipse.virgo.nano.deployer:assemble
:org.eclipse.virgo.site:org.eclipse.virgo.nano.deployer:compileTestJava UP-TO-DATE
:org.eclipse.virgo.site:org.eclipse.virgo.nano.deployer:processTestResources UP-TO-DATE
:org.eclipse.virgo.site:org.eclipse.virgo.nano.deployer:testClasses UP-TO-DATE
:org.eclipse.virgo.site:org.eclipse.virgo.nano.deployer:test UP-TO-DATE
:org.eclipse.virgo.site:org.eclipse.virgo.nano.deployer:check UP-TO-DATE
:org.eclipse.virgo.site:org.eclipse.virgo.nano.deployer:build
:org.eclipse.virgo.site:org.eclipse.virgo.nano.mbeans:assemble
:org.eclipse.virgo.site:org.eclipse.virgo.nano.mbeans:compileTestJava UP-TO-DATE
:org.eclipse.virgo.site:org.eclipse.virgo.nano.mbeans:processTestResources UP-TO-DATE
:org.eclipse.virgo.site:org.eclipse.virgo.nano.mbeans:testClasses UP-TO-DATE
:org.eclipse.virgo.site:org.eclipse.virgo.nano.mbeans:test UP-TO-DATE
:org.eclipse.virgo.site:org.eclipse.virgo.nano.mbeans:check UP-TO-DATE
:org.eclipse.virgo.site:org.eclipse.virgo.nano.mbeans:build
:org.eclipse.virgo.site:org.eclipse.virgo.nano.mbeans.controller:assemble
:org.eclipse.virgo.site:org.eclipse.virgo.nano.mbeans.controller:compileTestJava UP-TO-DATE
:org.eclipse.virgo.site:org.eclipse.virgo.nano.mbeans.controller:processTestResources UP-TO-DATE
:org.eclipse.virgo.site:org.eclipse.virgo.nano.mbeans.controller:testClasses UP-TO-DATE
:org.eclipse.virgo.site:org.eclipse.virgo.nano.mbeans.controller:test UP-TO-DATE
:org.eclipse.virgo.site:org.eclipse.virgo.nano.mbeans.controller:check UP-TO-DATE
:org.eclipse.virgo.site:org.eclipse.virgo.nano.mbeans.controller:build
:org.eclipse.virgo.site:org.eclipse.virgo.nano.war.deployer:assemble
:org.eclipse.virgo.site:org.eclipse.virgo.nano.war.deployer:compileTestJava UP-TO-DATE
:org.eclipse.virgo.site:org.eclipse.virgo.nano.war.deployer:processTestResources UP-TO-DATE
:org.eclipse.virgo.site:org.eclipse.virgo.nano.war.deployer:testClasses UP-TO-DATE
:org.eclipse.virgo.site:org.eclipse.virgo.nano.war.deployer:test UP-TO-DATE
:org.eclipse.virgo.site:org.eclipse.virgo.nano.war.deployer:check UP-TO-DATE
:org.eclipse.virgo.site:org.eclipse.virgo.nano.war.deployer:build
:org.eclipse.virgo.site:org.eclipse.virgo.p2.provisioning:assemble
:org.eclipse.virgo.site:org.eclipse.virgo.p2.provisioning:compileTestJava UP-TO-DATE
:org.eclipse.virgo.site:org.eclipse.virgo.p2.provisioning:processTestResources UP-TO-DATE
:org.eclipse.virgo.site:org.eclipse.virgo.p2.provisioning:testClasses UP-TO-DATE
:org.eclipse.virgo.site:org.eclipse.virgo.p2.provisioning:test UP-TO-DATE
:org.eclipse.virgo.site:org.eclipse.virgo.p2.provisioning:check UP-TO-DATE
:org.eclipse.virgo.site:org.eclipse.virgo.p2.provisioning:build
:org.eclipse.virgo.site:org.eclipse.virgo.services.concurrent:assemble
:org.eclipse.virgo.site:org.eclipse.virgo.services.concurrent:compileTestJava UP-TO-DATE
:org.eclipse.virgo.site:org.eclipse.virgo.services.concurrent:processTestResources UP-TO-DATE
:org.eclipse.virgo.site:org.eclipse.virgo.services.concurrent:testClasses UP-TO-DATE
:org.eclipse.virgo.site:org.eclipse.virgo.services.concurrent:test UP-TO-DATE
:org.eclipse.virgo.site:org.eclipse.virgo.services.concurrent:check UP-TO-DATE
:org.eclipse.virgo.site:org.eclipse.virgo.services.concurrent:build
:org.eclipse.virgo.site:org.eclipse.virgo.services.ds:assemble
:org.eclipse.virgo.site:org.eclipse.virgo.services.ds:compileTestJava UP-TO-DATE
:org.eclipse.virgo.site:org.eclipse.virgo.services.ds:processTestResources UP-TO-DATE
:org.eclipse.virgo.site:org.eclipse.virgo.services.ds:testClasses UP-TO-DATE
:org.eclipse.virgo.site:org.eclipse.virgo.services.ds:test UP-TO-DATE
:org.eclipse.virgo.site:org.eclipse.virgo.services.ds:check UP-TO-DATE
:org.eclipse.virgo.site:org.eclipse.virgo.services.ds:build
:org.eclipse.virgo.site:org.eclipse.virgo.shell:assemble
:org.eclipse.virgo.site:org.eclipse.virgo.shell:compileTestJava UP-TO-DATE
:org.eclipse.virgo.site:org.eclipse.virgo.shell:processTestResources UP-TO-DATE
:org.eclipse.virgo.site:org.eclipse.virgo.shell:testClasses UP-TO-DATE
:org.eclipse.virgo.site:org.eclipse.virgo.shell:test UP-TO-DATE
:org.eclipse.virgo.site:org.eclipse.virgo.shell:check UP-TO-DATE
:org.eclipse.virgo.site:org.eclipse.virgo.shell:build
:org.eclipse.virgo.site:org.eclipse.virgo.simpleconfigurator:assemble
:org.eclipse.virgo.site:org.eclipse.virgo.simpleconfigurator:compileTestJava UP-TO-DATE
:org.eclipse.virgo.site:org.eclipse.virgo.simpleconfigurator:processTestResources UP-TO-DATE
:org.eclipse.virgo.site:org.eclipse.virgo.simpleconfigurator:testClasses UP-TO-DATE
:org.eclipse.virgo.site:org.eclipse.virgo.simpleconfigurator:test UP-TO-DATE
:org.eclipse.virgo.site:org.eclipse.virgo.simpleconfigurator:check UP-TO-DATE
:org.eclipse.virgo.site:org.eclipse.virgo.simpleconfigurator:build
:org.eclipse.virgo.site:org.eclipse.virgo.springdm:assemble
:org.eclipse.virgo.site:org.eclipse.virgo.springdm:compileTestJava UP-TO-DATE
:org.eclipse.virgo.site:org.eclipse.virgo.springdm:processTestResources UP-TO-DATE
:org.eclipse.virgo.site:org.eclipse.virgo.springdm:testClasses UP-TO-DATE
:org.eclipse.virgo.site:org.eclipse.virgo.springdm:test UP-TO-DATE
:org.eclipse.virgo.site:org.eclipse.virgo.springdm:check UP-TO-DATE
:org.eclipse.virgo.site:org.eclipse.virgo.springdm:build
:org.eclipse.virgo.site:org.eclipse.virgo.tools:assemble
:org.eclipse.virgo.site:org.eclipse.virgo.tools:compileTestJava UP-TO-DATE
:org.eclipse.virgo.site:org.eclipse.virgo.tools:processTestResources UP-TO-DATE
:org.eclipse.virgo.site:org.eclipse.virgo.tools:testClasses UP-TO-DATE
:org.eclipse.virgo.site:org.eclipse.virgo.tools:test UP-TO-DATE
:org.eclipse.virgo.site:org.eclipse.virgo.tools:check UP-TO-DATE
:org.eclipse.virgo.site:org.eclipse.virgo.tools:build
:org.eclipse.virgo.site:org.eclipse.virgo.webconsole.deps:assemble
:org.eclipse.virgo.site:org.eclipse.virgo.webconsole.deps:compileTestJava UP-TO-DATE
:org.eclipse.virgo.site:org.eclipse.virgo.webconsole.deps:processTestResources UP-TO-DATE
:org.eclipse.virgo.site:org.eclipse.virgo.webconsole.deps:testClasses UP-TO-DATE
:org.eclipse.virgo.site:org.eclipse.virgo.webconsole.deps:test UP-TO-DATE
:org.eclipse.virgo.site:org.eclipse.virgo.webconsole.deps:check UP-TO-DATE
:org.eclipse.virgo.site:org.eclipse.virgo.webconsole.deps:build
:org.eclipse.virgo.site:publishBase
Generating metadata for ..
Generation completed with success [0 seconds].
:org.eclipse.virgo.site:publishKernelBase
Generating metadata for ..
Generation completed with success [0 seconds].
:packaging:jetty-server:publishJettyServer
Generating metadata for ..
Generation completed with success [0 seconds].
:packaging:jetty-server:installProductJettyServer
Installing jetty-server.product 1.0.0.
Operation completed in 2363 ms.
:packaging:jetty-server:packageResourcesAndProducts
Copy the lib artifacts:
org.eclipse.virgo.kernel.equinox.extensions-3.7.0.M03.jar
org.eclipse.virgo.nano.authentication-3.7.0.M03.jar
org.eclipse.virgo.nano.shutdown-3.7.0.M03.jar
org.eclipse.virgo.util.env-3.7.0.M03.jar
org.eclipse.equinox.launcher-1.3.0.v20130327-1440.jar
to '/jobs/genie.virgo/3.7.0.Milestones/workspace/packaging/jetty-server/build/common_resources/lib'.
Copy the libPersistence artifacts:
org.eclipse.virgo.web.enterprise.openejb.jpa.integration-3.7.0.M03.jar
to '/jobs/genie.virgo/3.7.0.Milestones/workspace/packaging/jetty-server/build/common_resources/lib/persistence'.
Copy the libEndorsed artifacts:
javax.annotation-1.1.0.v201108011116.jar
javax.transaction-1.1.1.v201105210645.jar
to '/jobs/genie.virgo/3.7.0.Milestones/workspace/packaging/jetty-server/build/common_resources/lib/endorsed'.
Copy the pluginsExtras artifacts:
org.eclipse.virgo.kernel.userregion-3.7.0.M03.jar
to '/jobs/genie.virgo/3.7.0.Milestones/workspace/packaging/jetty-server/build/common_resources/plugins'.
Copy the repositoryExt artifacts:
org.eclipse.osgi.services-3.3.100.v20130513-1956.jar
osgi.enterprise-4.2.0.v201108120515.jar
org.eclipse.equinox.ds-1.4.101.v20130813-1853.jar
org.eclipse.equinox.util-1.0.500.v20130404-1337.jar
org.eclipse.equinox.region-1.1.101.v20130722-1314.jar
oevm.org.aopalliance-1.0.0.jar
org.apache.commons.codec-1.10.0.jar
org.springframework.aop-4.2.4.RELEASE.jar
org.springframework.beans-4.2.4.RELEASE.jar
org.springframework.context-4.2.4.RELEASE.jar
org.springframework.core-4.2.4.RELEASE.jar
org.springframework.expression-4.2.4.RELEASE.jar
gemini-blueprint-io-2.0.0.RELEASE.jar
gemini-blueprint-core-2.0.0.RELEASE.jar
gemini-blueprint-extender-2.0.0.RELEASE.jar
org.eclipse.gemini.management-1.0.5.RELEASE.jar
org.eclipse.virgo.management.fragment-3.7.0.M03.jar
org.eclipse.virgo.kernel.agent.dm-3.7.0.M03.jar
org.eclipse.virgo.kernel.deployer.dm-3.7.0.M03.jar
org.eclipse.virgo.kernel.dmfragment-3.7.0.M03.jar
commons-io-2.2.jar
commons-fileupload-1.3.1.jar
jolokia-osgi-1.3.3.jar
org.eclipse.virgo.medic-3.7.0.M03.jar
org.eclipse.virgo.medic.core-3.7.0.M03.jar
org.eclipse.virgo.web.dm-3.7.0.M03.jar
javax.jms-1.1.0.v201205091237.jar
javax.servlet-3.1.0.v201410161800.jar
org.springframework.aspects-4.2.4.RELEASE.jar
org.springframework.context.support-4.2.4.RELEASE.jar
org.springframework.jdbc-4.2.4.RELEASE.jar
org.springframework.messaging-4.2.4.RELEASE.jar
org.springframework.jms-4.2.4.RELEASE.jar
org.springframework.orm-4.2.4.RELEASE.jar
org.springframework.oxm-4.2.4.RELEASE.jar
org.springframework.transaction-4.2.4.RELEASE.jar
org.springframework.web-4.2.4.RELEASE.jar
org.springframework.webmvc-4.2.4.RELEASE.jar
org.springframework.webmvc.portlet-4.2.4.RELEASE.jar
org.springframework.websocket-4.2.4.RELEASE.jar
oevm.org.aspectj.aspectjweaver-1.7.2.RELEASE.jar
oevm.javax.portlet-2.0.0.jar
javax.servlet.jsp.jstl-1.2.0.v201105211821.jar
javax.servlet.jsp.jstl.impl-1.2.0.v201210211230.jar
org.eclipse.virgo.web.servlet.adapter-3.7.0.M03.jar
org.eclipse.jetty.continuation-8.1.16.v20140903.jar
org.eclipse.jetty.deploy-8.1.16.v20140903.jar
org.eclipse.jetty.http-8.1.16.v20140903.jar
org.eclipse.jetty.io-8.1.16.v20140903.jar
org.eclipse.jetty.osgi.boot-8.1.16.v20140903.jar
org.eclipse.jetty.security-8.1.16.v20140903.jar
org.eclipse.jetty.server-8.1.16.v20140903.jar
org.eclipse.jetty.servlet-8.1.16.v20140903.jar
org.eclipse.jetty.util-8.1.16.v20140903.jar
org.eclipse.jetty.webapp-8.1.16.v20140903.jar
org.eclipse.jetty.xml-8.1.16.v20140903.jar
to '/jobs/genie.virgo/3.7.0.Milestones/workspace/packaging/jetty-server/build/common_resources/repository/ext'.
Copy the pickup artifacts:
org.eclipse.virgo.management.console-3.7.0.M03.jar
org.eclipse.virgo.apps.splash-3.7.0.M03.jar
to '/jobs/genie.virgo/3.7.0.Milestones/workspace/packaging/jetty-server/build/common_resources/pickup'.
:packaging:jetty-server:assembleJettyServer
:packaging:jetty-server:distZip
:packaging:jetty-server:assemble
:packaging:jetty-server:check UP-TO-DATE
:packaging:jetty-server:build
:packaging:kernel:publishKernel
Generating metadata for ..
Generation completed with success [0 seconds].
:packaging:kernel:installProductKernel
Installing kernel.product 1.0.0.
Operation completed in 2626 ms.
:packaging:kernel:packageResourcesAndProducts
Copy the lib artifacts:
org.eclipse.virgo.kernel.equinox.extensions-3.7.0.M03.jar
org.eclipse.virgo.nano.authentication-3.7.0.M03.jar
org.eclipse.virgo.nano.shutdown-3.7.0.M03.jar
org.eclipse.virgo.util.env-3.7.0.M03.jar
org.eclipse.equinox.launcher-1.3.0.v20130327-1440.jar
to '/jobs/genie.virgo/3.7.0.Milestones/workspace/packaging/kernel/build/common_resources/lib'.
Copy the libPersistence artifacts:
org.eclipse.virgo.web.enterprise.openejb.jpa.integration-3.7.0.M03.jar
to '/jobs/genie.virgo/3.7.0.Milestones/workspace/packaging/kernel/build/common_resources/lib/persistence'.
Copy the libEndorsed artifacts:
javax.annotation-1.1.0.v201108011116.jar
javax.transaction-1.1.1.v201105210645.jar
to '/jobs/genie.virgo/3.7.0.Milestones/workspace/packaging/kernel/build/common_resources/lib/endorsed'.
Copy the pluginsExtras artifacts:
org.eclipse.virgo.kernel.userregion-3.7.0.M03.jar
to '/jobs/genie.virgo/3.7.0.Milestones/workspace/packaging/kernel/build/common_resources/plugins'.
Copy the repositoryExt artifacts:
org.eclipse.osgi.services-3.3.100.v20130513-1956.jar
osgi.enterprise-4.2.0.v201108120515.jar
org.eclipse.equinox.ds-1.4.101.v20130813-1853.jar
org.eclipse.equinox.util-1.0.500.v20130404-1337.jar
org.eclipse.equinox.region-1.1.101.v20130722-1314.jar
oevm.org.aopalliance-1.0.0.jar
org.apache.commons.codec-1.10.0.jar
org.springframework.aop-4.2.4.RELEASE.jar
org.springframework.beans-4.2.4.RELEASE.jar
org.springframework.context-4.2.4.RELEASE.jar
org.springframework.core-4.2.4.RELEASE.jar
org.springframework.expression-4.2.4.RELEASE.jar
gemini-blueprint-io-2.0.0.RELEASE.jar
gemini-blueprint-core-2.0.0.RELEASE.jar
gemini-blueprint-extender-2.0.0.RELEASE.jar
org.eclipse.gemini.management-1.0.5.RELEASE.jar
org.eclipse.virgo.management.fragment-3.7.0.M03.jar
org.eclipse.virgo.kernel.agent.dm-3.7.0.M03.jar
org.eclipse.virgo.kernel.deployer.dm-3.7.0.M03.jar
org.eclipse.virgo.kernel.dmfragment-3.7.0.M03.jar
commons-io-2.2.jar
commons-fileupload-1.3.1.jar
jolokia-osgi-1.3.3.jar
to '/jobs/genie.virgo/3.7.0.Milestones/workspace/packaging/kernel/build/common_resources/repository/ext'.
Copy the pickup artifacts:
org.eclipse.virgo.management.console-3.7.0.M03.jar
to '/jobs/genie.virgo/3.7.0.Milestones/workspace/packaging/kernel/build/common_resources/pickup'.
:packaging:kernel:assembleKernel
:packaging:kernel:distZip
:packaging:kernel:assemble
:packaging:kernel:check UP-TO-DATE
:packaging:kernel:build
:org.eclipse.virgo.site:publishNanoBase
Generating metadata for ..
Generation completed with success [0 seconds].
:org.eclipse.virgo.site:publishNanoCore
Generating metadata for ..
Generation completed with success [0 seconds].
:packaging:nano:publishNano
Generating metadata for ..
Generation completed with success [0 seconds].
:packaging:nano:publishNanoFull
Generating metadata for ..
Generation completed with success [0 seconds].
:packaging:nano:publishNanoRap
Generating metadata for ..
Generation completed with success [0 seconds].
:packaging:nano:groupPublish
:packaging:nano:installProductNano
Installing nano.product 1.0.0.
Operation completed in 2590 ms.
:packaging:nano:installProductNanoFull
Installing nano-full.product 1.0.0.
Operation completed in 6134 ms.
:packaging:nano:installProductNanoRap
Installing nano-rap.product 1.0.0.
Operation completed in 3213 ms.
:packaging:nano:packageResourcesAndProducts
Copy the lib artifacts:
org.eclipse.virgo.kernel.equinox.extensions-3.7.0.M03.jar
org.eclipse.virgo.nano.authentication-3.7.0.M03.jar
org.eclipse.virgo.nano.shutdown-3.7.0.M03.jar
org.eclipse.virgo.util.env-3.7.0.M03.jar
org.eclipse.equinox.launcher-1.3.0.v20130327-1440.jar
to '/jobs/genie.virgo/3.7.0.Milestones/workspace/packaging/nano/build/common_resources/lib'.
Copy the libPersistence artifacts:
org.eclipse.virgo.web.enterprise.openejb.jpa.integration-3.7.0.M03.jar
to '/jobs/genie.virgo/3.7.0.Milestones/workspace/packaging/nano/build/common_resources/lib/persistence'.
Copy the libEndorsed artifacts:
javax.annotation-1.1.0.v201108011116.jar
javax.transaction-1.1.1.v201105210645.jar
to '/jobs/genie.virgo/3.7.0.Milestones/workspace/packaging/nano/build/common_resources/lib/endorsed'.
Copy the pickup artifacts:
org.eclipse.virgo.management.console-3.7.0.M03.jar
to '/jobs/genie.virgo/3.7.0.Milestones/workspace/packaging/nano/build/common_resources/pickup'.
:packaging:nano:assembleNano
:packaging:nano:distZip
:packaging:nano:fullDistZip
:packaging:nano:rapDistZip
:packaging:nano:assemble
:packaging:nano:check UP-TO-DATE
:packaging:nano:build
:packaging:tomcat-server:publishTomcatServer
Generating metadata for ..
Generation completed with success [0 seconds].
:packaging:tomcat-server:installProductTomcatServer
Installing tomcat-server.product 1.0.0.
Operation completed in 2328 ms.
:packaging:tomcat-server:packageResourcesAndProducts
Copy the lib artifacts:
org.eclipse.virgo.kernel.equinox.extensions-3.7.0.M03.jar
org.eclipse.virgo.nano.authentication-3.7.0.M03.jar
org.eclipse.virgo.nano.shutdown-3.7.0.M03.jar
org.eclipse.virgo.util.env-3.7.0.M03.jar
org.eclipse.equinox.launcher-1.3.0.v20130327-1440.jar
to '/jobs/genie.virgo/3.7.0.Milestones/workspace/packaging/tomcat-server/build/common_resources/lib'.
Copy the libPersistence artifacts:
org.eclipse.virgo.web.enterprise.openejb.jpa.integration-3.7.0.M03.jar
to '/jobs/genie.virgo/3.7.0.Milestones/workspace/packaging/tomcat-server/build/common_resources/lib/persistence'.
Copy the libEndorsed artifacts:
javax.annotation-1.1.0.v201108011116.jar
javax.transaction-1.1.1.v201105210645.jar
to '/jobs/genie.virgo/3.7.0.Milestones/workspace/packaging/tomcat-server/build/common_resources/lib/endorsed'.
Copy the pluginsExtras artifacts:
org.eclipse.virgo.kernel.userregion-3.7.0.M03.jar
to '/jobs/genie.virgo/3.7.0.Milestones/workspace/packaging/tomcat-server/build/common_resources/plugins'.
Copy the repositoryExt artifacts:
org.eclipse.osgi.services-3.3.100.v20130513-1956.jar
osgi.enterprise-4.2.0.v201108120515.jar
org.eclipse.equinox.ds-1.4.101.v20130813-1853.jar
org.eclipse.equinox.util-1.0.500.v20130404-1337.jar
org.eclipse.equinox.region-1.1.101.v20130722-1314.jar
oevm.org.aopalliance-1.0.0.jar
org.apache.commons.codec-1.10.0.jar
org.springframework.aop-4.2.4.RELEASE.jar
org.springframework.beans-4.2.4.RELEASE.jar
org.springframework.context-4.2.4.RELEASE.jar
org.springframework.core-4.2.4.RELEASE.jar
org.springframework.expression-4.2.4.RELEASE.jar
gemini-blueprint-io-2.0.0.RELEASE.jar
gemini-blueprint-core-2.0.0.RELEASE.jar
gemini-blueprint-extender-2.0.0.RELEASE.jar
org.eclipse.gemini.management-1.0.5.RELEASE.jar
org.eclipse.virgo.management.fragment-3.7.0.M03.jar
org.eclipse.virgo.kernel.agent.dm-3.7.0.M03.jar
org.eclipse.virgo.kernel.deployer.dm-3.7.0.M03.jar
org.eclipse.virgo.kernel.dmfragment-3.7.0.M03.jar
commons-io-2.2.jar
commons-fileupload-1.3.1.jar
jolokia-osgi-1.3.3.jar
org.eclipse.virgo.medic-3.7.0.M03.jar
org.eclipse.virgo.medic.core-3.7.0.M03.jar
org.eclipse.virgo.web.dm-3.7.0.M03.jar
javax.jms-1.1.0.v201205091237.jar
javax.servlet-3.1.0.v201410161800.jar
org.springframework.aspects-4.2.4.RELEASE.jar
org.springframework.context.support-4.2.4.RELEASE.jar
org.springframework.jdbc-4.2.4.RELEASE.jar
org.springframework.messaging-4.2.4.RELEASE.jar
org.springframework.jms-4.2.4.RELEASE.jar
org.springframework.orm-4.2.4.RELEASE.jar
org.springframework.oxm-4.2.4.RELEASE.jar
org.springframework.transaction-4.2.4.RELEASE.jar
org.springframework.web-4.2.4.RELEASE.jar
org.springframework.webmvc-4.2.4.RELEASE.jar
org.springframework.webmvc.portlet-4.2.4.RELEASE.jar
org.springframework.websocket-4.2.4.RELEASE.jar
oevm.org.aspectj.aspectjweaver-1.7.2.RELEASE.jar
oevm.javax.portlet-2.0.0.jar
javax.servlet.jsp.jstl-1.2.0.v201105211821.jar
javax.servlet.jsp.jstl.impl-1.2.0.v201210211230.jar
org.eclipse.virgo.web.core-3.7.0.M03.jar
org.eclipse.virgo.web.tomcat.support-3.7.0.M03.jar
org.eclipse.virgo.web.servlet.adapter-3.7.0.M03.jar
org.eclipse.virgo.web.spring.integration-3.7.0.M03.jar
javax.annotation-1.1.0.v201108011116.jar
javax.ejb-3.1.1.v201204261316.jar
javax.el-2.2.0.v201108011116.jar
javax.mail-1.4.0.v201005080615.jar
javax.persistence-2.0.5.v201212031355.jar
javax.servlet.jsp-2.2.0.v201112011158.jar
javax.xml.rpc-1.1.0.v201005080400.jar
javax.websocket-1.1.0.v201401130840.jar
org.eclipse.equinox.event-1.3.0.v20130327-1442.jar
oevm.org.apache.taglibs.standard-1.1.2.v20110517.jar
slf4j-api-1.7.13.jar
slf4j-jcl-1.7.13.jar
jul-to-slf4j-1.7.13.jar
slf4j-log4j12-1.7.13.jar
org.eclipse.jdt.core.compiler.batch-3.10.0.v20140604-1726.jar
org.apache.catalina-7.0.61.jar
org.apache.catalina.ha-7.0.61.jar
org.apache.catalina.tribes-7.0.61.jar
org.apache.coyote-7.0.61.jar
org.apache.el-7.0.61.jar
org.apache.jasper-7.0.61.jar
org.apache.juli.extras-7.0.61.jar
org.apache.tomcat.api-7.0.61.jar
org.apache.tomcat.util-7.0.61.jar
org.apache.tomcat.websocket-7.0.61.jar
org.eclipse.gemini.web.core-2.2.7.RELEASE.jar
org.eclipse.gemini.web.tomcat-2.2.7.RELEASE.jar
to '/jobs/genie.virgo/3.7.0.Milestones/workspace/packaging/tomcat-server/build/common_resources/repository/ext'.
Copy the pickup artifacts:
org.eclipse.virgo.management.console-3.7.0.M03.jar
org.eclipse.virgo.apps.splash-3.7.0.M03.jar
to '/jobs/genie.virgo/3.7.0.Milestones/workspace/packaging/tomcat-server/build/common_resources/pickup'.
:packaging:tomcat-server:assembleTomcatServer
:packaging:tomcat-server:distZip
:packaging:tomcat-server:assemble
:packaging:tomcat-server:check UP-TO-DATE
:packaging:tomcat-server:build
:repository:org.eclipse.virgo.repository:assemble
:repository:org.eclipse.virgo.repository:compileTestJava
:repository:org.eclipse.virgo.repository:processTestResources
:repository:org.eclipse.virgo.repository:testClasses
:repository:org.eclipse.virgo.repository:test
:repository:org.eclipse.virgo.repository:check
:repository:org.eclipse.virgo.repository:build
:test:org.eclipse.virgo.test.stubs:assemble
:test:org.eclipse.virgo.test.stubs:compileTestAspect
:test:org.eclipse.virgo.test.stubs:compileTestJava
:test:org.eclipse.virgo.test.stubs:processTestResources
:test:org.eclipse.virgo.test.stubs:testClasses
:test:org.eclipse.virgo.test.stubs:test
:test:org.eclipse.virgo.test.stubs:check
:test:org.eclipse.virgo.test.stubs:build
:test:org.eclipse.virgo.test.tools:assemble
:test:org.eclipse.virgo.test.tools:compileTestJava UP-TO-DATE
:test:org.eclipse.virgo.test.tools:processTestResources UP-TO-DATE
:test:org.eclipse.virgo.test.tools:testClasses UP-TO-DATE
:test:org.eclipse.virgo.test.tools:test UP-TO-DATE
:test:org.eclipse.virgo.test.tools:check UP-TO-DATE
:test:org.eclipse.virgo.test.tools:build
:util:org.eclipse.virgo.util.common:assemble
:util:org.eclipse.virgo.util.common:compileTestJava
:util:org.eclipse.virgo.util.common:processTestResources UP-TO-DATE
:util:org.eclipse.virgo.util.common:testClasses
:util:org.eclipse.virgo.util.common:test
:util:org.eclipse.virgo.util.common:check
:util:org.eclipse.virgo.util.common:build
:util:org.eclipse.virgo.util.env:assemble
:util:org.eclipse.virgo.util.env:compileTestJava
:util:org.eclipse.virgo.util.env:processTestResources UP-TO-DATE
:util:org.eclipse.virgo.util.env:testClasses
:util:org.eclipse.virgo.util.env:test
:util:org.eclipse.virgo.util.env:check
:util:org.eclipse.virgo.util.env:build
:util:org.eclipse.virgo.util.integrationtest:assemble
:util:org.eclipse.virgo.util.integrationtest:compileTestJavaincorrect classpath: /jobs/genie.virgo/3.7.0.Milestones/workspace/util/org.eclipse.virgo.util.integrationtest/build/classes/main
incorrect classpath: /jobs/genie.virgo/3.7.0.Milestones/workspace/util/org.eclipse.virgo.util.integrationtest/build/resources/main
----------
1. WARNING in /jobs/genie.virgo/3.7.0.Milestones/workspace/util/org.eclipse.virgo.util.integrationtest/src/test/java/org/eclipse/virgo/util/test/UtilBundlesResolutionPaxExamTests.java (at line 109)
	Dictionary<String, String> headers = bundle.getHeaders();
	                                     ^^^^^^^^^^^^^^^^^^^
Type safety: The expression of type Dictionary needs unchecked conversion to conform to Dictionary<String,String>
----------
1 problem (1 warning)

:util:org.eclipse.virgo.util.integrationtest:processTestResources UP-TO-DATE
:util:org.eclipse.virgo.util.integrationtest:testClasses
:util:org.eclipse.virgo.util.integrationtest:test
:util:org.eclipse.virgo.util.integrationtest:check
:util:org.eclipse.virgo.util.integrationtest:build
:util:org.eclipse.virgo.util.io:assemble
:util:org.eclipse.virgo.util.io:compileTestJava
:util:org.eclipse.virgo.util.io:processTestResources
:util:org.eclipse.virgo.util.io:testClasses
:util:org.eclipse.virgo.util.io:test
:util:org.eclipse.virgo.util.io:check
:util:org.eclipse.virgo.util.io:build
:util:org.eclipse.virgo.util.jmx:assemble
:util:org.eclipse.virgo.util.jmx:compileTestAspect
:util:org.eclipse.virgo.util.jmx:compileTestJava
:util:org.eclipse.virgo.util.jmx:processTestResources UP-TO-DATE
:util:org.eclipse.virgo.util.jmx:testClasses
:util:org.eclipse.virgo.util.jmx:test
:util:org.eclipse.virgo.util.jmx:check
:util:org.eclipse.virgo.util.jmx:build
:util:org.eclipse.virgo.util.math:assemble
:util:org.eclipse.virgo.util.math:compileTestJava
:util:org.eclipse.virgo.util.math:processTestResources UP-TO-DATE
:util:org.eclipse.virgo.util.math:testClasses
:util:org.eclipse.virgo.util.math:test
:util:org.eclipse.virgo.util.math:check
:util:org.eclipse.virgo.util.math:build
:util:org.eclipse.virgo.util.osgi:assemble
:util:org.eclipse.virgo.util.osgi:compileTestJava
:util:org.eclipse.virgo.util.osgi:processTestResources
:util:org.eclipse.virgo.util.osgi:testClasses
:util:org.eclipse.virgo.util.osgi:test
:util:org.eclipse.virgo.util.osgi:check
:util:org.eclipse.virgo.util.osgi:build
:util:org.eclipse.virgo.util.osgi.manifest:assemble
:util:org.eclipse.virgo.util.osgi.manifest:compileTestJava
:util:org.eclipse.virgo.util.osgi.manifest:processTestResources
:util:org.eclipse.virgo.util.osgi.manifest:testClasses
:util:org.eclipse.virgo.util.osgi.manifest:test
:util:org.eclipse.virgo.util.osgi.manifest:check
:util:org.eclipse.virgo.util.osgi.manifest:build
:util:org.eclipse.virgo.util.parser.launcher:assemble
:util:org.eclipse.virgo.util.parser.launcher:compileTestJava
:util:org.eclipse.virgo.util.parser.launcher:processTestResources
:util:org.eclipse.virgo.util.parser.launcher:testClasses
:util:org.eclipse.virgo.util.parser.launcher:test
:util:org.eclipse.virgo.util.parser.launcher:check
:util:org.eclipse.virgo.util.parser.launcher:build
:util:org.eclipse.virgo.util.parser.manifest:assemble
:util:org.eclipse.virgo.util.parser.manifest:compileTestJava
:util:org.eclipse.virgo.util.parser.manifest:processTestResources
:util:org.eclipse.virgo.util.parser.manifest:testClasses
:util:org.eclipse.virgo.util.parser.manifest:test
:util:org.eclipse.virgo.util.parser.manifest:check
:util:org.eclipse.virgo.util.parser.manifest:build
:web:org.eclipse.virgo.web.core:assemble
:web:org.eclipse.virgo.web.core:compileTestJava
:web:org.eclipse.virgo.web.core:processTestResources UP-TO-DATE
:web:org.eclipse.virgo.web.core:testClasses
:web:org.eclipse.virgo.web.core:test
:web:org.eclipse.virgo.web.core:check
:web:org.eclipse.virgo.web.core:build
:web:org.eclipse.virgo.web.dm:assemble
:web:org.eclipse.virgo.web.dm:compileTestJavaincorrect classpath: /jobs/genie.virgo/3.7.0.Milestones/workspace/web/org.eclipse.virgo.web.dm/build/resources/main

:web:org.eclipse.virgo.web.dm:processTestResources UP-TO-DATE
:web:org.eclipse.virgo.web.dm:testClasses
:web:org.eclipse.virgo.web.dm:test
:web:org.eclipse.virgo.web.dm:check
:web:org.eclipse.virgo.web.dm:build
:web:org.eclipse.virgo.web.enterprise.appdeployer:assemble
:web:org.eclipse.virgo.web.enterprise.appdeployer:compileTestJava UP-TO-DATE
:web:org.eclipse.virgo.web.enterprise.appdeployer:processTestResources UP-TO-DATE
:web:org.eclipse.virgo.web.enterprise.appdeployer:testClasses UP-TO-DATE
:web:org.eclipse.virgo.web.enterprise.appdeployer:test UP-TO-DATE
:web:org.eclipse.virgo.web.enterprise.appdeployer:check UP-TO-DATE
:web:org.eclipse.virgo.web.enterprise.appdeployer:build
:web:org.eclipse.virgo.web.enterprise.applistener:assemble
:web:org.eclipse.virgo.web.enterprise.applistener:compileTestJava UP-TO-DATE
:web:org.eclipse.virgo.web.enterprise.applistener:processTestResources UP-TO-DATE
:web:org.eclipse.virgo.web.enterprise.applistener:testClasses UP-TO-DATE
:web:org.eclipse.virgo.web.enterprise.applistener:test UP-TO-DATE
:web:org.eclipse.virgo.web.enterprise.applistener:check UP-TO-DATE
:web:org.eclipse.virgo.web.enterprise.applistener:build
:web:org.eclipse.virgo.web.enterprise.catalina.fragment.webbeans:assemble
:web:org.eclipse.virgo.web.enterprise.catalina.fragment.webbeans:compileTestJava UP-TO-DATE
:web:org.eclipse.virgo.web.enterprise.catalina.fragment.webbeans:processTestResources UP-TO-DATE
:web:org.eclipse.virgo.web.enterprise.catalina.fragment.webbeans:testClasses UP-TO-DATE
:web:org.eclipse.virgo.web.enterprise.catalina.fragment.webbeans:test UP-TO-DATE
:web:org.eclipse.virgo.web.enterprise.catalina.fragment.webbeans:check UP-TO-DATE
:web:org.eclipse.virgo.web.enterprise.catalina.fragment.webbeans:build
:web:org.eclipse.virgo.web.enterprise.javax.persistence.extension:assemble
:web:org.eclipse.virgo.web.enterprise.javax.persistence.extension:compileTestJava
:web:org.eclipse.virgo.web.enterprise.javax.persistence.extension:processTestResources UP-TO-DATE
:web:org.eclipse.virgo.web.enterprise.javax.persistence.extension:testClasses
:web:org.eclipse.virgo.web.enterprise.javax.persistence.extension:test
:web:org.eclipse.virgo.web.enterprise.javax.persistence.extension:check
:web:org.eclipse.virgo.web.enterprise.javax.persistence.extension:build
:web:org.eclipse.virgo.web.enterprise.javax.persistence.provider.initializer:assemble
:web:org.eclipse.virgo.web.enterprise.javax.persistence.provider.initializer:compileTestJava
:web:org.eclipse.virgo.web.enterprise.javax.persistence.provider.initializer:processTestResources UP-TO-DATE
:web:org.eclipse.virgo.web.enterprise.javax.persistence.provider.initializer:testClasses
:web:org.eclipse.virgo.web.enterprise.javax.persistence.provider.initializer:test
:web:org.eclipse.virgo.web.enterprise.javax.persistence.provider.initializer:check
:web:org.eclipse.virgo.web.enterprise.javax.persistence.provider.initializer:build
:web:org.eclipse.virgo.web.enterprise.jsf.support:assemble
:web:org.eclipse.virgo.web.enterprise.jsf.support:compileTestJava UP-TO-DATE
:web:org.eclipse.virgo.web.enterprise.jsf.support:processTestResources UP-TO-DATE
:web:org.eclipse.virgo.web.enterprise.jsf.support:testClasses UP-TO-DATE
:web:org.eclipse.virgo.web.enterprise.jsf.support:test UP-TO-DATE
:web:org.eclipse.virgo.web.enterprise.jsf.support:check UP-TO-DATE
:web:org.eclipse.virgo.web.enterprise.jsf.support:build
:web:org.eclipse.virgo.web.enterprise.openejb.fragment.bval:assemble
:web:org.eclipse.virgo.web.enterprise.openejb.fragment.bval:compileTestJava UP-TO-DATE
:web:org.eclipse.virgo.web.enterprise.openejb.fragment.bval:processTestResources UP-TO-DATE
:web:org.eclipse.virgo.web.enterprise.openejb.fragment.bval:testClasses UP-TO-DATE
:web:org.eclipse.virgo.web.enterprise.openejb.fragment.bval:test UP-TO-DATE
:web:org.eclipse.virgo.web.enterprise.openejb.fragment.bval:check UP-TO-DATE
:web:org.eclipse.virgo.web.enterprise.openejb.fragment.bval:build
:web:org.eclipse.virgo.web.enterprise.openejb.fragment.jotm:assemble
:web:org.eclipse.virgo.web.enterprise.openejb.fragment.jotm:compileTestJava UP-TO-DATE
:web:org.eclipse.virgo.web.enterprise.openejb.fragment.jotm:processTestResources UP-TO-DATE
:web:org.eclipse.virgo.web.enterprise.openejb.fragment.jotm:testClasses UP-TO-DATE
:web:org.eclipse.virgo.web.enterprise.openejb.fragment.jotm:test UP-TO-DATE
:web:org.eclipse.virgo.web.enterprise.openejb.fragment.jotm:check UP-TO-DATE
:web:org.eclipse.virgo.web.enterprise.openejb.fragment.jotm:build
:web:org.eclipse.virgo.web.enterprise.openejb.fragment.jpa:assemble
:web:org.eclipse.virgo.web.enterprise.openejb.fragment.jpa:compileTestJava UP-TO-DATE
:web:org.eclipse.virgo.web.enterprise.openejb.fragment.jpa:processTestResources UP-TO-DATE
:web:org.eclipse.virgo.web.enterprise.openejb.fragment.jpa:testClasses UP-TO-DATE
:web:org.eclipse.virgo.web.enterprise.openejb.fragment.jpa:test UP-TO-DATE
:web:org.eclipse.virgo.web.enterprise.openejb.fragment.jpa:check UP-TO-DATE
:web:org.eclipse.virgo.web.enterprise.openejb.fragment.jpa:build
:web:org.eclipse.virgo.web.enterprise.openejb.fragment.webbeans:assemble
:web:org.eclipse.virgo.web.enterprise.openejb.fragment.webbeans:compileTestJava UP-TO-DATE
:web:org.eclipse.virgo.web.enterprise.openejb.fragment.webbeans:processTestResources UP-TO-DATE
:web:org.eclipse.virgo.web.enterprise.openejb.fragment.webbeans:testClasses UP-TO-DATE
:web:org.eclipse.virgo.web.enterprise.openejb.fragment.webbeans:test UP-TO-DATE
:web:org.eclipse.virgo.web.enterprise.openejb.fragment.webbeans:check UP-TO-DATE
:web:org.eclipse.virgo.web.enterprise.openejb.fragment.webbeans:build
:web:org.eclipse.virgo.web.enterprise.openejb.initialiser:assemble
:web:org.eclipse.virgo.web.enterprise.openejb.initialiser:compileTestJava UP-TO-DATE
:web:org.eclipse.virgo.web.enterprise.openejb.initialiser:processTestResources UP-TO-DATE
:web:org.eclipse.virgo.web.enterprise.openejb.initialiser:testClasses UP-TO-DATE
:web:org.eclipse.virgo.web.enterprise.openejb.initialiser:test UP-TO-DATE
:web:org.eclipse.virgo.web.enterprise.openejb.initialiser:check UP-TO-DATE
:web:org.eclipse.virgo.web.enterprise.openejb.initialiser:build
:web:org.eclipse.virgo.web.enterprise.openejb.jpa.integration:assemble
:web:org.eclipse.virgo.web.enterprise.openejb.jpa.integration:compileTestJava UP-TO-DATE
:web:org.eclipse.virgo.web.enterprise.openejb.jpa.integration:processTestResources UP-TO-DATE
:web:org.eclipse.virgo.web.enterprise.openejb.jpa.integration:testClasses UP-TO-DATE
:web:org.eclipse.virgo.web.enterprise.openejb.jpa.integration:test UP-TO-DATE
:web:org.eclipse.virgo.web.enterprise.openejb.jpa.integration:check UP-TO-DATE
:web:org.eclipse.virgo.web.enterprise.openejb.jpa.integration:build
:web:org.eclipse.virgo.web.enterprise.openejb.tomcat.factory:assemble
:web:org.eclipse.virgo.web.enterprise.openejb.tomcat.factory:compileTestJava
:web:org.eclipse.virgo.web.enterprise.openejb.tomcat.factory:processTestResources UP-TO-DATE
:web:org.eclipse.virgo.web.enterprise.openejb.tomcat.factory:testClasses
:web:org.eclipse.virgo.web.enterprise.openejb.tomcat.factory:test
:web:org.eclipse.virgo.web.enterprise.openejb.tomcat.factory:check
:web:org.eclipse.virgo.web.enterprise.openejb.tomcat.factory:build
:web:org.eclipse.virgo.web.enterprise.openwebbeans.initialiser:assemble
:web:org.eclipse.virgo.web.enterprise.openwebbeans.initialiser:compileTestJava UP-TO-DATE
:web:org.eclipse.virgo.web.enterprise.openwebbeans.initialiser:processTestResources UP-TO-DATE
:web:org.eclipse.virgo.web.enterprise.openwebbeans.initialiser:testClasses UP-TO-DATE
:web:org.eclipse.virgo.web.enterprise.openwebbeans.initialiser:test UP-TO-DATE
:web:org.eclipse.virgo.web.enterprise.openwebbeans.initialiser:check UP-TO-DATE
:web:org.eclipse.virgo.web.enterprise.openwebbeans.initialiser:build
:web:org.eclipse.virgo.web.enterprise.persistence.openejb.classloading.hook:assemble
:web:org.eclipse.virgo.web.enterprise.persistence.openejb.classloading.hook:compileTestJava
:web:org.eclipse.virgo.web.enterprise.persistence.openejb.classloading.hook:processTestResources UP-TO-DATE
:web:org.eclipse.virgo.web.enterprise.persistence.openejb.classloading.hook:testClasses
:web:org.eclipse.virgo.web.enterprise.persistence.openejb.classloading.hook:test
:web:org.eclipse.virgo.web.enterprise.persistence.openejb.classloading.hook:check
:web:org.eclipse.virgo.web.enterprise.persistence.openejb.classloading.hook:build
:web:org.eclipse.virgo.web.enterprise.security:assemble
:web:org.eclipse.virgo.web.enterprise.security:compileTestJava----------
1. WARNING in /jobs/genie.virgo/3.7.0.Milestones/workspace/web/org.eclipse.virgo.web.enterprise.security/src/test/java/org/eclipse/virgo/web/enterprise/security/StandardSecurityServiceTest.java (at line 193)
	ThreadLocal<Wrapper> wrapperLocal = (ThreadLocal<Wrapper>) wrapper; 
	                                    ^^^^^^^^^^^^^^^^^^^^^^^^^^^^^^
Type safety: Unchecked cast from Object to ThreadLocal<Wrapper>
----------
1 problem (1 warning)

:web:org.eclipse.virgo.web.enterprise.security:processTestResources UP-TO-DATE
:web:org.eclipse.virgo.web.enterprise.security:testClasses
:web:org.eclipse.virgo.web.enterprise.security:test
:web:org.eclipse.virgo.web.enterprise.security:check
:web:org.eclipse.virgo.web.enterprise.security:build
:web:org.eclipse.virgo.web.enterprise.security.openejb.classloading.hook:assemble
:web:org.eclipse.virgo.web.enterprise.security.openejb.classloading.hook:compileTestJava UP-TO-DATE
:web:org.eclipse.virgo.web.enterprise.security.openejb.classloading.hook:processTestResources UP-TO-DATE
:web:org.eclipse.virgo.web.enterprise.security.openejb.classloading.hook:testClasses UP-TO-DATE
:web:org.eclipse.virgo.web.enterprise.security.openejb.classloading.hook:test UP-TO-DATE
:web:org.eclipse.virgo.web.enterprise.security.openejb.classloading.hook:check UP-TO-DATE
:web:org.eclipse.virgo.web.enterprise.security.openejb.classloading.hook:build
:web:org.eclipse.virgo.web.enterprise.security.valve:assemble
:web:org.eclipse.virgo.web.enterprise.security.valve:compileTestJava UP-TO-DATE
:web:org.eclipse.virgo.web.enterprise.security.valve:processTestResources UP-TO-DATE
:web:org.eclipse.virgo.web.enterprise.security.valve:testClasses UP-TO-DATE
:web:org.eclipse.virgo.web.enterprise.security.valve:test UP-TO-DATE
:web:org.eclipse.virgo.web.enterprise.security.valve:check UP-TO-DATE
:web:org.eclipse.virgo.web.enterprise.security.valve:build
:web:org.eclipse.virgo.web.enterprise.services.accessor:assemble
:web:org.eclipse.virgo.web.enterprise.services.accessor:compileTestJava----------
1. WARNING in /jobs/genie.virgo/3.7.0.Milestones/workspace/web/org.eclipse.virgo.web.enterprise.services.accessor/src/test/java/org/eclipse/virgo/web/enterprise/services/accessor/WebAppBundleClassloaderCustomizerTest.java (at line 94)
	assertTrue(((List<ClassLoaderDelegateHook>) field.get(PluggableDelegatingClassLoaderDelegateHook.getInstance())).contains(webAppBundleClassloaderCustomizer.getWebAppBundleClassLoaderDelegateHook()));
	           ^^^^^^^^^^^^^^^^^^^^^^^^^^^^^^^^^^^^^^^^^^^^^^^^^^^^^^^^^^^^^^^^^^^^^^^^^^^^^^^^^^^^^^^^^^^^^^^^^^^^^
Type safety: Unchecked cast from Object to List<ClassLoaderDelegateHook>
----------
2. WARNING in /jobs/genie.virgo/3.7.0.Milestones/workspace/web/org.eclipse.virgo.web.enterprise.services.accessor/src/test/java/org/eclipse/virgo/web/enterprise/services/accessor/WebAppBundleClassloaderCustomizerTest.java (at line 98)
	assertTrue(((Map<Bundle, Set<String>>) field2.get(webAppBundleClassloaderCustomizer.getWebAppBundleClassLoaderDelegateHook())).containsKey(webBundle));
	           ^^^^^^^^^^^^^^^^^^^^^^^^^^^^^^^^^^^^^^^^^^^^^^^^^^^^^^^^^^^^^^^^^^^^^^^^^^^^^^^^^^^^^^^^^^^^^^^^^^^^^^^^^^^^^^^^^^^
Type safety: Unchecked cast from Object to Map<Bundle,Set<String>>
----------
3. WARNING in /jobs/genie.virgo/3.7.0.Milestones/workspace/web/org.eclipse.virgo.web.enterprise.services.accessor/src/test/java/org/eclipse/virgo/web/enterprise/services/accessor/WebAppBundleClassloaderCustomizerTest.java (at line 104)
	assertTrue(((List<ClassLoaderDelegateHook>) field.get(PluggableDelegatingClassLoaderDelegateHook.getInstance())).isEmpty());
	           ^^^^^^^^^^^^^^^^^^^^^^^^^^^^^^^^^^^^^^^^^^^^^^^^^^^^^^^^^^^^^^^^^^^^^^^^^^^^^^^^^^^^^^^^^^^^^^^^^^^^^
Type safety: Unchecked cast from Object to List<ClassLoaderDelegateHook>
----------
3 problems (3 warnings)

:web:org.eclipse.virgo.web.enterprise.services.accessor:processTestResources UP-TO-DATE
:web:org.eclipse.virgo.web.enterprise.services.accessor:testClasses
:web:org.eclipse.virgo.web.enterprise.services.accessor:test
:web:org.eclipse.virgo.web.enterprise.services.accessor:check
:web:org.eclipse.virgo.web.enterprise.services.accessor:build
:web:org.eclipse.virgo.web.servlet.adapter:assemble
:web:org.eclipse.virgo.web.servlet.adapter:compileTestJava UP-TO-DATE
:web:org.eclipse.virgo.web.servlet.adapter:processTestResources UP-TO-DATE
:web:org.eclipse.virgo.web.servlet.adapter:testClasses UP-TO-DATE
:web:org.eclipse.virgo.web.servlet.adapter:test UP-TO-DATE
:web:org.eclipse.virgo.web.servlet.adapter:check UP-TO-DATE
:web:org.eclipse.virgo.web.servlet.adapter:build
:web:org.eclipse.virgo.web.spring.integration:assemble
:web:org.eclipse.virgo.web.spring.integration:compileTestJava UP-TO-DATE
:web:org.eclipse.virgo.web.spring.integration:processTestResources UP-TO-DATE
:web:org.eclipse.virgo.web.spring.integration:testClasses UP-TO-DATE
:web:org.eclipse.virgo.web.spring.integration:test UP-TO-DATE
:web:org.eclipse.virgo.web.spring.integration:check UP-TO-DATE
:web:org.eclipse.virgo.web.spring.integration:build
:web:org.eclipse.virgo.web.tomcat.support:assemble
:web:org.eclipse.virgo.web.tomcat.support:compileTestJava UP-TO-DATE
:web:org.eclipse.virgo.web.tomcat.support:processTestResources UP-TO-DATE
:web:org.eclipse.virgo.web.tomcat.support:testClasses UP-TO-DATE
:web:org.eclipse.virgo.web.tomcat.support:test UP-TO-DATE
:web:org.eclipse.virgo.web.tomcat.support:check UP-TO-DATE
:web:org.eclipse.virgo.web.tomcat.support:build
:web:org.eclipse.virgo.web.war.deployer:assemble
:web:org.eclipse.virgo.web.war.deployer:compileTestJava
:web:org.eclipse.virgo.web.war.deployer:processTestResources
:web:org.eclipse.virgo.web.war.deployer:testClasses
:web:org.eclipse.virgo.web.war.deployer:test
:web:org.eclipse.virgo.web.war.deployer:check
:web:org.eclipse.virgo.web.war.deployer:build
:packaging:jetty-server:org.eclipse.virgo.jetty.smoketest:assemble
:packaging:jetty-server:org.eclipse.virgo.jetty.smoketest:compileTestJava UP-TO-DATE
:packaging:jetty-server:org.eclipse.virgo.jetty.smoketest:processTestResources UP-TO-DATE
:packaging:jetty-server:org.eclipse.virgo.jetty.smoketest:testClasses UP-TO-DATE
:packaging:jetty-server:org.eclipse.virgo.jetty.smoketest:test UP-TO-DATE
:packaging:jetty-server:org.eclipse.virgo.jetty.smoketest:check UP-TO-DATE
:packaging:jetty-server:org.eclipse.virgo.jetty.smoketest:build
:packaging:kernel:org.eclipse.virgo.kernel.smoketest:assemble
:packaging:kernel:org.eclipse.virgo.kernel.smoketest:compileTestJava UP-TO-DATE
:packaging:kernel:org.eclipse.virgo.kernel.smoketest:processTestResources UP-TO-DATE
:packaging:kernel:org.eclipse.virgo.kernel.smoketest:testClasses UP-TO-DATE
:packaging:kernel:org.eclipse.virgo.kernel.smoketest:test UP-TO-DATE
:packaging:kernel:org.eclipse.virgo.kernel.smoketest:check UP-TO-DATE
:packaging:kernel:org.eclipse.virgo.kernel.smoketest:build
:packaging:nano:org.eclipse.virgo.nano.smoketest:assemble
:packaging:nano:org.eclipse.virgo.nano.smoketest:compileTestJava UP-TO-DATE
:packaging:nano:org.eclipse.virgo.nano.smoketest:processTestResources UP-TO-DATE
:packaging:nano:org.eclipse.virgo.nano.smoketest:testClasses UP-TO-DATE
:packaging:nano:org.eclipse.virgo.nano.smoketest:test UP-TO-DATE
:packaging:nano:org.eclipse.virgo.nano.smoketest:check UP-TO-DATE
:packaging:nano:org.eclipse.virgo.nano.smoketest:build
:packaging:tomcat-server:org.eclipse.virgo.tomcat.smoketest:assemble
:packaging:tomcat-server:org.eclipse.virgo.tomcat.smoketest:compileTestJava UP-TO-DATE
:packaging:tomcat-server:org.eclipse.virgo.tomcat.smoketest:processTestResources UP-TO-DATE
:packaging:tomcat-server:org.eclipse.virgo.tomcat.smoketest:testClasses UP-TO-DATE
:packaging:tomcat-server:org.eclipse.virgo.tomcat.smoketest:test UP-TO-DATE
:packaging:tomcat-server:org.eclipse.virgo.tomcat.smoketest:check UP-TO-DATE
:packaging:tomcat-server:org.eclipse.virgo.tomcat.smoketest:build
:packaging:jetty-server:installDist
:packaging:kernel:installDist
:packaging:nano:installDist
:packaging:tomcat-server:installDist
:packaging:nano:installFullDist
:packaging:nano:installRapDist
:org.eclipse.virgo.site:zipUpdateSite

FAILURE: Build failed with an exception.

* What went wrong:
Execution failed for task ':kernel:org.eclipse.virgo.kernel.userregion:test'.
> There were failing tests. See the report at: file:///jobs/genie.virgo/3.7.0.Milestones/workspace/kernel/org.eclipse.virgo.kernel.userregion/build/reports/tests/index.html

* Try:
Run with --info or --debug option to get more log output.

* Exception is:
org.gradle.api.tasks.TaskExecutionException: Execution failed for task ':kernel:org.eclipse.virgo.kernel.userregion:test'.
	at org.gradle.api.internal.tasks.execution.ExecuteActionsTaskExecuter.executeActions(ExecuteActionsTaskExecuter.java:69)
	at org.gradle.api.internal.tasks.execution.ExecuteActionsTaskExecuter.execute(ExecuteActionsTaskExecuter.java:46)
	at org.gradle.api.internal.tasks.execution.PostExecutionAnalysisTaskExecuter.execute(PostExecutionAnalysisTaskExecuter.java:35)
	at org.gradle.api.internal.tasks.execution.SkipUpToDateTaskExecuter.execute(SkipUpToDateTaskExecuter.java:64)
	at org.gradle.api.internal.tasks.execution.ValidatingTaskExecuter.execute(ValidatingTaskExecuter.java:58)
	at org.gradle.api.internal.tasks.execution.SkipEmptySourceFilesTaskExecuter.execute(SkipEmptySourceFilesTaskExecuter.java:52)
	at org.gradle.api.internal.tasks.execution.SkipTaskWithNoActionsExecuter.execute(SkipTaskWithNoActionsExecuter.java:52)
	at org.gradle.api.internal.tasks.execution.SkipOnlyIfTaskExecuter.execute(SkipOnlyIfTaskExecuter.java:53)
	at org.gradle.api.internal.tasks.execution.ExecuteAtMostOnceTaskExecuter.execute(ExecuteAtMostOnceTaskExecuter.java:43)
	at org.gradle.execution.taskgraph.DefaultTaskGraphExecuter$EventFiringTaskWorker.execute(DefaultTaskGraphExecuter.java:203)
	at org.gradle.execution.taskgraph.DefaultTaskGraphExecuter$EventFiringTaskWorker.execute(DefaultTaskGraphExecuter.java:185)
	at org.gradle.execution.taskgraph.AbstractTaskPlanExecutor$TaskExecutorWorker.processTask(AbstractTaskPlanExecutor.java:66)
	at org.gradle.execution.taskgraph.AbstractTaskPlanExecutor$TaskExecutorWorker.run(AbstractTaskPlanExecutor.java:50)
	at org.gradle.execution.taskgraph.DefaultTaskPlanExecutor.process(DefaultTaskPlanExecutor.java:25)
	at org.gradle.execution.taskgraph.DefaultTaskGraphExecuter.execute(DefaultTaskGraphExecuter.java:110)
	at org.gradle.execution.SelectedTaskExecutionAction.execute(SelectedTaskExecutionAction.java:37)
	at org.gradle.execution.DefaultBuildExecuter.execute(DefaultBuildExecuter.java:37)
	at org.gradle.execution.DefaultBuildExecuter.access$000(DefaultBuildExecuter.java:23)
	at org.gradle.execution.DefaultBuildExecuter$1.proceed(DefaultBuildExecuter.java:43)
	at org.gradle.execution.DryRunBuildExecutionAction.execute(DryRunBuildExecutionAction.java:32)
	at org.gradle.execution.DefaultBuildExecuter.execute(DefaultBuildExecuter.java:37)
	at org.gradle.execution.DefaultBuildExecuter.execute(DefaultBuildExecuter.java:30)
	at org.gradle.initialization.DefaultGradleLauncher$4.run(DefaultGradleLauncher.java:154)
	at org.gradle.internal.Factories$1.create(Factories.java:22)
	at org.gradle.internal.progress.DefaultBuildOperationExecutor.run(DefaultBuildOperationExecutor.java:90)
	at org.gradle.internal.progress.DefaultBuildOperationExecutor.run(DefaultBuildOperationExecutor.java:52)
	at org.gradle.initialization.DefaultGradleLauncher.doBuildStages(DefaultGradleLauncher.java:151)
	at org.gradle.initialization.DefaultGradleLauncher.access$200(DefaultGradleLauncher.java:32)
	at org.gradle.initialization.DefaultGradleLauncher$1.create(DefaultGradleLauncher.java:99)
	at org.gradle.initialization.DefaultGradleLauncher$1.create(DefaultGradleLauncher.java:93)
	at org.gradle.internal.progress.DefaultBuildOperationExecutor.run(DefaultBuildOperationExecutor.java:90)
	at org.gradle.internal.progress.DefaultBuildOperationExecutor.run(DefaultBuildOperationExecutor.java:62)
	at org.gradle.initialization.DefaultGradleLauncher.doBuild(DefaultGradleLauncher.java:93)
	at org.gradle.initialization.DefaultGradleLauncher.run(DefaultGradleLauncher.java:82)
	at org.gradle.launcher.exec.InProcessBuildActionExecuter$DefaultBuildController.run(InProcessBuildActionExecuter.java:94)
	at org.gradle.tooling.internal.provider.ExecuteBuildActionRunner.run(ExecuteBuildActionRunner.java:28)
	at org.gradle.launcher.exec.ChainingBuildActionRunner.run(ChainingBuildActionRunner.java:35)
	at org.gradle.launcher.exec.InProcessBuildActionExecuter.execute(InProcessBuildActionExecuter.java:43)
	at org.gradle.launcher.exec.InProcessBuildActionExecuter.execute(InProcessBuildActionExecuter.java:28)
	at org.gradle.launcher.exec.ContinuousBuildActionExecuter.execute(ContinuousBuildActionExecuter.java:78)
	at org.gradle.launcher.exec.ContinuousBuildActionExecuter.execute(ContinuousBuildActionExecuter.java:48)
	at org.gradle.launcher.exec.DaemonUsageSuggestingBuildActionExecuter.execute(DaemonUsageSuggestingBuildActionExecuter.java:51)
	at org.gradle.launcher.exec.DaemonUsageSuggestingBuildActionExecuter.execute(DaemonUsageSuggestingBuildActionExecuter.java:28)
	at org.gradle.launcher.cli.RunBuildAction.run(RunBuildAction.java:43)
	at org.gradle.internal.Actions$RunnableActionAdapter.execute(Actions.java:170)
	at org.gradle.launcher.cli.CommandLineActionFactory$ParseAndBuildAction.execute(CommandLineActionFactory.java:237)
	at org.gradle.launcher.cli.CommandLineActionFactory$ParseAndBuildAction.execute(CommandLineActionFactory.java:210)
	at org.gradle.launcher.cli.JavaRuntimeValidationAction.execute(JavaRuntimeValidationAction.java:35)
	at org.gradle.launcher.cli.JavaRuntimeValidationAction.execute(JavaRuntimeValidationAction.java:24)
	at org.gradle.launcher.cli.CommandLineActionFactory$WithLogging.execute(CommandLineActionFactory.java:206)
	at org.gradle.launcher.cli.CommandLineActionFactory$WithLogging.execute(CommandLineActionFactory.java:169)
	at org.gradle.launcher.cli.ExceptionReportingAction.execute(ExceptionReportingAction.java:33)
	at org.gradle.launcher.cli.ExceptionReportingAction.execute(ExceptionReportingAction.java:22)
	at org.gradle.launcher.Main.doAction(Main.java:33)
	at org.gradle.launcher.bootstrap.EntryPoint.run(EntryPoint.java:45)
	at org.gradle.launcher.bootstrap.ProcessBootstrap.runNoExit(ProcessBootstrap.java:54)
	at org.gradle.launcher.bootstrap.ProcessBootstrap.run(ProcessBootstrap.java:35)
	at org.gradle.launcher.GradleMain.main(GradleMain.java:23)
	at org.gradle.wrapper.BootstrapMainStarter.start(BootstrapMainStarter.java:30)
	at org.gradle.wrapper.WrapperExecutor.execute(WrapperExecutor.java:127)
	at org.gradle.wrapper.GradleWrapperMain.main(GradleWrapperMain.java:56)
Caused by: org.gradle.api.GradleException: There were failing tests. See the report at: file:///jobs/genie.virgo/3.7.0.Milestones/workspace/kernel/org.eclipse.virgo.kernel.userregion/build/reports/tests/index.html
	at org.gradle.api.tasks.testing.Test.handleTestFailures(Test.java:1157)
	at org.gradle.api.tasks.testing.Test.executeTests(Test.java:570)
	at org.gradle.internal.reflect.JavaMethod.invoke(JavaMethod.java:75)
	at org.gradle.api.internal.project.taskfactory.AnnotationProcessingTaskFactory$StandardTaskAction.doExecute(AnnotationProcessingTaskFactory.java:227)
	at org.gradle.api.internal.project.taskfactory.AnnotationProcessingTaskFactory$StandardTaskAction.execute(AnnotationProcessingTaskFactory.java:220)
	at org.gradle.api.internal.project.taskfactory.AnnotationProcessingTaskFactory$StandardTaskAction.execute(AnnotationProcessingTaskFactory.java:209)
	at org.gradle.api.internal.AbstractTask$TaskActionWrapper.execute(AbstractTask.java:585)
	at org.gradle.api.internal.AbstractTask$TaskActionWrapper.execute(AbstractTask.java:568)
	at org.gradle.api.internal.tasks.execution.ExecuteActionsTaskExecuter.executeAction(ExecuteActionsTaskExecuter.java:80)
	at org.gradle.api.internal.tasks.execution.ExecuteActionsTaskExecuter.executeActions(ExecuteActionsTaskExecuter.java:61)
	... 60 more


BUILD FAILED

Total time: 6 mins 33.821 secs
[locks-and-latches] Releasing all the locks
[locks-and-latches] All the locks released
Recording test results
Archiving artifacts
Sending e-mails to: fwaibel@eclipsesource.com
Finished: FAILURE