FailedConsole Output

Started by user Florian Waibel
Running as Florian Waibel
Agent basic-agent-v35t3 is provisioned from template basic-agent
---
apiVersion: "v1"
kind: "Pod"
metadata:
  annotations: {}
  labels:
    jenkins: "slave"
    jenkins/label: ""
  name: "basic-agent-v35t3"
spec:
  containers:
  - env:
    - name: "MAVEN_OPTS"
      value: "-Dorg.slf4j.simpleLogger.log.org.apache.maven.cli.transfer.Slf4jMavenTransferListener=warn"
    - name: "JENKINS_SECRET"
      value: "********"
    - name: "JENKINS_TUNNEL"
      value: "jenkins-discovery.virgo.svc.cluster.local:50000"
    - name: "JENKINS_AGENT_NAME"
      value: "basic-agent-v35t3"
    - name: "MAVEN_CONFIG"
      value: "-B -e"
    - name: "JENKINS_NAME"
      value: "basic-agent-v35t3"
    - name: "JENKINS_AGENT_WORKDIR"
      value: "/home/jenkins/agent"
    - name: "JENKINS_URL"
      value: "http://jenkins-ui.virgo.svc.cluster.local/virgo/"
    - name: "HOME"
      value: "/home/jenkins"
    image: "eclipsecbijenkins/basic-agent:3.35"
    imagePullPolicy: "Always"
    name: "jnlp"
    resources:
      limits:
        memory: "4096Mi"
        cpu: "2000m"
      requests:
        memory: "4096Mi"
        cpu: "1000m"
    securityContext:
      privileged: false
    tty: true
    volumeMounts:
    - mountPath: "/home/jenkins/.m2/toolchains.xml"
      name: "m2-dir"
      readOnly: true
      subPath: "toolchains.xml"
    - mountPath: "/opt/tools"
      name: "volume-0"
      readOnly: false
    - mountPath: "/home/jenkins"
      name: "volume-2"
      readOnly: false
    - mountPath: "/home/jenkins/.m2/repository"
      name: "volume-3"
      readOnly: false
    - mountPath: "/home/jenkins/.m2/settings-security.xml"
      name: "m2-secret-dir"
      readOnly: true
      subPath: "settings-security.xml"
    - mountPath: "/home/jenkins/.m2/wrapper"
      name: "volume-4"
      readOnly: false
    - mountPath: "/home/jenkins/.m2/settings.xml"
      name: "m2-secret-dir"
      readOnly: true
      subPath: "settings.xml"
    - mountPath: "/home/jenkins/.ssh"
      name: "volume-1"
      readOnly: false
    - mountPath: "/home/jenkins/agent"
      name: "workspace-volume"
      readOnly: false
    workingDir: "/home/jenkins/agent"
  nodeSelector:
    beta.kubernetes.io/os: "linux"
  restartPolicy: "Never"
  securityContext: {}
  volumes:
  - name: "volume-0"
    persistentVolumeClaim:
      claimName: "tools-claim-jiro-virgo"
      readOnly: true
  - name: "m2-secret-dir"
    secret:
      secretName: "m2-secret-dir"
  - emptyDir:
      medium: ""
    name: "volume-2"
  - configMap:
      name: "m2-dir"
    name: "m2-dir"
  - configMap:
      name: "known-hosts"
    name: "volume-1"
  - emptyDir:
      medium: ""
    name: "workspace-volume"
  - emptyDir:
      medium: ""
    name: "volume-4"
  - emptyDir:
      medium: ""
    name: "volume-3"

Building remotely on basic-agent-v35t3 in workspace /home/jenkins/agent/workspace/virgo-mirrored-master
No credentials specified
Cloning the remote Git repository
Cloning repository git://git.eclipse.org/gitroot/virgo/org.eclipse.virgo.root.git
 > git init /home/jenkins/agent/workspace/virgo-mirrored-master # timeout=10
Fetching upstream changes from git://git.eclipse.org/gitroot/virgo/org.eclipse.virgo.root.git
 > git --version # timeout=10
 > git fetch --tags --force --progress -- git://git.eclipse.org/gitroot/virgo/org.eclipse.virgo.root.git +refs/heads/*:refs/remotes/origin/* # timeout=10
 > git config remote.origin.url git://git.eclipse.org/gitroot/virgo/org.eclipse.virgo.root.git # timeout=10
 > git config --add remote.origin.fetch +refs/heads/*:refs/remotes/origin/* # timeout=10
 > git config remote.origin.url git://git.eclipse.org/gitroot/virgo/org.eclipse.virgo.root.git # timeout=10
Fetching upstream changes from git://git.eclipse.org/gitroot/virgo/org.eclipse.virgo.root.git
 > git fetch --tags --force --progress -- git://git.eclipse.org/gitroot/virgo/org.eclipse.virgo.root.git +refs/heads/*:refs/remotes/origin/* # timeout=10
 > git rev-parse feature/spring_4_3_21^{commit} # timeout=10
 > git rev-parse refs/remotes/origin/feature/spring_4_3_21^{commit} # timeout=10
Checking out Revision ddfee6fafa82fa4e13f633826ec6333a7320941f (refs/remotes/origin/feature/spring_4_3_21)
 > git config core.sparsecheckout # timeout=10
 > git checkout -f ddfee6fafa82fa4e13f633826ec6333a7320941f # timeout=10
Commit message: "Bump Spring Framework version to 4.3.26.RELEASE"
 > git rev-list --no-walk e423fcc6231428796884a3c7eb883386dfc1257b # timeout=10
[Gradle] - Launching build.
[ebr] $ /home/jenkins/agent/workspace/virgo-mirrored-master/gradlew clean bundlor publishIvyPublicationToIvyRepository
Picked up JAVA_TOOL_OPTIONS: -XX:+IgnoreUnrecognizedVMOptions -XX:+UseContainerSupport -XX:+UnlockExperimentalVMOptions -XX:+UseCGroupMemoryLimitForHeap
Picked up _JAVA_OPTIONS: -XX:MaxRAMPercentage=64.0
Downloading https://services.gradle.org/distributions/gradle-3.5-all.zip
..................................................................................................................................................................................................................................................................................................................................................................................................................................................................................................................................................................................................................................................................................................................................................................................................................................................................................................................................................................................................................................................................................................................................................................................................................................................................................................................................................................................................................................................................................................................................................................................................................................................................................................................................................................................................................................................................................................................................................................................................................................................................................................................................................................................................................................................................................................................................................................................................................................................................................................................................................................................................................................................................................................................................................................................................................................................................................................................................................................................................................................................................................................................................................................................................................................................................................................................................................................................................................................................................................................................................................................................................................................................................................................................................................................................................................................................................................................................................................................................................................................................................................................................................................................................................................................................................................................................................................................................................................................................................................................................................................................................................................................................................................................................................................................................................................................................................................................................................................
Unzipping /home/jenkins/.gradle/wrapper/dists/gradle-3.5-all/exhrs6ca08n232b14ue48lbye/gradle-3.5-all.zip to /home/jenkins/.gradle/wrapper/dists/gradle-3.5-all/exhrs6ca08n232b14ue48lbye
Set executable permissions for: /home/jenkins/.gradle/wrapper/dists/gradle-3.5-all/exhrs6ca08n232b14ue48lbye/gradle-3.5/bin/gradle
Starting a Gradle Daemon (subsequent builds will be faster)
Download https://repo1.maven.org/maven2/org/apache/ivy/ivy/2.4.0/ivy-2.4.0.pom
Download https://repo1.maven.org/maven2/org/apache/apache/7/apache-7.pom
Download https://repo1.maven.org/maven2/org/apache/ivy/ivy/2.4.0/ivy-2.4.0.jar
Download https://repo1.maven.org/maven2/org/springframework/spring-aop/4.3.26.RELEASE/spring-aop-4.3.26.RELEASE.pom
Download https://repo1.maven.org/maven2/org/springframework/spring-beans/4.3.26.RELEASE/spring-beans-4.3.26.RELEASE.pom
Download https://repo1.maven.org/maven2/org/springframework/spring-core/4.3.26.RELEASE/spring-core-4.3.26.RELEASE.pom
Download https://repo1.maven.org/maven2/commons-logging/commons-logging/1.2/commons-logging-1.2.pom
Download https://repo1.maven.org/maven2/org/apache/commons/commons-parent/34/commons-parent-34.pom
Download https://repo1.maven.org/maven2/org/apache/apache/13/apache-13.pom
Download https://repo1.maven.org/maven2/org/springframework/spring-aop/4.3.26.RELEASE/spring-aop-4.3.26.RELEASE.jar
Download https://repo1.maven.org/maven2/org/springframework/spring-beans/4.3.26.RELEASE/spring-beans-4.3.26.RELEASE.jar
Download https://repo1.maven.org/maven2/org/springframework/spring-core/4.3.26.RELEASE/spring-core-4.3.26.RELEASE.jar
Download https://repo1.maven.org/maven2/commons-logging/commons-logging/1.2/commons-logging-1.2.jar
:clean UP-TO-DATE
:com.squareup.okhttp3-3.8.1:clean UP-TO-DATE
:com.squareup.okio-1.13.0:clean UP-TO-DATE
:org.aspectj.weaver-1.8.10:clean UP-TO-DATE
:org.springframework.aop-4.3.26.RELEASE:clean UP-TO-DATE
:org.springframework.aspects-4.3.26.RELEASE:clean UP-TO-DATE
:org.springframework.beans-4.3.26.RELEASE:clean UP-TO-DATE
:org.springframework.context-4.3.26.RELEASE:clean UP-TO-DATE
:org.springframework.context.support-4.3.26.RELEASE:clean UP-TO-DATE
:org.springframework.core-4.3.26.RELEASE:clean UP-TO-DATE
:org.springframework.expression-4.3.26.RELEASE:clean UP-TO-DATE
:org.springframework.jdbc-4.3.26.RELEASE:clean UP-TO-DATE
:org.springframework.jms-4.3.26.RELEASE:clean UP-TO-DATE
:org.springframework.messaging-4.3.26.RELEASE:clean UP-TO-DATE
:org.springframework.orm-4.3.26.RELEASE:clean UP-TO-DATE
:org.springframework.oxm-4.3.26.RELEASE:clean UP-TO-DATE
:org.springframework.test-4.3.26.RELEASE:clean UP-TO-DATE
:org.springframework.transaction-4.3.26.RELEASE:clean UP-TO-DATE
:org.springframework.web-4.3.26.RELEASE:clean UP-TO-DATE
:org.springframework.webmvc-4.3.26.RELEASE:clean UP-TO-DATE
:org.springframework.webmvc.portlet-4.3.26.RELEASE:clean UP-TO-DATE
:org.springframework.websocket-4.3.26.RELEASE:clean UP-TO-DATE
:com.squareup.okhttp3-3.8.1:addProjectVersionToGradlePropertiesTask
:com.squareup.okhttp3-3.8.1:createBuildDir
:com.squareup.okhttp3-3.8.1:bundlor
Download https://repo1.maven.org/maven2/com/squareup/okhttp3/okhttp/3.8.1/okhttp-3.8.1.pom
Download https://repo1.maven.org/maven2/com/squareup/okhttp3/parent/3.8.1/parent-3.8.1.pom
Download https://repo1.maven.org/maven2/org/sonatype/oss/oss-parent/7/oss-parent-7.pom
Download https://repo1.maven.org/maven2/com/squareup/okio/okio/1.13.0/okio-1.13.0.pom
Download https://repo1.maven.org/maven2/com/squareup/okio/okio-parent/1.13.0/okio-parent-1.13.0.pom
Download https://repo1.maven.org/maven2/com/squareup/okhttp3/okhttp/3.8.1/okhttp-3.8.1.jar
Download https://repo1.maven.org/maven2/com/squareup/okio/okio/1.13.0/okio-1.13.0.jar
Download http://build.eclipse.org/rt/virgo/gradle/bundles/org/eclipse/virgo/bundlor/org.eclipse.virgo.bundlor.commandline/1.1.3.M01/org.eclipse.virgo.bundlor.commandline-1.1.3.M01.pom
Download http://build.eclipse.org/rt/virgo/gradle/bundles/org/eclipse/virgo/bundlor/org.eclipse.virgo.bundlor/1.1.3.M01/org.eclipse.virgo.bundlor-1.1.3.M01.pom
Download http://build.eclipse.org/rt/virgo/gradle/bundles/org/eclipse/virgo/bundlor/org.eclipse.virgo.bundlor.blint/1.1.3.M01/org.eclipse.virgo.bundlor.blint-1.1.3.M01.pom
Download https://repo1.maven.org/maven2/org/osgi/org.osgi.core/4.3.0/org.osgi.core-4.3.0.pom
Download https://repo1.maven.org/maven2/commons-cli/commons-cli/1.2/commons-cli-1.2.pom
Download https://repo1.maven.org/maven2/org/apache/commons/commons-parent/11/commons-parent-11.pom
Download https://repo1.maven.org/maven2/org/apache/apache/4/apache-4.pom
Download https://repo1.maven.org/maven2/org/ow2/asm/asm-all/5.1/asm-all-5.1.pom
Download https://repo1.maven.org/maven2/org/ow2/asm/asm-parent/5.1/asm-parent-5.1.pom
Download https://repo1.maven.org/maven2/org/ow2/ow2/1.3/ow2-1.3.pom
Download https://repo1.maven.org/maven2/org/osgi/org.osgi.compendium/4.1.0/org.osgi.compendium-4.1.0.pom
Download http://build.eclipse.org/rt/virgo/gradle/bundles/org/eclipse/virgo/bundlor/org.eclipse.virgo.bundlor.commandline/1.1.3.M01/org.eclipse.virgo.bundlor.commandline-1.1.3.M01.jar
Download http://build.eclipse.org/rt/virgo/gradle/bundles/org/eclipse/virgo/bundlor/org.eclipse.virgo.bundlor/1.1.3.M01/org.eclipse.virgo.bundlor-1.1.3.M01.jar
Download http://build.eclipse.org/rt/virgo/gradle/bundles/org/eclipse/virgo/bundlor/org.eclipse.virgo.bundlor.blint/1.1.3.M01/org.eclipse.virgo.bundlor.blint-1.1.3.M01.jar
Download https://repo1.maven.org/maven2/org/osgi/org.osgi.core/4.3.0/org.osgi.core-4.3.0.jar
Download https://repo1.maven.org/maven2/commons-cli/commons-cli/1.2/commons-cli-1.2.jar
Download https://repo1.maven.org/maven2/org/ow2/asm/asm-all/5.1/asm-all-5.1.jar
Download https://repo1.maven.org/maven2/org/osgi/org.osgi.compendium/4.1.0/org.osgi.compendium-4.1.0.jar
Picked up JAVA_TOOL_OPTIONS: -XX:+IgnoreUnrecognizedVMOptions -XX:+UseContainerSupport -XX:+UnlockExperimentalVMOptions -XX:+UseCGroupMemoryLimitForHeap
Picked up _JAVA_OPTIONS: -XX:MaxRAMPercentage=64.0
Transformed bundle written to '/home/jenkins/agent/workspace/virgo-mirrored-master/ebr/com.squareup.okhttp3-3.8.1/build/com.squareup.okhttp3-3.8.1.jar'
:com.squareup.okio-1.13.0:addProjectVersionToGradlePropertiesTask
:com.squareup.okio-1.13.0:createBuildDir
:com.squareup.okio-1.13.0:bundlorPicked up JAVA_TOOL_OPTIONS: -XX:+IgnoreUnrecognizedVMOptions -XX:+UseContainerSupport -XX:+UnlockExperimentalVMOptions -XX:+UseCGroupMemoryLimitForHeap
Picked up _JAVA_OPTIONS: -XX:MaxRAMPercentage=64.0

Transformed bundle written to '/home/jenkins/agent/workspace/virgo-mirrored-master/ebr/com.squareup.okio-1.13.0/build/com.squareup.okio-1.13.0.jar'
:org.aspectj.weaver-1.8.10:addProjectVersionToGradlePropertiesTask
:org.aspectj.weaver-1.8.10:createBuildDir
:org.aspectj.weaver-1.8.10:bundlor
Download https://repo1.maven.org/maven2/org/aspectj/aspectjweaver/1.8.10/aspectjweaver-1.8.10.pom
Download https://repo1.maven.org/maven2/org/aspectj/aspectjweaver/1.8.10/aspectjweaver-1.8.10.jar
Picked up JAVA_TOOL_OPTIONS: -XX:+IgnoreUnrecognizedVMOptions -XX:+UseContainerSupport -XX:+UnlockExperimentalVMOptions -XX:+UseCGroupMemoryLimitForHeap
Picked up _JAVA_OPTIONS: -XX:MaxRAMPercentage=64.0
Transformed bundle written to '/home/jenkins/agent/workspace/virgo-mirrored-master/ebr/org.aspectj.weaver-1.8.10/build/org.aspectj.weaver-1.8.10.jar'
:org.springframework.aop-4.3.26.RELEASE:addProjectVersionToGradlePropertiesTask
:org.springframework.aop-4.3.26.RELEASE:createBuildDir
:org.springframework.aop-4.3.26.RELEASE:removeAopallianceFromJar
:org.springframework.aop-4.3.26.RELEASE:bundlorPicked up JAVA_TOOL_OPTIONS: -XX:+IgnoreUnrecognizedVMOptions -XX:+UseContainerSupport -XX:+UnlockExperimentalVMOptions -XX:+UseCGroupMemoryLimitForHeap
Picked up _JAVA_OPTIONS: -XX:MaxRAMPercentage=64.0

Transformed bundle written to '/home/jenkins/agent/workspace/virgo-mirrored-master/ebr/org.springframework.aop-4.3.26.RELEASE/build/org.springframework.aop-4.3.26.RELEASE.jar'
:org.springframework.aspects-4.3.26.RELEASE:addProjectVersionToGradlePropertiesTask
:org.springframework.aspects-4.3.26.RELEASE:createBuildDir
:org.springframework.aspects-4.3.26.RELEASE:bundlor
Download https://repo1.maven.org/maven2/org/springframework/spring-aspects/4.3.26.RELEASE/spring-aspects-4.3.26.RELEASE.pom
Download https://repo1.maven.org/maven2/org/aspectj/aspectjweaver/1.8.9/aspectjweaver-1.8.9.pom
Download https://repo1.maven.org/maven2/org/springframework/spring-aspects/4.3.26.RELEASE/spring-aspects-4.3.26.RELEASE.jar
Download https://repo1.maven.org/maven2/org/aspectj/aspectjweaver/1.8.9/aspectjweaver-1.8.9.jar
Picked up JAVA_TOOL_OPTIONS: -XX:+IgnoreUnrecognizedVMOptions -XX:+UseContainerSupport -XX:+UnlockExperimentalVMOptions -XX:+UseCGroupMemoryLimitForHeap
Picked up _JAVA_OPTIONS: -XX:MaxRAMPercentage=64.0
Transformed bundle written to '/home/jenkins/agent/workspace/virgo-mirrored-master/ebr/org.springframework.aspects-4.3.26.RELEASE/build/org.springframework.aspects-4.3.26.RELEASE.jar'
:org.springframework.beans-4.3.26.RELEASE:addProjectVersionToGradlePropertiesTask
:org.springframework.beans-4.3.26.RELEASE:createBuildDir
:org.springframework.beans-4.3.26.RELEASE:bundlorPicked up JAVA_TOOL_OPTIONS: -XX:+IgnoreUnrecognizedVMOptions -XX:+UseContainerSupport -XX:+UnlockExperimentalVMOptions -XX:+UseCGroupMemoryLimitForHeap
Picked up _JAVA_OPTIONS: -XX:MaxRAMPercentage=64.0

Transformed bundle written to '/home/jenkins/agent/workspace/virgo-mirrored-master/ebr/org.springframework.beans-4.3.26.RELEASE/build/org.springframework.beans-4.3.26.RELEASE.jar'
:org.springframework.context-4.3.26.RELEASE:addProjectVersionToGradlePropertiesTask
:org.springframework.context-4.3.26.RELEASE:createBuildDir
:org.springframework.context-4.3.26.RELEASE:bundlor
Download https://repo1.maven.org/maven2/org/springframework/spring-context/4.3.26.RELEASE/spring-context-4.3.26.RELEASE.pom
Download https://repo1.maven.org/maven2/org/springframework/spring-expression/4.3.26.RELEASE/spring-expression-4.3.26.RELEASE.pom
Download https://repo1.maven.org/maven2/org/springframework/spring-context/4.3.26.RELEASE/spring-context-4.3.26.RELEASE.jar
Download https://repo1.maven.org/maven2/org/springframework/spring-expression/4.3.26.RELEASE/spring-expression-4.3.26.RELEASE.jar
Picked up JAVA_TOOL_OPTIONS: -XX:+IgnoreUnrecognizedVMOptions -XX:+UseContainerSupport -XX:+UnlockExperimentalVMOptions -XX:+UseCGroupMemoryLimitForHeap
Picked up _JAVA_OPTIONS: -XX:MaxRAMPercentage=64.0
java.io.FileNotFoundException: /home/jenkins/agent/workspace/virgo-mirrored-master/ebr/org.springframework.context-4.3.26.RELEASE/rmi.dtd (No such file or directory)
	at java.io.FileInputStream.open0(Native Method)
	at java.io.FileInputStream.open(FileInputStream.java:195)
	at java.io.FileInputStream.<init>(FileInputStream.java:138)
	at java.io.FileInputStream.<init>(FileInputStream.java:93)
	at sun.net.www.protocol.file.FileURLConnection.connect(FileURLConnection.java:90)
	at sun.net.www.protocol.file.FileURLConnection.getInputStream(FileURLConnection.java:188)
	at com.sun.org.apache.xerces.internal.impl.XMLEntityManager.setupCurrentEntity(XMLEntityManager.java:623)
	at com.sun.org.apache.xerces.internal.impl.XMLEntityManager.startEntity(XMLEntityManager.java:1304)
	at com.sun.org.apache.xerces.internal.impl.XMLEntityManager.startDTDEntity(XMLEntityManager.java:1270)
	at com.sun.org.apache.xerces.internal.impl.XMLDTDScannerImpl.setInputSource(XMLDTDScannerImpl.java:264)
	at com.sun.org.apache.xerces.internal.impl.XMLDocumentScannerImpl$DTDDriver.dispatch(XMLDocumentScannerImpl.java:1161)
	at com.sun.org.apache.xerces.internal.impl.XMLDocumentScannerImpl$DTDDriver.next(XMLDocumentScannerImpl.java:1045)
	at com.sun.org.apache.xerces.internal.impl.XMLDocumentScannerImpl$PrologDriver.next(XMLDocumentScannerImpl.java:959)
	at com.sun.org.apache.xerces.internal.impl.XMLDocumentScannerImpl.next(XMLDocumentScannerImpl.java:602)
	at com.sun.org.apache.xerces.internal.impl.XMLNSDocumentScannerImpl.next(XMLNSDocumentScannerImpl.java:112)
	at com.sun.org.apache.xerces.internal.impl.XMLDocumentFragmentScannerImpl.scanDocument(XMLDocumentFragmentScannerImpl.java:505)
	at com.sun.org.apache.xerces.internal.parsers.XML11Configuration.parse(XML11Configuration.java:842)
	at com.sun.org.apache.xerces.internal.parsers.XML11Configuration.parse(XML11Configuration.java:771)
	at com.sun.org.apache.xerces.internal.parsers.XMLParser.parse(XMLParser.java:141)
	at com.sun.org.apache.xerces.internal.parsers.DOMParser.parse(DOMParser.java:243)
	at com.sun.org.apache.xerces.internal.jaxp.DocumentBuilderImpl.parse(DocumentBuilderImpl.java:339)
	at org.eclipse.virgo.bundlor.support.contributors.xml.StandardXmlArtifactAnalyzer.getDocument(StandardXmlArtifactAnalyzer.java:118)
	at org.eclipse.virgo.bundlor.support.contributors.xml.StandardXmlArtifactAnalyzer.<init>(StandardXmlArtifactAnalyzer.java:62)
	at org.eclipse.virgo.bundlor.support.contributors.xml.StandardXmlArtifactAnalyzer.<init>(StandardXmlArtifactAnalyzer.java:56)
	at org.eclipse.virgo.bundlor.support.contributors.xml.SpringApplicationContextArtifactAnalyzer.analyse(SpringApplicationContextArtifactAnalyzer.java:84)
	at org.eclipse.virgo.bundlor.support.StandardManifestGenerator.analyzeEntry(StandardManifestGenerator.java:114)
	at org.eclipse.virgo.bundlor.support.StandardManifestGenerator.analyzeEntries(StandardManifestGenerator.java:99)
	at org.eclipse.virgo.bundlor.support.StandardManifestGenerator.generate(StandardManifestGenerator.java:64)
	at org.eclipse.virgo.bundlor.commandline.internal.CommandLineBundlorExecutor.execute(CommandLineBundlorExecutor.java:61)
	at org.eclipse.virgo.bundlor.commandline.Bundlor.run(Bundlor.java:51)
	at org.eclipse.virgo.bundlor.commandline.Bundlor.main(Bundlor.java:37)
Transformed bundle written to '/home/jenkins/agent/workspace/virgo-mirrored-master/ebr/org.springframework.context-4.3.26.RELEASE/build/org.springframework.context-4.3.26.RELEASE.jar'
:org.springframework.context.support-4.3.26.RELEASE:addProjectVersionToGradlePropertiesTask
:org.springframework.context.support-4.3.26.RELEASE:createBuildDir
:org.springframework.context.support-4.3.26.RELEASE:bundlor
Download https://repo1.maven.org/maven2/org/springframework/spring-context-support/4.3.26.RELEASE/spring-context-support-4.3.26.RELEASE.pom
Download https://repo1.maven.org/maven2/org/springframework/spring-context-support/4.3.26.RELEASE/spring-context-support-4.3.26.RELEASE.jar
Picked up JAVA_TOOL_OPTIONS: -XX:+IgnoreUnrecognizedVMOptions -XX:+UseContainerSupport -XX:+UnlockExperimentalVMOptions -XX:+UseCGroupMemoryLimitForHeap
Picked up _JAVA_OPTIONS: -XX:MaxRAMPercentage=64.0
Transformed bundle written to '/home/jenkins/agent/workspace/virgo-mirrored-master/ebr/org.springframework.context.support-4.3.26.RELEASE/build/org.springframework.context.support-4.3.26.RELEASE.jar'
:org.springframework.core-4.3.26.RELEASE:addProjectVersionToGradlePropertiesTask
:org.springframework.core-4.3.26.RELEASE:createBuildDir
:org.springframework.core-4.3.26.RELEASE:bundlorPicked up JAVA_TOOL_OPTIONS: -XX:+IgnoreUnrecognizedVMOptions -XX:+UseContainerSupport -XX:+UnlockExperimentalVMOptions -XX:+UseCGroupMemoryLimitForHeap
Picked up _JAVA_OPTIONS: -XX:MaxRAMPercentage=64.0

Transformed bundle written to '/home/jenkins/agent/workspace/virgo-mirrored-master/ebr/org.springframework.core-4.3.26.RELEASE/build/org.springframework.core-4.3.26.RELEASE.jar'
:org.springframework.expression-4.3.26.RELEASE:addProjectVersionToGradlePropertiesTask
:org.springframework.expression-4.3.26.RELEASE:createBuildDir
:org.springframework.expression-4.3.26.RELEASE:bundlorPicked up JAVA_TOOL_OPTIONS: -XX:+IgnoreUnrecognizedVMOptions -XX:+UseContainerSupport -XX:+UnlockExperimentalVMOptions -XX:+UseCGroupMemoryLimitForHeap
Picked up _JAVA_OPTIONS: -XX:MaxRAMPercentage=64.0

Transformed bundle written to '/home/jenkins/agent/workspace/virgo-mirrored-master/ebr/org.springframework.expression-4.3.26.RELEASE/build/org.springframework.expression-4.3.26.RELEASE.jar'
:org.springframework.jdbc-4.3.26.RELEASE:addProjectVersionToGradlePropertiesTask
:org.springframework.jdbc-4.3.26.RELEASE:createBuildDir
:org.springframework.jdbc-4.3.26.RELEASE:bundlor
Download https://repo1.maven.org/maven2/org/springframework/spring-jdbc/4.3.26.RELEASE/spring-jdbc-4.3.26.RELEASE.pom
Download https://repo1.maven.org/maven2/org/springframework/spring-tx/4.3.26.RELEASE/spring-tx-4.3.26.RELEASE.pom
Download https://repo1.maven.org/maven2/org/springframework/spring-jdbc/4.3.26.RELEASE/spring-jdbc-4.3.26.RELEASE.jar
Download https://repo1.maven.org/maven2/org/springframework/spring-tx/4.3.26.RELEASE/spring-tx-4.3.26.RELEASE.jar
Picked up JAVA_TOOL_OPTIONS: -XX:+IgnoreUnrecognizedVMOptions -XX:+UseContainerSupport -XX:+UnlockExperimentalVMOptions -XX:+UseCGroupMemoryLimitForHeap
Picked up _JAVA_OPTIONS: -XX:MaxRAMPercentage=64.0
Transformed bundle written to '/home/jenkins/agent/workspace/virgo-mirrored-master/ebr/org.springframework.jdbc-4.3.26.RELEASE/build/org.springframework.jdbc-4.3.26.RELEASE.jar'
:org.springframework.jms-4.3.26.RELEASE:addProjectVersionToGradlePropertiesTask
:org.springframework.jms-4.3.26.RELEASE:createBuildDir
:org.springframework.jms-4.3.26.RELEASE:bundlor
Download https://repo1.maven.org/maven2/org/springframework/spring-jms/4.3.26.RELEASE/spring-jms-4.3.26.RELEASE.pom
Download https://repo1.maven.org/maven2/org/springframework/spring-messaging/4.3.26.RELEASE/spring-messaging-4.3.26.RELEASE.pom
Download https://repo1.maven.org/maven2/org/springframework/spring-jms/4.3.26.RELEASE/spring-jms-4.3.26.RELEASE.jar
Download https://repo1.maven.org/maven2/org/springframework/spring-messaging/4.3.26.RELEASE/spring-messaging-4.3.26.RELEASE.jar
Picked up JAVA_TOOL_OPTIONS: -XX:+IgnoreUnrecognizedVMOptions -XX:+UseContainerSupport -XX:+UnlockExperimentalVMOptions -XX:+UseCGroupMemoryLimitForHeap
Picked up _JAVA_OPTIONS: -XX:MaxRAMPercentage=64.0
Transformed bundle written to '/home/jenkins/agent/workspace/virgo-mirrored-master/ebr/org.springframework.jms-4.3.26.RELEASE/build/org.springframework.jms-4.3.26.RELEASE.jar'
:org.springframework.messaging-4.3.26.RELEASE:addProjectVersionToGradlePropertiesTask
:org.springframework.messaging-4.3.26.RELEASE:createBuildDir
:org.springframework.messaging-4.3.26.RELEASE:bundlorPicked up JAVA_TOOL_OPTIONS: -XX:+IgnoreUnrecognizedVMOptions -XX:+UseContainerSupport -XX:+UnlockExperimentalVMOptions -XX:+UseCGroupMemoryLimitForHeap
Picked up _JAVA_OPTIONS: -XX:MaxRAMPercentage=64.0

Transformed bundle written to '/home/jenkins/agent/workspace/virgo-mirrored-master/ebr/org.springframework.messaging-4.3.26.RELEASE/build/org.springframework.messaging-4.3.26.RELEASE.jar'
:org.springframework.orm-4.3.26.RELEASE:addProjectVersionToGradlePropertiesTask
:org.springframework.orm-4.3.26.RELEASE:createBuildDir
:org.springframework.orm-4.3.26.RELEASE:bundlor
Download https://repo1.maven.org/maven2/org/springframework/spring-orm/4.3.26.RELEASE/spring-orm-4.3.26.RELEASE.pom
Download https://repo1.maven.org/maven2/org/springframework/spring-orm/4.3.26.RELEASE/spring-orm-4.3.26.RELEASE.jar
Picked up JAVA_TOOL_OPTIONS: -XX:+IgnoreUnrecognizedVMOptions -XX:+UseContainerSupport -XX:+UnlockExperimentalVMOptions -XX:+UseCGroupMemoryLimitForHeap
Picked up _JAVA_OPTIONS: -XX:MaxRAMPercentage=64.0
Transformed bundle written to '/home/jenkins/agent/workspace/virgo-mirrored-master/ebr/org.springframework.orm-4.3.26.RELEASE/build/org.springframework.orm-4.3.26.RELEASE.jar'
:org.springframework.oxm-4.3.26.RELEASE:addProjectVersionToGradlePropertiesTask
:org.springframework.oxm-4.3.26.RELEASE:createBuildDir
:org.springframework.oxm-4.3.26.RELEASE:bundlor
Download https://repo1.maven.org/maven2/org/springframework/spring-oxm/4.3.26.RELEASE/spring-oxm-4.3.26.RELEASE.pom
Download https://repo1.maven.org/maven2/org/springframework/spring-oxm/4.3.26.RELEASE/spring-oxm-4.3.26.RELEASE.jar
Picked up JAVA_TOOL_OPTIONS: -XX:+IgnoreUnrecognizedVMOptions -XX:+UseContainerSupport -XX:+UnlockExperimentalVMOptions -XX:+UseCGroupMemoryLimitForHeap
Picked up _JAVA_OPTIONS: -XX:MaxRAMPercentage=64.0
Transformed bundle written to '/home/jenkins/agent/workspace/virgo-mirrored-master/ebr/org.springframework.oxm-4.3.26.RELEASE/build/org.springframework.oxm-4.3.26.RELEASE.jar'
:org.springframework.test-4.3.26.RELEASE:addProjectVersionToGradlePropertiesTask
:org.springframework.test-4.3.26.RELEASE:createBuildDir
:org.springframework.test-4.3.26.RELEASE:bundlor
Download https://repo1.maven.org/maven2/org/springframework/spring-test/4.3.26.RELEASE/spring-test-4.3.26.RELEASE.pom
Download https://repo1.maven.org/maven2/org/springframework/spring-test/4.3.26.RELEASE/spring-test-4.3.26.RELEASE.jar
Picked up JAVA_TOOL_OPTIONS: -XX:+IgnoreUnrecognizedVMOptions -XX:+UseContainerSupport -XX:+UnlockExperimentalVMOptions -XX:+UseCGroupMemoryLimitForHeap
Picked up _JAVA_OPTIONS: -XX:MaxRAMPercentage=64.0
Transformed bundle written to '/home/jenkins/agent/workspace/virgo-mirrored-master/ebr/org.springframework.test-4.3.26.RELEASE/build/org.springframework.test-4.3.26.RELEASE.jar'
:org.springframework.transaction-4.3.26.RELEASE:addProjectVersionToGradlePropertiesTask
:org.springframework.transaction-4.3.26.RELEASE:createBuildDir
:org.springframework.transaction-4.3.26.RELEASE:bundlorPicked up JAVA_TOOL_OPTIONS: -XX:+IgnoreUnrecognizedVMOptions -XX:+UseContainerSupport -XX:+UnlockExperimentalVMOptions -XX:+UseCGroupMemoryLimitForHeap
Picked up _JAVA_OPTIONS: -XX:MaxRAMPercentage=64.0

Transformed bundle written to '/home/jenkins/agent/workspace/virgo-mirrored-master/ebr/org.springframework.transaction-4.3.26.RELEASE/build/org.springframework.transaction-4.3.26.RELEASE.jar'
:org.springframework.web-4.3.26.RELEASE:addProjectVersionToGradlePropertiesTask
:org.springframework.web-4.3.26.RELEASE:createBuildDir
:org.springframework.web-4.3.26.RELEASE:bundlor
Download https://repo1.maven.org/maven2/org/springframework/spring-web/4.3.26.RELEASE/spring-web-4.3.26.RELEASE.pom
Download https://repo1.maven.org/maven2/org/springframework/spring-web/4.3.26.RELEASE/spring-web-4.3.26.RELEASE.jar
Picked up JAVA_TOOL_OPTIONS: -XX:+IgnoreUnrecognizedVMOptions -XX:+UseContainerSupport -XX:+UnlockExperimentalVMOptions -XX:+UseCGroupMemoryLimitForHeap
Picked up _JAVA_OPTIONS: -XX:MaxRAMPercentage=64.0
Transformed bundle written to '/home/jenkins/agent/workspace/virgo-mirrored-master/ebr/org.springframework.web-4.3.26.RELEASE/build/org.springframework.web-4.3.26.RELEASE.jar'
:org.springframework.webmvc-4.3.26.RELEASE:addProjectVersionToGradlePropertiesTask
:org.springframework.webmvc-4.3.26.RELEASE:createBuildDir
:org.springframework.webmvc-4.3.26.RELEASE:bundlor
Download https://repo1.maven.org/maven2/org/springframework/spring-webmvc/4.3.26.RELEASE/spring-webmvc-4.3.26.RELEASE.pom
Download https://repo1.maven.org/maven2/org/springframework/spring-webmvc/4.3.26.RELEASE/spring-webmvc-4.3.26.RELEASE.jar
Picked up JAVA_TOOL_OPTIONS: -XX:+IgnoreUnrecognizedVMOptions -XX:+UseContainerSupport -XX:+UnlockExperimentalVMOptions -XX:+UseCGroupMemoryLimitForHeap
Picked up _JAVA_OPTIONS: -XX:MaxRAMPercentage=64.0
Transformed bundle written to '/home/jenkins/agent/workspace/virgo-mirrored-master/ebr/org.springframework.webmvc-4.3.26.RELEASE/build/org.springframework.webmvc-4.3.26.RELEASE.jar'
:org.springframework.webmvc.portlet-4.3.26.RELEASE:addProjectVersionToGradlePropertiesTask
:org.springframework.webmvc.portlet-4.3.26.RELEASE:createBuildDir
:org.springframework.webmvc.portlet-4.3.26.RELEASE:bundlor
Download https://repo1.maven.org/maven2/org/springframework/spring-webmvc-portlet/4.3.26.RELEASE/spring-webmvc-portlet-4.3.26.RELEASE.pom
Download https://repo1.maven.org/maven2/org/springframework/spring-webmvc-portlet/4.3.26.RELEASE/spring-webmvc-portlet-4.3.26.RELEASE.jar
Picked up JAVA_TOOL_OPTIONS: -XX:+IgnoreUnrecognizedVMOptions -XX:+UseContainerSupport -XX:+UnlockExperimentalVMOptions -XX:+UseCGroupMemoryLimitForHeap
Picked up _JAVA_OPTIONS: -XX:MaxRAMPercentage=64.0
Transformed bundle written to '/home/jenkins/agent/workspace/virgo-mirrored-master/ebr/org.springframework.webmvc.portlet-4.3.26.RELEASE/build/org.springframework.webmvc.portlet-4.3.26.RELEASE.jar'
:org.springframework.websocket-4.3.26.RELEASE:addProjectVersionToGradlePropertiesTask
:org.springframework.websocket-4.3.26.RELEASE:createBuildDir
:org.springframework.websocket-4.3.26.RELEASE:bundlor
Download https://repo1.maven.org/maven2/org/springframework/spring-websocket/4.3.26.RELEASE/spring-websocket-4.3.26.RELEASE.pom
Download https://repo1.maven.org/maven2/org/springframework/spring-websocket/4.3.26.RELEASE/spring-websocket-4.3.26.RELEASE.jar
Picked up JAVA_TOOL_OPTIONS: -XX:+IgnoreUnrecognizedVMOptions -XX:+UseContainerSupport -XX:+UnlockExperimentalVMOptions -XX:+UseCGroupMemoryLimitForHeap
Picked up _JAVA_OPTIONS: -XX:MaxRAMPercentage=64.0
Transformed bundle written to '/home/jenkins/agent/workspace/virgo-mirrored-master/ebr/org.springframework.websocket-4.3.26.RELEASE/build/org.springframework.websocket-4.3.26.RELEASE.jar'
:com.squareup.okhttp3-3.8.1:generateDescriptorFileForIvyPublication
:com.squareup.okhttp3-3.8.1:publishIvyPublicationToIvyRepository FAILED

FAILURE: Build failed with an exception.

* What went wrong:
Execution failed for task ':com.squareup.okhttp3-3.8.1:publishIvyPublicationToIvyRepository'.
> Failed to publish publication 'ivy' to repository 'ivy'
   > Failed to create parent directory '/opt/public' when creating directory '/opt/public/rt/virgo/ivy/bundles/release/org.eclipse.virgo.mirrored/com.squareup.okhttp3/3.8.1'

* Try:
Run with --stacktrace option to get the stack trace. Run with --info or --debug option to get more log output.

BUILD FAILED

Total time: 55.001 secs
Build step 'Invoke Gradle script' changed build result to FAILURE
Build step 'Invoke Gradle script' marked build as failure
Sending e-mails to: fwaibel@datenkollektiv.de
Finished: FAILURE