FailedConsole Output

Started by user fwaibel@eclipsesource.com
Building in workspace /home/hudson/genie.virgo/.jenkins/jobs/virgo-mirrored-master/workspace
 > /usr/local/bin/git rev-parse --is-inside-work-tree # timeout=10
Fetching changes from the remote Git repository
 > /usr/local/bin/git config remote.origin.url git://git.eclipse.org/gitroot/virgo/org.eclipse.virgo.root.git # timeout=10
Fetching upstream changes from git://git.eclipse.org/gitroot/virgo/org.eclipse.virgo.root.git
 > /usr/local/bin/git --version # timeout=10
 > /usr/local/bin/git fetch --tags --progress git://git.eclipse.org/gitroot/virgo/org.eclipse.virgo.root.git +refs/heads/*:refs/remotes/origin/*
 > /usr/local/bin/git rev-parse feature/spring_5^{commit} # timeout=10
 > /usr/local/bin/git rev-parse refs/remotes/origin/feature/spring_5^{commit} # timeout=10
Checking out Revision aca54b43aa18799de1367f6669aa6e425abb55fb (refs/remotes/origin/feature/spring_5)
 > /usr/local/bin/git config core.sparsecheckout # timeout=10
 > /usr/local/bin/git checkout -f aca54b43aa18799de1367f6669aa6e425abb55fb
Commit message: "532222 - Prepare 3rd party dependencies for Gemini Blueprint upgrade"
First time build. Skipping changelog.
[Gradle] - Launching build.
[ebr] $ /home/hudson/genie.virgo/.jenkins/jobs/virgo-mirrored-master/workspace/gradlew clean bundlor publishIvyPublicationToIvyRepository
Picked up JAVA_TOOL_OPTIONS: -Xmx2G -Djava.io.tmpdir=/tmp/genie.virgo
Starting a Gradle Daemon (subsequent builds will be faster)
:clean UP-TO-DATE
:com.squareup.okhttp3-3.9.1:clean UP-TO-DATE
:com.squareup.okio-1.14.0:clean UP-TO-DATE
:org.aspectj.weaver-1.8.13:clean UP-TO-DATE
:org.springframework.aop-5.0.4.RELEASE:clean UP-TO-DATE
:org.springframework.aspects-5.0.4.RELEASE:clean UP-TO-DATE
:org.springframework.beans-5.0.4.RELEASE:clean UP-TO-DATE
:org.springframework.context-5.0.4.RELEASE:clean UP-TO-DATE
:org.springframework.context.support-5.0.4.RELEASE:clean UP-TO-DATE
:org.springframework.core-5.0.4.RELEASE:clean UP-TO-DATE
:org.springframework.expression-5.0.4.RELEASE:clean UP-TO-DATE
:org.springframework.jcl-5.0.4.RELEASE:clean UP-TO-DATE
:org.springframework.jdbc-5.0.4.RELEASE:clean UP-TO-DATE
:org.springframework.jms-5.0.4.RELEASE:clean UP-TO-DATE
:org.springframework.messaging-5.0.4.RELEASE:clean UP-TO-DATE
:org.springframework.orm-5.0.4.RELEASE:clean UP-TO-DATE
:org.springframework.oxm-5.0.4.RELEASE:clean UP-TO-DATE
:org.springframework.test-5.0.4.RELEASE:clean UP-TO-DATE
:org.springframework.transaction-5.0.4.RELEASE:clean UP-TO-DATE
:org.springframework.web-5.0.4.RELEASE:clean UP-TO-DATE
:org.springframework.webflux-5.0.4.RELEASE:clean UP-TO-DATE
:org.springframework.webmvc-5.0.4.RELEASE:clean UP-TO-DATE
:org.springframework.websocket-5.0.4.RELEASE:clean UP-TO-DATE
:com.squareup.okhttp3-3.9.1:addProjectVersionToGradlePropertiesTask
:com.squareup.okhttp3-3.9.1:createBuildDir
:com.squareup.okhttp3-3.9.1:bundlor
Download https://repo1.maven.org/maven2/com/squareup/okhttp3/okhttp/3.9.1/okhttp-3.9.1.pom
Download https://repo1.maven.org/maven2/com/squareup/okhttp3/parent/3.9.1/parent-3.9.1.pom
Download https://repo1.maven.org/maven2/com/squareup/okhttp3/okhttp/3.9.1/okhttp-3.9.1.jar
Picked up JAVA_TOOL_OPTIONS: -Xmx2G -Djava.io.tmpdir=/tmp/genie.virgo
Transformed bundle written to '/jobs/genie.virgo/virgo-mirrored-master/workspace/ebr/com.squareup.okhttp3-3.9.1/build/com.squareup.okhttp3-3.9.1.jar'
:com.squareup.okio-1.14.0:addProjectVersionToGradlePropertiesTask
:com.squareup.okio-1.14.0:createBuildDir
:com.squareup.okio-1.14.0:bundlor
Download https://repo1.maven.org/maven2/com/squareup/okio/okio/1.14.0/okio-1.14.0.pom
Download https://repo1.maven.org/maven2/com/squareup/okio/okio-parent/1.14.0/okio-parent-1.14.0.pom
Download https://repo1.maven.org/maven2/com/squareup/okio/okio/1.14.0/okio-1.14.0.jar
Picked up JAVA_TOOL_OPTIONS: -Xmx2G -Djava.io.tmpdir=/tmp/genie.virgo
Transformed bundle written to '/jobs/genie.virgo/virgo-mirrored-master/workspace/ebr/com.squareup.okio-1.14.0/build/com.squareup.okio-1.14.0.jar'
:org.aspectj.weaver-1.8.13:addProjectVersionToGradlePropertiesTask
:org.aspectj.weaver-1.8.13:createBuildDir
:org.aspectj.weaver-1.8.13:bundlor
Download https://repo1.maven.org/maven2/org/aspectj/aspectjweaver/1.8.13/aspectjweaver-1.8.13.pom
Download https://repo1.maven.org/maven2/org/aspectj/aspectjweaver/1.8.13/aspectjweaver-1.8.13.jar
Picked up JAVA_TOOL_OPTIONS: -Xmx2G -Djava.io.tmpdir=/tmp/genie.virgo
Transformed bundle written to '/jobs/genie.virgo/virgo-mirrored-master/workspace/ebr/org.aspectj.weaver-1.8.13/build/org.aspectj.weaver-1.8.13.jar'
:org.springframework.aop-5.0.4.RELEASE:addProjectVersionToGradlePropertiesTask
:org.springframework.aop-5.0.4.RELEASE:createBuildDir
:org.springframework.aop-5.0.4.RELEASE:bundlor
Download https://repo1.maven.org/maven2/org/springframework/spring-aop/5.0.4.RELEASE/spring-aop-5.0.4.RELEASE.pom
Download https://repo1.maven.org/maven2/org/springframework/spring-beans/5.0.4.RELEASE/spring-beans-5.0.4.RELEASE.pom
Download https://repo1.maven.org/maven2/org/springframework/spring-core/5.0.4.RELEASE/spring-core-5.0.4.RELEASE.pom
Download https://repo1.maven.org/maven2/io/projectreactor/reactor-bom/Bismuth-SR6/reactor-bom-Bismuth-SR6.pom
Download https://repo1.maven.org/maven2/io/netty/netty-bom/4.1.21.Final/netty-bom-4.1.21.Final.pom
Download https://repo1.maven.org/maven2/org/springframework/spring-jcl/5.0.4.RELEASE/spring-jcl-5.0.4.RELEASE.pom
Download https://repo1.maven.org/maven2/org/springframework/spring-aop/5.0.4.RELEASE/spring-aop-5.0.4.RELEASE.jar
Download https://repo1.maven.org/maven2/org/springframework/spring-beans/5.0.4.RELEASE/spring-beans-5.0.4.RELEASE.jar
Download https://repo1.maven.org/maven2/org/springframework/spring-core/5.0.4.RELEASE/spring-core-5.0.4.RELEASE.jar
Download https://repo1.maven.org/maven2/org/springframework/spring-jcl/5.0.4.RELEASE/spring-jcl-5.0.4.RELEASE.jar
Picked up JAVA_TOOL_OPTIONS: -Xmx2G -Djava.io.tmpdir=/tmp/genie.virgo
java.lang.ArrayIndexOutOfBoundsException: 52264
	at org.objectweb.asm.ClassReader.readClass(Unknown Source)
	at org.objectweb.asm.ClassReader.accept(Unknown Source)
	at org.objectweb.asm.ClassReader.accept(Unknown Source)
	at org.eclipse.virgo.bundlor.support.asm.AsmTypeArtifactAnalyzer.analyse(AsmTypeArtifactAnalyzer.java:38)
	at org.eclipse.virgo.bundlor.support.StandardManifestGenerator.analyzeEntry(StandardManifestGenerator.java:114)
	at org.eclipse.virgo.bundlor.support.StandardManifestGenerator.analyzeEntries(StandardManifestGenerator.java:99)
	at org.eclipse.virgo.bundlor.support.StandardManifestGenerator.generate(StandardManifestGenerator.java:64)
	at org.eclipse.virgo.bundlor.commandline.internal.CommandLineBundlorExecutor.execute(CommandLineBundlorExecutor.java:61)
	at org.eclipse.virgo.bundlor.commandline.Bundlor.run(Bundlor.java:51)
	at org.eclipse.virgo.bundlor.commandline.Bundlor.main(Bundlor.java:37)
java.lang.ArrayIndexOutOfBoundsException: 37992
	at org.objectweb.asm.ClassReader.<init>(Unknown Source)
	at org.objectweb.asm.ClassReader.<init>(Unknown Source)
	at org.objectweb.asm.ClassReader.<init>(Unknown Source)
	at org.eclipse.virgo.bundlor.support.asm.AsmTypeArtifactAnalyzer.analyse(AsmTypeArtifactAnalyzer.java:37)
	at org.eclipse.virgo.bundlor.support.StandardManifestGenerator.analyzeEntry(StandardManifestGenerator.java:114)
	at org.eclipse.virgo.bundlor.support.StandardManifestGenerator.analyzeEntries(StandardManifestGenerator.java:99)
	at org.eclipse.virgo.bundlor.support.StandardManifestGenerator.generate(StandardManifestGenerator.java:64)
	at org.eclipse.virgo.bundlor.commandline.internal.CommandLineBundlorExecutor.execute(CommandLineBundlorExecutor.java:61)
	at org.eclipse.virgo.bundlor.commandline.Bundlor.run(Bundlor.java:51)
	at org.eclipse.virgo.bundlor.commandline.Bundlor.main(Bundlor.java:37)
java.lang.ArrayIndexOutOfBoundsException: 52264
	at org.objectweb.asm.ClassReader.readClass(Unknown Source)
	at org.objectweb.asm.ClassReader.accept(Unknown Source)
	at org.objectweb.asm.ClassReader.accept(Unknown Source)
	at org.eclipse.virgo.bundlor.support.asm.AsmTypeArtifactAnalyzer.analyse(AsmTypeArtifactAnalyzer.java:38)
	at org.eclipse.virgo.bundlor.support.StandardManifestGenerator.analyzeEntry(StandardManifestGenerator.java:114)
	at org.eclipse.virgo.bundlor.support.StandardManifestGenerator.analyzeEntries(StandardManifestGenerator.java:99)
	at org.eclipse.virgo.bundlor.support.StandardManifestGenerator.generate(StandardManifestGenerator.java:64)
	at org.eclipse.virgo.bundlor.commandline.internal.CommandLineBundlorExecutor.execute(CommandLineBundlorExecutor.java:61)
	at org.eclipse.virgo.bundlor.commandline.Bundlor.run(Bundlor.java:51)
	at org.eclipse.virgo.bundlor.commandline.Bundlor.main(Bundlor.java:37)
java.lang.ArrayIndexOutOfBoundsException: 1901
	at org.objectweb.asm.ClassReader.readClass(Unknown Source)
	at org.objectweb.asm.ClassReader.accept(Unknown Source)
	at org.objectweb.asm.ClassReader.accept(Unknown Source)
	at org.eclipse.virgo.bundlor.support.asm.AsmTypeArtifactAnalyzer.analyse(AsmTypeArtifactAnalyzer.java:38)
	at org.eclipse.virgo.bundlor.support.StandardManifestGenerator.analyzeEntry(StandardManifestGenerator.java:114)
	at org.eclipse.virgo.bundlor.support.StandardManifestGenerator.analyzeEntries(StandardManifestGenerator.java:99)
	at org.eclipse.virgo.bundlor.support.StandardManifestGenerator.generate(StandardManifestGenerator.java:64)
	at org.eclipse.virgo.bundlor.commandline.internal.CommandLineBundlorExecutor.execute(CommandLineBundlorExecutor.java:61)
	at org.eclipse.virgo.bundlor.commandline.Bundlor.run(Bundlor.java:51)
	at org.eclipse.virgo.bundlor.commandline.Bundlor.main(Bundlor.java:37)
java.lang.ArrayIndexOutOfBoundsException: 52264
	at org.objectweb.asm.ClassReader.readClass(Unknown Source)
	at org.objectweb.asm.ClassReader.accept(Unknown Source)
	at org.objectweb.asm.ClassReader.accept(Unknown Source)
	at org.eclipse.virgo.bundlor.support.asm.AsmTypeArtifactAnalyzer.analyse(AsmTypeArtifactAnalyzer.java:38)
	at org.eclipse.virgo.bundlor.support.StandardManifestGenerator.analyzeEntry(StandardManifestGenerator.java:114)
	at org.eclipse.virgo.bundlor.support.StandardManifestGenerator.analyzeEntries(StandardManifestGenerator.java:99)
	at org.eclipse.virgo.bundlor.support.StandardManifestGenerator.generate(StandardManifestGenerator.java:64)
	at org.eclipse.virgo.bundlor.commandline.internal.CommandLineBundlorExecutor.execute(CommandLineBundlorExecutor.java:61)
	at org.eclipse.virgo.bundlor.commandline.Bundlor.run(Bundlor.java:51)
	at org.eclipse.virgo.bundlor.commandline.Bundlor.main(Bundlor.java:37)
java.lang.ArrayIndexOutOfBoundsException: 11585
	at org.objectweb.asm.ClassReader.<init>(Unknown Source)
	at org.objectweb.asm.ClassReader.<init>(Unknown Source)
	at org.objectweb.asm.ClassReader.<init>(Unknown Source)
	at org.eclipse.virgo.bundlor.support.asm.AsmTypeArtifactAnalyzer.analyse(AsmTypeArtifactAnalyzer.java:37)
	at org.eclipse.virgo.bundlor.support.StandardManifestGenerator.analyzeEntry(StandardManifestGenerator.java:114)
	at org.eclipse.virgo.bundlor.support.StandardManifestGenerator.analyzeEntries(StandardManifestGenerator.java:99)
	at org.eclipse.virgo.bundlor.support.StandardManifestGenerator.generate(StandardManifestGenerator.java:64)
	at org.eclipse.virgo.bundlor.commandline.internal.CommandLineBundlorExecutor.execute(CommandLineBundlorExecutor.java:61)
	at org.eclipse.virgo.bundlor.commandline.Bundlor.run(Bundlor.java:51)
	at org.eclipse.virgo.bundlor.commandline.Bundlor.main(Bundlor.java:37)
Transformed bundle written to '/jobs/genie.virgo/virgo-mirrored-master/workspace/ebr/org.springframework.aop-5.0.4.RELEASE/build/org.springframework.aop-5.0.4.RELEASE.jar'
Bundlor Warnings:
    The import of package org.springframework.aop.aspectj does not specify a version
    The import of package org.springframework.aop.aspectj.annotation does not specify a version
    The manifest both imports and exports the package org.springframework.aop.aspectj
Bundlor returned warnings.  Please fix manifest template at 'org.springframework.aop.mf' and try again.
    The manifest both imports and exports the package org.springframework.aop.aspectj.annotation
:org.springframework.aop-5.0.4.RELEASE:bundlor FAILED

FAILURE: Build failed with an exception.

* What went wrong:
Execution failed for task ':org.springframework.aop-5.0.4.RELEASE:bundlor'.
> Process 'command '/opt/public/common/java/oracle/jdk1.8.0_162_x64/bin/java'' finished with non-zero exit value 255

* Try:
Run with --stacktrace option to get the stack trace. Run with --info or --debug option to get more log output.

BUILD FAILED

Total time: 19.214 secs
Build step 'Invoke Gradle script' changed build result to FAILURE
Build step 'Invoke Gradle script' marked build as failure
Started calculate disk usage of build
Finished Calculation of disk usage of build in 0 seconds
Started calculate disk usage of workspace
Finished Calculation of disk usage of workspace in 0 seconds
Finished: FAILURE