FailedConsole Output

Started by timer
Building in workspace /home/hudson/genie.virgo/.jenkins/jobs/virgo-master-jdk9/workspace
[WS-CLEANUP] Deleting project workspace...
[WS-CLEANUP] Deferred wipeout is used...
[WS-CLEANUP] Done
No credentials specified
Cloning the remote Git repository
Cloning repository git://git.eclipse.org/gitroot/virgo/org.eclipse.virgo.root.git
 > /usr/local/bin/git init /home/hudson/genie.virgo/.jenkins/jobs/virgo-master-jdk9/workspace # timeout=10
Fetching upstream changes from git://git.eclipse.org/gitroot/virgo/org.eclipse.virgo.root.git
 > /usr/local/bin/git --version # timeout=10
 > /usr/local/bin/git fetch --tags --progress git://git.eclipse.org/gitroot/virgo/org.eclipse.virgo.root.git +refs/heads/*:refs/remotes/origin/*
 > /usr/local/bin/git config remote.origin.url git://git.eclipse.org/gitroot/virgo/org.eclipse.virgo.root.git # timeout=10
 > /usr/local/bin/git config --add remote.origin.fetch +refs/heads/*:refs/remotes/origin/* # timeout=10
 > /usr/local/bin/git config remote.origin.url git://git.eclipse.org/gitroot/virgo/org.eclipse.virgo.root.git # timeout=10
Fetching upstream changes from git://git.eclipse.org/gitroot/virgo/org.eclipse.virgo.root.git
 > /usr/local/bin/git fetch --tags --progress git://git.eclipse.org/gitroot/virgo/org.eclipse.virgo.root.git refs/heads/master
 > /usr/local/bin/git rev-parse origin/master^{commit} # timeout=10
Checking out Revision b2ef942bb1f9b114f2655ef5f5a3c3a710bb41df (origin/master)
 > /usr/local/bin/git config core.sparsecheckout # timeout=10
 > /usr/local/bin/git checkout -f b2ef942bb1f9b114f2655ef5f5a3c3a710bb41df
Commit message: "Bug 551921 - Properly close ZipFile and JarOutputStream"
 > /usr/local/bin/git rev-list --no-walk b2ef942bb1f9b114f2655ef5f5a3c3a710bb41df # timeout=10
[workspace] $ /bin/sh -xe /tmp/genie.virgo/jenkins9038077471282655305.sh
+ rm -rf /opt/public/hipp/homes/genie.virgo/.gradle/caches/
[Gradle] - Launching build.
[ebr] $ /home/hudson/genie.virgo/.jenkins/jobs/virgo-master-jdk9/workspace/ebr/gradlew bundlor
Picked up JAVA_TOOL_OPTIONS: -Xmx2G -Djava.io.tmpdir=/tmp/genie.virgo -DforkCount=1

FAILURE: Build failed with an exception.

* What went wrong:
Could not determine java version from '9.0.1'.

* Try:
Run with --stacktrace option to get the stack trace. Run with --info or --debug option to get more log output.
Build step 'Invoke Gradle script' changed build result to FAILURE
Build step 'Invoke Gradle script' marked build as failure
[FINDBUGS] Skipping publisher since build result is FAILURE
Sending e-mails to: fwaibel@datenkollektiv.de
Recording test results
ERROR: Step ‘Publish JUnit test result report’ failed: No test report files were found. Configuration error?
Archiving artifacts
Started calculate disk usage of build
Finished Calculation of disk usage of build in 0 seconds
Started calculate disk usage of workspace
Finished Calculation of disk usage of workspace in 0 seconds
Finished: FAILURE