FailedConsole Output

Started by user
Building in workspace /home/hudson/genie.virgo/.jenkins/jobs/virgo-luna/workspace
Wiping out workspace first.
Cloning the remote Git repository
Cloning repository git://
 > /usr/local/bin/git init /home/hudson/genie.virgo/.jenkins/jobs/virgo-luna/workspace # timeout=10
Fetching upstream changes from git://
 > /usr/local/bin/git --version # timeout=10
 > /usr/local/bin/git fetch --tags --progress git:// +refs/heads/*:refs/remotes/origin/*
 > /usr/local/bin/git config remote.origin.url git:// # timeout=10
 > /usr/local/bin/git config --add remote.origin.fetch +refs/heads/*:refs/remotes/origin/* # timeout=10
 > /usr/local/bin/git config remote.origin.url git:// # timeout=10
Fetching upstream changes from git://
 > /usr/local/bin/git fetch --tags --progress git:// +refs/heads/*:refs/remotes/origin/*
 > /usr/local/bin/git rev-parse origin/virgo_luna^{commit} # timeout=10
Checking out Revision 06361b16dc45f096c00adf1a0e0dad00b9edb91f (origin/virgo_luna)
 > /usr/local/bin/git config core.sparsecheckout # timeout=10
 > /usr/local/bin/git checkout -f 06361b16dc45f096c00adf1a0e0dad00b9edb91f
Commit message: "Align javax.servlet version used in test with main product"
 > /usr/local/bin/git rev-list --no-walk 84a2c6046a851ccbb32c6675e44c89bf51cb159a # timeout=10
[Gradle] - Launching build.
[workspace] $ /home/hudson/genie.virgo/.jenkins/jobs/virgo-luna/workspace/gradlew -Phttp.proxyPort=1234 -Phttp.proxyHost=localhost -Dskip.normalize.bundles=true -Dskip.compress.bundles=true -Dskip.local.signing=true --continue --refresh-dependencies clean jar build distZip fullDistZip rapDistZip installDist installFullDist installRapDist findbugsMain -x distTar
Starting a Gradle Daemon (subsequent builds will be faster)
:buildSrc:clean UP-TO-DATE
:buildSrc:compileJava NO-SOURCE
:buildSrc:compileGroovyPicked up JAVA_TOOL_OPTIONS: -Xmx2G

:buildSrc:processResources NO-SOURCE
:buildSrc:compileTestJava NO-SOURCE
:buildSrc:compileTestGroovy NO-SOURCE
:buildSrc:processTestResources NO-SOURCE
:buildSrc:testClasses UP-TO-DATE
:buildSrc:test NO-SOURCE
:buildSrc:check UP-TO-DATE

FAILURE: Build failed with an exception.

* What went wrong:
A problem occurred configuring root project 'workspace'.
> Could not resolve all files for configuration ':classpath'.
   > Could not download org.eclipse.virgo.bundlor.gradle.plugin.jar (org.eclipse.virgo.bundlor:org.eclipse.virgo.bundlor.gradle.plugin:1.1.3.M01)
      > Failed to download SHA1 for resource ''.
         > For input string: "<!"

* Try:
Run with --stacktrace option to get the stack trace. Run with --info or --debug option to get more log output.


Total time: 23.911 secs
Build step 'Invoke Gradle script' changed build result to FAILURE
Build step 'Invoke Gradle script' marked build as failure
[FINDBUGS] Skipping publisher since build result is FAILURE
Sending e-mails to:
Recording test results
ERROR: Step ‘Publish JUnit test result report’ failed: No test report files were found. Configuration error?
Archiving artifacts
Started calculate disk usage of build
Finished Calculation of disk usage of build in 0 seconds
Started calculate disk usage of workspace
Finished Calculation of disk usage of workspace in 0 seconds
Finished: FAILURE