FailedConsole Output

Started by user fwaibel@datenkollektiv.de
Building in workspace /home/hudson/genie.virgo/.jenkins/jobs/recipe-custom-virgo/workspace
 > /usr/local/bin/git rev-parse --is-inside-work-tree # timeout=10
Fetching changes from the remote Git repository
 > /usr/local/bin/git config remote.origin.url git://git.eclipse.org/gitroot/virgo/org.eclipse.virgo.samples.git # timeout=10
Fetching upstream changes from git://git.eclipse.org/gitroot/virgo/org.eclipse.virgo.samples.git
 > /usr/local/bin/git --version # timeout=10
 > /usr/local/bin/git fetch --tags --progress git://git.eclipse.org/gitroot/virgo/org.eclipse.virgo.samples.git +refs/heads/*:refs/remotes/origin/*
 > /usr/local/bin/git rev-parse origin/master^{commit} # timeout=10
Checking out Revision 2be32b8fc6d53261e073f145224c82722bb88fd1 (origin/master)
 > /usr/local/bin/git config core.sparsecheckout # timeout=10
 > /usr/local/bin/git checkout -f 2be32b8fc6d53261e073f145224c82722bb88fd1
Commit message: "Update recipe-custome-virgo"
 > /usr/local/bin/git rev-list --no-walk 2be32b8fc6d53261e073f145224c82722bb88fd1 # timeout=10
[Gradle] - Launching build.
[recipe-custom-virgo] $ /home/hudson/genie.virgo/.jenkins/jobs/recipe-custom-virgo/workspace/recipe-custom-virgo/gradlew -Declipse.build=true -Dci.build=true clean asciidoc
Picked up JAVA_TOOL_OPTIONS: -Xmx2G -Djava.io.tmpdir=/tmp/genie.virgo
Starting a Gradle Daemon (subsequent builds will be faster)

FAILURE: Build failed with an exception.

* Where:
Build file '/jobs/genie.virgo/recipe-custom-virgo/workspace/recipe-custom-virgo/recipe-custom-virgo-runtime/build.gradle' line: 37

* What went wrong:
A problem occurred evaluating project ':recipe-custom-virgo-runtime'.
> /jobs/genie.virgo/recipe-custom-virgo/workspace/recipe-custom-virgo/recipe-custom-virgo-runtime/build

* Try:
Run with --stacktrace option to get the stack trace. Run with --info or --debug option to get more log output. Run with --scan to get full insights.

* Get more help at https://help.gradle.org

Deprecated Gradle features were used in this build, making it incompatible with Gradle 5.0.
See https://docs.gradle.org/4.6/userguide/command_line_interface.html#sec:command_line_warnings

BUILD FAILED in 6s
Build step 'Invoke Gradle script' changed build result to FAILURE
Build step 'Invoke Gradle script' marked build as failure
Sending e-mails to: fwaibel@datenkollektiv.de
Archiving artifacts
Started calculate disk usage of build
Finished Calculation of disk usage of build in 0 seconds
Started calculate disk usage of workspace
Finished Calculation of disk usage of workspace in 0 seconds
Finished: FAILURE