FailedConsole Output

Started by user ujhelyiz@incquerylabs.com
Checkout:workspace / /home/hudson/genie.viatra/.hudson/jobs/viatra-petrinet-example-mavenbuild/workspace - hudson.remoting.LocalChannel@15f10300
Using strategy: Default
Git Exe: git
Last Built Revision: Revision ca95e0c4597c391f955c71b35fff6be4ec85d610 (origin/master)
Checkout:workspace / /home/hudson/genie.viatra/.hudson/jobs/viatra-petrinet-example-mavenbuild/workspace - hudson.remoting.LocalChannel@15f10300
Fetching changes from the remote Git repository
Fetching upstream changes from /gitroot/viatra/org.eclipse.viatra.examples.git
Commencing build of Revision c4963fd8bea6920e99c3a45d34da701a33ee0258 (origin/master)
Checking out Revision c4963fd8bea6920e99c3a45d34da701a33ee0258 (origin/master)
[INFO] Using Maven 3 installation: apache-maven-latest
[INFO] Checking Maven 3 installation environment
[workspace] $ /shared/common/apache-maven-latest/bin/mvn --help
[INFO] Checking Maven 3 installation version
[INFO] Detected Maven 3 installation version: 3.3.9
[workspace] $ /shared/common/apache-maven-latest/bin/mvn clean install -V -B -e -Dmaven.ext.class.path=/home/hudson/genie.viatra/.hudson/maven/slavebundle/resources:/home/hudson/genie.viatra/.hudson/maven/slavebundle/lib/maven3-eventspy-3.1.jar:/home/hudson/genie.viatra/.hudson/war/webapp/WEB-INF/lib/hudson-remoting-3.0.3.jar -Dhudson.eventspy.port=59566 -Dmaven.repo.local=/home/hudson/genie.viatra/.hudson/jobs/viatra-petrinet-example-mavenbuild/workspace/.maven/repo -f /home/hudson/genie.viatra/.hudson/jobs/viatra-petrinet-example-mavenbuild/workspace/transformation/petrinet-simulator-maven/pom.xml
[DEBUG] Waiting for connection on port: 59566
Apache Maven 3.3.9 (bb52d8502b132ec0a5a3f4c09453c07478323dc5; 2015-11-10T11:41:47-05:00)
Maven home: /shared/common/apache-maven-latest
Java version: 1.7.0_80, vendor: Oracle Corporation
Java home: /opt/public/common/jdk1.7.0_80/jre
Default locale: en_US, platform encoding: UTF-8
OS name: "linux", version: "3.0.101-0.47.71-default", arch: "amd64", family: "unix"
SLF4J: Class path contains multiple SLF4J bindings.
SLF4J: Found binding in [jar:file:/home/hudson/genie.viatra/.hudson/maven/slavebundle/lib/maven3-eventspy-runtime.jar!/org/slf4j/impl/StaticLoggerBinder.class]
SLF4J: Found binding in [jar:file:/shared/common/apache-maven-latest/lib/slf4j-simple-1.7.5.jar!/org/slf4j/impl/StaticLoggerBinder.class]
SLF4J: See http://www.slf4j.org/codes.html#multiple_bindings for an explanation.
[DEBUG] Connected to remote
[INFO] Error stacktraces are turned on.
[WARN] o.h.m.e.EventSpyProcessor - Unhandled event: org.apache.maven.toolchain.building.DefaultToolchainsBuildingRequest@54958bb5 (org.apache.maven.toolchain.building.DefaultToolchainsBuildingRequest)
[WARN] o.h.m.e.EventSpyProcessor - Unhandled event: org.apache.maven.toolchain.building.DefaultToolchainsBuildingRequest@54958bb5 (org.apache.maven.toolchain.building.DefaultToolchainsBuildingRequest)
[INFO] Scanning for projects...
[INFO] ------------------------------------------------------------------------
[INFO] Reactor Build Order:
[INFO] 
[INFO] org.eclipse.viatra.examples.petrinet
[INFO] org.eclipse.viatra.examples.petrinet.model
[INFO] org.eclipse.viatra.examples.petrinet.simulator
[INFO]                                                                         
[INFO] ------------------------------------------------------------------------
[INFO] Building org.eclipse.viatra.examples.petrinet 0.12.0-SNAPSHOT
[INFO] ------------------------------------------------------------------------
[INFO] 
[INFO] --- maven-clean-plugin:2.5:clean (default-clean) @ org.eclipse.viatra.examples.petrinet ---
[INFO] 
[INFO] --- maven-install-plugin:2.4:install (default-install) @ org.eclipse.viatra.examples.petrinet ---
[INFO] Installing /home/hudson/genie.viatra/.hudson/jobs/viatra-petrinet-example-mavenbuild/workspace/transformation/petrinet-simulator-maven/pom.xml to /home/hudson/genie.viatra/.hudson/jobs/viatra-petrinet-example-mavenbuild/workspace/.maven/repo/org/eclipse/viatra/examples/petrinet/org.eclipse.viatra.examples.petrinet/0.12.0-SNAPSHOT/org.eclipse.viatra.examples.petrinet-0.12.0-SNAPSHOT.pom
[INFO]                                                                         
[INFO] ------------------------------------------------------------------------
[INFO] Building org.eclipse.viatra.examples.petrinet.model 0.12.0-SNAPSHOT
[INFO] ------------------------------------------------------------------------
[INFO] 
[INFO] --- maven-clean-plugin:2.5:clean (default-clean) @ org.eclipse.viatra.examples.petrinet.model ---
[INFO] Deleting /home/hudson/genie.viatra/.hudson/jobs/viatra-petrinet-example-mavenbuild/workspace/transformation/petrinet-simulator-maven/org.eclipse.viatra.examples.petrinet.model/target
[INFO] 
[INFO] --- maven-resources-plugin:2.6:resources (default-resources) @ org.eclipse.viatra.examples.petrinet.model ---
[INFO] Using 'UTF-8' encoding to copy filtered resources.
[INFO] Copying 1 resource
[INFO] 
[INFO] --- maven-compiler-plugin:3.1:compile (default-compile) @ org.eclipse.viatra.examples.petrinet.model ---
[INFO] Changes detected - recompiling the module!
[INFO] Compiling 22 source files to /home/hudson/genie.viatra/.hudson/jobs/viatra-petrinet-example-mavenbuild/workspace/transformation/petrinet-simulator-maven/org.eclipse.viatra.examples.petrinet.model/target/classes
[INFO] 
[INFO] --- maven-resources-plugin:2.6:testResources (default-testResources) @ org.eclipse.viatra.examples.petrinet.model ---
[INFO] Using 'UTF-8' encoding to copy filtered resources.
[INFO] Copying 1 resource
[INFO] 
[INFO] --- maven-compiler-plugin:3.1:testCompile (default-testCompile) @ org.eclipse.viatra.examples.petrinet.model ---
[INFO] No sources to compile
[INFO] 
[INFO] --- maven-surefire-plugin:2.12.4:test (default-test) @ org.eclipse.viatra.examples.petrinet.model ---
[INFO] 
[INFO] --- maven-jar-plugin:2.4:jar (default-jar) @ org.eclipse.viatra.examples.petrinet.model ---
[INFO] Building jar: /home/hudson/genie.viatra/.hudson/jobs/viatra-petrinet-example-mavenbuild/workspace/transformation/petrinet-simulator-maven/org.eclipse.viatra.examples.petrinet.model/target/org.eclipse.viatra.examples.petrinet.model-0.12.0-SNAPSHOT.jar
[INFO] 
[INFO] --- maven-install-plugin:2.4:install (default-install) @ org.eclipse.viatra.examples.petrinet.model ---
[INFO] Installing /home/hudson/genie.viatra/.hudson/jobs/viatra-petrinet-example-mavenbuild/workspace/transformation/petrinet-simulator-maven/org.eclipse.viatra.examples.petrinet.model/target/org.eclipse.viatra.examples.petrinet.model-0.12.0-SNAPSHOT.jar to /home/hudson/genie.viatra/.hudson/jobs/viatra-petrinet-example-mavenbuild/workspace/.maven/repo/org/eclipse/viatra/examples/petrinet/org.eclipse.viatra.examples.petrinet.model/0.12.0-SNAPSHOT/org.eclipse.viatra.examples.petrinet.model-0.12.0-SNAPSHOT.jar
[INFO] Installing /home/hudson/genie.viatra/.hudson/jobs/viatra-petrinet-example-mavenbuild/workspace/transformation/petrinet-simulator-maven/org.eclipse.viatra.examples.petrinet.model/pom.xml to /home/hudson/genie.viatra/.hudson/jobs/viatra-petrinet-example-mavenbuild/workspace/.maven/repo/org/eclipse/viatra/examples/petrinet/org.eclipse.viatra.examples.petrinet.model/0.12.0-SNAPSHOT/org.eclipse.viatra.examples.petrinet.model-0.12.0-SNAPSHOT.pom
[INFO]                                                                         
[INFO] ------------------------------------------------------------------------
[INFO] Building org.eclipse.viatra.examples.petrinet.simulator 0.12.0-SNAPSHOT
[INFO] ------------------------------------------------------------------------
Downloading: https://repo.eclipse.org/content/repositories/viatra-releases/org/eclipse/viatra/viatra-maven-plugin/1.2.1/viatra-maven-plugin-1.2.1.pom
Downloaded: https://repo.eclipse.org/content/repositories/viatra-releases/org/eclipse/viatra/viatra-maven-plugin/1.2.1/viatra-maven-plugin-1.2.1.pom (3 KB at 5.9 KB/sec)
Downloading: https://repo.eclipse.org/content/repositories/viatra-releases/org/eclipse/viatra/org.eclipse.viatra.parent.core/1.2.1/org.eclipse.viatra.parent.core-1.2.1.pom
Downloaded: https://repo.eclipse.org/content/repositories/viatra-releases/org/eclipse/viatra/org.eclipse.viatra.parent.core/1.2.1/org.eclipse.viatra.parent.core-1.2.1.pom (4 KB at 93.7 KB/sec)
Downloading: https://repo.eclipse.org/content/repositories/viatra-releases/org/eclipse/viatra/org.eclipse.viatra.parent/1.2.1-SNAPSHOT/maven-metadata.xml
Downloading: https://repo.eclipse.org/content/groups/releases/org/eclipse/viatra/org.eclipse.viatra.parent/1.2.1-SNAPSHOT/maven-metadata.xml
Downloading: https://repo.eclipse.org/content/repositories/viatra-releases/org/eclipse/viatra/org.eclipse.viatra.parent/1.2.1-SNAPSHOT/org.eclipse.viatra.parent-1.2.1-SNAPSHOT.pom
Downloading: https://repo.eclipse.org/content/groups/releases/org/eclipse/viatra/org.eclipse.viatra.parent/1.2.1-SNAPSHOT/org.eclipse.viatra.parent-1.2.1-SNAPSHOT.pom
[INFO] ------------------------------------------------------------------------
[INFO] Reactor Summary:
[INFO] 
[INFO] org.eclipse.viatra.examples.petrinet ............... SUCCESS [  0.679 s]
[INFO] org.eclipse.viatra.examples.petrinet.model ......... SUCCESS [  3.606 s]
[INFO] org.eclipse.viatra.examples.petrinet.simulator ..... FAILURE [  0.902 s]
[INFO] ------------------------------------------------------------------------
[INFO] BUILD FAILURE
[INFO] ------------------------------------------------------------------------
[INFO] Total time: 5.666 s
[INFO] Finished at: 2016-05-27T10:19:26-04:00
[INFO] Final Memory: 41M/1932M
[INFO] ------------------------------------------------------------------------
[INFO] o.h.m.e.h.MavenExecutionResultHandler - Build failed with exception(s)
[INFO] o.h.m.e.h.MavenExecutionResultHandler - [1] org.apache.maven.plugin.PluginResolutionException: Plugin org.eclipse.viatra:viatra-maven-plugin:1.2.1 or one of its dependencies could not be resolved: Failed to read artifact descriptor for org.eclipse.viatra:viatra-maven-plugin:jar:1.2.1
[DEBUG] Closing connection to remote
[ERROR] Plugin org.eclipse.viatra:viatra-maven-plugin:1.2.1 or one of its dependencies could not be resolved: Failed to read artifact descriptor for org.eclipse.viatra:viatra-maven-plugin:jar:1.2.1: Could not find artifact org.eclipse.viatra:org.eclipse.viatra.parent:pom:1.2.1-SNAPSHOT in viatra-repo (https://repo.eclipse.org/content/repositories/viatra-releases/) -> [Help 1]
org.apache.maven.plugin.PluginResolutionException: Plugin org.eclipse.viatra:viatra-maven-plugin:1.2.1 or one of its dependencies could not be resolved: Failed to read artifact descriptor for org.eclipse.viatra:viatra-maven-plugin:jar:1.2.1
	at org.apache.maven.plugin.internal.DefaultPluginDependenciesResolver.resolve(DefaultPluginDependenciesResolver.java:117)
	at org.apache.maven.plugin.internal.DefaultMavenPluginManager.getPluginDescriptor(DefaultMavenPluginManager.java:179)
	at org.apache.maven.plugin.internal.DefaultMavenPluginManager.getMojoDescriptor(DefaultMavenPluginManager.java:284)
	at org.apache.maven.plugin.DefaultBuildPluginManager.getMojoDescriptor(DefaultBuildPluginManager.java:241)
	at org.apache.maven.lifecycle.internal.DefaultLifecycleMappingDelegate.calculateLifecycleMappings(DefaultLifecycleMappingDelegate.java:110)
	at org.apache.maven.lifecycle.internal.DefaultLifecycleExecutionPlanCalculator.calculateLifecycleMappings(DefaultLifecycleExecutionPlanCalculator.java:266)
	at org.apache.maven.lifecycle.internal.DefaultLifecycleExecutionPlanCalculator.calculateMojoExecutions(DefaultLifecycleExecutionPlanCalculator.java:217)
	at org.apache.maven.lifecycle.internal.DefaultLifecycleExecutionPlanCalculator.calculateExecutionPlan(DefaultLifecycleExecutionPlanCalculator.java:127)
	at org.apache.maven.lifecycle.internal.DefaultLifecycleExecutionPlanCalculator.calculateExecutionPlan(DefaultLifecycleExecutionPlanCalculator.java:145)
	at org.apache.maven.lifecycle.internal.builder.BuilderCommon.resolveBuildPlan(BuilderCommon.java:96)
	at org.apache.maven.lifecycle.internal.LifecycleModuleBuilder.buildProject(LifecycleModuleBuilder.java:109)
	at org.apache.maven.lifecycle.internal.LifecycleModuleBuilder.buildProject(LifecycleModuleBuilder.java:80)
	at org.apache.maven.lifecycle.internal.builder.singlethreaded.SingleThreadedBuilder.build(SingleThreadedBuilder.java:51)
	at org.apache.maven.lifecycle.internal.LifecycleStarter.execute(LifecycleStarter.java:128)
	at org.apache.maven.DefaultMaven.doExecute(DefaultMaven.java:307)
	at org.apache.maven.DefaultMaven.doExecute(DefaultMaven.java:193)
	at org.apache.maven.DefaultMaven.execute(DefaultMaven.java:106)
	at org.apache.maven.cli.MavenCli.execute(MavenCli.java:863)
	at org.apache.maven.cli.MavenCli.doMain(MavenCli.java:288)
	at org.apache.maven.cli.MavenCli.main(MavenCli.java:199)
	at sun.reflect.NativeMethodAccessorImpl.invoke0(Native Method)
	at sun.reflect.NativeMethodAccessorImpl.invoke(NativeMethodAccessorImpl.java:57)
	at sun.reflect.DelegatingMethodAccessorImpl.invoke(DelegatingMethodAccessorImpl.java:43)
	at java.lang.reflect.Method.invoke(Method.java:606)
	at org.codehaus.plexus.classworlds.launcher.Launcher.launchEnhanced(Launcher.java:289)
	at org.codehaus.plexus.classworlds.launcher.Launcher.launch(Launcher.java:229)
	at org.codehaus.plexus.classworlds.launcher.Launcher.mainWithExitCode(Launcher.java:415)
	at org.codehaus.plexus.classworlds.launcher.Launcher.main(Launcher.java:356)
Caused by: org.eclipse.aether.resolution.ArtifactDescriptorException: Failed to read artifact descriptor for org.eclipse.viatra:viatra-maven-plugin:jar:1.2.1
	at org.apache.maven.repository.internal.DefaultArtifactDescriptorReader.loadPom(DefaultArtifactDescriptorReader.java:329)
	at org.apache.maven.repository.internal.DefaultArtifactDescriptorReader.readArtifactDescriptor(DefaultArtifactDescriptorReader.java:198)
	at org.eclipse.aether.internal.impl.DefaultRepositorySystem.readArtifactDescriptor(DefaultRepositorySystem.java:287)
	at org.apache.maven.plugin.internal.DefaultPluginDependenciesResolver.resolve(DefaultPluginDependenciesResolver.java:103)
	... 27 more
Caused by: org.apache.maven.model.resolution.UnresolvableModelException: Could not find artifact org.eclipse.viatra:org.eclipse.viatra.parent:pom:1.2.1-SNAPSHOT in viatra-repo (https://repo.eclipse.org/content/repositories/viatra-releases/)
	at org.apache.maven.repository.internal.DefaultModelResolver.resolveModel(DefaultModelResolver.java:177)
	at org.apache.maven.repository.internal.DefaultModelResolver.resolveModel(DefaultModelResolver.java:226)
	at org.apache.maven.model.building.DefaultModelBuilder.readParentExternally(DefaultModelBuilder.java:1000)
	at org.apache.maven.model.building.DefaultModelBuilder.readParent(DefaultModelBuilder.java:800)
	at org.apache.maven.model.building.DefaultModelBuilder.build(DefaultModelBuilder.java:329)
	at org.apache.maven.repository.internal.DefaultArtifactDescriptorReader.loadPom(DefaultArtifactDescriptorReader.java:320)
	... 30 more
Caused by: org.eclipse.aether.resolution.ArtifactResolutionException: Could not find artifact org.eclipse.viatra:org.eclipse.viatra.parent:pom:1.2.1-SNAPSHOT in viatra-repo (https://repo.eclipse.org/content/repositories/viatra-releases/)
	at org.eclipse.aether.internal.impl.DefaultArtifactResolver.resolve(DefaultArtifactResolver.java:444)
	at org.eclipse.aether.internal.impl.DefaultArtifactResolver.resolveArtifacts(DefaultArtifactResolver.java:246)
	at org.eclipse.aether.internal.impl.DefaultArtifactResolver.resolveArtifact(DefaultArtifactResolver.java:223)
	at org.apache.maven.repository.internal.DefaultModelResolver.resolveModel(DefaultModelResolver.java:173)
	... 35 more
Caused by: org.eclipse.aether.transfer.ArtifactNotFoundException: Could not find artifact org.eclipse.viatra:org.eclipse.viatra.parent:pom:1.2.1-SNAPSHOT in viatra-repo (https://repo.eclipse.org/content/repositories/viatra-releases/)
	at org.eclipse.aether.connector.basic.ArtifactTransportListener.transferFailed(ArtifactTransportListener.java:39)
	at org.eclipse.aether.connector.basic.BasicRepositoryConnector$TaskRunner.run(BasicRepositoryConnector.java:355)
	at org.eclipse.aether.util.concurrency.RunnableErrorForwarder$1.run(RunnableErrorForwarder.java:67)
	at org.eclipse.aether.connector.basic.BasicRepositoryConnector$DirectExecutor.execute(BasicRepositoryConnector.java:581)
	at org.eclipse.aether.connector.basic.BasicRepositoryConnector.get(BasicRepositoryConnector.java:249)
	at org.eclipse.aether.internal.impl.DefaultArtifactResolver.performDownloads(DefaultArtifactResolver.java:520)
	at org.eclipse.aether.internal.impl.DefaultArtifactResolver.resolve(DefaultArtifactResolver.java:421)
	... 38 more
[ERROR] 
[ERROR] Re-run Maven using the -X switch to enable full debug logging.
[ERROR] 
[ERROR] For more information about the errors and possible solutions, please read the following articles:
[ERROR] [Help 1] http://cwiki.apache.org/confluence/display/MAVEN/PluginResolutionException
[DEBUG] Waiting for process to finish
[DEBUG] Result: 1
Finished: FAILURE