FailedConsole Output

Started by user abel.hegedus@mit.bme.hu
Checkout:workspace / /home/hudson/genie.modeling.viatra/.hudson/jobs/viatra-modelobfuscator-master-maven/workspace - hudson.remoting.LocalChannel@17fad974
Using strategy: Default
Checkout:workspace / /home/hudson/genie.modeling.viatra/.hudson/jobs/viatra-modelobfuscator-master-maven/workspace - hudson.remoting.LocalChannel@17fad974
Cloning the remote Git repository
Cloning repository origin
Fetching upstream changes from git://git.eclipse.org/gitroot/viatra2/org.eclipse.viatra.modelobfuscator.git
Commencing build of Revision 6ca8608abdf965d7a4e3f6faad3242623aaee47b (origin/master)
Checking out Revision 6ca8608abdf965d7a4e3f6faad3242623aaee47b (origin/master)
No change to record in branch origin/master
[workspace] $ /bin/sh -xe /tmp/genie.modeling.viatra/hudson8782786759848424221.sh
[INFO] Using bundled Maven 3 installation
[INFO] Checking Maven 3 installation environment
[workspace] $ /home/hudson/genie.modeling.viatra/.hudson/maven/slavebundle/bundled-maven/bin/mvn --help
[INFO] Checking Maven 3 installation version
[INFO] Detected Maven 3 installation version: 3.1.1
[workspace] $ /home/hudson/genie.modeling.viatra/.hudson/maven/slavebundle/bundled-maven/bin/mvn clean deploy -V -B -DBUILD_TYPE=ci -Dmaven.runtime=true -Dmaven.ext.class.path=/home/hudson/genie.modeling.viatra/.hudson/maven/slavebundle/resources:/home/hudson/genie.modeling.viatra/.hudson/maven/slavebundle/lib/maven3-eventspy-3.1.jar:/home/hudson/genie.modeling.viatra/.hudson/war/webapp/WEB-INF/lib/hudson-remoting-3.0.0.jar -Dhudson.eventspy.port=60386 -Dmaven.repo.local=/home/hudson/genie.modeling.viatra/.hudson/jobs/viatra-modelobfuscator-master-maven/workspace/.maven/repo -f releng/org.eclipse.viatra.modelobfuscator.parent/pom.xml
[DEBUG] Waiting for connection on port: 60386
Apache Maven 3.1.1 (0728685237757ffbf44136acec0402957f723d9a; 2013-09-17 11:22:22-0400)
Maven home: /home/hudson/genie.modeling.viatra/.hudson/maven/slavebundle/bundled-maven
Java version: 1.7.0_51, vendor: Oracle Corporation
Java home: /opt/public/common/jdk1.7.0_51/jre
Default locale: en_US, platform encoding: UTF-8
OS name: "linux", version: "3.0.76-0.11-default", arch: "amd64", family: "unix"
SLF4J: Class path contains multiple SLF4J bindings.
SLF4J: Found binding in [jar:file:/home/hudson/genie.modeling.viatra/.hudson/maven/slavebundle/lib/maven3-eventspy-runtime.jar!/org/slf4j/impl/StaticLoggerBinder.class]
SLF4J: Found binding in [jar:file:/home/hudson/genie.modeling.viatra/.hudson/maven/slavebundle/bundled-maven/lib/slf4j-simple-1.7.5.jar!/org/slf4j/impl/StaticLoggerBinder.class]
SLF4J: See http://www.slf4j.org/codes.html#multiple_bindings for an explanation.
[DEBUG] Connected to remote
[INFO] o.h.m.e.h.SettingsBuildingRequestHandler - Using settings document ID: e23a0b6a-ab36-4ea3-8d97-c6ce7ba3db90
[INFO] Scanning for projects...
Downloading: http://repo.maven.apache.org/maven2/org/eclipse/tycho/tycho-maven-plugin/0.18.1/tycho-maven-plugin-0.18.1.pom
Downloaded: http://repo.maven.apache.org/maven2/org/eclipse/tycho/tycho-maven-plugin/0.18.1/tycho-maven-plugin-0.18.1.pom (3 KB at 7.4 KB/sec)
Downloading: http://repo.maven.apache.org/maven2/org/eclipse/tycho/tycho/0.18.1/tycho-0.18.1.pom
Downloaded: http://repo.maven.apache.org/maven2/org/eclipse/tycho/tycho/0.18.1/tycho-0.18.1.pom (19 KB at 102.4 KB/sec)
Downloading: http://repo.maven.apache.org/maven2/org/eclipse/tycho/tycho-core/0.18.1/tycho-core-0.18.1.pom
Downloaded: http://repo.maven.apache.org/maven2/org/eclipse/tycho/tycho-core/0.18.1/tycho-core-0.18.1.pom (5 KB at 29.9 KB/sec)
Downloading: http://repo.maven.apache.org/maven2/org/apache/maven/maven-core/3.0/maven-core-3.0.pom
Downloaded: http://repo.maven.apache.org/maven2/org/apache/maven/maven-core/3.0/maven-core-3.0.pom (7 KB at 42.0 KB/sec)
Downloading: http://repo.maven.apache.org/maven2/org/apache/maven/maven/3.0/maven-3.0.pom
Downloaded: http://repo.maven.apache.org/maven2/org/apache/maven/maven/3.0/maven-3.0.pom (22 KB at 120.7 KB/sec)
Downloading: http://repo.maven.apache.org/maven2/org/apache/maven/maven-parent/15/maven-parent-15.pom
Downloaded: http://repo.maven.apache.org/maven2/org/apache/maven/maven-parent/15/maven-parent-15.pom (24 KB at 135.5 KB/sec)
Downloading: http://repo.maven.apache.org/maven2/org/apache/apache/6/apache-6.pom
Downloaded: http://repo.maven.apache.org/maven2/org/apache/apache/6/apache-6.pom (13 KB at 81.1 KB/sec)
Downloading: http://repo.maven.apache.org/maven2/org/apache/maven/maven-model/3.0/maven-model-3.0.pom
Downloaded: http://repo.maven.apache.org/maven2/org/apache/maven/maven-model/3.0/maven-model-3.0.pom (4 KB at 25.2 KB/sec)
Downloading: http://repo.maven.apache.org/maven2/org/codehaus/plexus/plexus-utils/3.0.7/plexus-utils-3.0.7.pom
Downloaded: http://repo.maven.apache.org/maven2/org/codehaus/plexus/plexus-utils/3.0.7/plexus-utils-3.0.7.pom (3 KB at 16.4 KB/sec)
Downloading: http://repo.maven.apache.org/maven2/org/codehaus/plexus/plexus/3.1/plexus-3.1.pom
Downloaded: http://repo.maven.apache.org/maven2/org/codehaus/plexus/plexus/3.1/plexus-3.1.pom (19 KB at 103.9 KB/sec)
Downloading: http://repo.maven.apache.org/maven2/org/sonatype/spice/spice-parent/17/spice-parent-17.pom
Downloaded: http://repo.maven.apache.org/maven2/org/sonatype/spice/spice-parent/17/spice-parent-17.pom (7 KB at 43.1 KB/sec)
Downloading: http://repo.maven.apache.org/maven2/org/sonatype/forge/forge-parent/10/forge-parent-10.pom
Downloaded: http://repo.maven.apache.org/maven2/org/sonatype/forge/forge-parent/10/forge-parent-10.pom (14 KB at 86.6 KB/sec)
Downloading: http://repo.maven.apache.org/maven2/org/apache/maven/maven-settings/3.0/maven-settings-3.0.pom
Downloaded: http://repo.maven.apache.org/maven2/org/apache/maven/maven-settings/3.0/maven-settings-3.0.pom (2 KB at 12.2 KB/sec)
Downloading: http://repo.maven.apache.org/maven2/org/apache/maven/maven-settings-builder/3.0/maven-settings-builder-3.0.pom
Downloaded: http://repo.maven.apache.org/maven2/org/apache/maven/maven-settings-builder/3.0/maven-settings-builder-3.0.pom (3 KB at 14.5 KB/sec)
Downloading: http://repo.maven.apache.org/maven2/org/codehaus/plexus/plexus-interpolation/1.14/plexus-interpolation-1.14.pom
Downloaded: http://repo.maven.apache.org/maven2/org/codehaus/plexus/plexus-interpolation/1.14/plexus-interpolation-1.14.pom (910 B at 5.9 KB/sec)
Downloading: http://repo.maven.apache.org/maven2/org/codehaus/plexus/plexus-components/1.1.18/plexus-components-1.1.18.pom
Downloaded: http://repo.maven.apache.org/maven2/org/codehaus/plexus/plexus-components/1.1.18/plexus-components-1.1.18.pom (6 KB at 34.2 KB/sec)
Downloading: http://repo.maven.apache.org/maven2/org/codehaus/plexus/plexus/2.0.7/plexus-2.0.7.pom
Downloaded: http://repo.maven.apache.org/maven2/org/codehaus/plexus/plexus/2.0.7/plexus-2.0.7.pom (17 KB at 99.4 KB/sec)
Downloading: http://repo.maven.apache.org/maven2/org/codehaus/plexus/plexus-component-annotations/1.5.5/plexus-component-annotations-1.5.5.pom
Downloaded: http://repo.maven.apache.org/maven2/org/codehaus/plexus/plexus-component-annotations/1.5.5/plexus-component-annotations-1.5.5.pom (815 B at 5.3 KB/sec)
Downloading: http://repo.maven.apache.org/maven2/org/codehaus/plexus/plexus-containers/1.5.5/plexus-containers-1.5.5.pom
Downloaded: http://repo.maven.apache.org/maven2/org/codehaus/plexus/plexus-containers/1.5.5/plexus-containers-1.5.5.pom (5 KB at 26.5 KB/sec)
Downloading: http://repo.maven.apache.org/maven2/org/sonatype/plexus/plexus-sec-dispatcher/1.3/plexus-sec-dispatcher-1.3.pom
Downloaded: http://repo.maven.apache.org/maven2/org/sonatype/plexus/plexus-sec-dispatcher/1.3/plexus-sec-dispatcher-1.3.pom (3 KB at 10.2 KB/sec)
Downloading: http://repo.maven.apache.org/maven2/org/sonatype/spice/spice-parent/12/spice-parent-12.pom
Downloaded: http://repo.maven.apache.org/maven2/org/sonatype/spice/spice-parent/12/spice-parent-12.pom (7 KB at 43.7 KB/sec)
Downloading: http://repo.maven.apache.org/maven2/org/sonatype/forge/forge-parent/4/forge-parent-4.pom
Downloaded: http://repo.maven.apache.org/maven2/org/sonatype/forge/forge-parent/4/forge-parent-4.pom (9 KB at 53.9 KB/sec)
Downloading: http://repo.maven.apache.org/maven2/org/sonatype/plexus/plexus-cipher/1.4/plexus-cipher-1.4.pom
Downloaded: http://repo.maven.apache.org/maven2/org/sonatype/plexus/plexus-cipher/1.4/plexus-cipher-1.4.pom (3 KB at 13.3 KB/sec)
Downloading: http://repo.maven.apache.org/maven2/org/apache/maven/maven-repository-metadata/3.0/maven-repository-metadata-3.0.pom
Downloaded: http://repo.maven.apache.org/maven2/org/apache/maven/maven-repository-metadata/3.0/maven-repository-metadata-3.0.pom (2 KB at 12.5 KB/sec)
Downloading: http://repo.maven.apache.org/maven2/org/apache/maven/maven-artifact/3.0/maven-artifact-3.0.pom
Downloaded: http://repo.maven.apache.org/maven2/org/apache/maven/maven-artifact/3.0/maven-artifact-3.0.pom (2 KB at 12.5 KB/sec)
Downloading: http://repo.maven.apache.org/maven2/org/apache/maven/maven-plugin-api/3.0/maven-plugin-api-3.0.pom
Downloaded: http://repo.maven.apache.org/maven2/org/apache/maven/maven-plugin-api/3.0/maven-plugin-api-3.0.pom (3 KB at 14.6 KB/sec)
Downloading: http://repo.maven.apache.org/maven2/org/sonatype/sisu/sisu-inject-plexus/1.4.2/sisu-inject-plexus-1.4.2.pom
Downloaded: http://repo.maven.apache.org/maven2/org/sonatype/sisu/sisu-inject-plexus/1.4.2/sisu-inject-plexus-1.4.2.pom (6 KB at 34.7 KB/sec)
Downloading: http://repo.maven.apache.org/maven2/org/sonatype/sisu/inject/guice-plexus/1.4.2/guice-plexus-1.4.2.pom
Downloaded: http://repo.maven.apache.org/maven2/org/sonatype/sisu/inject/guice-plexus/1.4.2/guice-plexus-1.4.2.pom (4 KB at 20.0 KB/sec)
Downloading: http://repo.maven.apache.org/maven2/org/sonatype/sisu/inject/guice-bean/1.4.2/guice-bean-1.4.2.pom
Downloaded: http://repo.maven.apache.org/maven2/org/sonatype/sisu/inject/guice-bean/1.4.2/guice-bean-1.4.2.pom (3 KB at 17.1 KB/sec)
Downloading: http://repo.maven.apache.org/maven2/org/sonatype/sisu/sisu-inject/1.4.2/sisu-inject-1.4.2.pom
Downloaded: http://repo.maven.apache.org/maven2/org/sonatype/sisu/sisu-inject/1.4.2/sisu-inject-1.4.2.pom (2 KB at 8.1 KB/sec)
Downloading: http://repo.maven.apache.org/maven2/org/sonatype/sisu/sisu-parent/1.4.2/sisu-parent-1.4.2.pom
Downloaded: http://repo.maven.apache.org/maven2/org/sonatype/sisu/sisu-parent/1.4.2/sisu-parent-1.4.2.pom (8 KB at 50.6 KB/sec)
Downloading: http://repo.maven.apache.org/maven2/org/sonatype/forge/forge-parent/6/forge-parent-6.pom
Downloaded: http://repo.maven.apache.org/maven2/org/sonatype/forge/forge-parent/6/forge-parent-6.pom (11 KB at 75.0 KB/sec)
Downloading: http://repo.maven.apache.org/maven2/org/codehaus/plexus/plexus-classworlds/2.2.3/plexus-classworlds-2.2.3.pom
Downloaded: http://repo.maven.apache.org/maven2/org/codehaus/plexus/plexus-classworlds/2.2.3/plexus-classworlds-2.2.3.pom (4 KB at 26.0 KB/sec)
Downloading: http://repo.maven.apache.org/maven2/org/codehaus/plexus/plexus/2.0.6/plexus-2.0.6.pom
Downloaded: http://repo.maven.apache.org/maven2/org/codehaus/plexus/plexus/2.0.6/plexus-2.0.6.pom (17 KB at 83.5 KB/sec)
Downloading: http://repo.maven.apache.org/maven2/org/sonatype/sisu/sisu-inject-bean/1.4.2/sisu-inject-bean-1.4.2.pom
Downloaded: http://repo.maven.apache.org/maven2/org/sonatype/sisu/sisu-inject-bean/1.4.2/sisu-inject-bean-1.4.2.pom (6 KB at 35.8 KB/sec)
Downloading: http://repo.maven.apache.org/maven2/org/sonatype/sisu/sisu-guice/2.1.7/sisu-guice-2.1.7.pom
Downloaded: http://repo.maven.apache.org/maven2/org/sonatype/sisu/sisu-guice/2.1.7/sisu-guice-2.1.7.pom (11 KB at 70.6 KB/sec)
Downloading: http://repo.maven.apache.org/maven2/org/apache/maven/maven-model-builder/3.0/maven-model-builder-3.0.pom
Downloaded: http://repo.maven.apache.org/maven2/org/apache/maven/maven-model-builder/3.0/maven-model-builder-3.0.pom (3 KB at 14.7 KB/sec)
Downloading: http://repo.maven.apache.org/maven2/org/apache/maven/maven-aether-provider/3.0/maven-aether-provider-3.0.pom
Downloaded: http://repo.maven.apache.org/maven2/org/apache/maven/maven-aether-provider/3.0/maven-aether-provider-3.0.pom (3 KB at 16.3 KB/sec)
Downloading: http://repo.maven.apache.org/maven2/org/sonatype/aether/aether-api/1.7/aether-api-1.7.pom
Downloaded: http://repo.maven.apache.org/maven2/org/sonatype/aether/aether-api/1.7/aether-api-1.7.pom (2 KB at 10.9 KB/sec)
Downloading: http://repo.maven.apache.org/maven2/org/sonatype/aether/aether-parent/1.7/aether-parent-1.7.pom
Downloaded: http://repo.maven.apache.org/maven2/org/sonatype/aether/aether-parent/1.7/aether-parent-1.7.pom (8 KB at 49.3 KB/sec)
Downloading: http://repo.maven.apache.org/maven2/org/sonatype/aether/aether-util/1.7/aether-util-1.7.pom
Downloaded: http://repo.maven.apache.org/maven2/org/sonatype/aether/aether-util/1.7/aether-util-1.7.pom (3 KB at 13.2 KB/sec)
Downloading: http://repo.maven.apache.org/maven2/org/sonatype/aether/aether-impl/1.7/aether-impl-1.7.pom
Downloaded: http://repo.maven.apache.org/maven2/org/sonatype/aether/aether-impl/1.7/aether-impl-1.7.pom (4 KB at 23.9 KB/sec)
Downloading: http://repo.maven.apache.org/maven2/org/sonatype/aether/aether-spi/1.7/aether-spi-1.7.pom
Downloaded: http://repo.maven.apache.org/maven2/org/sonatype/aether/aether-spi/1.7/aether-spi-1.7.pom (2 KB at 11.2 KB/sec)
Downloading: http://repo.maven.apache.org/maven2/org/codehaus/plexus/plexus-archiver/2.2/plexus-archiver-2.2.pom
Downloaded: http://repo.maven.apache.org/maven2/org/codehaus/plexus/plexus-archiver/2.2/plexus-archiver-2.2.pom (4 KB at 20.6 KB/sec)
Downloading: http://repo.maven.apache.org/maven2/org/codehaus/plexus/plexus-components/1.1.20/plexus-components-1.1.20.pom
Downloaded: http://repo.maven.apache.org/maven2/org/codehaus/plexus/plexus-components/1.1.20/plexus-components-1.1.20.pom (3 KB at 19.4 KB/sec)
Downloading: http://repo.maven.apache.org/maven2/org/codehaus/plexus/plexus-io/2.0.5/plexus-io-2.0.5.pom
Downloaded: http://repo.maven.apache.org/maven2/org/codehaus/plexus/plexus-io/2.0.5/plexus-io-2.0.5.pom (3 KB at 14.2 KB/sec)
Downloading: http://repo.maven.apache.org/maven2/org/codehaus/plexus/plexus-components/1.2/plexus-components-1.2.pom
Downloaded: http://repo.maven.apache.org/maven2/org/codehaus/plexus/plexus-components/1.2/plexus-components-1.2.pom (3 KB at 19.6 KB/sec)
Downloading: http://repo.maven.apache.org/maven2/org/codehaus/plexus/plexus/3.2/plexus-3.2.pom
Downloaded: http://repo.maven.apache.org/maven2/org/codehaus/plexus/plexus/3.2/plexus-3.2.pom (19 KB at 93.9 KB/sec)
Downloading: http://repo.maven.apache.org/maven2/org/eclipse/tycho/org.eclipse.osgi/3.9.0.v20130529-1710/org.eclipse.osgi-3.9.0.v20130529-1710.pom
Downloaded: http://repo.maven.apache.org/maven2/org/eclipse/tycho/org.eclipse.osgi/3.9.0.v20130529-1710/org.eclipse.osgi-3.9.0.v20130529-1710.pom (2 KB at 9.7 KB/sec)
Downloading: http://repo.maven.apache.org/maven2/org/eclipse/tycho/sisu-equinox-embedder/0.18.1/sisu-equinox-embedder-0.18.1.pom
Downloaded: http://repo.maven.apache.org/maven2/org/eclipse/tycho/sisu-equinox-embedder/0.18.1/sisu-equinox-embedder-0.18.1.pom (2 KB at 12.0 KB/sec)
Downloading: http://repo.maven.apache.org/maven2/org/eclipse/tycho/sisu-equinox/0.18.1/sisu-equinox-0.18.1.pom
Downloaded: http://repo.maven.apache.org/maven2/org/eclipse/tycho/sisu-equinox/0.18.1/sisu-equinox-0.18.1.pom (2 KB at 6.6 KB/sec)
Downloading: http://repo.maven.apache.org/maven2/org/eclipse/tycho/sisu-equinox-api/0.18.1/sisu-equinox-api-0.18.1.pom
Downloaded: http://repo.maven.apache.org/maven2/org/eclipse/tycho/sisu-equinox-api/0.18.1/sisu-equinox-api-0.18.1.pom (2 KB at 11.0 KB/sec)
Downloading: http://repo.maven.apache.org/maven2/org/eclipse/tycho/tycho-metadata-model/0.18.1/tycho-metadata-model-0.18.1.pom
Downloaded: http://repo.maven.apache.org/maven2/org/eclipse/tycho/tycho-metadata-model/0.18.1/tycho-metadata-model-0.18.1.pom (2 KB at 8.3 KB/sec)
Downloading: http://repo.maven.apache.org/maven2/de/pdark/decentxml/1.3/decentxml-1.3.pom
Downloaded: http://repo.maven.apache.org/maven2/de/pdark/decentxml/1.3/decentxml-1.3.pom (7 KB at 40.5 KB/sec)
Downloading: http://repo.maven.apache.org/maven2/org/eclipse/tycho/tycho-embedder-api/0.18.1/tycho-embedder-api-0.18.1.pom
Downloaded: http://repo.maven.apache.org/maven2/org/eclipse/tycho/tycho-embedder-api/0.18.1/tycho-embedder-api-0.18.1.pom (3 KB at 13.7 KB/sec)
Downloading: http://repo.maven.apache.org/maven2/org/eclipse/tycho/org.eclipse.tycho.embedder.shared/0.18.1/org.eclipse.tycho.embedder.shared-0.18.1.pom
Downloaded: http://repo.maven.apache.org/maven2/org/eclipse/tycho/org.eclipse.tycho.embedder.shared/0.18.1/org.eclipse.tycho.embedder.shared-0.18.1.pom (2 KB at 6.9 KB/sec)
Downloading: http://repo.maven.apache.org/maven2/org/eclipse/tycho/tycho-bundles/0.18.1/tycho-bundles-0.18.1.pom
Downloaded: http://repo.maven.apache.org/maven2/org/eclipse/tycho/tycho-bundles/0.18.1/tycho-bundles-0.18.1.pom (3 KB at 16.9 KB/sec)
Downloading: http://repo.maven.apache.org/maven2/org/eclipse/tycho/org.eclipse.tycho.core.shared/0.18.1/org.eclipse.tycho.core.shared-0.18.1.pom
Downloaded: http://repo.maven.apache.org/maven2/org/eclipse/tycho/org.eclipse.tycho.core.shared/0.18.1/org.eclipse.tycho.core.shared-0.18.1.pom (2 KB at 6.9 KB/sec)
Downloading: http://repo.maven.apache.org/maven2/org/eclipse/tycho/tycho-p2-facade/0.18.1/tycho-p2-facade-0.18.1.pom
Downloaded: http://repo.maven.apache.org/maven2/org/eclipse/tycho/tycho-p2-facade/0.18.1/tycho-p2-facade-0.18.1.pom (3 KB at 14.6 KB/sec)
Downloading: http://repo.maven.apache.org/maven2/org/eclipse/tycho/tycho-p2/0.18.1/tycho-p2-0.18.1.pom
Downloaded: http://repo.maven.apache.org/maven2/org/eclipse/tycho/tycho-p2/0.18.1/tycho-p2-0.18.1.pom (2 KB at 7.4 KB/sec)
Downloading: http://repo.maven.apache.org/maven2/org/eclipse/tycho/org.eclipse.tycho.p2.resolver.shared/0.18.1/org.eclipse.tycho.p2.resolver.shared-0.18.1.pom
Downloaded: http://repo.maven.apache.org/maven2/org/eclipse/tycho/org.eclipse.tycho.p2.resolver.shared/0.18.1/org.eclipse.tycho.p2.resolver.shared-0.18.1.pom (2 KB at 7.1 KB/sec)
Downloading: http://repo.maven.apache.org/maven2/org/eclipse/tycho/org.eclipse.tycho.p2.tools.shared/0.18.1/org.eclipse.tycho.p2.tools.shared-0.18.1.pom
Downloaded: http://repo.maven.apache.org/maven2/org/eclipse/tycho/org.eclipse.tycho.p2.tools.shared/0.18.1/org.eclipse.tycho.p2.tools.shared-0.18.1.pom (2 KB at 7.1 KB/sec)
Downloading: http://repo.maven.apache.org/maven2/org/eclipse/tycho/tycho-maven-plugin/0.18.1/tycho-maven-plugin-0.18.1.jar
Downloading: http://repo.maven.apache.org/maven2/org/eclipse/tycho/tycho-core/0.18.1/tycho-core-0.18.1.jar
Downloading: http://repo.maven.apache.org/maven2/org/sonatype/aether/aether-util/1.7/aether-util-1.7.jar
Downloading: http://repo.maven.apache.org/maven2/org/sonatype/sisu/sisu-inject-bean/1.4.2/sisu-inject-bean-1.4.2.jar
Downloading: http://repo.maven.apache.org/maven2/org/sonatype/sisu/sisu-guice/2.1.7/sisu-guice-2.1.7-noaop.jar
Downloaded: http://repo.maven.apache.org/maven2/org/eclipse/tycho/tycho-maven-plugin/0.18.1/tycho-maven-plugin-0.18.1.jar (5 KB at 44.1 KB/sec)
Downloading: http://repo.maven.apache.org/maven2/org/codehaus/plexus/plexus-interpolation/1.14/plexus-interpolation-1.14.jar
Downloaded: http://repo.maven.apache.org/maven2/org/sonatype/aether/aether-util/1.7/aether-util-1.7.jar (106 KB at 535.1 KB/sec)
Downloading: http://repo.maven.apache.org/maven2/org/sonatype/plexus/plexus-sec-dispatcher/1.3/plexus-sec-dispatcher-1.3.jar
Downloaded: http://repo.maven.apache.org/maven2/org/sonatype/sisu/sisu-inject-bean/1.4.2/sisu-inject-bean-1.4.2.jar (150 KB at 447.3 KB/sec)
Downloading: http://repo.maven.apache.org/maven2/org/sonatype/plexus/plexus-cipher/1.4/plexus-cipher-1.4.jar
Downloaded: http://repo.maven.apache.org/maven2/org/codehaus/plexus/plexus-interpolation/1.14/plexus-interpolation-1.14.jar (60 KB at 208.5 KB/sec)
Downloading: http://repo.maven.apache.org/maven2/org/codehaus/plexus/plexus-utils/3.0.7/plexus-utils-3.0.7.jar
Downloaded: http://repo.maven.apache.org/maven2/org/eclipse/tycho/tycho-core/0.18.1/tycho-core-0.18.1.jar (178 KB at 418.7 KB/sec)
Downloading: http://repo.maven.apache.org/maven2/org/codehaus/plexus/plexus-archiver/2.2/plexus-archiver-2.2.jar
Downloaded: http://repo.maven.apache.org/maven2/org/sonatype/plexus/plexus-sec-dispatcher/1.3/plexus-sec-dispatcher-1.3.jar (28 KB at 117.2 KB/sec)
Downloading: http://repo.maven.apache.org/maven2/org/codehaus/plexus/plexus-io/2.0.5/plexus-io-2.0.5.jar
Downloaded: http://repo.maven.apache.org/maven2/org/sonatype/plexus/plexus-cipher/1.4/plexus-cipher-1.4.jar (14 KB at 88.4 KB/sec)
Downloading: http://repo.maven.apache.org/maven2/org/eclipse/tycho/org.eclipse.osgi/3.9.0.v20130529-1710/org.eclipse.osgi-3.9.0.v20130529-1710.jar
Downloaded: http://repo.maven.apache.org/maven2/org/sonatype/sisu/sisu-guice/2.1.7/sisu-guice-2.1.7-noaop.jar (461 KB at 815.4 KB/sec)
Downloading: http://repo.maven.apache.org/maven2/org/eclipse/tycho/sisu-equinox-embedder/0.18.1/sisu-equinox-embedder-0.18.1.jar
Downloaded: http://repo.maven.apache.org/maven2/org/codehaus/plexus/plexus-io/2.0.5/plexus-io-2.0.5.jar (57 KB at 289.6 KB/sec)
Downloading: http://repo.maven.apache.org/maven2/org/eclipse/tycho/sisu-equinox-api/0.18.1/sisu-equinox-api-0.18.1.jar
Downloaded: http://repo.maven.apache.org/maven2/org/eclipse/tycho/sisu-equinox-embedder/0.18.1/sisu-equinox-embedder-0.18.1.jar (13 KB at 120.9 KB/sec)
Downloading: http://repo.maven.apache.org/maven2/org/eclipse/tycho/tycho-metadata-model/0.18.1/tycho-metadata-model-0.18.1.jar
Downloaded: http://repo.maven.apache.org/maven2/org/codehaus/plexus/plexus-utils/3.0.7/plexus-utils-3.0.7.jar (226 KB at 768.2 KB/sec)
Downloading: http://repo.maven.apache.org/maven2/de/pdark/decentxml/1.3/decentxml-1.3.jar
Downloaded: http://repo.maven.apache.org/maven2/org/eclipse/tycho/sisu-equinox-api/0.18.1/sisu-equinox-api-0.18.1.jar (4 KB at 20.9 KB/sec)
Downloading: http://repo.maven.apache.org/maven2/org/eclipse/tycho/tycho-embedder-api/0.18.1/tycho-embedder-api-0.18.1.jar
Downloaded: http://repo.maven.apache.org/maven2/org/eclipse/tycho/tycho-metadata-model/0.18.1/tycho-metadata-model-0.18.1.jar (29 KB at 164.4 KB/sec)
Downloading: http://repo.maven.apache.org/maven2/org/eclipse/tycho/org.eclipse.tycho.embedder.shared/0.18.1/org.eclipse.tycho.embedder.shared-0.18.1.jar
Downloaded: http://repo.maven.apache.org/maven2/org/eclipse/tycho/tycho-embedder-api/0.18.1/tycho-embedder-api-0.18.1.jar (7 KB at 66.7 KB/sec)
Downloading: http://repo.maven.apache.org/maven2/org/eclipse/tycho/org.eclipse.tycho.core.shared/0.18.1/org.eclipse.tycho.core.shared-0.18.1.jar
Downloaded: http://repo.maven.apache.org/maven2/org/codehaus/plexus/plexus-archiver/2.2/plexus-archiver-2.2.jar (181 KB at 385.2 KB/sec)
Downloading: http://repo.maven.apache.org/maven2/org/eclipse/tycho/tycho-p2-facade/0.18.1/tycho-p2-facade-0.18.1.jar
Downloaded: http://repo.maven.apache.org/maven2/org/eclipse/tycho/org.eclipse.osgi/3.9.0.v20130529-1710/org.eclipse.osgi-3.9.0.v20130529-1710.jar (1358 KB at 3135.6 KB/sec)
Downloading: http://repo.maven.apache.org/maven2/org/codehaus/plexus/plexus-component-annotations/1.5.5/plexus-component-annotations-1.5.5.jar
Downloaded: http://repo.maven.apache.org/maven2/org/eclipse/tycho/org.eclipse.tycho.embedder.shared/0.18.1/org.eclipse.tycho.embedder.shared-0.18.1.jar (7 KB at 42.8 KB/sec)
Downloading: http://repo.maven.apache.org/maven2/org/eclipse/tycho/org.eclipse.tycho.p2.resolver.shared/0.18.1/org.eclipse.tycho.p2.resolver.shared-0.18.1.jar
Downloaded: http://repo.maven.apache.org/maven2/org/eclipse/tycho/tycho-p2-facade/0.18.1/tycho-p2-facade-0.18.1.jar (33 KB at 241.8 KB/sec)
Downloading: http://repo.maven.apache.org/maven2/org/eclipse/tycho/org.eclipse.tycho.p2.tools.shared/0.18.1/org.eclipse.tycho.p2.tools.shared-0.18.1.jar
Downloaded: http://repo.maven.apache.org/maven2/org/codehaus/plexus/plexus-component-annotations/1.5.5/plexus-component-annotations-1.5.5.jar (5 KB at 27.8 KB/sec)
Downloaded: http://repo.maven.apache.org/maven2/de/pdark/decentxml/1.3/decentxml-1.3.jar (109 KB at 288.2 KB/sec)
Downloaded: http://repo.maven.apache.org/maven2/org/eclipse/tycho/org.eclipse.tycho.core.shared/0.18.1/org.eclipse.tycho.core.shared-0.18.1.jar (30 KB at 123.2 KB/sec)
Downloaded: http://repo.maven.apache.org/maven2/org/eclipse/tycho/org.eclipse.tycho.p2.resolver.shared/0.18.1/org.eclipse.tycho.p2.resolver.shared-0.18.1.jar (25 KB at 128.4 KB/sec)
Downloaded: http://repo.maven.apache.org/maven2/org/eclipse/tycho/org.eclipse.tycho.p2.tools.shared/0.18.1/org.eclipse.tycho.p2.tools.shared-0.18.1.jar (20 KB at 111.3 KB/sec)
[WARNING] No explicit target runtime environment configuration. Build is platform dependent.
Downloading: http://repo.maven.apache.org/maven2/org/eclipse/tycho/tycho-bundles-external/0.18.1/tycho-bundles-external-0.18.1.zip
Downloaded: http://repo.maven.apache.org/maven2/org/eclipse/tycho/tycho-bundles-external/0.18.1/tycho-bundles-external-0.18.1.zip (6119 KB at 4879.0 KB/sec)
Downloading: http://repo.maven.apache.org/maven2/org/eclipse/tycho/org.eclipse.tycho.p2.resolver.impl/0.18.1/org.eclipse.tycho.p2.resolver.impl-0.18.1.jar
Downloaded: http://repo.maven.apache.org/maven2/org/eclipse/tycho/org.eclipse.tycho.p2.resolver.impl/0.18.1/org.eclipse.tycho.p2.resolver.impl-0.18.1.jar (183 KB at 434.0 KB/sec)
Downloading: http://repo.maven.apache.org/maven2/org/eclipse/tycho/org.eclipse.tycho.p2.maven.repository/0.18.1/org.eclipse.tycho.p2.maven.repository-0.18.1.jar
Downloaded: http://repo.maven.apache.org/maven2/org/eclipse/tycho/org.eclipse.tycho.p2.maven.repository/0.18.1/org.eclipse.tycho.p2.maven.repository-0.18.1.jar (100 KB at 302.3 KB/sec)
Downloading: http://repo.maven.apache.org/maven2/org/eclipse/tycho/org.eclipse.tycho.p2.tools.impl/0.18.1/org.eclipse.tycho.p2.tools.impl-0.18.1.jar
Downloaded: http://repo.maven.apache.org/maven2/org/eclipse/tycho/org.eclipse.tycho.p2.tools.impl/0.18.1/org.eclipse.tycho.p2.tools.impl-0.18.1.jar (34 KB at 140.7 KB/sec)
Downloading: http://repo.maven.apache.org/maven2/org/eclipse/tycho/target-platform-configuration/0.18.1/target-platform-configuration-0.18.1.pom
Downloaded: http://repo.maven.apache.org/maven2/org/eclipse/tycho/target-platform-configuration/0.18.1/target-platform-configuration-0.18.1.pom (2 KB at 7.3 KB/sec)
Downloading: http://repo.maven.apache.org/maven2/org/eclipse/tycho/target-platform-configuration/0.18.1/target-platform-configuration-0.18.1.jar
Downloaded: http://repo.maven.apache.org/maven2/org/eclipse/tycho/target-platform-configuration/0.18.1/target-platform-configuration-0.18.1.jar (4 KB at 21.2 KB/sec)
Downloading: http://repo.maven.apache.org/maven2/org/eclipse/tycho/tycho-source-plugin/0.18.1/tycho-source-plugin-0.18.1.pom
Downloaded: http://repo.maven.apache.org/maven2/org/eclipse/tycho/tycho-source-plugin/0.18.1/tycho-source-plugin-0.18.1.pom (3 KB at 16.2 KB/sec)
Downloading: http://repo.maven.apache.org/maven2/org/eclipse/tycho/tycho-source-plugin/0.18.1/tycho-source-plugin-0.18.1.jar
Downloaded: http://repo.maven.apache.org/maven2/org/eclipse/tycho/tycho-source-plugin/0.18.1/tycho-source-plugin-0.18.1.jar (19 KB at 97.5 KB/sec)
Downloading: http://repo.maven.apache.org/maven2/org/apache/maven/plugins/maven-source-plugin/2.1/maven-source-plugin-2.1.pom
Downloaded: http://repo.maven.apache.org/maven2/org/apache/maven/plugins/maven-source-plugin/2.1/maven-source-plugin-2.1.pom (5 KB at 32.6 KB/sec)
Downloading: http://repo.maven.apache.org/maven2/org/apache/maven/plugins/maven-plugins/13/maven-plugins-13.pom
Downloaded: http://repo.maven.apache.org/maven2/org/apache/maven/plugins/maven-plugins/13/maven-plugins-13.pom (12 KB at 75.2 KB/sec)
Downloading: http://repo.maven.apache.org/maven2/org/apache/maven/maven-parent/11/maven-parent-11.pom
Downloaded: http://repo.maven.apache.org/maven2/org/apache/maven/maven-parent/11/maven-parent-11.pom (32 KB at 161.5 KB/sec)
Downloading: http://repo.maven.apache.org/maven2/org/apache/apache/5/apache-5.pom
Downloaded: http://repo.maven.apache.org/maven2/org/apache/apache/5/apache-5.pom (5 KB at 27.0 KB/sec)
Downloading: http://repo.maven.apache.org/maven2/org/apache/maven/maven-archiver/2.5/maven-archiver-2.5.pom
Downloaded: http://repo.maven.apache.org/maven2/org/apache/maven/maven-archiver/2.5/maven-archiver-2.5.pom (5 KB at 29.3 KB/sec)
Downloading: http://repo.maven.apache.org/maven2/org/apache/maven/shared/maven-shared-components/17/maven-shared-components-17.pom
Downloaded: http://repo.maven.apache.org/maven2/org/apache/maven/shared/maven-shared-components/17/maven-shared-components-17.pom (9 KB at 57.0 KB/sec)
Downloading: http://repo.maven.apache.org/maven2/org/apache/maven/maven-parent/21/maven-parent-21.pom
Downloaded: http://repo.maven.apache.org/maven2/org/apache/maven/maven-parent/21/maven-parent-21.pom (26 KB at 131.3 KB/sec)
Downloading: http://repo.maven.apache.org/maven2/org/apache/apache/10/apache-10.pom
Downloaded: http://repo.maven.apache.org/maven2/org/apache/apache/10/apache-10.pom (15 KB at 74.9 KB/sec)
Downloading: http://repo.maven.apache.org/maven2/org/codehaus/plexus/plexus-interpolation/1.15/plexus-interpolation-1.15.pom
Downloaded: http://repo.maven.apache.org/maven2/org/codehaus/plexus/plexus-interpolation/1.15/plexus-interpolation-1.15.pom (1018 B at 6.6 KB/sec)
Downloading: http://repo.maven.apache.org/maven2/org/codehaus/plexus/plexus/3.0.1/plexus-3.0.1.pom
Downloaded: http://repo.maven.apache.org/maven2/org/codehaus/plexus/plexus/3.0.1/plexus-3.0.1.pom (19 KB at 93.7 KB/sec)
Downloading: http://repo.maven.apache.org/maven2/org/eclipse/tycho/tycho-packaging-plugin/0.18.1/tycho-packaging-plugin-0.18.1.pom
Downloaded: http://repo.maven.apache.org/maven2/org/eclipse/tycho/tycho-packaging-plugin/0.18.1/tycho-packaging-plugin-0.18.1.pom (3 KB at 17.4 KB/sec)
Downloading: http://repo.maven.apache.org/maven2/org/apache/maven/plugins/maven-source-plugin/2.1/maven-source-plugin-2.1.jar
Downloading: http://repo.maven.apache.org/maven2/org/apache/maven/maven-archiver/2.5/maven-archiver-2.5.jar
Downloading: http://repo.maven.apache.org/maven2/org/eclipse/tycho/tycho-packaging-plugin/0.18.1/tycho-packaging-plugin-0.18.1.jar
Downloaded: http://repo.maven.apache.org/maven2/org/apache/maven/plugins/maven-source-plugin/2.1/maven-source-plugin-2.1.jar (24 KB at 179.1 KB/sec)
Downloaded: http://repo.maven.apache.org/maven2/org/apache/maven/maven-archiver/2.5/maven-archiver-2.5.jar (22 KB at 89.1 KB/sec)
Downloaded: http://repo.maven.apache.org/maven2/org/eclipse/tycho/tycho-packaging-plugin/0.18.1/tycho-packaging-plugin-0.18.1.jar (106 KB at 318.1 KB/sec)
Downloading: http://repo.maven.apache.org/maven2/org/eclipse/tycho/tycho-p2-publisher-plugin/0.18.1/tycho-p2-publisher-plugin-0.18.1.pom
Downloaded: http://repo.maven.apache.org/maven2/org/eclipse/tycho/tycho-p2-publisher-plugin/0.18.1/tycho-p2-publisher-plugin-0.18.1.pom (2 KB at 11.0 KB/sec)
Downloading: http://repo.maven.apache.org/maven2/org/eclipse/tycho/tycho-p2-publisher-plugin/0.18.1/tycho-p2-publisher-plugin-0.18.1.jar
Downloaded: http://repo.maven.apache.org/maven2/org/eclipse/tycho/tycho-p2-publisher-plugin/0.18.1/tycho-p2-publisher-plugin-0.18.1.jar (21 KB at 103.9 KB/sec)
Downloading: http://repo.maven.apache.org/maven2/org/jacoco/jacoco-maven-plugin/0.6.3.201306030806/jacoco-maven-plugin-0.6.3.201306030806.pom
Downloaded: http://repo.maven.apache.org/maven2/org/jacoco/jacoco-maven-plugin/0.6.3.201306030806/jacoco-maven-plugin-0.6.3.201306030806.pom (4 KB at 23.8 KB/sec)
Downloading: http://repo.maven.apache.org/maven2/org/jacoco/org.jacoco.build/0.6.3.201306030806/org.jacoco.build-0.6.3.201306030806.pom
Downloaded: http://repo.maven.apache.org/maven2/org/jacoco/org.jacoco.build/0.6.3.201306030806/org.jacoco.build-0.6.3.201306030806.pom (33 KB at 151.0 KB/sec)
Downloading: http://repo.maven.apache.org/maven2/org/jacoco/jacoco-maven-plugin/0.6.3.201306030806/jacoco-maven-plugin-0.6.3.201306030806.jar
Downloaded: http://repo.maven.apache.org/maven2/org/jacoco/jacoco-maven-plugin/0.6.3.201306030806/jacoco-maven-plugin-0.6.3.201306030806.jar (36 KB at 151.2 KB/sec)
Downloading: http://repo.maven.apache.org/maven2/org/apache/maven/plugins/maven-clean-plugin/2.5/maven-clean-plugin-2.5.pom
Downloaded: http://repo.maven.apache.org/maven2/org/apache/maven/plugins/maven-clean-plugin/2.5/maven-clean-plugin-2.5.pom (4 KB at 25.7 KB/sec)
Downloading: http://repo.maven.apache.org/maven2/org/apache/maven/plugins/maven-plugins/22/maven-plugins-22.pom
Downloaded: http://repo.maven.apache.org/maven2/org/apache/maven/plugins/maven-plugins/22/maven-plugins-22.pom (13 KB at 84.9 KB/sec)
Downloading: http://repo.maven.apache.org/maven2/org/apache/maven/plugins/maven-clean-plugin/2.5/maven-clean-plugin-2.5.jar
Downloaded: http://repo.maven.apache.org/maven2/org/apache/maven/plugins/maven-clean-plugin/2.5/maven-clean-plugin-2.5.jar (25 KB at 120.9 KB/sec)
Downloading: http://repo.maven.apache.org/maven2/org/eclipse/xtend/xtend-maven-plugin/2.6.1/xtend-maven-plugin-2.6.1.pom
Downloaded: http://repo.maven.apache.org/maven2/org/eclipse/xtend/xtend-maven-plugin/2.6.1/xtend-maven-plugin-2.6.1.pom (8 KB at 38.5 KB/sec)
Downloading: http://repo.maven.apache.org/maven2/org/eclipse/xtext/org.eclipse.xtext.parent/2.6.1/org.eclipse.xtext.parent-2.6.1.pom
Downloaded: http://repo.maven.apache.org/maven2/org/eclipse/xtext/org.eclipse.xtext.parent/2.6.1/org.eclipse.xtext.parent-2.6.1.pom (9 KB at 47.7 KB/sec)
Downloading: http://repo.maven.apache.org/maven2/org/sonatype/oss/oss-parent/7/oss-parent-7.pom
Downloaded: http://repo.maven.apache.org/maven2/org/sonatype/oss/oss-parent/7/oss-parent-7.pom (5 KB at 31.4 KB/sec)
Downloading: http://repo.maven.apache.org/maven2/org/eclipse/xtend/xtend-maven-plugin/2.6.1/xtend-maven-plugin-2.6.1.jar
Downloaded: http://repo.maven.apache.org/maven2/org/eclipse/xtend/xtend-maven-plugin/2.6.1/xtend-maven-plugin-2.6.1.jar (33 KB at 140.6 KB/sec)
Downloading: http://repo.maven.apache.org/maven2/org/apache/maven/plugins/maven-install-plugin/2.3.1/maven-install-plugin-2.3.1.pom
Downloaded: http://repo.maven.apache.org/maven2/org/apache/maven/plugins/maven-install-plugin/2.3.1/maven-install-plugin-2.3.1.pom (5 KB at 32.0 KB/sec)
Downloading: http://repo.maven.apache.org/maven2/org/apache/maven/plugins/maven-plugins/18/maven-plugins-18.pom
Downloaded: http://repo.maven.apache.org/maven2/org/apache/maven/plugins/maven-plugins/18/maven-plugins-18.pom (13 KB at 85.8 KB/sec)
Downloading: http://repo.maven.apache.org/maven2/org/apache/maven/maven-parent/16/maven-parent-16.pom
Downloaded: http://repo.maven.apache.org/maven2/org/apache/maven/maven-parent/16/maven-parent-16.pom (23 KB at 116.0 KB/sec)
Downloading: http://repo.maven.apache.org/maven2/org/apache/apache/7/apache-7.pom
Downloaded: http://repo.maven.apache.org/maven2/org/apache/apache/7/apache-7.pom (15 KB at 73.4 KB/sec)
Downloading: http://repo.maven.apache.org/maven2/org/apache/maven/plugins/maven-install-plugin/2.3.1/maven-install-plugin-2.3.1.jar
Downloaded: http://repo.maven.apache.org/maven2/org/apache/maven/plugins/maven-install-plugin/2.3.1/maven-install-plugin-2.3.1.jar (23 KB at 115.2 KB/sec)
Downloading: http://repo.maven.apache.org/maven2/org/eclipse/tycho/tycho-p2-plugin/0.18.1/tycho-p2-plugin-0.18.1.pom
Downloaded: http://repo.maven.apache.org/maven2/org/eclipse/tycho/tycho-p2-plugin/0.18.1/tycho-p2-plugin-0.18.1.pom (3 KB at 14.0 KB/sec)
Downloading: http://repo.maven.apache.org/maven2/org/eclipse/tycho/tycho-p2-plugin/0.18.1/tycho-p2-plugin-0.18.1.jar
Downloaded: http://repo.maven.apache.org/maven2/org/eclipse/tycho/tycho-p2-plugin/0.18.1/tycho-p2-plugin-0.18.1.jar (23 KB at 116.7 KB/sec)
Downloading: http://repo.maven.apache.org/maven2/org/eclipse/tycho/sisu-equinox-launching/0.18.1/sisu-equinox-launching-0.18.1.pom
Downloaded: http://repo.maven.apache.org/maven2/org/eclipse/tycho/sisu-equinox-launching/0.18.1/sisu-equinox-launching-0.18.1.pom (3 KB at 15.1 KB/sec)
Downloading: http://repo.maven.apache.org/maven2/org/eclipse/tycho/tycho-artifactcomparator/0.18.1/tycho-artifactcomparator-0.18.1.pom
Downloaded: http://repo.maven.apache.org/maven2/org/eclipse/tycho/tycho-artifactcomparator/0.18.1/tycho-artifactcomparator-0.18.1.pom (2 KB at 11.7 KB/sec)
Downloading: http://repo.maven.apache.org/maven2/org/ow2/asm/asm-debug-all/4.0/asm-debug-all-4.0.pom
Downloaded: http://repo.maven.apache.org/maven2/org/ow2/asm/asm-debug-all/4.0/asm-debug-all-4.0.pom (2 KB at 13.0 KB/sec)
Downloading: http://repo.maven.apache.org/maven2/org/ow2/asm/asm-parent/4.0/asm-parent-4.0.pom
Downloaded: http://repo.maven.apache.org/maven2/org/ow2/asm/asm-parent/4.0/asm-parent-4.0.pom (6 KB at 35.5 KB/sec)
Downloading: http://repo.maven.apache.org/maven2/org/ow2/ow2/1.3/ow2-1.3.pom
Downloaded: http://repo.maven.apache.org/maven2/org/ow2/ow2/1.3/ow2-1.3.pom (10 KB at 62.3 KB/sec)
Downloading: http://repo.maven.apache.org/maven2/org/eclipse/tycho/sisu-equinox-launching/0.18.1/sisu-equinox-launching-0.18.1.jar
Downloading: http://repo.maven.apache.org/maven2/org/eclipse/tycho/tycho-artifactcomparator/0.18.1/tycho-artifactcomparator-0.18.1.jar
Downloading: http://repo.maven.apache.org/maven2/org/ow2/asm/asm-debug-all/4.0/asm-debug-all-4.0.jar
Downloaded: http://repo.maven.apache.org/maven2/org/eclipse/tycho/tycho-artifactcomparator/0.18.1/tycho-artifactcomparator-0.18.1.jar (19 KB at 142.8 KB/sec)
Downloaded: http://repo.maven.apache.org/maven2/org/eclipse/tycho/sisu-equinox-launching/0.18.1/sisu-equinox-launching-0.18.1.jar (28 KB at 114.1 KB/sec)
Downloaded: http://repo.maven.apache.org/maven2/org/ow2/asm/asm-debug-all/4.0/asm-debug-all-4.0.jar (314 KB at 605.1 KB/sec)
Downloading: http://repo.maven.apache.org/maven2/org/apache/maven/plugins/maven-resources-plugin/2.4.3/maven-resources-plugin-2.4.3.pom
Downloaded: http://repo.maven.apache.org/maven2/org/apache/maven/plugins/maven-resources-plugin/2.4.3/maven-resources-plugin-2.4.3.pom (6 KB at 38.7 KB/sec)
Downloading: http://repo.maven.apache.org/maven2/org/apache/maven/plugins/maven-resources-plugin/2.4.3/maven-resources-plugin-2.4.3.jar
Downloaded: http://repo.maven.apache.org/maven2/org/apache/maven/plugins/maven-resources-plugin/2.4.3/maven-resources-plugin-2.4.3.jar (24 KB at 123.0 KB/sec)
Downloading: http://repo.maven.apache.org/maven2/org/eclipse/tycho/tycho-compiler-plugin/0.18.1/tycho-compiler-plugin-0.18.1.pom
Downloaded: http://repo.maven.apache.org/maven2/org/eclipse/tycho/tycho-compiler-plugin/0.18.1/tycho-compiler-plugin-0.18.1.pom (3 KB at 16.6 KB/sec)
Downloading: http://repo.maven.apache.org/maven2/org/eclipse/tycho/tycho-compiler-plugin/0.18.1/tycho-compiler-plugin-0.18.1.jar
Downloaded: http://repo.maven.apache.org/maven2/org/eclipse/tycho/tycho-compiler-plugin/0.18.1/tycho-compiler-plugin-0.18.1.jar (27 KB at 134.5 KB/sec)
Downloading: http://repo.maven.apache.org/maven2/org/apache/maven/plugins/maven-deploy-plugin/2.5/maven-deploy-plugin-2.5.pom
Downloaded: http://repo.maven.apache.org/maven2/org/apache/maven/plugins/maven-deploy-plugin/2.5/maven-deploy-plugin-2.5.pom (6 KB at 36.7 KB/sec)
Downloading: http://repo.maven.apache.org/maven2/org/apache/maven/plugins/maven-plugins/16/maven-plugins-16.pom
Downloaded: http://repo.maven.apache.org/maven2/org/apache/maven/plugins/maven-plugins/16/maven-plugins-16.pom (13 KB at 83.7 KB/sec)
Downloading: http://repo.maven.apache.org/maven2/org/apache/maven/plugins/maven-deploy-plugin/2.5/maven-deploy-plugin-2.5.jar
Downloaded: http://repo.maven.apache.org/maven2/org/apache/maven/plugins/maven-deploy-plugin/2.5/maven-deploy-plugin-2.5.jar (23 KB at 115.6 KB/sec)
Downloading: http://repo.maven.apache.org/maven2/org/apache/maven/plugins/maven-site-plugin/3.3/maven-site-plugin-3.3.pom
Downloaded: http://repo.maven.apache.org/maven2/org/apache/maven/plugins/maven-site-plugin/3.3/maven-site-plugin-3.3.pom (21 KB at 104.8 KB/sec)
Downloading: http://repo.maven.apache.org/maven2/org/apache/maven/plugins/maven-plugins/24/maven-plugins-24.pom
Downloaded: http://repo.maven.apache.org/maven2/org/apache/maven/plugins/maven-plugins/24/maven-plugins-24.pom (11 KB at 70.4 KB/sec)
Downloading: http://repo.maven.apache.org/maven2/org/apache/maven/maven-parent/23/maven-parent-23.pom
Downloaded: http://repo.maven.apache.org/maven2/org/apache/maven/maven-parent/23/maven-parent-23.pom (32 KB at 163.2 KB/sec)
Downloading: http://repo.maven.apache.org/maven2/org/apache/apache/13/apache-13.pom
Downloaded: http://repo.maven.apache.org/maven2/org/apache/apache/13/apache-13.pom (14 KB at 92.8 KB/sec)
Downloading: http://repo.maven.apache.org/maven2/org/apache/maven/plugins/maven-site-plugin/3.3/maven-site-plugin-3.3.jar
Downloaded: http://repo.maven.apache.org/maven2/org/apache/maven/plugins/maven-site-plugin/3.3/maven-site-plugin-3.3.jar (122 KB at 364.7 KB/sec)
[WARNING] No explicit target runtime environment configuration. Build is platform dependent.
[INFO] Computing target platform for MavenProject: org.eclipse.viatra:org.eclipse.viatra.modelobfuscator.runtime:0.7.0-SNAPSHOT @ /jobs/genie.modeling.viatra/viatra-modelobfuscator-master-maven/workspace/plugins/org.eclipse.viatra.modelobfuscator.runtime/pom.xml
[INFO] Resolving dependencies of MavenProject: org.eclipse.viatra:org.eclipse.viatra.modelobfuscator.runtime:0.7.0-SNAPSHOT @ /jobs/genie.modeling.viatra/viatra-modelobfuscator-master-maven/workspace/plugins/org.eclipse.viatra.modelobfuscator.runtime/pom.xml
[INFO] Downloading org.eclipse.equinox.preferences
[INFO] Downloading org.eclipse.core.contenttype
[INFO] Downloading org.eclipse.osgi
[INFO] Downloading org.eclipse.equinox.registry
[INFO] Fetching R-3.7.2-201202080800&format=xml&protocol=http&countryCode=us&timeZone=-5&format=xml from http://www.eclipse.org/downloads/download.php?file=/eclipse/updates/3.7/ (0B at 0B/s)
[INFO] Fetching R-3.7.2-201202080800&format=xml&protocol=http&countryCode=us&timeZone=-5&format=xml from http://www.eclipse.org/downloads/download.php?file=/eclipse/updates/3.7/ (63B at 0B/s)
[INFO] Fetching org.eclipse.osgi_3.7.2.v20120110-1415.jar.pack.gz from http://download.eclipse.org/eclipse/updates/3.7/R-3.7.2-201202080800/plugins/ (0B of 448.11kB at 0B/s)
[INFO] Fetching org.eclipse.equinox.preferences_3.4.2.v20120111-2020.jar.pack.gz from http://download.eclipse.org/eclipse/updates/3.7/R-3.7.2-201202080800/plugins/ (0B of 44.08kB at 0B/s)
[INFO] 1 operation remaining.
[INFO] Fetching org.eclipse.equinox.preferences_3.4.2.v20120111-2020.jar.pack.gz from http://download.eclipse.org/eclipse/updates/3.7/R-3.7.2-201202080800/plugins/ (1.13kB of 44.08kB at 0B/s)
[INFO] Fetching org.eclipse.osgi_3.7.2.v20120110-1415.jar.pack.gz from http://download.eclipse.org/eclipse/updates/3.7/R-3.7.2-201202080800/plugins/ (3.96kB of 448.11kB at 0B/s)
[INFO] Fetching org.eclipse.core.contenttype_3.4.100.v20110423-0524.jar.pack.gz from http://download.eclipse.org/eclipse/updates/3.7/R-3.7.2-201202080800/plugins/ (0B of 33.54kB at 0B/s)
[INFO] 1 operation remaining.
[INFO] Fetching org.eclipse.equinox.registry_3.5.101.R37x_v20110810-1611.jar.pack.gz from http://download.eclipse.org/eclipse/updates/3.7/R-3.7.2-201202080800/plugins/ (0B of 66.67kB at 0B/s)
[INFO] 1 operation remaining.
[INFO] Fetching org.eclipse.equinox.registry_3.5.101.R37x_v20110810-1611.jar.pack.gz from http://download.eclipse.org/eclipse/updates/3.7/R-3.7.2-201202080800/plugins/ (1.13kB of 66.67kB at 0B/s)
[INFO] Fetching org.eclipse.core.contenttype_3.4.100.v20110423-0524.jar.pack.gz from http://download.eclipse.org/eclipse/updates/3.7/R-3.7.2-201202080800/plugins/ (4kB of 33.54kB at 0B/s)
[INFO] Downloading org.eclipse.equinox.common
[INFO] Downloading org.eclipse.core.jobs
[INFO] Fetching org.eclipse.equinox.common_3.6.0.v20110523.jar.pack.gz from http://download.eclipse.org/eclipse/updates/3.7/R-3.7.2-201202080800/plugins/ (0B of 42.3kB at 0B/s)
[INFO] 1 operation remaining.
[INFO] Fetching org.eclipse.equinox.common_3.6.0.v20110523.jar.pack.gz from http://download.eclipse.org/eclipse/updates/3.7/R-3.7.2-201202080800/plugins/ (1.13kB of 42.3kB at 0B/s)
[INFO] Downloading org.eclipse.core.runtime
[INFO] Fetching org.eclipse.core.jobs_3.5.101.v20120113-1953.jar.pack.gz from http://download.eclipse.org/eclipse/updates/3.7/R-3.7.2-201202080800/plugins/ (0B of 36.34kB at 0B/s)
[INFO] 1 operation remaining.
[INFO] Fetching org.eclipse.core.jobs_3.5.101.v20120113-1953.jar.pack.gz from http://download.eclipse.org/eclipse/updates/3.7/R-3.7.2-201202080800/plugins/ (1.13kB of 36.34kB at 0B/s)
[INFO] Fetching org.eclipse.core.runtime_3.7.0.v20110110.jar.pack.gz from http://download.eclipse.org/eclipse/updates/3.7/R-3.7.2-201202080800/plugins/ (0B of 29.54kB at 0B/s)
[INFO] 1 operation remaining.
[INFO] Fetching org.eclipse.core.runtime_3.7.0.v20110110.jar.pack.gz from http://download.eclipse.org/eclipse/updates/3.7/R-3.7.2-201202080800/plugins/ (1.13kB of 29.54kB at 0B/s)
[INFO] Downloading org.eclipse.core.runtime.compatibility.auth
[INFO] Downloading org.eclipse.equinox.app
[INFO] Downloading org.eclipse.osgi.services
[INFO] Fetching org.eclipse.core.runtime.compatibility.auth_3.2.200.v20110110.jar.pack.gz from http://download.eclipse.org/eclipse/updates/3.7/R-3.7.2-201202080800/plugins/ (0B of 12.18kB at 0B/s)
[INFO] Fetching org.eclipse.equinox.app_1.3.100.v20110321.jar.pack.gz from http://download.eclipse.org/eclipse/updates/3.7/R-3.7.2-201202080800/plugins/ (0B of 37.82kB at 0B/s)
[INFO] 1 operation remaining.
[INFO] Fetching org.eclipse.core.runtime.compatibility.auth_3.2.200.v20110110.jar.pack.gz from http://download.eclipse.org/eclipse/updates/3.7/R-3.7.2-201202080800/plugins/ (1.13kB of 12.18kB at 0B/s)
[INFO] Fetching org.eclipse.equinox.app_1.3.100.v20110321.jar.pack.gz from http://download.eclipse.org/eclipse/updates/3.7/R-3.7.2-201202080800/plugins/ (1.13kB of 37.82kB at 0B/s)
[INFO] Fetching org.eclipse.osgi.services_3.3.0.v20110513.jar.pack.gz from http://download.eclipse.org/eclipse/updates/3.7/R-3.7.2-201202080800/plugins/ (0B of 27.28kB at 0B/s)
[INFO] 1 operation remaining.
[INFO] Fetching org.eclipse.osgi.services_3.3.0.v20110513.jar.pack.gz from http://download.eclipse.org/eclipse/updates/3.7/R-3.7.2-201202080800/plugins/ (1.13kB of 27.28kB at 0B/s)
[INFO] Downloading com.google.guava
[INFO] Fetching mwe&format=xml&countryCode=us&timeZone=-5&format=xml from http://www.eclipse.org/downloads/download.php?file=//modeling/emft/mwe/updates/releases/R201406110919/ (0B at 0B/s)
[INFO] Fetching mwe&format=xml&countryCode=us&timeZone=-5&format=xml from http://www.eclipse.org/downloads/download.php?file=//modeling/emft/mwe/updates/releases/R201406110919/ (63B at 0B/s)
[INFO] Fetching com.google.guava_15.0.0.v201403281430.jar.pack.gz from http://download.eclipse.org/modeling/emft/mwe/updates/releases/R201406110919/mwe/plugins/ (0B of 592.33kB at 0B/s)
[INFO] Fetching com.google.guava_15.0.0.v201403281430.jar.pack.gz from http://download.eclipse.org/modeling/emft/mwe/updates/releases/R201406110919/mwe/plugins/ (1.13kB of 592.33kB at 0B/s)
[INFO] 1 operation remaining.
[INFO] Downloading org.eclipse.xtend.lib
[INFO] Downloading org.eclipse.xtext.xbase.lib
[INFO] Fetching R201406120726&format=xml&countryCode=us&timeZone=-5&format=xml from http://www.eclipse.org/downloads/download.php?file=//modeling/tmf/xtext/updates/releases/head/ (0B at 0B/s)
[INFO] Fetching R201406120726&format=xml&countryCode=us&timeZone=-5&format=xml from http://www.eclipse.org/downloads/download.php?file=//modeling/tmf/xtext/updates/releases/head/ (63B at 0B/s)
[INFO] Fetching org.eclipse.xtext.xbase.lib_2.6.1.v201406120726.jar.pack.gz from http://download.eclipse.org/modeling/tmf/xtext/updates/releases/head/R201406120726/plugins/ (0B of 33.67kB at 0B/s)
[INFO] Fetching org.eclipse.xtend.lib_2.6.1.v201406120726.jar.pack.gz from http://download.eclipse.org/modeling/tmf/xtext/updates/releases/head/R201406120726/plugins/ (0B of 17.16kB at 0B/s)
[INFO] 1 operation remaining.
[INFO] Fetching org.eclipse.xtend.lib_2.6.1.v201406120726.jar.pack.gz from http://download.eclipse.org/modeling/tmf/xtext/updates/releases/head/R201406120726/plugins/ (3.96kB of 17.16kB at 0B/s)
[INFO] Fetching org.eclipse.xtext.xbase.lib_2.6.1.v201406120726.jar.pack.gz from http://download.eclipse.org/modeling/tmf/xtext/updates/releases/head/R201406120726/plugins/ (3.96kB of 33.67kB at 0B/s)
[INFO] Downloading org.eclipse.emf.common
[INFO] Downloading org.eclipse.emf.ecore
[INFO] Fetching R201405190339&format=xml&countryCode=us&timeZone=-5&format=xml from http://www.eclipse.org/downloads/download.php?file=//modeling/emf/emf/updates/2.10/core/ (0B at 0B/s)
[INFO] Fetching R201405190339&format=xml&countryCode=us&timeZone=-5&format=xml from http://www.eclipse.org/downloads/download.php?file=//modeling/emf/emf/updates/2.10/core/ (63B at 0B/s)
[INFO] Fetching org.eclipse.emf.ecore_2.10.0.v20140514-1158.jar.pack.gz from http://download.eclipse.org/modeling/emf/emf/updates/2.10/core/R201405190339/plugins/ (0B of 361.64kB at 0B/s)
[INFO] 1 operation remaining.
[INFO] Fetching org.eclipse.emf.ecore_2.10.0.v20140514-1158.jar.pack.gz from http://download.eclipse.org/modeling/emf/emf/updates/2.10/core/R201405190339/plugins/ (3.96kB of 361.64kB at 0B/s)
[INFO] Fetching org.eclipse.emf.common_2.10.0.v20140514-1158.jar.pack.gz from http://download.eclipse.org/modeling/emf/emf/updates/2.10/core/R201405190339/plugins/ (0B of 103.3kB at 0B/s)
[INFO] 1 operation remaining.
[INFO] Fetching org.eclipse.emf.common_2.10.0.v20140514-1158.jar.pack.gz from http://download.eclipse.org/modeling/emf/emf/updates/2.10/core/R201405190339/plugins/ (1.13kB of 103.3kB at 0B/s)
[INFO] Resolving class path of MavenProject: org.eclipse.viatra:org.eclipse.viatra.modelobfuscator.runtime:0.7.0-SNAPSHOT @ /jobs/genie.modeling.viatra/viatra-modelobfuscator-master-maven/workspace/plugins/org.eclipse.viatra.modelobfuscator.runtime/pom.xml
[INFO] Computing target platform for MavenProject: org.eclipse.viatra:org.eclipse.viatra.modelobfuscator.ui:0.7.0-SNAPSHOT @ /jobs/genie.modeling.viatra/viatra-modelobfuscator-master-maven/workspace/plugins/org.eclipse.viatra.modelobfuscator.ui/pom.xml
[INFO] Resolving dependencies of MavenProject: org.eclipse.viatra:org.eclipse.viatra.modelobfuscator.ui:0.7.0-SNAPSHOT @ /jobs/genie.modeling.viatra/viatra-modelobfuscator-master-maven/workspace/plugins/org.eclipse.viatra.modelobfuscator.ui/pom.xml
[INFO] Downloading org.eclipse.core.variables
[INFO] Downloading org.eclipse.ant.core
[INFO] Downloading org.eclipse.core.commands
[INFO] Downloading org.eclipse.core.databinding
[INFO] Fetching org.eclipse.ant.core_3.2.302.v20120110-1739.jar.pack.gz from http://download.eclipse.org/eclipse/updates/3.7/R-3.7.2-201202080800/plugins/ (0B of 46.61kB at 0B/s)
[INFO] 1 operation remaining.
[INFO] Fetching org.eclipse.ant.core_3.2.302.v20120110-1739.jar.pack.gz from http://download.eclipse.org/eclipse/updates/3.7/R-3.7.2-201202080800/plugins/ (3.96kB of 46.61kB at 0B/s)
[INFO] Fetching org.eclipse.core.commands_3.6.0.I20110111-0800.jar.pack.gz from http://download.eclipse.org/eclipse/updates/3.7/R-3.7.2-201202080800/plugins/ (0B of 34.32kB at 0B/s)
[INFO] 1 operation remaining.
[INFO] Fetching org.eclipse.core.commands_3.6.0.I20110111-0800.jar.pack.gz from http://download.eclipse.org/eclipse/updates/3.7/R-3.7.2-201202080800/plugins/ (1.13kB of 34.32kB at 0B/s)
[INFO] Fetching org.eclipse.core.variables_3.2.500.v20110928-1503.jar.pack.gz from http://download.eclipse.org/eclipse/updates/3.7/R-3.7.2-201202080800/plugins/ (0B of 15.1kB at 0B/s)
[INFO] 1 operation remaining.
[INFO] Fetching org.eclipse.core.variables_3.2.500.v20110928-1503.jar.pack.gz from http://download.eclipse.org/eclipse/updates/3.7/R-3.7.2-201202080800/plugins/ (3.96kB of 15.1kB at 0B/s)
[INFO] Fetching org.eclipse.core.databinding_1.4.0.I20110111-0800.jar.pack.gz from http://download.eclipse.org/eclipse/updates/3.7/R-3.7.2-201202080800/plugins/ (0B of 50.7kB at 0B/s)
[INFO] 1 operation remaining.
[INFO] Fetching org.eclipse.core.databinding_1.4.0.I20110111-0800.jar.pack.gz from http://download.eclipse.org/eclipse/updates/3.7/R-3.7.2-201202080800/plugins/ (1.13kB of 50.7kB at 0B/s)
[INFO] Downloading org.eclipse.core.databinding.observable
[INFO] Fetching org.eclipse.core.databinding.observable_1.4.0.I20110222-0800.jar.pack.gz from http://download.eclipse.org/eclipse/updates/3.7/R-3.7.2-201202080800/plugins/ (0B of 65.67kB at 0B/s)
[INFO] 1 operation remaining.
[INFO] Fetching org.eclipse.core.databinding.observable_1.4.0.I20110222-0800.jar.pack.gz from http://download.eclipse.org/eclipse/updates/3.7/R-3.7.2-201202080800/plugins/ (1.13kB of 65.67kB at 0B/s)
[INFO] Downloading org.eclipse.core.databinding.property
[INFO] Fetching org.eclipse.core.databinding.property_1.4.0.I20110222-0800.jar.pack.gz from http://download.eclipse.org/eclipse/updates/3.7/R-3.7.2-201202080800/plugins/ (0B of 35.73kB at 0B/s)
[INFO] 1 operation remaining.
[INFO] Fetching org.eclipse.core.databinding.property_1.4.0.I20110222-0800.jar.pack.gz from http://download.eclipse.org/eclipse/updates/3.7/R-3.7.2-201202080800/plugins/ (3.96kB of 35.73kB at 0B/s)
[INFO] Fetching org.eclipse.ant.core_3.2.302.v20120110-1739.jar from http://download.eclipse.org/eclipse/updates/3.7/R-3.7.2-201202080800/plugins/ (0B of 95.58kB at 0B/s)
[INFO] 1 operation remaining.
[INFO] Fetching org.eclipse.ant.core_3.2.302.v20120110-1739.jar from http://download.eclipse.org/eclipse/updates/3.7/R-3.7.2-201202080800/plugins/ (3.95kB of 95.58kB at 0B/s)
[INFO] Downloading com.ibm.icu
[INFO] Fetching com.ibm.icu_4.4.2.v20110823.jar from http://download.eclipse.org/eclipse/updates/3.7/R-3.7.2-201202080800/plugins/ (0B of 6.39MB at 0B/s)
[INFO] 1 operation remaining.
[INFO] Fetching com.ibm.icu_4.4.2.v20110823.jar from http://download.eclipse.org/eclipse/updates/3.7/R-3.7.2-201202080800/plugins/ (3.95kB of 6.39MB at 0B/s)
[INFO] Downloading org.eclipse.core.expressions
[INFO] Fetching org.eclipse.core.expressions_3.4.300.v20110228.jar.pack.gz from http://download.eclipse.org/eclipse/updates/3.7/R-3.7.2-201202080800/plugins/ (0B of 27.85kB at 0B/s)
[INFO] 1 operation remaining.
[INFO] Fetching org.eclipse.core.expressions_3.4.300.v20110228.jar.pack.gz from http://download.eclipse.org/eclipse/updates/3.7/R-3.7.2-201202080800/plugins/ (1.13kB of 27.85kB at 0B/s)
[INFO] Downloading org.eclipse.core.filesystem
[INFO] Fetching org.eclipse.core.filesystem_1.3.100.v20110423-0524.jar.pack.gz from http://download.eclipse.org/eclipse/updates/3.7/R-3.7.2-201202080800/plugins/ (0B of 21.55kB at 0B/s)
[INFO] 1 operation remaining.
[INFO] Fetching org.eclipse.core.filesystem_1.3.100.v20110423-0524.jar.pack.gz from http://download.eclipse.org/eclipse/updates/3.7/R-3.7.2-201202080800/plugins/ (1.13kB of 21.55kB at 0B/s)
[INFO] Downloading org.eclipse.core.resources
[INFO] Fetching org.eclipse.core.resources_3.7.101.v20120125-1505.jar.pack.gz from http://download.eclipse.org/eclipse/updates/3.7/R-3.7.2-201202080800/plugins/ (0B of 272.5kB at 0B/s)
[INFO] 1 operation remaining.
[INFO] Fetching org.eclipse.core.resources_3.7.101.v20120125-1505.jar.pack.gz from http://download.eclipse.org/eclipse/updates/3.7/R-3.7.2-201202080800/plugins/ (3.96kB of 272.5kB at 0B/s)
[INFO] Downloading org.eclipse.help
[INFO] Fetching org.eclipse.help_3.5.100.v20110426.jar.pack.gz from http://download.eclipse.org/eclipse/updates/3.7/R-3.7.2-201202080800/plugins/ (0B of 106.26kB at 0B/s)
[INFO] 1 operation remaining.
[INFO] Fetching org.eclipse.help_3.5.100.v20110426.jar.pack.gz from http://download.eclipse.org/eclipse/updates/3.7/R-3.7.2-201202080800/plugins/ (3.96kB of 106.26kB at 0B/s)
[INFO] Downloading org.eclipse.jface
[INFO] Fetching org.eclipse.jface_3.7.0.v20110928-1505.jar.pack.gz from http://download.eclipse.org/eclipse/updates/3.7/R-3.7.2-201202080800/plugins/ (0B of 312.33kB at 0B/s)
[INFO] 1 operation remaining.
[INFO] Fetching org.eclipse.jface_3.7.0.v20110928-1505.jar.pack.gz from http://download.eclipse.org/eclipse/updates/3.7/R-3.7.2-201202080800/plugins/ (3.96kB of 312.33kB at 0B/s)
[INFO] Downloading org.eclipse.swt
[INFO] Fetching org.eclipse.swt_3.7.2.v3740f.jar.pack.gz from http://download.eclipse.org/eclipse/updates/3.7/R-3.7.2-201202080800/plugins/ (0B of 15.47kB at 0B/s)
[INFO] 1 operation remaining.
[INFO] Fetching org.eclipse.swt_3.7.2.v3740f.jar.pack.gz from http://download.eclipse.org/eclipse/updates/3.7/R-3.7.2-201202080800/plugins/ (1.13kB of 15.47kB at 0B/s)
[INFO] Downloading org.eclipse.jface.databinding
[INFO] Fetching org.eclipse.jface.databinding_1.5.0.I20100907-0800.jar.pack.gz from http://download.eclipse.org/eclipse/updates/3.7/R-3.7.2-201202080800/plugins/ (0B of 58.45kB at 0B/s)
[INFO] 1 operation remaining.
[INFO] Fetching org.eclipse.jface.databinding_1.5.0.I20100907-0800.jar.pack.gz from http://download.eclipse.org/eclipse/updates/3.7/R-3.7.2-201202080800/plugins/ (1.13kB of 58.45kB at 0B/s)
[INFO] Downloading org.eclipse.ui
[INFO] Fetching org.eclipse.core.resources_3.7.101.v20120125-1505.jar from http://download.eclipse.org/eclipse/updates/3.7/R-3.7.2-201202080800/plugins/ (0B of 788.32kB at 0B/s)
[INFO] 1 operation remaining.
[INFO] Fetching org.eclipse.core.resources_3.7.101.v20120125-1505.jar from http://download.eclipse.org/eclipse/updates/3.7/R-3.7.2-201202080800/plugins/ (3.95kB of 788.32kB at 0B/s)
[INFO] Fetching org.eclipse.ui_3.7.0.v20110928-1505.jar.pack.gz from http://download.eclipse.org/eclipse/updates/3.7/R-3.7.2-201202080800/plugins/ (0B of 91.63kB at 0B/s)
[INFO] 1 operation remaining.
[INFO] Fetching org.eclipse.ui_3.7.0.v20110928-1505.jar.pack.gz from http://download.eclipse.org/eclipse/updates/3.7/R-3.7.2-201202080800/plugins/ (1.13kB of 91.63kB at 0B/s)
[INFO] Downloading org.eclipse.ui.workbench
[INFO] Fetching org.eclipse.ui.workbench_3.7.1.v20120104-1859.jar.pack.gz from http://download.eclipse.org/eclipse/updates/3.7/R-3.7.2-201202080800/plugins/ (0B of 1.14MB at 0B/s)
[INFO] 1 operation remaining.
[INFO] Fetching org.eclipse.ui.workbench_3.7.1.v20120104-1859.jar.pack.gz from http://download.eclipse.org/eclipse/updates/3.7/R-3.7.2-201202080800/plugins/ (3.96kB of 1.14MB at 0B/s)
[INFO] Downloading org.eclipse.swt.gtk.linux.x86_64
[INFO] Fetching org.eclipse.swt.gtk.linux.x86_64_3.7.2.v3740f.jar.pack.gz from http://download.eclipse.org/eclipse/updates/3.7/R-3.7.2-201202080800/plugins/ (0B of 1.18MB at 0B/s)
[INFO] 1 operation remaining.
[INFO] Fetching org.eclipse.swt.gtk.linux.x86_64_3.7.2.v3740f.jar.pack.gz from http://download.eclipse.org/eclipse/updates/3.7/R-3.7.2-201202080800/plugins/ (1.13kB of 1.18MB at 0B/s)
[INFO] Downloading org.eclipse.emf.transaction
[INFO] Downloading org.eclipse.emf.validation
[INFO] Fetching &countryCode=us&timeZone=-5&format=xml from http://www.eclipse.org/downloads/download.php?format=xml&file=/releases/indigo/201202240900/aggregate/ (0B at 0B/s)
[INFO] Fetching &countryCode=us&timeZone=-5&format=xml from http://www.eclipse.org/downloads/download.php?format=xml&file=/releases/indigo/201202240900/aggregate/ (63B at 0B/s)
[INFO] Fetching org.eclipse.emf.validation_1.4.0.v20100428-2315.jar.pack.gz from http://download.eclipse.org/releases/indigo/201202240900/aggregate/plugins/ (0B of 122.57kB at 0B/s)
[INFO] 1 operation remaining.
[INFO] Fetching org.eclipse.emf.validation_1.4.0.v20100428-2315.jar.pack.gz from http://download.eclipse.org/releases/indigo/201202240900/aggregate/plugins/ (1.13kB of 122.57kB at 0B/s)
[INFO] Fetching org.eclipse.emf.transaction_1.4.0.v20100331-1738.jar.pack.gz from http://download.eclipse.org/releases/indigo/201202240900/aggregate/plugins/ (0B of 52.31kB at 0B/s)
[INFO] 1 operation remaining.
[INFO] Fetching org.eclipse.emf.transaction_1.4.0.v20100331-1738.jar.pack.gz from http://download.eclipse.org/releases/indigo/201202240900/aggregate/plugins/ (3.96kB of 52.31kB at 0B/s)
[INFO] Downloading org.eclipse.emf.edit
[INFO] Downloading org.eclipse.emf.ecore.change
[INFO] Fetching org.eclipse.emf.edit_2.10.0.v20140519-0339.jar.pack.gz from http://download.eclipse.org/modeling/emf/emf/updates/2.10/core/R201405190339/plugins/ (0B of 88.26kB at 0B/s)
[INFO] 1 operation remaining.
[INFO] Fetching org.eclipse.emf.ecore.change_2.10.0.v20140514-1158.jar.pack.gz from http://download.eclipse.org/modeling/emf/emf/updates/2.10/core/R201405190339/plugins/ (0B of 35.53kB at 0B/s)
[INFO] 1 operation remaining.
[INFO] Fetching org.eclipse.emf.edit_2.10.0.v20140519-0339.jar.pack.gz from http://download.eclipse.org/modeling/emf/emf/updates/2.10/core/R201405190339/plugins/ (1.13kB of 88.26kB at 0B/s)
[INFO] Fetching org.eclipse.emf.ecore.change_2.10.0.v20140514-1158.jar.pack.gz from http://download.eclipse.org/modeling/emf/emf/updates/2.10/core/R201405190339/plugins/ (3.96kB of 35.53kB at 0B/s)
[INFO] Resolving class path of MavenProject: org.eclipse.viatra:org.eclipse.viatra.modelobfuscator.ui:0.7.0-SNAPSHOT @ /jobs/genie.modeling.viatra/viatra-modelobfuscator-master-maven/workspace/plugins/org.eclipse.viatra.modelobfuscator.ui/pom.xml
[INFO] ------------------------------------------------------------------------
[INFO] Reactor Build Order:
[INFO] 
[INFO] VIATRA Model Obfuscator
[INFO] org.eclipse.viatra.modelobfuscator.runtime
[INFO] org.eclipse.viatra.modelobfuscator.ui
[INFO] org.eclipse.viatra.modelobfuscator.target
[INFO] VIATRA Model Obfuscator
[INFO]                                                                         
[INFO] ------------------------------------------------------------------------
[INFO] Building VIATRA Model Obfuscator 0.7.0-SNAPSHOT
[INFO] ------------------------------------------------------------------------
Downloading: http://repo.maven.apache.org/maven2/org/apache/maven/plugins/maven-install-plugin/2.4/maven-install-plugin-2.4.pom
Downloaded: http://repo.maven.apache.org/maven2/org/apache/maven/plugins/maven-install-plugin/2.4/maven-install-plugin-2.4.pom (7 KB at 39.4 KB/sec)
Downloading: http://repo.maven.apache.org/maven2/org/apache/maven/plugins/maven-plugins/23/maven-plugins-23.pom
Downloaded: http://repo.maven.apache.org/maven2/org/apache/maven/plugins/maven-plugins/23/maven-plugins-23.pom (9 KB at 88.9 KB/sec)
Downloading: http://repo.maven.apache.org/maven2/org/apache/maven/maven-parent/22/maven-parent-22.pom
Downloaded: http://repo.maven.apache.org/maven2/org/apache/maven/maven-parent/22/maven-parent-22.pom (30 KB at 232.4 KB/sec)
Downloading: http://repo.maven.apache.org/maven2/org/apache/apache/11/apache-11.pom
Downloaded: http://repo.maven.apache.org/maven2/org/apache/apache/11/apache-11.pom (15 KB at 114.8 KB/sec)
Downloading: http://repo.maven.apache.org/maven2/org/apache/maven/plugins/maven-install-plugin/2.4/maven-install-plugin-2.4.jar
Downloaded: http://repo.maven.apache.org/maven2/org/apache/maven/plugins/maven-install-plugin/2.4/maven-install-plugin-2.4.jar (27 KB at 210.6 KB/sec)
Downloading: http://repo.maven.apache.org/maven2/org/apache/maven/plugins/maven-deploy-plugin/2.7/maven-deploy-plugin-2.7.pom
Downloaded: http://repo.maven.apache.org/maven2/org/apache/maven/plugins/maven-deploy-plugin/2.7/maven-deploy-plugin-2.7.pom (6 KB at 51.7 KB/sec)
Downloading: http://repo.maven.apache.org/maven2/org/apache/maven/plugins/maven-deploy-plugin/2.7/maven-deploy-plugin-2.7.jar
Downloaded: http://repo.maven.apache.org/maven2/org/apache/maven/plugins/maven-deploy-plugin/2.7/maven-deploy-plugin-2.7.jar (27 KB at 208.0 KB/sec)
[INFO] 
[INFO] --- maven-clean-plugin:2.5:clean (default-clean) @ org.eclipse.viatra.modelobfuscator.parent ---
Downloading: http://repo.maven.apache.org/maven2/org/apache/maven/maven-plugin-api/2.0.6/maven-plugin-api-2.0.6.pom
Downloaded: http://repo.maven.apache.org/maven2/org/apache/maven/maven-plugin-api/2.0.6/maven-plugin-api-2.0.6.pom (2 KB at 13.7 KB/sec)
Downloading: http://repo.maven.apache.org/maven2/org/apache/maven/maven/2.0.6/maven-2.0.6.pom
Downloaded: http://repo.maven.apache.org/maven2/org/apache/maven/maven/2.0.6/maven-2.0.6.pom (9 KB at 83.3 KB/sec)
Downloading: http://repo.maven.apache.org/maven2/org/apache/maven/maven-parent/5/maven-parent-5.pom
Downloaded: http://repo.maven.apache.org/maven2/org/apache/maven/maven-parent/5/maven-parent-5.pom (15 KB at 121.0 KB/sec)
Downloading: http://repo.maven.apache.org/maven2/org/apache/apache/3/apache-3.pom
Downloaded: http://repo.maven.apache.org/maven2/org/apache/apache/3/apache-3.pom (4 KB at 31.3 KB/sec)
Downloading: http://repo.maven.apache.org/maven2/org/codehaus/plexus/plexus-utils/3.0/plexus-utils-3.0.pom
Downloaded: http://repo.maven.apache.org/maven2/org/codehaus/plexus/plexus-utils/3.0/plexus-utils-3.0.pom (4 KB at 38.6 KB/sec)
Downloading: http://repo.maven.apache.org/maven2/org/sonatype/spice/spice-parent/16/spice-parent-16.pom
Downloaded: http://repo.maven.apache.org/maven2/org/sonatype/spice/spice-parent/16/spice-parent-16.pom (9 KB at 80.0 KB/sec)
Downloading: http://repo.maven.apache.org/maven2/org/sonatype/forge/forge-parent/5/forge-parent-5.pom
Downloaded: http://repo.maven.apache.org/maven2/org/sonatype/forge/forge-parent/5/forge-parent-5.pom (9 KB at 79.3 KB/sec)
Downloading: http://repo.maven.apache.org/maven2/org/codehaus/plexus/plexus-utils/3.0/plexus-utils-3.0.jar
Downloaded: http://repo.maven.apache.org/maven2/org/codehaus/plexus/plexus-utils/3.0/plexus-utils-3.0.jar (221 KB at 904.8 KB/sec)
[INFO] 
[INFO] --- jacoco-maven-plugin:0.6.3.201306030806:prepare-agent (default) @ org.eclipse.viatra.modelobfuscator.parent ---
Downloading: http://repo.maven.apache.org/maven2/org/apache/maven/maven-plugin-api/2.1.0/maven-plugin-api-2.1.0.pom
Downloaded: http://repo.maven.apache.org/maven2/org/apache/maven/maven-plugin-api/2.1.0/maven-plugin-api-2.1.0.pom (2 KB at 13.7 KB/sec)
Downloading: http://repo.maven.apache.org/maven2/org/apache/maven/maven/2.1.0/maven-2.1.0.pom
Downloaded: http://repo.maven.apache.org/maven2/org/apache/maven/maven/2.1.0/maven-2.1.0.pom (22 KB at 167.1 KB/sec)
Downloading: http://repo.maven.apache.org/maven2/org/apache/maven/maven-project/2.1.0/maven-project-2.1.0.pom
Downloaded: http://repo.maven.apache.org/maven2/org/apache/maven/maven-project/2.1.0/maven-project-2.1.0.pom (3 KB at 26.3 KB/sec)
Downloading: http://repo.maven.apache.org/maven2/org/apache/maven/maven-settings/2.1.0/maven-settings-2.1.0.pom
Downloaded: http://repo.maven.apache.org/maven2/org/apache/maven/maven-settings/2.1.0/maven-settings-2.1.0.pom (3 KB at 20.6 KB/sec)
Downloading: http://repo.maven.apache.org/maven2/org/apache/maven/maven-model/2.1.0/maven-model-2.1.0.pom
Downloaded: http://repo.maven.apache.org/maven2/org/apache/maven/maven-model/2.1.0/maven-model-2.1.0.pom (4 KB at 31.0 KB/sec)
Downloading: http://repo.maven.apache.org/maven2/org/codehaus/plexus/plexus-utils/1.5.6/plexus-utils-1.5.6.pom
Downloaded: http://repo.maven.apache.org/maven2/org/codehaus/plexus/plexus-utils/1.5.6/plexus-utils-1.5.6.pom (6 KB at 50.3 KB/sec)
Downloading: http://repo.maven.apache.org/maven2/org/codehaus/plexus/plexus/1.0.12/plexus-1.0.12.pom
Downloaded: http://repo.maven.apache.org/maven2/org/codehaus/plexus/plexus/1.0.12/plexus-1.0.12.pom (10 KB at 92.0 KB/sec)
Downloading: http://repo.maven.apache.org/maven2/org/codehaus/plexus/plexus-interpolation/1.8.1/plexus-interpolation-1.8.1.pom
Downloaded: http://repo.maven.apache.org/maven2/org/codehaus/plexus/plexus-interpolation/1.8.1/plexus-interpolation-1.8.1.pom (880 B at 8.2 KB/sec)
Downloading: http://repo.maven.apache.org/maven2/org/codehaus/plexus/plexus/1.0.13/plexus-1.0.13.pom
Downloaded: http://repo.maven.apache.org/maven2/org/codehaus/plexus/plexus/1.0.13/plexus-1.0.13.pom (11 KB at 102.5 KB/sec)
Downloading: http://repo.maven.apache.org/maven2/org/codehaus/plexus/plexus-container-default/1.0-alpha-9-stable-1/plexus-container-default-1.0-alpha-9-stable-1.pom
Downloaded: http://repo.maven.apache.org/maven2/org/codehaus/plexus/plexus-container-default/1.0-alpha-9-stable-1/plexus-container-default-1.0-alpha-9-stable-1.pom (4 KB at 32.7 KB/sec)
Downloading: http://repo.maven.apache.org/maven2/org/codehaus/plexus/plexus-containers/1.0.3/plexus-containers-1.0.3.pom
Downloaded: http://repo.maven.apache.org/maven2/org/codehaus/plexus/plexus-containers/1.0.3/plexus-containers-1.0.3.pom (492 B at 4.4 KB/sec)
Downloading: http://repo.maven.apache.org/maven2/org/codehaus/plexus/plexus/1.0.4/plexus-1.0.4.pom
Downloaded: http://repo.maven.apache.org/maven2/org/codehaus/plexus/plexus/1.0.4/plexus-1.0.4.pom (6 KB at 54.4 KB/sec)
Downloading: http://repo.maven.apache.org/maven2/junit/junit/4.8.2/junit-4.8.2.pom
Downloaded: http://repo.maven.apache.org/maven2/junit/junit/4.8.2/junit-4.8.2.pom (2 KB at 14.3 KB/sec)
Downloading: http://repo.maven.apache.org/maven2/org/codehaus/plexus/plexus-utils/1.0.4/plexus-utils-1.0.4.pom
Downloaded: http://repo.maven.apache.org/maven2/org/codehaus/plexus/plexus-utils/1.0.4/plexus-utils-1.0.4.pom (7 KB at 65.0 KB/sec)
Downloading: http://repo.maven.apache.org/maven2/classworlds/classworlds/1.1-alpha-2/classworlds-1.1-alpha-2.pom
Downloaded: http://repo.maven.apache.org/maven2/classworlds/classworlds/1.1-alpha-2/classworlds-1.1-alpha-2.pom (4 KB at 29.1 KB/sec)
Downloading: http://repo.maven.apache.org/maven2/org/apache/maven/maven-profile/2.1.0/maven-profile-2.1.0.pom
Downloaded: http://repo.maven.apache.org/maven2/org/apache/maven/maven-profile/2.1.0/maven-profile-2.1.0.pom (2 KB at 11.2 KB/sec)
Downloading: http://repo.maven.apache.org/maven2/org/apache/maven/maven-artifact-manager/2.1.0/maven-artifact-manager-2.1.0.pom
Downloaded: http://repo.maven.apache.org/maven2/org/apache/maven/maven-artifact-manager/2.1.0/maven-artifact-manager-2.1.0.pom (4 KB at 28.7 KB/sec)
Downloading: http://repo.maven.apache.org/maven2/org/apache/maven/maven-repository-metadata/2.1.0/maven-repository-metadata-2.1.0.pom
Downloaded: http://repo.maven.apache.org/maven2/org/apache/maven/maven-repository-metadata/2.1.0/maven-repository-metadata-2.1.0.pom (2 KB at 17.7 KB/sec)
Downloading: http://repo.maven.apache.org/maven2/org/apache/maven/maven-artifact/2.1.0/maven-artifact-2.1.0.pom
Downloaded: http://repo.maven.apache.org/maven2/org/apache/maven/maven-artifact/2.1.0/maven-artifact-2.1.0.pom (2 KB at 14.8 KB/sec)
Downloading: http://repo.maven.apache.org/maven2/backport-util-concurrent/backport-util-concurrent/3.1/backport-util-concurrent-3.1.pom
Downloaded: http://repo.maven.apache.org/maven2/backport-util-concurrent/backport-util-concurrent/3.1/backport-util-concurrent-3.1.pom (880 B at 8.3 KB/sec)
Downloading: http://repo.maven.apache.org/maven2/org/apache/maven/maven-plugin-registry/2.1.0/maven-plugin-registry-2.1.0.pom
Downloaded: http://repo.maven.apache.org/maven2/org/apache/maven/maven-plugin-registry/2.1.0/maven-plugin-registry-2.1.0.pom (2 KB at 18.1 KB/sec)
Downloading: http://repo.maven.apache.org/maven2/org/apache/maven/reporting/maven-reporting-api/2.1.0/maven-reporting-api-2.1.0.pom
Downloaded: http://repo.maven.apache.org/maven2/org/apache/maven/reporting/maven-reporting-api/2.1.0/maven-reporting-api-2.1.0.pom (2 KB at 17.2 KB/sec)
Downloading: http://repo.maven.apache.org/maven2/org/apache/maven/reporting/maven-reporting/2.1.0/maven-reporting-2.1.0.pom
Downloaded: http://repo.maven.apache.org/maven2/org/apache/maven/reporting/maven-reporting/2.1.0/maven-reporting-2.1.0.pom (2 KB at 13.5 KB/sec)
Downloading: http://repo.maven.apache.org/maven2/org/apache/maven/doxia/doxia-sink-api/1.1/doxia-sink-api-1.1.pom
Downloaded: http://repo.maven.apache.org/maven2/org/apache/maven/doxia/doxia-sink-api/1.1/doxia-sink-api-1.1.pom (2 KB at 18.8 KB/sec)
Downloading: http://repo.maven.apache.org/maven2/org/apache/maven/doxia/doxia/1.1/doxia-1.1.pom
Downloaded: http://repo.maven.apache.org/maven2/org/apache/maven/doxia/doxia/1.1/doxia-1.1.pom (15 KB at 117.6 KB/sec)
Downloading: http://repo.maven.apache.org/maven2/org/apache/maven/doxia/doxia-logging-api/1.1/doxia-logging-api-1.1.pom
Downloaded: http://repo.maven.apache.org/maven2/org/apache/maven/doxia/doxia-logging-api/1.1/doxia-logging-api-1.1.pom (2 KB at 14.8 KB/sec)
Downloading: http://repo.maven.apache.org/maven2/org/codehaus/plexus/plexus-container-default/1.0-alpha-30/plexus-container-default-1.0-alpha-30.pom
Downloaded: http://repo.maven.apache.org/maven2/org/codehaus/plexus/plexus-container-default/1.0-alpha-30/plexus-container-default-1.0-alpha-30.pom (4 KB at 33.6 KB/sec)
Downloading: http://repo.maven.apache.org/maven2/org/codehaus/plexus/plexus-containers/1.0-alpha-30/plexus-containers-1.0-alpha-30.pom
Downloaded: http://repo.maven.apache.org/maven2/org/codehaus/plexus/plexus-containers/1.0-alpha-30/plexus-containers-1.0-alpha-30.pom (2 KB at 18.0 KB/sec)
Downloading: http://repo.maven.apache.org/maven2/org/codehaus/plexus/plexus/1.0.11/plexus-1.0.11.pom
Downloaded: http://repo.maven.apache.org/maven2/org/codehaus/plexus/plexus/1.0.11/plexus-1.0.11.pom (9 KB at 82.6 KB/sec)
Downloading: http://repo.maven.apache.org/maven2/org/codehaus/plexus/plexus-utils/1.4.5/plexus-utils-1.4.5.pom
Downloaded: http://repo.maven.apache.org/maven2/org/codehaus/plexus/plexus-utils/1.4.5/plexus-utils-1.4.5.pom (3 KB at 21.7 KB/sec)
Downloading: http://repo.maven.apache.org/maven2/org/codehaus/plexus/plexus-classworlds/1.2-alpha-9/plexus-classworlds-1.2-alpha-9.pom
Downloaded: http://repo.maven.apache.org/maven2/org/codehaus/plexus/plexus-classworlds/1.2-alpha-9/plexus-classworlds-1.2-alpha-9.pom (4 KB at 29.7 KB/sec)
Downloading: http://repo.maven.apache.org/maven2/org/codehaus/plexus/plexus/1.0.10/plexus-1.0.10.pom
Downloaded: http://repo.maven.apache.org/maven2/org/codehaus/plexus/plexus/1.0.10/plexus-1.0.10.pom (9 KB at 77.5 KB/sec)
Downloading: http://repo.maven.apache.org/maven2/org/apache/maven/reporting/maven-reporting-impl/2.1/maven-reporting-impl-2.1.pom
Downloaded: http://repo.maven.apache.org/maven2/org/apache/maven/reporting/maven-reporting-impl/2.1/maven-reporting-impl-2.1.pom (5 KB at 42.5 KB/sec)
Downloading: http://repo.maven.apache.org/maven2/org/apache/maven/shared/maven-shared-components/15/maven-shared-components-15.pom
Downloaded: http://repo.maven.apache.org/maven2/org/apache/maven/shared/maven-shared-components/15/maven-shared-components-15.pom (10 KB at 88.5 KB/sec)
Downloading: http://repo.maven.apache.org/maven2/org/apache/maven/reporting/maven-reporting-api/3.0/maven-reporting-api-3.0.pom
Downloaded: http://repo.maven.apache.org/maven2/org/apache/maven/reporting/maven-reporting-api/3.0/maven-reporting-api-3.0.pom (3 KB at 22.1 KB/sec)
Downloading: http://repo.maven.apache.org/maven2/org/apache/maven/doxia/doxia-sink-api/1.0/doxia-sink-api-1.0.pom
Downloaded: http://repo.maven.apache.org/maven2/org/apache/maven/doxia/doxia-sink-api/1.0/doxia-sink-api-1.0.pom (2 KB at 12.7 KB/sec)
Downloading: http://repo.maven.apache.org/maven2/org/apache/maven/doxia/doxia/1.0/doxia-1.0.pom
Downloaded: http://repo.maven.apache.org/maven2/org/apache/maven/doxia/doxia/1.0/doxia-1.0.pom (10 KB at 91.4 KB/sec)
Downloading: http://repo.maven.apache.org/maven2/org/apache/maven/maven-parent/10/maven-parent-10.pom
Downloaded: http://repo.maven.apache.org/maven2/org/apache/maven/maven-parent/10/maven-parent-10.pom (31 KB at 245.2 KB/sec)
Downloading: http://repo.maven.apache.org/maven2/org/apache/apache/4/apache-4.pom
Downloaded: http://repo.maven.apache.org/maven2/org/apache/apache/4/apache-4.pom (5 KB at 41.4 KB/sec)
Downloading: http://repo.maven.apache.org/maven2/org/apache/maven/maven-project/2.0.10/maven-project-2.0.10.pom
Downloaded: http://repo.maven.apache.org/maven2/org/apache/maven/maven-project/2.0.10/maven-project-2.0.10.pom (3 KB at 27.0 KB/sec)
Downloading: http://repo.maven.apache.org/maven2/org/apache/maven/maven/2.0.10/maven-2.0.10.pom
Downloaded: http://repo.maven.apache.org/maven2/org/apache/maven/maven/2.0.10/maven-2.0.10.pom (24 KB at 182.4 KB/sec)
Downloading: http://repo.maven.apache.org/maven2/org/apache/maven/maven-parent/9/maven-parent-9.pom
Downloaded: http://repo.maven.apache.org/maven2/org/apache/maven/maven-parent/9/maven-parent-9.pom (33 KB at 254.5 KB/sec)
Downloading: http://repo.maven.apache.org/maven2/org/apache/maven/maven-settings/2.0.10/maven-settings-2.0.10.pom
Downloaded: http://repo.maven.apache.org/maven2/org/apache/maven/maven-settings/2.0.10/maven-settings-2.0.10.pom (3 KB at 20.6 KB/sec)
Downloading: http://repo.maven.apache.org/maven2/org/apache/maven/maven-model/2.0.10/maven-model-2.0.10.pom
Downloaded: http://repo.maven.apache.org/maven2/org/apache/maven/maven-model/2.0.10/maven-model-2.0.10.pom (4 KB at 31.3 KB/sec)
Downloading: http://repo.maven.apache.org/maven2/org/codehaus/plexus/plexus-utils/1.5.5/plexus-utils-1.5.5.pom
Downloaded: http://repo.maven.apache.org/maven2/org/codehaus/plexus/plexus-utils/1.5.5/plexus-utils-1.5.5.pom (6 KB at 48.3 KB/sec)
Downloading: http://repo.maven.apache.org/maven2/org/codehaus/plexus/plexus-interpolation/1.1/plexus-interpolation-1.1.pom
Downloaded: http://repo.maven.apache.org/maven2/org/codehaus/plexus/plexus-interpolation/1.1/plexus-interpolation-1.1.pom (2 KB at 13.5 KB/sec)
Downloading: http://repo.maven.apache.org/maven2/org/apache/maven/maven-profile/2.0.10/maven-profile-2.0.10.pom
Downloaded: http://repo.maven.apache.org/maven2/org/apache/maven/maven-profile/2.0.10/maven-profile-2.0.10.pom (3 KB at 19.9 KB/sec)
Downloading: http://repo.maven.apache.org/maven2/org/apache/maven/maven-artifact-manager/2.0.10/maven-artifact-manager-2.0.10.pom
Downloaded: http://repo.maven.apache.org/maven2/org/apache/maven/maven-artifact-manager/2.0.10/maven-artifact-manager-2.0.10.pom (3 KB at 25.9 KB/sec)
Downloading: http://repo.maven.apache.org/maven2/org/apache/maven/maven-repository-metadata/2.0.10/maven-repository-metadata-2.0.10.pom
Downloaded: http://repo.maven.apache.org/maven2/org/apache/maven/maven-repository-metadata/2.0.10/maven-repository-metadata-2.0.10.pom (3 KB at 21.7 KB/sec)
Downloading: http://repo.maven.apache.org/maven2/org/apache/maven/maven-artifact/2.0.10/maven-artifact-2.0.10.pom
Downloaded: http://repo.maven.apache.org/maven2/org/apache/maven/maven-artifact/2.0.10/maven-artifact-2.0.10.pom (2 KB at 14.8 KB/sec)
Downloading: http://repo.maven.apache.org/maven2/org/apache/maven/maven-plugin-registry/2.0.10/maven-plugin-registry-2.0.10.pom
Downloaded: http://repo.maven.apache.org/maven2/org/apache/maven/maven-plugin-registry/2.0.10/maven-plugin-registry-2.0.10.pom (2 KB at 19.3 KB/sec)
Downloading: http://repo.maven.apache.org/maven2/org/apache/maven/maven-plugin-api/2.0.10/maven-plugin-api-2.0.10.pom
Downloaded: http://repo.maven.apache.org/maven2/org/apache/maven/maven-plugin-api/2.0.10/maven-plugin-api-2.0.10.pom (2 KB at 13.3 KB/sec)
Downloading: http://repo.maven.apache.org/maven2/org/apache/maven/doxia/doxia-sink-api/1.1.2/doxia-sink-api-1.1.2.pom
Downloaded: http://repo.maven.apache.org/maven2/org/apache/maven/doxia/doxia-sink-api/1.1.2/doxia-sink-api-1.1.2.pom (2 KB at 14.9 KB/sec)
Downloading: http://repo.maven.apache.org/maven2/org/apache/maven/doxia/doxia/1.1.2/doxia-1.1.2.pom
Downloaded: http://repo.maven.apache.org/maven2/org/apache/maven/doxia/doxia/1.1.2/doxia-1.1.2.pom (18 KB at 140.7 KB/sec)
Downloading: http://repo.maven.apache.org/maven2/org/apache/maven/doxia/doxia-logging-api/1.1.2/doxia-logging-api-1.1.2.pom
Downloaded: http://repo.maven.apache.org/maven2/org/apache/maven/doxia/doxia-logging-api/1.1.2/doxia-logging-api-1.1.2.pom (2 KB at 14.8 KB/sec)
Downloading: http://repo.maven.apache.org/maven2/org/apache/maven/doxia/doxia-core/1.1.2/doxia-core-1.1.2.pom
Downloaded: http://repo.maven.apache.org/maven2/org/apache/maven/doxia/doxia-core/1.1.2/doxia-core-1.1.2.pom (4 KB at 34.9 KB/sec)
Downloading: http://repo.maven.apache.org/maven2/org/codehaus/plexus/plexus-utils/1.5.12/plexus-utils-1.5.12.pom
Downloaded: http://repo.maven.apache.org/maven2/org/codehaus/plexus/plexus-utils/1.5.12/plexus-utils-1.5.12.pom (6 KB at 52.4 KB/sec)
Downloading: http://repo.maven.apache.org/maven2/org/codehaus/plexus/plexus/2.0.2/plexus-2.0.2.pom
Downloaded: http://repo.maven.apache.org/maven2/org/codehaus/plexus/plexus/2.0.2/plexus-2.0.2.pom (12 KB at 110.1 KB/sec)
Downloading: http://repo.maven.apache.org/maven2/xerces/xercesImpl/2.8.1/xercesImpl-2.8.1.pom
Downloaded: http://repo.maven.apache.org/maven2/xerces/xercesImpl/2.8.1/xercesImpl-2.8.1.pom (3 KB at 20.1 KB/sec)
Downloading: http://repo.maven.apache.org/maven2/xml-apis/xml-apis/1.3.03/xml-apis-1.3.03.pom
Downloaded: http://repo.maven.apache.org/maven2/xml-apis/xml-apis/1.3.03/xml-apis-1.3.03.pom (738 B at 7.1 KB/sec)
Downloading: http://repo.maven.apache.org/maven2/org/apache/apache/1/apache-1.pom
Downloaded: http://repo.maven.apache.org/maven2/org/apache/apache/1/apache-1.pom (4 KB at 31.4 KB/sec)
Downloading: http://repo.maven.apache.org/maven2/commons-lang/commons-lang/2.4/commons-lang-2.4.pom
Downloaded: http://repo.maven.apache.org/maven2/commons-lang/commons-lang/2.4/commons-lang-2.4.pom (14 KB at 130.0 KB/sec)
Downloading: http://repo.maven.apache.org/maven2/org/apache/commons/commons-parent/9/commons-parent-9.pom
Downloaded: http://repo.maven.apache.org/maven2/org/apache/commons/commons-parent/9/commons-parent-9.pom (22 KB at 168.6 KB/sec)
Downloading: http://repo.maven.apache.org/maven2/commons-httpclient/commons-httpclient/3.1/commons-httpclient-3.1.pom
Downloaded: http://repo.maven.apache.org/maven2/commons-httpclient/commons-httpclient/3.1/commons-httpclient-3.1.pom (8 KB at 73.6 KB/sec)
Downloading: http://repo.maven.apache.org/maven2/commons-logging/commons-logging/1.0.4/commons-logging-1.0.4.pom
Downloaded: http://repo.maven.apache.org/maven2/commons-logging/commons-logging/1.0.4/commons-logging-1.0.4.pom (6 KB at 48.5 KB/sec)
Downloading: http://repo.maven.apache.org/maven2/commons-codec/commons-codec/1.2/commons-codec-1.2.pom
Downloaded: http://repo.maven.apache.org/maven2/commons-codec/commons-codec/1.2/commons-codec-1.2.pom (4 KB at 36.3 KB/sec)
Downloading: http://repo.maven.apache.org/maven2/org/apache/maven/doxia/doxia-site-renderer/1.1.2/doxia-site-renderer-1.1.2.pom
Downloaded: http://repo.maven.apache.org/maven2/org/apache/maven/doxia/doxia-site-renderer/1.1.2/doxia-site-renderer-1.1.2.pom (6 KB at 53.8 KB/sec)
Downloading: http://repo.maven.apache.org/maven2/org/apache/maven/doxia/doxia-sitetools/1.1.2/doxia-sitetools-1.1.2.pom
Downloaded: http://repo.maven.apache.org/maven2/org/apache/maven/doxia/doxia-sitetools/1.1.2/doxia-sitetools-1.1.2.pom (15 KB at 116.6 KB/sec)
Downloading: http://repo.maven.apache.org/maven2/org/apache/maven/doxia/doxia-decoration-model/1.1.2/doxia-decoration-model-1.1.2.pom
Downloaded: http://repo.maven.apache.org/maven2/org/apache/maven/doxia/doxia-decoration-model/1.1.2/doxia-decoration-model-1.1.2.pom (3 KB at 28.2 KB/sec)
Downloading: http://repo.maven.apache.org/maven2/org/apache/maven/doxia/doxia-module-xhtml/1.1.2/doxia-module-xhtml-1.1.2.pom
Downloaded: http://repo.maven.apache.org/maven2/org/apache/maven/doxia/doxia-module-xhtml/1.1.2/doxia-module-xhtml-1.1.2.pom (2 KB at 15.2 KB/sec)
Downloading: http://repo.maven.apache.org/maven2/org/apache/maven/doxia/doxia-modules/1.1.2/doxia-modules-1.1.2.pom
Downloaded: http://repo.maven.apache.org/maven2/org/apache/maven/doxia/doxia-modules/1.1.2/doxia-modules-1.1.2.pom (3 KB at 22.7 KB/sec)
Downloading: http://repo.maven.apache.org/maven2/org/apache/maven/doxia/doxia-module-fml/1.1.2/doxia-module-fml-1.1.2.pom
Downloaded: http://repo.maven.apache.org/maven2/org/apache/maven/doxia/doxia-module-fml/1.1.2/doxia-module-fml-1.1.2.pom (6 KB at 51.1 KB/sec)
Downloading: http://repo.maven.apache.org/maven2/org/codehaus/plexus/plexus-i18n/1.0-beta-7/plexus-i18n-1.0-beta-7.pom
Downloaded: http://repo.maven.apache.org/maven2/org/codehaus/plexus/plexus-i18n/1.0-beta-7/plexus-i18n-1.0-beta-7.pom (2 KB at 9.8 KB/sec)
Downloading: http://repo.maven.apache.org/maven2/org/codehaus/plexus/plexus-components/1.1.12/plexus-components-1.1.12.pom
Downloaded: http://repo.maven.apache.org/maven2/org/codehaus/plexus/plexus-components/1.1.12/plexus-components-1.1.12.pom (3 KB at 28.2 KB/sec)
Downloading: http://repo.maven.apache.org/maven2/org/codehaus/plexus/plexus-utils/1.4.1/plexus-utils-1.4.1.pom
Downloaded: http://repo.maven.apache.org/maven2/org/codehaus/plexus/plexus-utils/1.4.1/plexus-utils-1.4.1.pom (2 KB at 17.8 KB/sec)
Downloading: http://repo.maven.apache.org/maven2/org/codehaus/plexus/plexus-velocity/1.1.7/plexus-velocity-1.1.7.pom
Downloaded: http://repo.maven.apache.org/maven2/org/codehaus/plexus/plexus-velocity/1.1.7/plexus-velocity-1.1.7.pom (2 KB at 17.9 KB/sec)
Downloading: http://repo.maven.apache.org/maven2/org/codehaus/plexus/plexus-container-default/1.0-alpha-20/plexus-container-default-1.0-alpha-20.pom
Downloaded: http://repo.maven.apache.org/maven2/org/codehaus/plexus/plexus-container-default/1.0-alpha-20/plexus-container-default-1.0-alpha-20.pom (3 KB at 28.4 KB/sec)
Downloading: http://repo.maven.apache.org/maven2/org/codehaus/plexus/plexus-containers/1.0-alpha-20/plexus-containers-1.0-alpha-20.pom
Downloaded: http://repo.maven.apache.org/maven2/org/codehaus/plexus/plexus-containers/1.0-alpha-20/plexus-containers-1.0-alpha-20.pom (2 KB at 17.9 KB/sec)
Downloading: http://repo.maven.apache.org/maven2/org/codehaus/plexus/plexus-utils/1.3/plexus-utils-1.3.pom
Downloaded: http://repo.maven.apache.org/maven2/org/codehaus/plexus/plexus-utils/1.3/plexus-utils-1.3.pom (2 KB at 9.6 KB/sec)
Downloading: http://repo.maven.apache.org/maven2/org/codehaus/plexus/plexus/1.0.8/plexus-1.0.8.pom
Downloaded: http://repo.maven.apache.org/maven2/org/codehaus/plexus/plexus/1.0.8/plexus-1.0.8.pom (8 KB at 68.5 KB/sec)
Downloading: http://repo.maven.apache.org/maven2/org/codehaus/plexus/plexus-classworlds/1.2-alpha-7/plexus-classworlds-1.2-alpha-7.pom
Downloaded: http://repo.maven.apache.org/maven2/org/codehaus/plexus/plexus-classworlds/1.2-alpha-7/plexus-classworlds-1.2-alpha-7.pom (3 KB at 21.9 KB/sec)
Downloading: http://repo.maven.apache.org/maven2/org/codehaus/plexus/plexus/1.0.9/plexus-1.0.9.pom
Downloaded: http://repo.maven.apache.org/maven2/org/codehaus/plexus/plexus/1.0.9/plexus-1.0.9.pom (8 KB at 72.8 KB/sec)
Downloading: http://repo.maven.apache.org/maven2/org/apache/velocity/velocity/1.5/velocity-1.5.pom
Downloaded: http://repo.maven.apache.org/maven2/org/apache/velocity/velocity/1.5/velocity-1.5.pom (8 KB at 72.2 KB/sec)
Downloading: http://repo.maven.apache.org/maven2/commons-collections/commons-collections/3.1/commons-collections-3.1.pom
Downloaded: http://repo.maven.apache.org/maven2/commons-collections/commons-collections/3.1/commons-collections-3.1.pom (6 KB at 56.1 KB/sec)
Downloading: http://repo.maven.apache.org/maven2/commons-lang/commons-lang/2.1/commons-lang-2.1.pom
Downloaded: http://repo.maven.apache.org/maven2/commons-lang/commons-lang/2.1/commons-lang-2.1.pom (10 KB at 93.2 KB/sec)
Downloading: http://repo.maven.apache.org/maven2/oro/oro/2.0.8/oro-2.0.8.pom
Downloaded: http://repo.maven.apache.org/maven2/oro/oro/2.0.8/oro-2.0.8.pom (140 B at 1.3 KB/sec)
Downloading: http://repo.maven.apache.org/maven2/commons-collections/commons-collections/3.2/commons-collections-3.2.pom
Downloaded: http://repo.maven.apache.org/maven2/commons-collections/commons-collections/3.2/commons-collections-3.2.pom (11 KB at 101.7 KB/sec)
Downloading: http://repo.maven.apache.org/maven2/commons-validator/commons-validator/1.2.0/commons-validator-1.2.0.pom
Downloaded: http://repo.maven.apache.org/maven2/commons-validator/commons-validator/1.2.0/commons-validator-1.2.0.pom (9 KB at 87.8 KB/sec)
Downloading: http://repo.maven.apache.org/maven2/commons-beanutils/commons-beanutils/1.7.0/commons-beanutils-1.7.0.pom
Downloaded: http://repo.maven.apache.org/maven2/commons-beanutils/commons-beanutils/1.7.0/commons-beanutils-1.7.0.pom (357 B at 3.4 KB/sec)
Downloading: http://repo.maven.apache.org/maven2/commons-logging/commons-logging/1.0.3/commons-logging-1.0.3.pom
Downloaded: http://repo.maven.apache.org/maven2/commons-logging/commons-logging/1.0.3/commons-logging-1.0.3.pom (866 B at 8.3 KB/sec)
Downloading: http://repo.maven.apache.org/maven2/commons-digester/commons-digester/1.6/commons-digester-1.6.pom
Downloaded: http://repo.maven.apache.org/maven2/commons-digester/commons-digester/1.6/commons-digester-1.6.pom (974 B at 9.2 KB/sec)
Downloading: http://repo.maven.apache.org/maven2/commons-beanutils/commons-beanutils/1.6/commons-beanutils-1.6.pom
Downloaded: http://repo.maven.apache.org/maven2/commons-beanutils/commons-beanutils/1.6/commons-beanutils-1.6.pom (3 KB at 22.1 KB/sec)
Downloading: http://repo.maven.apache.org/maven2/commons-logging/commons-logging/1.0/commons-logging-1.0.pom
Downloaded: http://repo.maven.apache.org/maven2/commons-logging/commons-logging/1.0/commons-logging-1.0.pom (163 B at 1.6 KB/sec)
Downloading: http://repo.maven.apache.org/maven2/commons-collections/commons-collections/2.0/commons-collections-2.0.pom
Downloaded: http://repo.maven.apache.org/maven2/commons-collections/commons-collections/2.0/commons-collections-2.0.pom (171 B at 1.6 KB/sec)
Downloading: http://repo.maven.apache.org/maven2/commons-collections/commons-collections/2.1/commons-collections-2.1.pom
Downloaded: http://repo.maven.apache.org/maven2/commons-collections/commons-collections/2.1/commons-collections-2.1.pom (4 KB at 31.9 KB/sec)
Downloading: http://repo.maven.apache.org/maven2/xml-apis/xml-apis/1.0.b2/xml-apis-1.0.b2.pom
Downloaded: http://repo.maven.apache.org/maven2/xml-apis/xml-apis/1.0.b2/xml-apis-1.0.b2.pom (3 KB at 20.7 KB/sec)
Downloading: http://repo.maven.apache.org/maven2/xml-apis/xml-apis/2.0.2/xml-apis-2.0.2.pom
Downloaded: http://repo.maven.apache.org/maven2/xml-apis/xml-apis/2.0.2/xml-apis-2.0.2.pom (346 B at 3.2 KB/sec)
Downloading: http://repo.maven.apache.org/maven2/org/codehaus/plexus/plexus-utils/1.5.8/plexus-utils-1.5.8.pom
Downloaded: http://repo.maven.apache.org/maven2/org/codehaus/plexus/plexus-utils/1.5.8/plexus-utils-1.5.8.pom (8 KB at 75.7 KB/sec)
Downloading: http://repo.maven.apache.org/maven2/org/jacoco/org.jacoco.agent/0.6.3.201306030806/org.jacoco.agent-0.6.3.201306030806.pom
Downloaded: http://repo.maven.apache.org/maven2/org/jacoco/org.jacoco.agent/0.6.3.201306030806/org.jacoco.agent-0.6.3.201306030806.pom (3 KB at 27.1 KB/sec)
Downloading: http://repo.maven.apache.org/maven2/org/jacoco/org.jacoco.core/0.6.3.201306030806/org.jacoco.core-0.6.3.201306030806.pom
Downloaded: http://repo.maven.apache.org/maven2/org/jacoco/org.jacoco.core/0.6.3.201306030806/org.jacoco.core-0.6.3.201306030806.pom (2 KB at 11.3 KB/sec)
Downloading: http://repo.maven.apache.org/maven2/org/ow2/asm/asm-all/4.1/asm-all-4.1.pom
Downloaded: http://repo.maven.apache.org/maven2/org/ow2/asm/asm-all/4.1/asm-all-4.1.pom (2 KB at 18.7 KB/sec)
Downloading: http://repo.maven.apache.org/maven2/org/ow2/asm/asm-parent/4.1/asm-parent-4.1.pom
Downloaded: http://repo.maven.apache.org/maven2/org/ow2/asm/asm-parent/4.1/asm-parent-4.1.pom (6 KB at 51.6 KB/sec)
Downloading: http://repo.maven.apache.org/maven2/org/jacoco/org.jacoco.report/0.6.3.201306030806/org.jacoco.report-0.6.3.201306030806.pom
Downloaded: http://repo.maven.apache.org/maven2/org/jacoco/org.jacoco.report/0.6.3.201306030806/org.jacoco.report-0.6.3.201306030806.pom (2 KB at 12.7 KB/sec)
Downloading: http://repo.maven.apache.org/maven2/backport-util-concurrent/backport-util-concurrent/3.1/backport-util-concurrent-3.1.jar
Downloading: http://repo.maven.apache.org/maven2/org/codehaus/plexus/plexus-interpolation/1.8.1/plexus-interpolation-1.8.1.jar
Downloading: http://repo.maven.apache.org/maven2/junit/junit/4.8.2/junit-4.8.2.jar
Downloading: http://repo.maven.apache.org/maven2/org/codehaus/plexus/plexus-utils/1.5.6/plexus-utils-1.5.6.jar
Downloading: http://repo.maven.apache.org/maven2/org/apache/maven/reporting/maven-reporting-api/2.1.0/maven-reporting-api-2.1.0.jar
Downloaded: http://repo.maven.apache.org/maven2/org/apache/maven/reporting/maven-reporting-api/2.1.0/maven-reporting-api-2.1.0.jar (11 KB at 97.7 KB/sec)
Downloading: http://repo.maven.apache.org/maven2/org/apache/maven/doxia/doxia-sink-api/1.1/doxia-sink-api-1.1.jar
Downloaded: http://repo.maven.apache.org/maven2/org/codehaus/plexus/plexus-interpolation/1.8.1/plexus-interpolation-1.8.1.jar (50 KB at 319.4 KB/sec)
Downloading: http://repo.maven.apache.org/maven2/org/apache/maven/doxia/doxia-logging-api/1.1/doxia-logging-api-1.1.jar
Downloaded: http://repo.maven.apache.org/maven2/org/apache/maven/doxia/doxia-sink-api/1.1/doxia-sink-api-1.1.jar (13 KB at 121.5 KB/sec)
Downloading: http://repo.maven.apache.org/maven2/org/apache/maven/reporting/maven-reporting-impl/2.1/maven-reporting-impl-2.1.jar
Downloaded: http://repo.maven.apache.org/maven2/org/codehaus/plexus/plexus-utils/1.5.6/plexus-utils-1.5.6.jar (245 KB at 986.6 KB/sec)
Downloading: http://repo.maven.apache.org/maven2/org/apache/maven/doxia/doxia-core/1.1.2/doxia-core-1.1.2.jar
Downloaded: http://repo.maven.apache.org/maven2/junit/junit/4.8.2/junit-4.8.2.jar (232 KB at 923.4 KB/sec)
Downloading: http://repo.maven.apache.org/maven2/xerces/xercesImpl/2.8.1/xercesImpl-2.8.1.jar
Downloaded: http://repo.maven.apache.org/maven2/org/apache/maven/doxia/doxia-logging-api/1.1/doxia-logging-api-1.1.jar (12 KB at 107.5 KB/sec)
Downloading: http://repo.maven.apache.org/maven2/commons-lang/commons-lang/2.4/commons-lang-2.4.jar
Downloaded: http://repo.maven.apache.org/maven2/backport-util-concurrent/backport-util-concurrent/3.1/backport-util-concurrent-3.1.jar (324 KB at 1199.8 KB/sec)
Downloading: http://repo.maven.apache.org/maven2/commons-httpclient/commons-httpclient/3.1/commons-httpclient-3.1.jar
Downloaded: http://repo.maven.apache.org/maven2/org/apache/maven/reporting/maven-reporting-impl/2.1/maven-reporting-impl-2.1.jar (17 KB at 130.6 KB/sec)
Downloading: http://repo.maven.apache.org/maven2/commons-codec/commons-codec/1.2/commons-codec-1.2.jar
Downloaded: http://repo.maven.apache.org/maven2/commons-codec/commons-codec/1.2/commons-codec-1.2.jar (30 KB at 233.2 KB/sec)
Downloading: http://repo.maven.apache.org/maven2/org/apache/maven/doxia/doxia-site-renderer/1.1.2/doxia-site-renderer-1.1.2.jar
Downloaded: http://repo.maven.apache.org/maven2/org/apache/maven/doxia/doxia-core/1.1.2/doxia-core-1.1.2.jar (155 KB at 687.1 KB/sec)
Downloading: http://repo.maven.apache.org/maven2/org/apache/maven/doxia/doxia-decoration-model/1.1.2/doxia-decoration-model-1.1.2.jar
Downloaded: http://repo.maven.apache.org/maven2/commons-lang/commons-lang/2.4/commons-lang-2.4.jar (256 KB at 1065.3 KB/sec)
Downloading: http://repo.maven.apache.org/maven2/org/apache/maven/doxia/doxia-module-xhtml/1.1.2/doxia-module-xhtml-1.1.2.jar
Downloaded: http://repo.maven.apache.org/maven2/commons-httpclient/commons-httpclient/3.1/commons-httpclient-3.1.jar (298 KB at 1091.0 KB/sec)
Downloading: http://repo.maven.apache.org/maven2/org/apache/maven/doxia/doxia-module-fml/1.1.2/doxia-module-fml-1.1.2.jar
Downloaded: http://repo.maven.apache.org/maven2/org/apache/maven/doxia/doxia-site-renderer/1.1.2/doxia-site-renderer-1.1.2.jar (50 KB at 332.9 KB/sec)
Downloading: http://repo.maven.apache.org/maven2/org/codehaus/plexus/plexus-i18n/1.0-beta-7/plexus-i18n-1.0-beta-7.jar
Downloaded: http://repo.maven.apache.org/maven2/org/apache/maven/doxia/doxia-decoration-model/1.1.2/doxia-decoration-model-1.1.2.jar (52 KB at 347.5 KB/sec)
Downloading: http://repo.maven.apache.org/maven2/org/codehaus/plexus/plexus-velocity/1.1.7/plexus-velocity-1.1.7.jar
Downloaded: http://repo.maven.apache.org/maven2/org/apache/maven/doxia/doxia-module-xhtml/1.1.2/doxia-module-xhtml-1.1.2.jar (15 KB at 117.2 KB/sec)
Downloading: http://repo.maven.apache.org/maven2/org/apache/velocity/velocity/1.5/velocity-1.5.jar
Downloaded: http://repo.maven.apache.org/maven2/xerces/xercesImpl/2.8.1/xercesImpl-2.8.1.jar (1185 KB at 2889.1 KB/sec)
Downloading: http://repo.maven.apache.org/maven2/commons-collections/commons-collections/3.2/commons-collections-3.2.jar
Downloaded: http://repo.maven.apache.org/maven2/org/apache/maven/doxia/doxia-module-fml/1.1.2/doxia-module-fml-1.1.2.jar (37 KB at 238.7 KB/sec)
Downloading: http://repo.maven.apache.org/maven2/commons-validator/commons-validator/1.2.0/commons-validator-1.2.0.jar
Downloaded: http://repo.maven.apache.org/maven2/org/codehaus/plexus/plexus-i18n/1.0-beta-7/plexus-i18n-1.0-beta-7.jar (11 KB at 99.6 KB/sec)
Downloading: http://repo.maven.apache.org/maven2/commons-beanutils/commons-beanutils/1.7.0/commons-beanutils-1.7.0.jar
Downloaded: http://repo.maven.apache.org/maven2/org/codehaus/plexus/plexus-velocity/1.1.7/plexus-velocity-1.1.7.jar (8 KB at 74.1 KB/sec)
Downloading: http://repo.maven.apache.org/maven2/commons-digester/commons-digester/1.6/commons-digester-1.6.jar
Downloaded: http://repo.maven.apache.org/maven2/commons-validator/commons-validator/1.2.0/commons-validator-1.2.0.jar (89 KB at 511.4 KB/sec)
Downloading: http://repo.maven.apache.org/maven2/commons-logging/commons-logging/1.0.4/commons-logging-1.0.4.jar
Downloaded: http://repo.maven.apache.org/maven2/org/apache/velocity/velocity/1.5/velocity-1.5.jar (383 KB at 1255.5 KB/sec)
Downloading: http://repo.maven.apache.org/maven2/oro/oro/2.0.8/oro-2.0.8.jar
Downloaded: http://repo.maven.apache.org/maven2/commons-beanutils/commons-beanutils/1.7.0/commons-beanutils-1.7.0.jar (185 KB at 830.0 KB/sec)
Downloading: http://repo.maven.apache.org/maven2/xml-apis/xml-apis/1.0.b2/xml-apis-1.0.b2.jar
Downloaded: http://repo.maven.apache.org/maven2/commons-digester/commons-digester/1.6/commons-digester-1.6.jar (165 KB at 741.0 KB/sec)
Downloading: http://repo.maven.apache.org/maven2/org/jacoco/org.jacoco.agent/0.6.3.201306030806/org.jacoco.agent-0.6.3.201306030806-runtime.jar
Downloaded: http://repo.maven.apache.org/maven2/commons-collections/commons-collections/3.2/commons-collections-3.2.jar (558 KB at 1811.3 KB/sec)
Downloading: http://repo.maven.apache.org/maven2/org/jacoco/org.jacoco.core/0.6.3.201306030806/org.jacoco.core-0.6.3.201306030806.jar
Downloaded: http://repo.maven.apache.org/maven2/commons-logging/commons-logging/1.0.4/commons-logging-1.0.4.jar (38 KB at 249.2 KB/sec)
Downloading: http://repo.maven.apache.org/maven2/org/ow2/asm/asm-all/4.1/asm-all-4.1.jar
Downloaded: http://repo.maven.apache.org/maven2/oro/oro/2.0.8/oro-2.0.8.jar (64 KB at 370.5 KB/sec)
Downloading: http://repo.maven.apache.org/maven2/org/jacoco/org.jacoco.report/0.6.3.201306030806/org.jacoco.report-0.6.3.201306030806.jar
Downloaded: http://repo.maven.apache.org/maven2/xml-apis/xml-apis/1.0.b2/xml-apis-1.0.b2.jar (107 KB at 550.3 KB/sec)
Downloaded: http://repo.maven.apache.org/maven2/org/jacoco/org.jacoco.core/0.6.3.201306030806/org.jacoco.core-0.6.3.201306030806.jar (127 KB at 638.2 KB/sec)
Downloaded: http://repo.maven.apache.org/maven2/org/jacoco/org.jacoco.agent/0.6.3.201306030806/org.jacoco.agent-0.6.3.201306030806-runtime.jar (195 KB at 810.8 KB/sec)
Downloaded: http://repo.maven.apache.org/maven2/org/ow2/asm/asm-all/4.1/asm-all-4.1.jar (210 KB at 876.8 KB/sec)
Downloaded: http://repo.maven.apache.org/maven2/org/jacoco/org.jacoco.report/0.6.3.201306030806/org.jacoco.report-0.6.3.201306030806.jar (135 KB at 607.7 KB/sec)
[INFO] Skipping JaCoCo for project with packaging type 'pom'
[INFO] argLine set to 
[INFO] 
[INFO] --- tycho-source-plugin:0.18.1:plugin-source (plugin-source) @ org.eclipse.viatra.modelobfuscator.parent ---
[INFO] 
[INFO] --- maven-install-plugin:2.4:install (default-install) @ org.eclipse.viatra.modelobfuscator.parent ---
Downloading: http://repo.maven.apache.org/maven2/org/apache/maven/maven-project/2.0.6/maven-project-2.0.6.pom
Downloaded: http://repo.maven.apache.org/maven2/org/apache/maven/maven-project/2.0.6/maven-project-2.0.6.pom (3 KB at 25.2 KB/sec)
Downloading: http://repo.maven.apache.org/maven2/org/apache/maven/maven-settings/2.0.6/maven-settings-2.0.6.pom
Downloaded: http://repo.maven.apache.org/maven2/org/apache/maven/maven-settings/2.0.6/maven-settings-2.0.6.pom (2 KB at 18.8 KB/sec)
Downloading: http://repo.maven.apache.org/maven2/org/apache/maven/maven-model/2.0.6/maven-model-2.0.6.pom
Downloaded: http://repo.maven.apache.org/maven2/org/apache/maven/maven-model/2.0.6/maven-model-2.0.6.pom (3 KB at 28.6 KB/sec)
Downloading: http://repo.maven.apache.org/maven2/junit/junit/3.8.1/junit-3.8.1.pom
Downloaded: http://repo.maven.apache.org/maven2/junit/junit/3.8.1/junit-3.8.1.pom (998 B at 9.3 KB/sec)
Downloading: http://repo.maven.apache.org/maven2/org/apache/maven/maven-profile/2.0.6/maven-profile-2.0.6.pom
Downloaded: http://repo.maven.apache.org/maven2/org/apache/maven/maven-profile/2.0.6/maven-profile-2.0.6.pom (2 KB at 18.4 KB/sec)
Downloading: http://repo.maven.apache.org/maven2/org/apache/maven/maven-artifact-manager/2.0.6/maven-artifact-manager-2.0.6.pom
Downloaded: http://repo.maven.apache.org/maven2/org/apache/maven/maven-artifact-manager/2.0.6/maven-artifact-manager-2.0.6.pom (3 KB at 24.6 KB/sec)
Downloading: http://repo.maven.apache.org/maven2/org/apache/maven/maven-repository-metadata/2.0.6/maven-repository-metadata-2.0.6.pom
Downloaded: http://repo.maven.apache.org/maven2/org/apache/maven/maven-repository-metadata/2.0.6/maven-repository-metadata-2.0.6.pom (2 KB at 17.4 KB/sec)
Downloading: http://repo.maven.apache.org/maven2/org/apache/maven/maven-artifact/2.0.6/maven-artifact-2.0.6.pom
Downloaded: http://repo.maven.apache.org/maven2/org/apache/maven/maven-artifact/2.0.6/maven-artifact-2.0.6.pom (2 KB at 15.2 KB/sec)
Downloading: http://repo.maven.apache.org/maven2/org/apache/maven/maven-plugin-registry/2.0.6/maven-plugin-registry-2.0.6.pom
Downloaded: http://repo.maven.apache.org/maven2/org/apache/maven/maven-plugin-registry/2.0.6/maven-plugin-registry-2.0.6.pom (2 KB at 13.6 KB/sec)
Downloading: http://repo.maven.apache.org/maven2/org/codehaus/plexus/plexus-utils/3.0.5/plexus-utils-3.0.5.pom
Downloaded: http://repo.maven.apache.org/maven2/org/codehaus/plexus/plexus-utils/3.0.5/plexus-utils-3.0.5.pom (3 KB at 23.4 KB/sec)
Downloading: http://repo.maven.apache.org/maven2/org/codehaus/plexus/plexus-digest/1.0/plexus-digest-1.0.pom
Downloaded: http://repo.maven.apache.org/maven2/org/codehaus/plexus/plexus-digest/1.0/plexus-digest-1.0.pom (2 KB at 10.0 KB/sec)
Downloading: http://repo.maven.apache.org/maven2/org/codehaus/plexus/plexus-components/1.1.7/plexus-components-1.1.7.pom
Downloaded: http://repo.maven.apache.org/maven2/org/codehaus/plexus/plexus-components/1.1.7/plexus-components-1.1.7.pom (5 KB at 46.7 KB/sec)
Downloading: http://repo.maven.apache.org/maven2/org/codehaus/plexus/plexus-container-default/1.0-alpha-8/plexus-container-default-1.0-alpha-8.pom
Downloaded: http://repo.maven.apache.org/maven2/org/codehaus/plexus/plexus-container-default/1.0-alpha-8/plexus-container-default-1.0-alpha-8.pom (8 KB at 68.2 KB/sec)
Downloading: http://repo.maven.apache.org/maven2/junit/junit/3.8.1/junit-3.8.1.jar
Downloading: http://repo.maven.apache.org/maven2/org/codehaus/plexus/plexus-utils/3.0.5/plexus-utils-3.0.5.jar
Downloading: http://repo.maven.apache.org/maven2/org/codehaus/plexus/plexus-digest/1.0/plexus-digest-1.0.jar
Downloaded: http://repo.maven.apache.org/maven2/org/codehaus/plexus/plexus-digest/1.0/plexus-digest-1.0.jar (12 KB at 111.3 KB/sec)
Downloaded: http://repo.maven.apache.org/maven2/junit/junit/3.8.1/junit-3.8.1.jar (119 KB at 591.2 KB/sec)
Downloaded: http://repo.maven.apache.org/maven2/org/codehaus/plexus/plexus-utils/3.0.5/plexus-utils-3.0.5.jar (226 KB at 893.0 KB/sec)
[INFO] Installing /jobs/genie.modeling.viatra/viatra-modelobfuscator-master-maven/workspace/releng/org.eclipse.viatra.modelobfuscator.parent/pom.xml to /home/hudson/genie.modeling.viatra/.hudson/jobs/viatra-modelobfuscator-master-maven/workspace/.maven/repo/org/eclipse/viatra/org.eclipse.viatra.modelobfuscator.parent/0.7.0-SNAPSHOT/org.eclipse.viatra.modelobfuscator.parent-0.7.0-SNAPSHOT.pom
[INFO] 
[INFO] --- maven-deploy-plugin:2.7:deploy (default-deploy) @ org.eclipse.viatra.modelobfuscator.parent ---
[INFO] ------------------------------------------------------------------------
[INFO] Reactor Summary:
[INFO] 
[INFO] VIATRA Model Obfuscator ........................... FAILURE [17.056s]
[INFO] org.eclipse.viatra.modelobfuscator.runtime ........ SKIPPED
[INFO] org.eclipse.viatra.modelobfuscator.ui ............. SKIPPED
[INFO] org.eclipse.viatra.modelobfuscator.target ......... SKIPPED
[INFO] VIATRA Model Obfuscator ........................... SKIPPED
[INFO] ------------------------------------------------------------------------
[INFO] BUILD FAILURE
[INFO] ------------------------------------------------------------------------
[INFO] Total time: 1:33.092s
[INFO] Finished at: Thu Jul 10 08:37:15 EDT 2014
[INFO] Final Memory: 137M/2419M
[INFO] ------------------------------------------------------------------------
[INFO] o.h.m.e.h.MavenExecutionResultHandler - Build failed with exception(s)
[INFO] o.h.m.e.h.MavenExecutionResultHandler - [1] org.apache.maven.lifecycle.LifecycleExecutionException: Failed to execute goal org.apache.maven.plugins:maven-deploy-plugin:2.7:deploy (default-deploy) on project org.eclipse.viatra.modelobfuscator.parent: Deployment failed: repository element was not specified in the POM inside distributionManagement element or in -DaltDeploymentRepository=id::layout::url parameter
[DEBUG] Closing connection to remote
[ERROR] Failed to execute goal org.apache.maven.plugins:maven-deploy-plugin:2.7:deploy (default-deploy) on project org.eclipse.viatra.modelobfuscator.parent: Deployment failed: repository element was not specified in the POM inside distributionManagement element or in -DaltDeploymentRepository=id::layout::url parameter -> [Help 1]
[ERROR] 
[ERROR] To see the full stack trace of the errors, re-run Maven with the -e switch.
[ERROR] Re-run Maven using the -X switch to enable full debug logging.
[ERROR] 
[ERROR] For more information about the errors and possible solutions, please read the following articles:
[ERROR] [Help 1] http://cwiki.apache.org/confluence/display/MAVEN/MojoExecutionException
[DEBUG] Waiting for process to finish
[DEBUG] Result: 1
Sending e-mails to: abel.hegedus@mit.bme.hu
Finished: FAILURE