FailedConsole Output

Established TCP socket on 53427
<===[JENKINS REMOTING CAPACITY]===>channel started
Executing Maven:  -B -f /home/hudson/genie.unide/.jenkins/jobs/Unide Java Binding/workspace/bindings/ppmp-java-binding/pom.xml clean install deploy
[INFO] Scanning for projects...
[INFO]                                                                         
[INFO] ------------------------------------------------------------------------
[INFO] Building ppmp-java-binding 1.0.0-SNAPSHOT
[INFO] ------------------------------------------------------------------------
[INFO] 
[INFO] --- maven-clean-plugin:2.5:clean (default-clean) @ ppmp-java-binding ---
[INFO] 
[INFO] --- maven-resources-plugin:3.0.2:resources (default-resources) @ ppmp-java-binding ---
[INFO] Using 'UTF-8' encoding to copy filtered resources.
[INFO] skip non existing resourceDirectory /home/hudson/genie.unide/.jenkins/jobs/Unide Java Binding/workspace/bindings/ppmp-java-binding/src/main/resources
[INFO] 
[INFO] --- maven-compiler-plugin:3.7.0:compile (default-compile) @ ppmp-java-binding ---
[INFO] Changes detected - recompiling the module!
[INFO] Compiling 24 source files to /home/hudson/genie.unide/.jenkins/jobs/Unide Java Binding/workspace/bindings/ppmp-java-binding/target/classes
[INFO] 
[INFO] --- maven-resources-plugin:3.0.2:testResources (default-testResources) @ ppmp-java-binding ---
[INFO] Using 'UTF-8' encoding to copy filtered resources.
[INFO] Copying 3 resources
[INFO] 
[INFO] --- maven-compiler-plugin:3.7.0:testCompile (default-testCompile) @ ppmp-java-binding ---
[INFO] Changes detected - recompiling the module!
[INFO] Compiling 3 source files to /home/hudson/genie.unide/.jenkins/jobs/Unide Java Binding/workspace/bindings/ppmp-java-binding/target/test-classes
[INFO] 
[INFO] --- maven-surefire-plugin:2.20.1:test (default-test) @ ppmp-java-binding ---
[INFO] 
[INFO] -------------------------------------------------------
[INFO]  T E S T S
[INFO] -------------------------------------------------------
[INFO] Running org.eclipse.iot.unide.ppmp.ProcessTest
{
  "content-spec" : "urn:spec://eclipse.org/unide/process-message#v2",
  "device" : {
    "deviceID" : "a4927dad-58d4-4580-b460-79cefd56775b",
    "operationalStatus" : "normal",
    "metaData" : {
      "swVersion" : "2.0.3.13",
      "swBuildId" : "41535"
    }
  },
  "part" : {
    "partTypeId" : "F00VH07328",
    "partTypeID" : "F00VH07328",
    "partID" : "420003844",
    "type" : "SINGLE",
    "result" : "NOK",
    "code" : "HUH289",
    "metaData" : {
      "toolId" : "32324-432143"
    }
  },
  "measurements" : [ {
    "ts" : "2002-05-30T09:30:10.123+02:00",
    "phase" : "phasen name 2",
    "name" : "500 Grad links drehen",
    "result" : "NOK",
    "code" : "0000 EE01",
    "limits" : {
      "temperature" : {
        "upperError" : 4444,
        "lowerError" : 44,
        "upperWarn" : 2222,
        "lowerWarn" : 46,
        "target" : 35
      }
    },
    "series" : {
      "temperature" : [ 45.4243, 46.42342, 44.2432 ],
      "force" : [ 26, 23, 24 ],
      "time" : [ 0, 23, 24 ],
      "pressure" : [ 52.4, 46.32, 44.2432 ]
    },
    "specialValues" : {
      "force" : {
        "time" : 24,
        "value" : 24
      },
      "pressure" : {
        "time" : 24,
        "value" : 44.2432
      }
    }
  }, {
    "ts" : "2002-05-30T09:30:10.123+02:00",
    "phase" : "phasen name",
    "result" : "OK",
    "limits" : {
      "force" : {
        "upperError" : [ 27, 24, 25 ],
        "lowerError" : [ 25, 22, 23 ]
      },
      "pressure" : {
        "upperError" : [ 54, 48, 46 ],
        "lowerError" : [ 50, 44, 42 ]
      }
    },
    "series" : {
      "temperature" : [ 45.4243, 46.42342, 44.2432 ],
      "force" : [ 26, 23, 24 ],
      "time" : [ 30, 36, 42 ],
      "pressure" : [ 52.4, 46.32, 44.2432 ]
    },
    "specialValues" : {
      "force" : {
        "value" : 50
      },
      "pressure" : {
        "value" : 24
      }
    }
  } ],
  "process" : {
    "ts" : "2002-05-30T09:30:10.123+02:00",
    "result" : "NOK",
    "externalProcessId" : "b4927dad-58d4-4580-b460-79cefd56775b",
    "shutoffPhase" : "phase 1",
    "program" : {
      "name" : "Programm 1",
      "id" : "1",
      "lastChangedDate" : "2002-05-30T09:30:10.123+02:00"
    },
    "shutoffValues" : {
      "force" : {
        "upperError" : 26,
        "lowerError" : 22,
        "value" : 24,
        "ts" : "2002-05-30T09:30:11.123+02:00"
      },
      "pressure" : {
        "upperError" : 52,
        "lowerError" : 48,
        "value" : 50
      }
    },
    "metaData" : {
      "name" : "Getriebedeckel verschrauben"
    }
  }
}
[INFO] Tests run: 2, Failures: 0, Errors: 0, Skipped: 0, Time elapsed: 0.434 s - in org.eclipse.iot.unide.ppmp.ProcessTest
[INFO] Running org.eclipse.iot.unide.ppmp.MessagesTest
{
  "content-spec" : "urn:spec://eclipse.org/unide/machine-message#v2",
  "device" : {
    "deviceID" : "2ca5158b-8350-4592-bff9-755194497d4e",
    "operationalStatus" : "normal",
    "metaData" : {
      "swVersion" : "2.0.3.13",
      "swBuildID" : "41535"
    }
  },
  "messages" : [ {
    "origin" : "sensor-id-992.2393.22",
    "ts" : "2002-05-30T09:30:10.123+02:00",
    "type" : "DEVICE",
    "severity" : "HIGH",
    "code" : "190ABT",
    "title" : "control board damaged",
    "description" : "Electronic control board or its electrical connections are damaged",
    "hint" : "Check the control board",
    "metaData" : {
      "firmware" : "20130304_22.020"
    }
  }, {
    "ts" : "2002-05-30T09:30:10.125+02:00",
    "type" : "TECHNICAL_INFO",
    "severity" : "HIGH",
    "code" : "33-02",
    "title" : "Disk size limit reached",
    "description" : "Disk size has reached limit. Unable to write log files."
  } ]
}
[INFO] Tests run: 2, Failures: 0, Errors: 0, Skipped: 0, Time elapsed: 0.001 s - in org.eclipse.iot.unide.ppmp.MessagesTest
[INFO] Running org.eclipse.iot.unide.ppmp.MeasurementsTest
[INFO] Tests run: 2, Failures: 0, Errors: 0, Skipped: 0, Time elapsed: 0.017 s - in org.eclipse.iot.unide.ppmp.MeasurementsTest
[INFO] 
[INFO] Results:
[INFO] 
[INFO] Tests run: 6, Failures: 0, Errors: 0, Skipped: 0
[INFO] 
[JENKINS] Recording test results
[INFO] 
[INFO] --- maven-bundle-plugin:3.3.0:bundle (default-bundle) @ ppmp-java-binding ---
[INFO] 
[INFO] --- maven-install-plugin:2.5.2:install (default-install) @ ppmp-java-binding ---
[INFO] Installing /home/hudson/genie.unide/.jenkins/jobs/Unide Java Binding/workspace/bindings/ppmp-java-binding/target/ppmp-java-binding-1.0.0-SNAPSHOT.jar to /opt/public/hipp/homes/genie.unide/.m2/repository/org/eclipse/iot/unide/ppmp/ppmp-java-binding/1.0.0-SNAPSHOT/ppmp-java-binding-1.0.0-SNAPSHOT.jar
[INFO] Installing /home/hudson/genie.unide/.jenkins/jobs/Unide Java Binding/workspace/bindings/ppmp-java-binding/pom.xml to /opt/public/hipp/homes/genie.unide/.m2/repository/org/eclipse/iot/unide/ppmp/ppmp-java-binding/1.0.0-SNAPSHOT/ppmp-java-binding-1.0.0-SNAPSHOT.pom
[INFO] 
[INFO] --- maven-bundle-plugin:3.3.0:install (default-install) @ ppmp-java-binding ---
[INFO] Installing org/eclipse/iot/unide/ppmp/ppmp-java-binding/1.0.0-SNAPSHOT/ppmp-java-binding-1.0.0-SNAPSHOT.jar
[INFO] Writing OBR metadata
[INFO] 
[INFO] --- maven-resources-plugin:3.0.2:resources (default-resources) @ ppmp-java-binding ---
[INFO] Using 'UTF-8' encoding to copy filtered resources.
[INFO] skip non existing resourceDirectory /home/hudson/genie.unide/.jenkins/jobs/Unide Java Binding/workspace/bindings/ppmp-java-binding/src/main/resources
[INFO] 
[INFO] --- maven-compiler-plugin:3.7.0:compile (default-compile) @ ppmp-java-binding ---
[INFO] Nothing to compile - all classes are up to date
[INFO] 
[INFO] --- maven-resources-plugin:3.0.2:testResources (default-testResources) @ ppmp-java-binding ---
[INFO] Using 'UTF-8' encoding to copy filtered resources.
[INFO] Copying 3 resources
[INFO] 
[INFO] --- maven-compiler-plugin:3.7.0:testCompile (default-testCompile) @ ppmp-java-binding ---
[INFO] Nothing to compile - all classes are up to date
[INFO] 
[INFO] --- maven-surefire-plugin:2.20.1:test (default-test) @ ppmp-java-binding ---
[INFO] Skipping execution of surefire because it has already been run for this configuration
[JENKINS] Recording test results
[INFO] 
[INFO] --- maven-bundle-plugin:3.3.0:bundle (default-bundle) @ ppmp-java-binding ---
[INFO] 
[INFO] --- maven-install-plugin:2.5.2:install (default-install) @ ppmp-java-binding ---
[INFO] Installing /home/hudson/genie.unide/.jenkins/jobs/Unide Java Binding/workspace/bindings/ppmp-java-binding/target/ppmp-java-binding-1.0.0-SNAPSHOT.jar to /opt/public/hipp/homes/genie.unide/.m2/repository/org/eclipse/iot/unide/ppmp/ppmp-java-binding/1.0.0-SNAPSHOT/ppmp-java-binding-1.0.0-SNAPSHOT.jar
[INFO] Installing /home/hudson/genie.unide/.jenkins/jobs/Unide Java Binding/workspace/bindings/ppmp-java-binding/pom.xml to /opt/public/hipp/homes/genie.unide/.m2/repository/org/eclipse/iot/unide/ppmp/ppmp-java-binding/1.0.0-SNAPSHOT/ppmp-java-binding-1.0.0-SNAPSHOT.pom
[INFO] 
[INFO] --- maven-bundle-plugin:3.3.0:install (default-install) @ ppmp-java-binding ---
[INFO] Installing org/eclipse/iot/unide/ppmp/ppmp-java-binding/1.0.0-SNAPSHOT/ppmp-java-binding-1.0.0-SNAPSHOT.jar
[INFO] Writing OBR metadata
[INFO] 
[INFO] --- maven-deploy-plugin:2.8.2:deploy (default-deploy) @ ppmp-java-binding ---
[INFO] Downloading: https://repo.eclipse.org/content/repositories/unide-snapshots/org/eclipse/iot/unide/ppmp/ppmp-java-binding/1.0.0-SNAPSHOT/maven-metadata.xml
[INFO] Uploading: https://repo.eclipse.org/content/repositories/unide-snapshots/org/eclipse/iot/unide/ppmp/ppmp-java-binding/1.0.0-SNAPSHOT/ppmp-java-binding-1.0.0-20171212.154336-1.jar
[INFO] Uploading: https://repo.eclipse.org/content/repositories/unide-snapshots/org/eclipse/iot/unide/ppmp/ppmp-java-binding/1.0.0-SNAPSHOT/ppmp-java-binding-1.0.0-20171212.154336-1.pom
Started calculate disk usage of build
Finished Calculation of disk usage of build in 0 seconds
Started calculate disk usage of workspace
Finished Calculation of disk usage of workspace in 0 seconds
[INFO] ------------------------------------------------------------------------
[INFO] BUILD FAILURE
[INFO] ------------------------------------------------------------------------
[INFO] Total time: 14.174 s
[INFO] Finished at: 2017-12-12T10:43:36-05:00
[INFO] Final Memory: 29M/1891M
[INFO] ------------------------------------------------------------------------
Waiting for Jenkins to finish collecting data
[ERROR] Failed to execute goal org.apache.maven.plugins:maven-deploy-plugin:2.8.2:deploy (default-deploy) on project ppmp-java-binding: Failed to deploy artifacts: Could not find artifact org.eclipse.iot.unide.ppmp:ppmp-java-binding:jar:1.0.0-20171212.154336-1 in repo.eclipse.org (https://repo.eclipse.org/content/repositories/unide-snapshots/) -> [Help 1]
[ERROR] 
[ERROR] To see the full stack trace of the errors, re-run Maven with the -e switch.
[ERROR] Re-run Maven using the -X switch to enable full debug logging.
[ERROR] 
[ERROR] For more information about the errors and possible solutions, please read the following articles:
[ERROR] [Help 1] http://cwiki.apache.org/confluence/display/MAVEN/MojoExecutionException